Habitats directive Art. 17 reporting in year 2018
type: Collection
notation: art17_2018
has part: Conservation status assessment
has part: bioGeoReg
has part: CDR QaQc Habitats Directive Article 17 Reporting
has part: Member States codes
has part: Favourable reference value – operator
has part: Codelist of habitat types
has part: Codelist of species
has part: Conservation measures
has part: Status of measures
has part: Locations of the measures
has part: measuresPurposeHabitats
has part: Purpose of measures taken for species
has part: Response to the measures
has part: Methods used
has part: Valid population units for additional population size
has part: presenceHabitats
has part: presenceSpecies
has part: Future prospects of parameters
has part: qaqc
has part: Ranking of pressure/threat
has part: Change and reasons for change in value for parameter and in conservation status and conservation status trend
has part: Threats and pressures
has part: Trends
has part: trendsConclusion
has part: Type of estimate for population size
has part: Reintroduction success
has part: Sufficiency of area and quality of occupied habitat

Conservation status assessment
type: ConceptScheme
notation: assessments
is part of: Habitats directive Art. 17 reporting in year 2018
registration status: Public draft
user modified: roschsab
date modified: 2017-10-04 12:06:21.0
vocabulary type: Common
is numeric concept identifiers: false
is notations equal identifiers: false

Favourable
type: Concept
notation: FV
status: valid
status modified: 2017-07-25
in scheme: Conservation status assessment

Unfavourable - Inadequate
type: Concept
notation: U1
status: valid
status modified: 2017-07-25
in scheme: Conservation status assessment

Unfavourable - Bad
type: Concept
notation: U2
status: valid
status modified: 2017-07-25
in scheme: Conservation status assessment

Unknown
type: Concept
notation: XX
status: valid
status modified: 2017-07-25
in scheme: Conservation status assessment

Biogeographical and marine regions
type: ConceptScheme
notation: bioGeoReg
is part of: Habitats directive Art. 17 reporting in year 2018
registration status: Released
user modified: roschsab
date modified: 2017-10-04 12:10:55.0
vocabulary type: Common
is numeric concept identifiers: false
is notations equal identifiers: false

Alpine
type: Concept
notation: ALP
status: valid
status modified: 2013-03-22
accepted date: 2013-03-22
in scheme: Biogeographical and marine regions

Atlantic
type: Concept
notation: ATL
status: valid
status modified: 2013-03-22
accepted date: 2013-03-22
in scheme: Biogeographical and marine regions

Black Sea
type: Concept
notation: BLS
status: valid
status modified: 2013-03-22
accepted date: 2013-03-22
in scheme: Biogeographical and marine regions

Boreal
type: Concept
notation: BOR
status: valid
status modified: 2013-03-22
accepted date: 2013-03-22
in scheme: Biogeographical and marine regions

Continental
type: Concept
notation: CON
status: valid
status modified: 2013-03-22
accepted date: 2013-03-22
in scheme: Biogeographical and marine regions

Macaronesian
type: Concept
notation: MAC
status: valid
status modified: 2013-03-22
accepted date: 2013-03-22
in scheme: Biogeographical and marine regions

Marine Atlantic
type: Concept
notation: MATL
status: valid
status modified: 2013-03-22
accepted date: 2013-03-22
in scheme: Biogeographical and marine regions

Marine Baltic
type: Concept
notation: MBAL
status: valid
status modified: 2013-03-22
accepted date: 2013-03-22
in scheme: Biogeographical and marine regions

Marine Black Sea
type: Concept
notation: MBLS
status: valid
status modified: 2013-03-22
accepted date: 2013-03-22
in scheme: Biogeographical and marine regions

Mediterranean
type: Concept
notation: MED
status: valid
status modified: 2013-03-22
accepted date: 2013-03-22
in scheme: Biogeographical and marine regions

Marine Macaronesian
type: Concept
notation: MMAC
status: valid
status modified: 2013-03-22
accepted date: 2013-03-22
in scheme: Biogeographical and marine regions

Marine Mediterranean
type: Concept
notation: MMED
status: valid
status modified: 2013-03-22
accepted date: 2013-03-22
in scheme: Biogeographical and marine regions

Pannonian
type: Concept
notation: PAN
status: valid
status modified: 2013-03-22
accepted date: 2013-03-22
in scheme: Biogeographical and marine regions

Steppic
type: Concept
notation: STE
status: valid
status modified: 2013-03-22
accepted date: 2013-03-22
in scheme: Biogeographical and marine regions

CDR QaQc Habitats Directive Article 17 Reporting
type: ConceptScheme
notation: cdrqaqc
is part of: Habitats directive Art. 17 reporting in year 2018
registration status: Public draft
user modified: roschsab
date modified: 2019-04-02 16:43:39.0
vocabulary type: Common
is numeric concept identifiers: false
is notations equal identifiers: false

Invalid code.
type: Concept
notation: G001
definition: Please check the vocabulary countries.
status: valid
status modified: 2019-03-20
accepted date: 2019-03-20
in scheme: CDR QaQc Habitats Directive Article 17 Reporting
error type: BLOCKER

Mandatory information missing.
type: Concept
notation: G002
definition: Information on country code is expected.
status: valid
status modified: 2019-03-20
accepted date: 2019-03-20
in scheme: CDR QaQc Habitats Directive Article 17 Reporting
error type: BLOCKER

Mandatory information missing.
type: Concept
notation: G003
definition: Information on main achievements under the Habitats Directive during the reporting period is expected.
status: valid
status modified: 2019-03-20
accepted date: 2019-03-20
in scheme: CDR QaQc Habitats Directive Article 17 Reporting
error type: ERROR

Mandatory information missing.
type: Concept
notation: G004
definition: Information relating to the Habitats Directive and the Natura 2000 network of the Member State is expected.
status: valid
status modified: 2019-03-20
accepted date: 2019-03-20
in scheme: CDR QaQc Habitats Directive Article 17 Reporting
error type: ERROR

Mandatory information missing.
type: Concept
notation: G005
definition: General information on the network of pSCIs, SCIs and SACs is expected.
status: valid
status modified: 2019-03-20
accepted date: 2019-03-20
in scheme: CDR QaQc Habitats Directive Article 17 Reporting
error type: ERROR

Mandatory information missing.
type: Concept
notation: G006
definition: General information on monitoring is expected.
status: valid
status modified: 2019-03-20
accepted date: 2019-03-20
in scheme: CDR QaQc Habitats Directive Article 17 Reporting
error type: ERROR

Mandatory information missing.
type: Concept
notation: G007
definition: General information on species protection is expected.
status: valid
status modified: 2019-03-20
accepted date: 2019-03-20
in scheme: CDR QaQc Habitats Directive Article 17 Reporting
error type: ERROR

Mandatory information missing.
type: Concept
notation: G008
definition: General information on the implementation of conservation measures within the Natura 2000 sites and their impact on conservation status expected.
status: valid
status modified: 2019-03-20
accepted date: 2019-03-20
in scheme: CDR QaQc Habitats Directive Article 17 Reporting
error type: ERROR

Mandatory information missing.
type: Concept
notation: G009
definition: General information on transposition of the Directive is expected.
status: valid
status modified: 2019-03-20
accepted date: 2019-03-20
in scheme: CDR QaQc Habitats Directive Article 17 Reporting
error type: ERROR

Incorrect data format.
type: Concept
notation: G010
definition: Numeric field, only integers greater than 0 are permitted.
status: valid
status modified: 2019-03-20
accepted date: 2019-03-20
in scheme: CDR QaQc Habitats Directive Article 17 Reporting
error type: ERROR

Incoherent information.
type: Concept
notation: G011
definition: The total number of all SACs cannot be higher than the total number of all sites (pSCIs, SCIs and SACs).
status: valid
status modified: 2019-03-20
accepted date: 2019-03-20
in scheme: CDR QaQc Habitats Directive Article 17 Reporting
error type: ERROR

Incoherent information.
type: Concept
notation: G012
definition: The total number of marine sites (pSCIs, SCIs and SACs) cannot be higher than the total number of all sites (pSCIs, SCIs and SACs).
status: valid
status modified: 2019-03-20
accepted date: 2019-03-20
in scheme: CDR QaQc Habitats Directive Article 17 Reporting
error type: ERROR

Mandatory information missing.
type: Concept
notation: G013
definition: The total number of all sites (pSCIs, SCIs, SACs) should be provided.
status: valid
status modified: 2019-03-20
accepted date: 2019-03-20
in scheme: CDR QaQc Habitats Directive Article 17 Reporting
error type: ERROR

Incorrect data format.
type: Concept
notation: G014
definition: Numeric field, only decimals greater than 0 are permitted.
status: valid
status modified: 2019-03-20
accepted date: 2019-03-20
in scheme: CDR QaQc Habitats Directive Article 17 Reporting
error type: ERROR

Incoherent information.
type: Concept
notation: G015
definition: The surface area of all SACs cannot be higher than the surface area of all sites (pSCIs, SCIs and SACs).
status: valid
status modified: 2019-03-20
accepted date: 2019-03-20
in scheme: CDR QaQc Habitats Directive Article 17 Reporting
error type: ERROR

Incoherent information.
type: Concept
notation: G016
definition: The surface area of terrestrial sites (pSCIs, SCIs and SACs) cannot be higher than the surface area of all sites (pSCIs, SCIs and SACs).
status: valid
status modified: 2019-03-20
accepted date: 2019-03-20
in scheme: CDR QaQc Habitats Directive Article 17 Reporting
error type: ERROR

Incoherent information.
type: Concept
notation: G017
definition: The surface area of marine sites (pSCIs, SCIs and SACs) cannot be higher than the surface area of all sites (pSCIs, SCIs and SACs).
status: valid
status modified: 2019-03-20
accepted date: 2019-03-20
in scheme: CDR QaQc Habitats Directive Article 17 Reporting
error type: ERROR

Incoherent information.
type: Concept
notation: G018
definition: The surface area of terrestrial sites (pSCIs, SCIs and SACs) plus the surface area of marine sites (pSCIs, SCIs and SACs) together should give the surface area of all sites (pSCIs, SCIs and SACs).
status: valid
status modified: 2019-03-20
accepted date: 2019-03-20
in scheme: CDR QaQc Habitats Directive Article 17 Reporting
error type: ERROR

Mandatory information missing.
type: Concept
notation: G019
definition: The surface area of all sites (pSCIs, SCIs, SACs) should be provided.
status: valid
status modified: 2019-03-20
accepted date: 2019-03-20
in scheme: CDR QaQc Habitats Directive Article 17 Reporting
error type: ERROR

Incorrect data format.
type: Concept
notation: G020
definition: Numeric field, only integers greater than 0 are permitted.
status: valid
status modified: 2019-03-20
accepted date: 2019-03-20
in scheme: CDR QaQc Habitats Directive Article 17 Reporting
error type: ERROR

Incoherent information.
type: Concept
notation: G021
definition: The total number of marine SACs cannot be higher than the total number of all SACs.
status: valid
status modified: 2019-03-20
accepted date: 2019-03-20
in scheme: CDR QaQc Habitats Directive Article 17 Reporting
error type: ERROR

Mandatory information missing.
type: Concept
notation: G022
definition: The total number of all SACs should be provided.
status: valid
status modified: 2019-03-20
accepted date: 2019-03-20
in scheme: CDR QaQc Habitats Directive Article 17 Reporting
error type: ERROR

Incorrect data format.
type: Concept
notation: G023
definition: Numeric field, only decimals greater than 0 are permitted.
status: valid
status modified: 2019-03-20
accepted date: 2019-03-20
in scheme: CDR QaQc Habitats Directive Article 17 Reporting
error type: ERROR

Incoherent information.
type: Concept
notation: G024
definition: The surface area of terrestrial SACs cannot be higher than the surface area of all SACs.
status: valid
status modified: 2019-03-20
accepted date: 2019-03-20
in scheme: CDR QaQc Habitats Directive Article 17 Reporting
error type: ERROR

Incoherent information.
type: Concept
notation: G025
definition: The surface area of marine SACs cannot be higher than the surface area of all SACs.
status: valid
status modified: 2019-03-20
accepted date: 2019-03-20
in scheme: CDR QaQc Habitats Directive Article 17 Reporting
error type: ERROR

Incoherent information.
type: Concept
notation: G026
definition: The surface area of terrestrial SACs plus the surface area of marine SACs together should give the surface area of all SACs.
status: valid
status modified: 2019-03-20
accepted date: 2019-03-20
in scheme: CDR QaQc Habitats Directive Article 17 Reporting
error type: WARNING

Mandatory information missing.
type: Concept
notation: G027
definition: The surface area of all SACs should be provided.
status: valid
status modified: 2019-03-20
accepted date: 2019-03-20
in scheme: CDR QaQc Habitats Directive Article 17 Reporting
error type: ERROR

Incorrect data format.
type: Concept
notation: G028
definition: Numeric field, only decimals greater than 0 are permitted.
status: valid
status modified: 2019-03-20
accepted date: 2019-03-20
in scheme: CDR QaQc Habitats Directive Article 17 Reporting
error type: ERROR

Incoherent information.
type: Concept
notation: G029
definition: The surface area of terrestrial SACs cannot be higher than the surface area of terrestrial sites (pSCIs, SCIs and SACs).
status: valid
status modified: 2019-03-20
accepted date: 2019-03-20
in scheme: CDR QaQc Habitats Directive Article 17 Reporting
error type: ERROR

Mandatory information missing.
type: Concept
notation: G030
definition: The surface area of terrestrial sites (pSCIs, SCIs, SACs) should be provided.
status: valid
status modified: 2019-03-20
accepted date: 2019-03-20
in scheme: CDR QaQc Habitats Directive Article 17 Reporting
error type: ERROR

Incorrect data format.
type: Concept
notation: G031
definition: Numeric field, only decimals greater than 0 are permitted.
status: valid
status modified: 2019-03-20
accepted date: 2019-03-20
in scheme: CDR QaQc Habitats Directive Article 17 Reporting
error type: ERROR

Mandatory information missing.
type: Concept
notation: G032
definition: The surface area of terrestrial SACs should be provided.
status: valid
status modified: 2019-03-20
accepted date: 2019-03-20
in scheme: CDR QaQc Habitats Directive Article 17 Reporting
error type: ERROR

Incorrect data format.
type: Concept
notation: G033
definition: Numeric field, only integers greater than 0 are permitted.
status: valid
status modified: 2019-03-20
accepted date: 2019-03-20
in scheme: CDR QaQc Habitats Directive Article 17 Reporting
error type: ERROR

Incoherent information.
type: Concept
notation: G034
definition: The total number of marine SACs cannot be higher than the total number of marine sites (pSCIs, SCIs and SACs).
status: valid
status modified: 2019-03-20
accepted date: 2019-03-20
in scheme: CDR QaQc Habitats Directive Article 17 Reporting
error type: ERROR

Mandatory information missing.
type: Concept
notation: G035
definition: The total number of marine sites (pSCIs, SCIs and SACs) should be provided.
status: valid
status modified: 2019-03-20
accepted date: 2019-03-20
in scheme: CDR QaQc Habitats Directive Article 17 Reporting
error type: ERROR

Incorrect data format.
type: Concept
notation: G036
definition: Numeric field, only integers greater than 0 are permitted.
status: valid
status modified: 2019-03-20
accepted date: 2019-03-20
in scheme: CDR QaQc Habitats Directive Article 17 Reporting
error type: ERROR

Incoherent information.
type: Concept
notation: G037
definition: The surface area of marine SACs cannot be higher than the surface area of marine sites (pSCIs, SCIs and SACs).
status: valid
status modified: 2019-03-20
accepted date: 2019-03-20
in scheme: CDR QaQc Habitats Directive Article 17 Reporting
error type: ERROR

Mandatory information missing.
type: Concept
notation: G038
definition: The surface area of marine sites (pSCIs, SCIs and SACs) should be provided.
status: valid
status modified: 2019-03-20
accepted date: 2019-03-20
in scheme: CDR QaQc Habitats Directive Article 17 Reporting
error type: ERROR

Incorrect data format.
type: Concept
notation: G039
definition: Numeric field, only integers greater than 0 are permitted.
status: valid
status modified: 2019-03-20
accepted date: 2019-03-20
in scheme: CDR QaQc Habitats Directive Article 17 Reporting
error type: ERROR

Mandatory information missing.
type: Concept
notation: G040
definition: The total number of marine SACs should be provided.
status: valid
status modified: 2019-03-20
accepted date: 2019-03-20
in scheme: CDR QaQc Habitats Directive Article 17 Reporting
error type: ERROR

Incorrect data format.
type: Concept
notation: G041
definition: Numeric field, only integers greater than 0 are permitted.
status: valid
status modified: 2019-03-20
accepted date: 2019-03-20
in scheme: CDR QaQc Habitats Directive Article 17 Reporting
error type: ERROR

Mandatory information missing.
type: Concept
notation: G042
definition: The surface area of marine SACs should be provided.
status: valid
status modified: 2019-03-20
accepted date: 2019-03-20
in scheme: CDR QaQc Habitats Directive Article 17 Reporting
error type: ERROR

Mandatory information missing.
type: Concept
notation: G043
definition: The date of the last database delivered during the reporting period (2013-2018) is expected. Supply this information in the [DD]-MM-YYYY format.
status: valid
status modified: 2019-03-20
accepted date: 2019-03-20
in scheme: CDR QaQc Habitats Directive Article 17 Reporting
error type: ERROR

Incorrect data format.
type: Concept
notation: G044
definition: Numeric field, only integers greater than 0 are permitted.
status: valid
status modified: 2019-03-20
accepted date: 2019-03-20
in scheme: CDR QaQc Habitats Directive Article 17 Reporting
error type: ERROR

Mandatory information missing.
type: Concept
notation: G045
definition: The total number of SACs for which necessary conservation measures have been established should be provided.
status: valid
status modified: 2019-03-20
accepted date: 2019-03-20
in scheme: CDR QaQc Habitats Directive Article 17 Reporting
error type: ERROR

Incorrect data format.
type: Concept
notation: G046
definition: Numeric field, only decimals greater than 0 are permitted.
status: valid
status modified: 2019-03-20
accepted date: 2019-03-20
in scheme: CDR QaQc Habitats Directive Article 17 Reporting
error type: ERROR

Incoherent information.
type: Concept
notation: G047
definition: The proportion of the network area for which necessary conservation measures have been established should be between 0 and 100 %.
status: valid
status modified: 2019-03-20
accepted date: 2019-03-20
in scheme: CDR QaQc Habitats Directive Article 17 Reporting
error type: ERROR

Mandatory information missing.
type: Concept
notation: G048
definition: The proportion of the network area for which necessary conservation measures have been established should be provided.
status: valid
status modified: 2019-03-20
accepted date: 2019-03-20
in scheme: CDR QaQc Habitats Directive Article 17 Reporting
error type: ERROR

Incorrect data format.
type: Concept
notation: G049
definition: Numeric field, only integers greater than 0 are permitted.
status: valid
status modified: 2019-03-20
accepted date: 2019-03-20
in scheme: CDR QaQc Habitats Directive Article 17 Reporting
error type: ERROR

Mandatory information missing.
type: Concept
notation: G050
definition: The total number of SACs for which a comprehensive management plan or a similar instrument is in place should be provided.
status: valid
status modified: 2019-03-20
accepted date: 2019-03-20
in scheme: CDR QaQc Habitats Directive Article 17 Reporting
error type: ERROR

Incorrect data format.
type: Concept
notation: G051
definition: Numeric field, only decimals greater than 0 are permitted.
status: valid
status modified: 2019-03-20
accepted date: 2019-03-20
in scheme: CDR QaQc Habitats Directive Article 17 Reporting
error type: ERROR

Incoherent information.
type: Concept
notation: G052
definition: The proportion of the network area for a comprehensive management plan or a similar instrument is in place should be between 0 and 100 %.
status: valid
status modified: 2019-03-20
accepted date: 2019-03-20
in scheme: CDR QaQc Habitats Directive Article 17 Reporting
error type: ERROR

Mandatory information missing.
type: Concept
notation: G053
definition: The proportion of the network area for which a comprehensive management plan or a similar instrument is in place should be provided.
status: valid
status modified: 2019-03-20
accepted date: 2019-03-20
in scheme: CDR QaQc Habitats Directive Article 17 Reporting
error type: ERROR

Incorrect data format.
type: Concept
notation: G054
definition: The site code should contain 9 characters (letters and numbers).
status: valid
status modified: 2019-03-20
accepted date: 2019-03-20
in scheme: CDR QaQc Habitats Directive Article 17 Reporting
error type: WARNING

Incoherent information.
type: Concept
notation: G055
definition: The site name should be provided in addition to the sitecode.
status: valid
status modified: 2019-03-20
accepted date: 2019-03-20
in scheme: CDR QaQc Habitats Directive Article 17 Reporting
error type: ERROR

Incoherent information.
type: Concept
notation: G056
definition: The title of project/plan should be provided.
status: valid
status modified: 2019-03-20
accepted date: 2019-03-20
in scheme: CDR QaQc Habitats Directive Article 17 Reporting
error type: ERROR

Incoherent information.
type: Concept
notation: G057
definition: The year when Commission was informed about compensatory measures should be provided.
status: valid
status modified: 2019-03-20
accepted date: 2019-03-20
in scheme: CDR QaQc Habitats Directive Article 17 Reporting
error type: ERROR

Incoherent information.
type: Concept
notation: G058
definition: The year when project/plan was started to be implemented should be provided.
status: valid
status modified: 2019-03-20
accepted date: 2019-03-20
in scheme: CDR QaQc Habitats Directive Article 17 Reporting
error type: ERROR

Invalid code.
type: Concept
notation: G059
definition: Code should be 'Yes' or 'No'.
status: valid
status modified: 2019-03-20
accepted date: 2019-03-20
in scheme: CDR QaQc Habitats Directive Article 17 Reporting
error type: BLOCKER

Incoherent information.
type: Concept
notation: G060
definition: Indicate whether a Commission opinion was requested.
status: valid
status modified: 2019-03-20
accepted date: 2019-03-20
in scheme: CDR QaQc Habitats Directive Article 17 Reporting
error type: ERROR

Mandatory information missing.
type: Concept
notation: G061
definition: A general description of the main measures taken is expected.
status: valid
status modified: 2019-03-20
accepted date: 2019-03-20
in scheme: CDR QaQc Habitats Directive Article 17 Reporting
error type: ERROR

Invalid code.
type: Concept
notation: G062
definition: Please check the vocabulary HDspecies.
status: valid
status modified: 2019-03-20
accepted date: 2019-03-20
in scheme: CDR QaQc Habitats Directive Article 17 Reporting
error type: BLOCKER

Incoherent information.
type: Concept
notation: G063
definition: This section is to report on the reintroduction of Annex IV species only.
status: valid
status modified: 2019-03-20
accepted date: 2019-03-20
in scheme: CDR QaQc Habitats Directive Article 17 Reporting
error type: WARNING

Incoherent information.
type: Concept
notation: G064
definition: The combination species code/scientific name should exist in the look up table lu_hd_species.
status: valid
status modified: 2019-03-20
accepted date: 2019-03-20
in scheme: CDR QaQc Habitats Directive Article 17 Reporting
error type: WARNING

Incoherent information.
type: Concept
notation: G065
definition: The scientific name should be provided.
status: valid
status modified: 2019-03-20
accepted date: 2019-03-20
in scheme: CDR QaQc Habitats Directive Article 17 Reporting
error type: ERROR

Incoherent information.
type: Concept
notation: G066
definition: The reintroduction period should be provided.
status: valid
status modified: 2019-03-20
accepted date: 2019-03-20
in scheme: CDR QaQc Habitats Directive Article 17 Reporting
error type: ERROR

Incoherent information.
type: Concept
notation: G067
definition: The name of the reintroduction location and number of individuals reintroduced should be provided.
status: valid
status modified: 2019-03-20
accepted date: 2019-03-20
in scheme: CDR QaQc Habitats Directive Article 17 Reporting
error type: ERROR

Invalid code.
type: Concept
notation: G068
definition: Please check the vocabulary yesNoTooEearly.
status: valid
status modified: 2019-03-20
accepted date: 2019-03-20
in scheme: CDR QaQc Habitats Directive Article 17 Reporting
error type: BLOCKER

Incoherent information.
type: Concept
notation: G069
definition: The question on successful introduction should be answered.
status: valid
status modified: 2019-03-20
accepted date: 2019-03-20
in scheme: CDR QaQc Habitats Directive Article 17 Reporting
error type: ERROR

Incorrect data format.
type: Concept
notation: H001
definition: Numeric field, only decimals greater than 0 is permitted.
status: valid
status modified: 2019-03-20
accepted date: 2019-03-20
in scheme: CDR QaQc Habitats Directive Article 17 Reporting
error type: ERROR

Mandatory information missing.
type: Concept
notation: H002
definition: Surface area should be provided.
status: valid
status modified: 2019-03-20
accepted date: 2019-03-20
in scheme: CDR QaQc Habitats Directive Article 17 Reporting
error type: ERROR

Incorrect data format.
type: Concept
notation: H003
definition: Incorrect data format, it must be YYYY-YYYY.
status: valid
status modified: 2019-03-20
accepted date: 2019-03-20
in scheme: CDR QaQc Habitats Directive Article 17 Reporting
error type: ERROR

Incoherent information.
type: Concept
notation: H004
definition: Incoherent information provided. Year1 should be greater or equal year2.
status: valid
status modified: 2019-03-20
accepted date: 2019-03-20
in scheme: CDR QaQc Habitats Directive Article 17 Reporting
error type: ERROR

Mandatory information missing.
type: Concept
notation: H005
definition: Period should be provided.
status: valid
status modified: 2019-03-20
accepted date: 2019-03-20
in scheme: CDR QaQc Habitats Directive Article 17 Reporting
error type: ERROR

Invalid code.
type: Concept
notation: H006
definition: Please check the vocabulary trends.
status: valid
status modified: 2019-03-20
accepted date: 2019-03-20
in scheme: CDR QaQc Habitats Directive Article 17 Reporting
error type: BLOCKER

Mandatory information missing.
type: Concept
notation: H008
definition: Trend should be provided. In case the information to be reported in this section is not available use 'Unk - unknown'.
status: valid
status modified: 2019-03-20
accepted date: 2019-03-20
in scheme: CDR QaQc Habitats Directive Article 17 Reporting
error type: ERROR

Incorrect data format.
type: Concept
notation: H009
definition: Numeric field, only decimals greater or equal 0 are permitted.
status: valid
status modified: 2019-03-20
accepted date: 2019-03-20
in scheme: CDR QaQc Habitats Directive Article 17 Reporting
error type: ERROR

Incorrect data format.
type: Concept
notation: H010
definition: Numeric field, only decimals greater or equal 0 are permitted.
status: valid
status modified: 2019-03-20
accepted date: 2019-03-20
in scheme: CDR QaQc Habitats Directive Article 17 Reporting
error type: ERROR

4.4b Short-term trend Magnitude - max should be greater or equal min.
type: Concept
notation: H011
status: valid
status modified: 2019-03-20
accepted date: 2019-03-20
in scheme: CDR QaQc Habitats Directive Article 17 Reporting
error type: ERROR

Invalid code.
type: Concept
notation: H012
definition: Please check the vocabulary methodsUsed.
status: valid
status modified: 2019-03-20
accepted date: 2019-03-20
in scheme: CDR QaQc Habitats Directive Article 17 Reporting
error type: BLOCKER

Incoherent information.
type: Concept
notation: H013
definition: Inconsistent values provided in fields 4.3 Short-term trend Direction and 4.5 Short-term trend Method used. When the method is 'AbsentData - Insufficient or no data available', the trend cannot be defined. If you want to report a trend as stable, increasing or decreasing based on a method using limited data, please select 'estimateExpert - Based mainly on expert opinion with very limited data' for the method used.
status: valid
status modified: 2019-03-20
accepted date: 2019-03-20
in scheme: CDR QaQc Habitats Directive Article 17 Reporting
error type: WARNING

Mandatory information missing.
type: Concept
notation: H014
definition: The method should be provided. In case the information to be reported in this section is not available use 'AbsentData - Insufficient or no data available'.
status: valid
status modified: 2019-03-20
accepted date: 2019-03-20
in scheme: CDR QaQc Habitats Directive Article 17 Reporting
error type: ERROR

Incorrect data format.
type: Concept
notation: H015
definition: Incorrect data format, it must be YYYY-YYYY.
status: valid
status modified: 2019-03-20
accepted date: 2019-03-20
in scheme: CDR QaQc Habitats Directive Article 17 Reporting
error type: ERROR

Incoherent information.
type: Concept
notation: H016
definition: Incoherent information provided. Year1 should be greater or equal year2.
status: valid
status modified: 2019-03-20
accepted date: 2019-03-20
in scheme: CDR QaQc Habitats Directive Article 17 Reporting
error type: ERROR

Invalid code.
type: Concept
notation: H017
definition: Please check the vocabulary trends.
status: valid
status modified: 2019-03-20
accepted date: 2019-03-20
in scheme: CDR QaQc Habitats Directive Article 17 Reporting
error type: BLOCKER

Incorrect data format.
type: Concept
notation: H019
definition: Numeric field, only decimals greater or equal 0 are permitted.
status: valid
status modified: 2019-03-20
accepted date: 2019-03-20
in scheme: CDR QaQc Habitats Directive Article 17 Reporting
error type: ERROR

Incorrect data format.
type: Concept
notation: H020
definition: Numeric field, only decimals greater or equal 0 are permitted.
status: valid
status modified: 2019-03-20
accepted date: 2019-03-20
in scheme: CDR QaQc Habitats Directive Article 17 Reporting
error type: ERROR

4.8b Long-term trend Magnitude - max should be greater or equal min.
type: Concept
notation: H021
status: valid
status modified: 2019-03-20
accepted date: 2019-03-20
in scheme: CDR QaQc Habitats Directive Article 17 Reporting
error type: ERROR

Invalid code.
type: Concept
notation: H022
definition: Please check the vocabulary methodsUsed.
status: valid
status modified: 2019-03-20
accepted date: 2019-03-20
in scheme: CDR QaQc Habitats Directive Article 17 Reporting
error type: BLOCKER

Incorrect data format.
type: Concept
notation: H024
definition: Numeric field, only decimals greater than 0 permitted.
status: valid
status modified: 2019-03-20
accepted date: 2019-03-20
in scheme: CDR QaQc Habitats Directive Article 17 Reporting
error type: ERROR

Only one of 4.10a, b or c Favourable reference range should be filled in.
type: Concept
notation: H025
definition: If an operator is used, there is no need to insert a value. If the value is provided for range in km2, no operator should be used. Moreover, the use of 'x - unknown' is not compatible with the use of value or operators.
status: valid
status modified: 2019-03-20
accepted date: 2019-03-20
in scheme: CDR QaQc Habitats Directive Article 17 Reporting
error type: ERROR

Incoherent information.
type: Concept
notation: H026
definition: Incoherent information provided. The Favourable reference range is smaller than 4.1 Surface area. Check whether this is on purpose.
status: valid
status modified: 2019-03-20
accepted date: 2019-03-20
in scheme: CDR QaQc Habitats Directive Article 17 Reporting
error type: WARNING

Mandatory information missing.
type: Concept
notation: H027
definition: Information on Favourable reference range should be provided (4.10a, b or c). In case the information to be reported in this section is not available use 'x - unknown' in 4.10c, knowing the use of operators should help to reduce the use of 'unknown' to a minimum.
status: valid
status modified: 2019-03-20
accepted date: 2019-03-20
in scheme: CDR QaQc Habitats Directive Article 17 Reporting
error type: ERROR

Invalid code.
type: Concept
notation: H028
definition: Please check the vocabulary favourableOperator.
status: valid
status modified: 2019-03-20
accepted date: 2019-03-20
in scheme: CDR QaQc Habitats Directive Article 17 Reporting
error type: ERROR

Invalid code.
type: Concept
notation: H031
definition: Only 'x - unknown' is allowed in this section.
status: valid
status modified: 2019-03-20
accepted date: 2019-03-20
in scheme: CDR QaQc Habitats Directive Article 17 Reporting
error type: BLOCKER

Invalid code.
type: Concept
notation: H034
definition: Please check the vocabulary reasonChange.
status: valid
status modified: 2019-03-20
accepted date: 2019-03-20
in scheme: CDR QaQc Habitats Directive Article 17 Reporting
error type: BLOCKER

Incoherent information.
type: Concept
notation: H035
definition: If 'noChange' is selected, there is no need to explain the nature of change.
status: valid
status modified: 2019-03-20
accepted date: 2019-03-20
in scheme: CDR QaQc Habitats Directive Article 17 Reporting
error type: ERROR

Incoherent information.
type: Concept
notation: H036
definition: Only one main reason is expected and should be part of the reported reasons.
status: valid
status modified: 2019-03-20
accepted date: 2019-03-20
in scheme: CDR QaQc Habitats Directive Article 17 Reporting
error type: ERROR

Mandatory information missing.
type: Concept
notation: H037
definition: Indicate if there is any change since the previous reporting period (2007-2012) in the range surface area reported. Report 'noChange' if the answer to the question: 'Is there a change between reporting periods?' is 'No'. Provide the nature of that change (more than one option can be chosen) if the answer is 'Yes'.
status: valid
status modified: 2019-03-20
accepted date: 2019-03-20
in scheme: CDR QaQc Habitats Directive Article 17 Reporting
error type: ERROR

Incorrect data format.
type: Concept
notation: H038
definition: Incorrect data format, it must be YYYY or YYYY-YYYY.
status: valid
status modified: 2019-03-20
accepted date: 2019-03-20
in scheme: CDR QaQc Habitats Directive Article 17 Reporting
error type: ERROR

Incoherent information.
type: Concept
notation: H039
definition: Incoherent information provided. Year1 should be greater or equal year2.
status: valid
status modified: 2019-03-20
accepted date: 2019-03-20
in scheme: CDR QaQc Habitats Directive Article 17 Reporting
error type: ERROR

Mandatory information missing.
type: Concept
notation: H040
definition: The year or period should be provided.
status: valid
status modified: 2019-03-20
accepted date: 2019-03-20
in scheme: CDR QaQc Habitats Directive Article 17 Reporting
error type: ERROR

Incorrect data format.
type: Concept
notation: H041
definition: Numeric field, only decimals greater or equal 0 are permitted.
status: valid
status modified: 2019-03-20
accepted date: 2019-03-20
in scheme: CDR QaQc Habitats Directive Article 17 Reporting
error type: ERROR

Incorrect data format.
type: Concept
notation: H042
definition: Numeric field, only decimals greater than 0 are permitted.
status: valid
status modified: 2019-03-20
accepted date: 2019-03-20
in scheme: CDR QaQc Habitats Directive Article 17 Reporting
error type: ERROR

5.2b Surface area covered by the habitat - max should be greater or equal min.
type: Concept
notation: H043
status: valid
status modified: 2019-03-20
accepted date: 2019-03-20
in scheme: CDR QaQc Habitats Directive Article 17 Reporting
error type: ERROR

Incorrect data format.
type: Concept
notation: H044
definition: Numeric field, only decimals greater than 0 are permitted.
status: valid
status modified: 2019-03-20
accepted date: 2019-03-20
in scheme: CDR QaQc Habitats Directive Article 17 Reporting
error type: ERROR

Mandatory information missing.
type: Concept
notation: H045
definition: Surface area covered by the habitat should be provided as interval (5.2a, b) and/or single value (5.2c). When only a minimum (or maximum) value of the surface area covered by the habitat is known (e.g. through expert opinion) this should be entered in the 'Best single value' field and NOT the '(a) Minimum' or '(b) Maximum' fields.
status: valid
status modified: 2019-03-20
accepted date: 2019-03-20
in scheme: CDR QaQc Habitats Directive Article 17 Reporting
error type: ERROR

Invalid code.
type: Concept
notation: H046
definition: Please check the vocabulary typeEstimate. The value 'mean - multi-year mean' is not allowed in this section.
status: valid
status modified: 2019-03-20
accepted date: 2019-03-20
in scheme: CDR QaQc Habitats Directive Article 17 Reporting
error type: BLOCKER

Incoherent information.
type: Concept
notation: H047
definition: Type of estimate was provided although there is no entry for surface area covered by the habitat (5.2a,b,c). Check coherence between these two fields. If both interval (5.2a 'Minimum' and 5.2b 'Maximum') and a single value (5.2c 'Best single value') are provided, field 5.3 'Type of estimate' should correspond to the more accurate estimate. This should be noted in 5.15 'Additional information'
status: valid
status modified: 2019-03-20
accepted date: 2019-03-20
in scheme: CDR QaQc Habitats Directive Article 17 Reporting
error type: WARNING

Mandatory information missing.
type: Concept
notation: H048
definition: The type of estimate for the surface area covered by the habitat should be provided.
status: valid
status modified: 2019-03-20
accepted date: 2019-03-20
in scheme: CDR QaQc Habitats Directive Article 17 Reporting
error type: ERROR

Invalid code.
type: Concept
notation: H049
definition: Please check the vocabulary methodsUsed.
status: valid
status modified: 2019-03-20
accepted date: 2019-03-20
in scheme: CDR QaQc Habitats Directive Article 17 Reporting
error type: BLOCKER

Incoherent information.
type: Concept
notation: H050
definition: Incoherent information provided. 5.3 Type of estimate should be empty when Surface area Method used is 'AbsentData - Insufficient or no data available'. When the method is assessed as 'AbsentData - Insufficient or no data available', the type of estimate used for the surface area covered by the habitat cannot be defined. If you want to report an estimate based on a method using limited data, please select 'estimateExpert - Based mainly on expert opinion with very limited data' for the method used.
status: valid
status modified: 2019-03-20
accepted date: 2019-03-20
in scheme: CDR QaQc Habitats Directive Article 17 Reporting
error type: WARNING

Mandatory information missing.
type: Concept
notation: H051
definition: The method should be provided. In case the information to be reported in this section is not available use 'AbsentData - Insufficient or no data available'.
status: valid
status modified: 2019-03-20
accepted date: 2019-03-20
in scheme: CDR QaQc Habitats Directive Article 17 Reporting
error type: ERROR

Incorrect data format.
type: Concept
notation: H052
definition: Incorrect data format, it must be YYYY-YYYY.
status: valid
status modified: 2019-03-20
accepted date: 2019-03-20
in scheme: CDR QaQc Habitats Directive Article 17 Reporting
error type: ERROR

Incoherent information.
type: Concept
notation: H053
definition: Incoherent information provided. Year1 should be greater or equal year2.
status: valid
status modified: 2019-03-20
accepted date: 2019-03-20
in scheme: CDR QaQc Habitats Directive Article 17 Reporting
error type: ERROR

Mandatory information missing.
type: Concept
notation: H054
definition: The period should be provided.
status: valid
status modified: 2019-03-20
accepted date: 2019-03-20
in scheme: CDR QaQc Habitats Directive Article 17 Reporting
error type: ERROR

Invalid code.
type: Concept
notation: H055
definition: Please check the vocabulary trends.
status: valid
status modified: 2019-03-20
accepted date: 2019-03-20
in scheme: CDR QaQc Habitats Directive Article 17 Reporting
error type: BLOCKER

Mandatory information missing.
type: Concept
notation: H057
definition: Trend should be provided. In case the information to be reported in this section is not available use 'Unk - unknown'.
status: valid
status modified: 2019-03-20
accepted date: 2019-03-20
in scheme: CDR QaQc Habitats Directive Article 17 Reporting
error type: ERROR

Incorrect data format.
type: Concept
notation: H058
definition: Numeric field, only decimals greater or equal 0 are permitted.
status: valid
status modified: 2019-03-20
accepted date: 2019-03-20
in scheme: CDR QaQc Habitats Directive Article 17 Reporting
error type: ERROR

Incorrect data format.
type: Concept
notation: H059
definition: Numeric field, only decimals greater or equal 0 are permitted.
status: valid
status modified: 2019-03-20
accepted date: 2019-03-20
in scheme: CDR QaQc Habitats Directive Article 17 Reporting
error type: ERROR

5.7b Short-term trend Magnitude - max should be greater or equal min.
type: Concept
notation: H060
status: valid
status modified: 2019-03-20
accepted date: 2019-03-20
in scheme: CDR QaQc Habitats Directive Article 17 Reporting
error type: ERROR

Incorrect data format.
type: Concept
notation: H061
definition: Numeric field, only decimals greater or equal 0 are permitted.
status: valid
status modified: 2019-03-20
accepted date: 2019-03-20
in scheme: CDR QaQc Habitats Directive Article 17 Reporting
error type: ERROR

Invalid code.
type: Concept
notation: H062
definition: Please check the vocabulary methodsUsed.
status: valid
status modified: 2019-03-20
accepted date: 2019-03-20
in scheme: CDR QaQc Habitats Directive Article 17 Reporting
error type: BLOCKER

Incoherent information.
type: Concept
notation: H063
definition: Inconsistent values provided in fields 5.6 Short-term trend Direction and 5.8 Short-term trend Method used. When the method is assessed as 'AbsentData - Insufficient or no data available', the trend cannot be defined. If you want to report a trend as stable, increasing or decreasing based on a method using limited data, please select 'estimateExpert - Based mainly on expert opinion with very limited data' for the method used.
status: valid
status modified: 2019-03-20
accepted date: 2019-03-20
in scheme: CDR QaQc Habitats Directive Article 17 Reporting
error type: WARNING

Mandatory information missing.
type: Concept
notation: H064
definition: The method should be provided. In case the information to be reported in this section is not available use 'AbsentData - Insufficient or no data available'.
status: valid
status modified: 2019-03-20
accepted date: 2019-03-20
in scheme: CDR QaQc Habitats Directive Article 17 Reporting
error type: ERROR

Incorrect data format.
type: Concept
notation: H065
definition: Incorrect data format, it must be YYYY-YYYY.
status: valid
status modified: 2019-03-20
accepted date: 2019-03-20
in scheme: CDR QaQc Habitats Directive Article 17 Reporting
error type: ERROR

Incoherent information.
type: Concept
notation: H066
definition: Incoherent information provided. Year1 should be greater or equal year2.
status: valid
status modified: 2019-03-20
accepted date: 2019-03-20
in scheme: CDR QaQc Habitats Directive Article 17 Reporting
error type: ERROR

Invalid code.
type: Concept
notation: H067
definition: Please check the vocabulary trends.
status: valid
status modified: 2019-03-20
accepted date: 2019-03-20
in scheme: CDR QaQc Habitats Directive Article 17 Reporting
error type: BLOCKER

Incorrect data format.
type: Concept
notation: H069
definition: Numeric field, only decimals greater or equal 0 are permitted.
status: valid
status modified: 2019-03-20
accepted date: 2019-03-20
in scheme: CDR QaQc Habitats Directive Article 17 Reporting
error type: ERROR

Incorrect data format.
type: Concept
notation: H070
definition: Numeric field, only decimals greater or equal 0 are permitted.
status: valid
status modified: 2019-03-20
accepted date: 2019-03-20
in scheme: CDR QaQc Habitats Directive Article 17 Reporting
error type: ERROR

5.11b Long-term trend Magnitude - max should be greater or equal min.
type: Concept
notation: H071
status: valid
status modified: 2019-03-20
accepted date: 2019-03-20
in scheme: CDR QaQc Habitats Directive Article 17 Reporting
error type: ERROR

Incorrect data format.
type: Concept
notation: H072
definition: Numeric field, only decimals greater or equal 0 are permitted.
status: valid
status modified: 2019-03-20
accepted date: 2019-03-20
in scheme: CDR QaQc Habitats Directive Article 17 Reporting
error type: ERROR

Invalid code.
type: Concept
notation: H073
definition: Please check the vocabulary methodsUsed.
status: valid
status modified: 2019-03-20
accepted date: 2019-03-20
in scheme: CDR QaQc Habitats Directive Article 17 Reporting
error type: BLOCKER

Incorrect data format.
type: Concept
notation: H075
definition: Numeric field, only decimals greater than 0 is permitted.
status: valid
status modified: 2019-03-20
accepted date: 2019-03-20
in scheme: CDR QaQc Habitats Directive Article 17 Reporting
error type: ERROR

Only one of 5.13a, b or c Favourable reference area should be filled in.
type: Concept
notation: H076
definition: If an operator is used, there is no need to insert a value. If the value is provided for area in km2, no operator should be used. Moreover, the use of 'x - unknown' is not compatible with the use of value or operators.
status: valid
status modified: 2019-03-20
accepted date: 2019-03-20
in scheme: CDR QaQc Habitats Directive Article 17 Reporting
error type: ERROR

Incoherent information.
type: Concept
notation: H077
definition: Incoherent information provided. The Favourable reference area is smaller than 5.2 Surface area. Check whether this is on purpose.
status: valid
status modified: 2019-03-20
accepted date: 2019-03-20
in scheme: CDR QaQc Habitats Directive Article 17 Reporting
error type: WARNING

Mandatory information missing.
type: Concept
notation: H078
definition: Information on Favourable reference area should be provided (5.13a, b or c). In case the information to be reported in this section is not available use 'x - unknown' in 5.13c, knowing the use of operators should help to reduce the use of 'unknown' to a minimum.
status: valid
status modified: 2019-03-20
accepted date: 2019-03-20
in scheme: CDR QaQc Habitats Directive Article 17 Reporting
error type: ERROR

Invalid code.
type: Concept
notation: H079
definition: Please check the vocabulary favourableOperator.
status: valid
status modified: 2019-03-20
accepted date: 2019-03-20
in scheme: CDR QaQc Habitats Directive Article 17 Reporting
error type: BLOCKER

Invalid code.
type: Concept
notation: H082
definition: Only the symbol 'x - unknown' is allowed in this section.
status: valid
status modified: 2019-03-20
accepted date: 2019-03-20
in scheme: CDR QaQc Habitats Directive Article 17 Reporting
error type: BLOCKER

Invalid code.
type: Concept
notation: H085
definition: Please check the vocabulary reasonChange.
status: valid
status modified: 2019-03-20
accepted date: 2019-03-20
in scheme: CDR QaQc Habitats Directive Article 17 Reporting
error type: BLOCKER

Incoherent information.
type: Concept
notation: H086
definition: If 'noChange' is selected, there is no need to explain the nature of change.
status: valid
status modified: 2019-03-20
accepted date: 2019-03-20
in scheme: CDR QaQc Habitats Directive Article 17 Reporting
error type: ERROR

Incoherent information.
type: Concept
notation: H087
definition: Only one main reason is expected and should be part of the reported reasons.
status: valid
status modified: 2019-03-20
accepted date: 2019-03-20
in scheme: CDR QaQc Habitats Directive Article 17 Reporting
error type: ERROR

Mandatory information missing.
type: Concept
notation: H088
definition: Indicate if there is any change since the previous reporting period (2007-2012) in the area covered by habitat reported. Report 'noChange' if the answer to the question: 'Is there a change between reporting periods?' is 'No'. Provide the nature of that change (more than one option can be chosen) if the answer is 'Yes'.
status: valid
status modified: 2019-03-20
accepted date: 2019-03-20
in scheme: CDR QaQc Habitats Directive Article 17 Reporting
error type: ERROR

Incorrect data format.
type: Concept
notation: H089
definition: Numeric field, only decimals greater or equal 0 are permitted.
status: valid
status modified: 2019-03-20
accepted date: 2019-03-20
in scheme: CDR QaQc Habitats Directive Article 17 Reporting
error type: ERROR

Mandatory information missing.
type: Concept
notation: H090
definition: The minimum area of habitat with 'good' condition should be provided. Report '0' when the surface is null. The area is reported in km2 and can be reported as a range (minimum and maximum); if a precise value is known this value should be reported for both the 'minimum' and 'maximum' fields.
status: valid
status modified: 2019-03-20
accepted date: 2019-03-20
in scheme: CDR QaQc Habitats Directive Article 17 Reporting
error type: ERROR

Incorrect data format.
type: Concept
notation: H091
definition: Numeric field, only decimals greater or equal 0 are permitted.
status: valid
status modified: 2019-03-20
accepted date: 2019-03-20
in scheme: CDR QaQc Habitats Directive Article 17 Reporting
error type: ERROR

6.1a2 Area in good condition - max should be greater or equal min.
type: Concept
notation: H092
status: valid
status modified: 2019-03-20
accepted date: 2019-03-20
in scheme: CDR QaQc Habitats Directive Article 17 Reporting
error type: ERROR

Mandatory information missing.
type: Concept
notation: H093
definition: The maximum area of habitat with 'good' condition should be provided. Report '0' when the surface is null. The area is reported in km2 and can be reported as a range (minimum and maximum); if a precise value is known this value should be reported for both the 'minimum' and 'maximum' fields.
status: valid
status modified: 2019-03-20
accepted date: 2019-03-20
in scheme: CDR QaQc Habitats Directive Article 17 Reporting
error type: ERROR

Incorrect data format.
type: Concept
notation: H094
definition: Numeric field, only decimals greater or equal 0 are permitted.
status: valid
status modified: 2019-03-20
accepted date: 2019-03-20
in scheme: CDR QaQc Habitats Directive Article 17 Reporting
error type: ERROR

Mandatory information missing.
type: Concept
notation: H095
definition: The minimum area of habitat with 'not-good' condition should be provided. Report '0' when the surface is null. The area is reported in km2 and can be reported as a range (minimum and maximum); if a precise value is known this value should be reported for both the 'minimum' and 'maximum' fields.
status: valid
status modified: 2019-03-20
accepted date: 2019-03-20
in scheme: CDR QaQc Habitats Directive Article 17 Reporting
error type: ERROR

Incorrect data format.
type: Concept
notation: H096
definition: Numeric field, only decimals greater or equal 0 are permitted.
status: valid
status modified: 2019-03-20
accepted date: 2019-03-20
in scheme: CDR QaQc Habitats Directive Article 17 Reporting
error type: ERROR

6.1b2 Area in not-good condition - max should be greater or equal min.
type: Concept
notation: H097
status: valid
status modified: 2019-03-20
accepted date: 2019-03-20
in scheme: CDR QaQc Habitats Directive Article 17 Reporting
error type: ERROR

Mandatory information missing.
type: Concept
notation: H098
definition: The maximum area of habitat with 'not-good' condition should be provided. Report '0' when the surface is null. The area is reported in km2 and can be reported as a range (minimum and maximum); if a precise value is known this value should be reported for both the 'minimum' and 'maximum' fields.
status: valid
status modified: 2019-03-20
accepted date: 2019-03-20
in scheme: CDR QaQc Habitats Directive Article 17 Reporting
error type: ERROR

Incorrect data format.
type: Concept
notation: H099
definition: Numeric field, only decimals greater or equal 0 are permitted.
status: valid
status modified: 2019-03-20
accepted date: 2019-03-20
in scheme: CDR QaQc Habitats Directive Article 17 Reporting
error type: ERROR

Mandatory information missing.
type: Concept
notation: H100
definition: The minimum area of habitat with 'unknown' condition should be provided. Report '0' when the surface is null. The area is reported in km2 and can be reported as a range (minimum and maximum); if a precise value is known this value should be reported for both the 'minimum' and 'maximum' fields.
status: valid
status modified: 2019-03-20
accepted date: 2019-03-20
in scheme: CDR QaQc Habitats Directive Article 17 Reporting
error type: ERROR

Incorrect data format.
type: Concept
notation: H101
definition: Numeric field, only decimals greater or equal 0 are permitted.
status: valid
status modified: 2019-03-20
accepted date: 2019-03-20
in scheme: CDR QaQc Habitats Directive Article 17 Reporting
error type: ERROR

6.1c2 Area where condition is not known - max should be greater or equal min.
type: Concept
notation: H102
status: valid
status modified: 2019-03-20
accepted date: 2019-03-20
in scheme: CDR QaQc Habitats Directive Article 17 Reporting
error type: ERROR

Mandatory information missing.
type: Concept
notation: H103
definition: The maximum area of habitat with 'unknown' condition should be provided. Report '0' when the surface is null. The area is reported in km2 and can be reported as a range (minimum and maximum); if a precise value is known this value should be reported for both the 'minimum' and 'maximum' fields.
status: valid
status modified: 2019-03-20
accepted date: 2019-03-20
in scheme: CDR QaQc Habitats Directive Article 17 Reporting
error type: ERROR

Invalid code.
type: Concept
notation: H104
definition: Please check the vocabulary methodsUsed.
status: valid
status modified: 2019-03-20
accepted date: 2019-03-20
in scheme: CDR QaQc Habitats Directive Article 17 Reporting
error type: BLOCKER

Mandatory information missing.
type: Concept
notation: H105
definition: The method should be provided. In case the information to be reported in this section is not available use 'AbsentData - Insufficient or no data available'.
status: valid
status modified: 2019-03-20
accepted date: 2019-03-20
in scheme: CDR QaQc Habitats Directive Article 17 Reporting
error type: ERROR

Incorrect data format.
type: Concept
notation: H106
definition: Incorrect data format, it must be YYYY-YYYY.
status: valid
status modified: 2019-03-20
accepted date: 2019-03-20
in scheme: CDR QaQc Habitats Directive Article 17 Reporting
error type: ERROR

Incoherent information.
type: Concept
notation: H107
definition: Incoherent information provided. Year1 should be greater or equal year2.
status: valid
status modified: 2019-03-20
accepted date: 2019-03-20
in scheme: CDR QaQc Habitats Directive Article 17 Reporting
error type: ERROR

Mandatory information missing.
type: Concept
notation: H108
definition: The period should be provided.
status: valid
status modified: 2019-03-20
accepted date: 2019-03-20
in scheme: CDR QaQc Habitats Directive Article 17 Reporting
error type: ERROR

Invalid code.
type: Concept
notation: H109
definition: Please check the vocabulary trends.
status: valid
status modified: 2019-03-20
accepted date: 2019-03-20
in scheme: CDR QaQc Habitats Directive Article 17 Reporting
error type: BLOCKER

Mandatory information missing.
type: Concept
notation: H111
definition: The trend should be provided. In case the information to be reported in this section is not available use 'Unk - unknown'.
status: valid
status modified: 2019-03-20
accepted date: 2019-03-20
in scheme: CDR QaQc Habitats Directive Article 17 Reporting
error type: ERROR

Invalid code.
type: Concept
notation: H112
definition: Please check the vocabulary methodsUsed.
status: valid
status modified: 2019-03-20
accepted date: 2019-03-20
in scheme: CDR QaQc Habitats Directive Article 17 Reporting
error type: BLOCKER

Incoherent information.
type: Concept
notation: H113
definition: Inconsistent values provided in fields 6.4 Short-term trend of habitat area in good condition Direction and 6.5 Short-term trend of habitat area in good condition Method used. When the method is assessed as 'AbsentData - Insufficient or no data available', the trend cannot be defined. If you want to report a trend as stable, increasing or decreasing based on a method using limited data, please select 'estimateExpert - Based mainly on expert opinion with very limited data' for the method used.
status: valid
status modified: 2019-03-20
accepted date: 2019-03-20
in scheme: CDR QaQc Habitats Directive Article 17 Reporting
error type: WARNING

Mandatory information missing.
type: Concept
notation: H114
definition: The method should be provided. In case the information to be reported in this section is not available use 'AbsentData - Insufficient or no data available'.
status: valid
status modified: 2019-03-20
accepted date: 2019-03-20
in scheme: CDR QaQc Habitats Directive Article 17 Reporting
error type: ERROR

Invalid code.
type: Concept
notation: H115
definition: Please check the vocabulary threats.
status: valid
status modified: 2019-03-20
accepted date: 2019-03-20
in scheme: CDR QaQc Habitats Directive Article 17 Reporting
error type: BLOCKER

More entries than permitted.
type: Concept
notation: H116
definition: More entries than permitted. Maximum of 10 pressures per biogeographical assessment.
status: valid
status modified: 2019-03-20
accepted date: 2019-03-20
in scheme: CDR QaQc Habitats Directive Article 17 Reporting
error type: ERROR

More entries than permitted.
type: Concept
notation: H117
definition: More entries than permitted. Maximum of 10 threats per biogeographical assessment.
status: valid
status modified: 2019-03-20
accepted date: 2019-03-20
in scheme: CDR QaQc Habitats Directive Article 17 Reporting
error type: ERROR

More entries than permitted.
type: Concept
notation: H118
definition: More entries than permitted. Maximum of 5 pressures with 'H - High importance' per biogeographical assessment.
status: valid
status modified: 2019-03-20
accepted date: 2019-03-20
in scheme: CDR QaQc Habitats Directive Article 17 Reporting
error type: ERROR

More entries than permitted.
type: Concept
notation: H119
definition: More entries than permitted. Maximum of 5 threats with 'H - High importance' per biogeographical assessment.
status: valid
status modified: 2019-03-20
accepted date: 2019-03-20
in scheme: CDR QaQc Habitats Directive Article 17 Reporting
error type: ERROR

Incoherent information.
type: Concept
notation: H120
definition: Code 'Xu - Unknown pressure' or 'Xxp - No pressures ' should be reported as a pressure, not as a threat.
status: valid
status modified: 2019-03-20
accepted date: 2019-03-20
in scheme: CDR QaQc Habitats Directive Article 17 Reporting
error type: ERROR

Incoherent information.
type: Concept
notation: H121
definition: Code 'Xt - No information on threats' used but other threats listed.
status: valid
status modified: 2019-03-20
accepted date: 2019-03-20
in scheme: CDR QaQc Habitats Directive Article 17 Reporting
error type: WARNING

Incoherent information.
type: Concept
notation: H122
definition: Code 'Xp - No information on pressures' used but other pressures listed.
status: valid
status modified: 2019-03-20
accepted date: 2019-03-20
in scheme: CDR QaQc Habitats Directive Article 17 Reporting
error type: WARNING

Mandatory information missing.
type: Concept
notation: H125
definition: The list of pressures and/or threats should be provided. Report 'Xp - No information on pressures' and/or 'Xt - No information on threats' for missing information.
status: valid
status modified: 2019-03-20
accepted date: 2019-03-20
in scheme: CDR QaQc Habitats Directive Article 17 Reporting
error type: ERROR

Mandatory information missing.
type: Concept
notation: H126
definition: The list of threats should be provided. Report 'Xt - No information on threats' for missing information.
status: valid
status modified: 2019-03-20
accepted date: 2019-03-20
in scheme: CDR QaQc Habitats Directive Article 17 Reporting
error type: ERROR

Mandatory information missing.
type: Concept
notation: H127
definition: The list of pressures should be provided. Report 'Xp - No information on pressures' for missing information.
status: valid
status modified: 2019-03-20
accepted date: 2019-03-20
in scheme: CDR QaQc Habitats Directive Article 17 Reporting
error type: ERROR

Invalid code.
type: Concept
notation: H128
definition: Please check the vocabulary ranking.
status: valid
status modified: 2019-03-20
accepted date: 2019-03-20
in scheme: CDR QaQc Habitats Directive Article 17 Reporting
error type: BLOCKER

Incoherent information.
type: Concept
notation: H129
definition: Ranking is provided although no code indicated for pressure and/or threat.
status: valid
status modified: 2019-03-20
accepted date: 2019-03-20
in scheme: CDR QaQc Habitats Directive Article 17 Reporting
error type: ERROR

Mandatory information missing.
type: Concept
notation: H130
definition: This field cannot be empty unless the reported code is 'Xp', 'Xt', 'Xu', 'Xxp' or 'Xxt'.
status: valid
status modified: 2019-03-20
accepted date: 2019-03-20
in scheme: CDR QaQc Habitats Directive Article 17 Reporting
error type: ERROR

Invalid code.
type: Concept
notation: H131
definition: Code should be 'p' = pressure or 't' = threat.
status: valid
status modified: 2019-03-20
accepted date: 2019-03-20
in scheme: CDR QaQc Habitats Directive Article 17 Reporting
error type: ERROR

Incoherent information.
type: Concept
notation: H132
definition: Type of pressure/threat is provided although no code indicated for pressure and/or threat.
status: valid
status modified: 2019-03-20
accepted date: 2019-03-20
in scheme: CDR QaQc Habitats Directive Article 17 Reporting
error type: ERROR

Mandatory information missing.
type: Concept
notation: H133
definition: The type of pressure or threats should be systematically provided. Code should be 'p' = pressure or 't' = threat.
status: valid
status modified: 2019-03-20
accepted date: 2019-03-20
in scheme: CDR QaQc Habitats Directive Article 17 Reporting
error type: ERROR

Invalid code.
type: Concept
notation: H134
definition: Code should be 'Yes' or 'No'.
status: valid
status modified: 2019-03-20
accepted date: 2019-03-20
in scheme: CDR QaQc Habitats Directive Article 17 Reporting
error type: BLOCKER

Mandatory information missing.
type: Concept
notation: H135
definition: Indicate whether measures are needed or not.
status: valid
status modified: 2019-03-20
accepted date: 2019-03-20
in scheme: CDR QaQc Habitats Directive Article 17 Reporting
error type: ERROR

Incoherent information.
type: Concept
notation: H136
definition: Status of measures is not expected if no measures are needed.
status: valid
status modified: 2019-03-20
accepted date: 2019-03-20
in scheme: CDR QaQc Habitats Directive Article 17 Reporting
error type: ERROR

Invalid code.
type: Concept
notation: H137
definition: Please check the vocabulary measuresIdentified.
status: valid
status modified: 2019-03-20
accepted date: 2019-03-20
in scheme: CDR QaQc Habitats Directive Article 17 Reporting
error type: BLOCKER

Mandatory information missing.
type: Concept
notation: H138
definition: Status of measures should be provided if measures are needed.
status: valid
status modified: 2019-03-20
accepted date: 2019-03-20
in scheme: CDR QaQc Habitats Directive Article 17 Reporting
error type: ERROR

Incoherent information.
type: Concept
notation: H139
definition: The main purpose of measures taken is not expected if no measures are identified and taken.
status: valid
status modified: 2019-03-20
accepted date: 2019-03-20
in scheme: CDR QaQc Habitats Directive Article 17 Reporting
error type: WARNING

Invalid code.
type: Concept
notation: H140
definition: Please check the vocabulary: measuresPurposeHabitats.
status: valid
status modified: 2019-03-20
accepted date: 2019-03-20
in scheme: CDR QaQc Habitats Directive Article 17 Reporting
error type: BLOCKER

Incoherent information.
type: Concept
notation: H141
definition: The main purpose of measures taken is expected if measures are identified and taken.
status: valid
status modified: 2019-03-20
accepted date: 2019-03-20
in scheme: CDR QaQc Habitats Directive Article 17 Reporting
error type: ERROR

Incoherent information.
type: Concept
notation: H142
definition: Location of measures is not expected if no measures are identified and taken.
status: valid
status modified: 2019-03-20
accepted date: 2019-03-20
in scheme: CDR QaQc Habitats Directive Article 17 Reporting
error type: WARNING

Invalid code.
type: Concept
notation: H143
definition: Please check the vocabulary measuresLocation.
status: valid
status modified: 2019-03-20
accepted date: 2019-03-20
in scheme: CDR QaQc Habitats Directive Article 17 Reporting
error type: BLOCKER

Incoherent information.
type: Concept
notation: H144
definition: The location of the measures is expected if measures are identified and taken.
status: valid
status modified: 2019-03-20
accepted date: 2019-03-20
in scheme: CDR QaQc Habitats Directive Article 17 Reporting
error type: ERROR

Incoherent information.
type: Concept
notation: H145
definition: Time frame of response to measures is not expected if no measures are identified and taken.
status: valid
status modified: 2019-03-20
accepted date: 2019-03-20
in scheme: CDR QaQc Habitats Directive Article 17 Reporting
error type: WARNING

Invalid code.
type: Concept
notation: H146
definition: Please check the vocabulary measuresResponse.
status: valid
status modified: 2019-03-20
accepted date: 2019-03-20
in scheme: CDR QaQc Habitats Directive Article 17 Reporting
error type: BLOCKER

Mandatory information missing.
type: Concept
notation: H147
definition: The time frame of the response to measures should be provided if measures are identified and taken.
status: valid
status modified: 2019-03-20
accepted date: 2019-03-20
in scheme: CDR QaQc Habitats Directive Article 17 Reporting
error type: ERROR

Invalid code.
type: Concept
notation: H148
definition: Please check the vocabulary measures.
status: valid
status modified: 2019-03-20
accepted date: 2019-03-20
in scheme: CDR QaQc Habitats Directive Article 17 Reporting
error type: BLOCKER

More entries than permitted.
type: Concept
notation: H150
definition: More entries than permitted. Maximum of 10 measures per biogeographical assessment.
status: valid
status modified: 2019-03-20
accepted date: 2019-03-20
in scheme: CDR QaQc Habitats Directive Article 17 Reporting
error type: ERROR

Mandatory information missing.
type: Concept
notation: H151
definition: The list of measures should be provided if measures are identified and taken.
status: valid
status modified: 2019-03-20
accepted date: 2019-03-20
in scheme: CDR QaQc Habitats Directive Article 17 Reporting
error type: ERROR

Invalid code.
type: Concept
notation: H152
definition: Please check the vocabulary Prospects.
status: valid
status modified: 2019-03-20
accepted date: 2019-03-20
in scheme: CDR QaQc Habitats Directive Article 17 Reporting
error type: BLOCKER

Mandatory information missing.
type: Concept
notation: H153
definition: The future prospects of each of the three parameters should be provided. In case the information to be reported in this section is not available use 'unk - unknown'.
status: valid
status modified: 2019-03-20
accepted date: 2019-03-20
in scheme: CDR QaQc Habitats Directive Article 17 Reporting
error type: ERROR

Invalid code.
type: Concept
notation: H154
definition: Please check the vocabulary Prospects.
status: valid
status modified: 2019-03-20
accepted date: 2019-03-20
in scheme: CDR QaQc Habitats Directive Article 17 Reporting
error type: BLOCKER

Mandatory information missing.
type: Concept
notation: H155
definition: The future prospects of each of the three parameters should be provided. In case the information to be reported in this section is not available use 'unk - unknown'.
status: valid
status modified: 2019-03-20
accepted date: 2019-03-20
in scheme: CDR QaQc Habitats Directive Article 17 Reporting
error type: ERROR

Invalid code.
type: Concept
notation: H156
definition: Please check the vocabulary Prospects.
status: valid
status modified: 2019-03-20
accepted date: 2019-03-20
in scheme: CDR QaQc Habitats Directive Article 17 Reporting
error type: BLOCKER

Mandatory information missing.
type: Concept
notation: H157
definition: The future prospects of each of the three parameters should be provided. In case the information to be reported in this section is not available use 'unk - unknown'.
status: valid
status modified: 2019-03-20
accepted date: 2019-03-20
in scheme: CDR QaQc Habitats Directive Article 17 Reporting
error type: ERROR

Invalid code.
type: Concept
notation: H158
definition: Please check the vocabulary assessments.
status: valid
status modified: 2019-03-20
accepted date: 2019-03-20
in scheme: CDR QaQc Habitats Directive Article 17 Reporting
error type: BLOCKER

Incoherent information.
type: Concept
notation: H159
definition: The conclusion for Range should be 'U2 - Unfavourable - Bad' when range surface area is more than 10% below favourable reference range (reported value in 4.10b is '>> - Much more than').
status: valid
status modified: 2019-03-20
accepted date: 2019-03-20
in scheme: CDR QaQc Habitats Directive Article 17 Reporting
error type: ERROR

Incoherent information.
type: Concept
notation: H160
definition: The conclusion for Range cannot be 'FV - Favourable' when the trend is decreasing (reported value in 4.3 is 'D - Decreasing').
status: valid
status modified: 2019-03-20
accepted date: 2019-03-20
in scheme: CDR QaQc Habitats Directive Article 17 Reporting
error type: ERROR

Mandatory information missing.
type: Concept
notation: H161
definition: The conclusion for Range should be provided.
status: valid
status modified: 2019-03-20
accepted date: 2019-03-20
in scheme: CDR QaQc Habitats Directive Article 17 Reporting
error type: ERROR

Invalid code.
type: Concept
notation: H162
definition: Please check the vocabulary assessments.
status: valid
status modified: 2019-03-20
accepted date: 2019-03-20
in scheme: CDR QaQc Habitats Directive Article 17 Reporting
error type: BLOCKER

Incoherent information.
type: Concept
notation: H163
definition: Conclusion for Area should be 'U2 - Unfavourable - Bad' when area covered by habitat is more than 10% below favourable reference area (reported value in 5.13b is '>> - Much more than').
status: valid
status modified: 2019-03-20
accepted date: 2019-03-20
in scheme: CDR QaQc Habitats Directive Article 17 Reporting
error type: ERROR

Incoherent information.
type: Concept
notation: H164
definition: The conclusion for Area cannot be 'FV - Favourable' when the trend is decreasing (reported value in 5.6 is 'D - Decreasing').
status: valid
status modified: 2019-03-20
accepted date: 2019-03-20
in scheme: CDR QaQc Habitats Directive Article 17 Reporting
error type: ERROR

Mandatory information missing.
type: Concept
notation: H165
definition: The conclusion for Area should be provided.
status: valid
status modified: 2019-03-20
accepted date: 2019-03-20
in scheme: CDR QaQc Habitats Directive Article 17 Reporting
error type: ERROR

Invalid code.
type: Concept
notation: H166
definition: Please check the vocabulary assessments.
status: valid
status modified: 2019-03-20
accepted date: 2019-03-20
in scheme: CDR QaQc Habitats Directive Article 17 Reporting
error type: BLOCKER

Mandatory information missing.
type: Concept
notation: H167
definition: The conclusion for Specific structure and functions should be provided.
status: valid
status modified: 2019-03-20
accepted date: 2019-03-20
in scheme: CDR QaQc Habitats Directive Article 17 Reporting
error type: ERROR

Invalid code.
type: Concept
notation: H168
definition: Please check the vocabulary assessments.
status: valid
status modified: 2019-03-20
accepted date: 2019-03-20
in scheme: CDR QaQc Habitats Directive Article 17 Reporting
error type: BLOCKER

Incoherent information.
type: Concept
notation: H169
definition: Conclusion for Future prospects should be 'FV - Favourable' if all parameters (9.1a,b,c) have 'good' prospects, or prospects of one parameter is 'unk - unknown' and the other prospects are 'good'.
status: valid
status modified: 2019-03-20
accepted date: 2019-03-20
in scheme: CDR QaQc Habitats Directive Article 17 Reporting
error type: ERROR

Incoherent information.
type: Concept
notation: H170
definition: Conclusion for Future prospects should be 'U2 - Unfavourable - Bad' if one or more parameters (9.1a,b,c) have 'bad' prospects.
status: valid
status modified: 2019-03-20
accepted date: 2019-03-20
in scheme: CDR QaQc Habitats Directive Article 17 Reporting
error type: ERROR

Incoherent information.
type: Concept
notation: H171
definition: Conclusion for Future prospects should be 'XX - Unknown' if two or more parameters (9.1a,b,c) are 'unk - unknown' and no parameter with 'bad' prospects.
status: valid
status modified: 2019-03-20
accepted date: 2019-03-20
in scheme: CDR QaQc Habitats Directive Article 17 Reporting
error type: ERROR

Mandatory information missing.
type: Concept
notation: H172
definition: The conclusion for Future prospects should be provided.
status: valid
status modified: 2019-03-20
accepted date: 2019-03-20
in scheme: CDR QaQc Habitats Directive Article 17 Reporting
error type: ERROR

Invalid code.
type: Concept
notation: H173
definition: Please check the vocabulary assessments.
status: valid
status modified: 2019-03-20
accepted date: 2019-03-20
in scheme: CDR QaQc Habitats Directive Article 17 Reporting
error type: BLOCKER

Incoherent information.
type: Concept
notation: H174
definition: Overall assessment should be 'FV - Favourable' if all assessments of parameters (10.1 to 10.4) are 'FV - Favourable', or three are 'FV - Favourable' and one is 'XX - Unknown'.
status: valid
status modified: 2019-03-20
accepted date: 2019-03-20
in scheme: CDR QaQc Habitats Directive Article 17 Reporting
error type: ERROR

Incoherent information.
type: Concept
notation: H175
definition: Overall assessment should be 'U2 - Unfavourable - Bad' if at least one assessment of parameters (10.1 to 10.4) is 'U2 - Unfavourable - Bad'.
status: valid
status modified: 2019-03-20
accepted date: 2019-03-20
in scheme: CDR QaQc Habitats Directive Article 17 Reporting
error type: ERROR

Incoherent information.
type: Concept
notation: H176
definition: Overall assessment should be 'U1 - Unfavourable - Inadequate' if at least one assessment of parameters (10.1 to 10.4) is 'U1 - Unfavourable - Inadequate' and none is 'U2 - Unfavourable - Bad'.
status: valid
status modified: 2019-03-20
accepted date: 2019-03-20
in scheme: CDR QaQc Habitats Directive Article 17 Reporting
error type: ERROR

Mandatory information missing.
type: Concept
notation: H177
definition: Conclusion for Overall assessment of Conservation Status should be provided.
status: valid
status modified: 2019-03-20
accepted date: 2019-03-20
in scheme: CDR QaQc Habitats Directive Article 17 Reporting
error type: ERROR

Mandatory information missing.
type: Concept
notation: H178
definition: Conclusion for Overall assessment of Conservation Status should be provided as other conclusions are provided (10.1 to 10.4).
status: valid
status modified: 2019-03-20
accepted date: 2019-03-20
in scheme: CDR QaQc Habitats Directive Article 17 Reporting
error type: ERROR

Invalid code.
type: Concept
notation: H179
definition: Please check the vocabulary trendsConclusion.
status: valid
status modified: 2019-03-20
accepted date: 2019-03-20
in scheme: CDR QaQc Habitats Directive Article 17 Reporting
error type: BLOCKER

Mandatory information missing.
type: Concept
notation: H181
definition: Overall trend in conservation status should be provided when 10.5 Conclusions - Overall assessment of Conservation Status is not 'XX - Unknown'.
status: valid
status modified: 2019-03-20
accepted date: 2019-03-20
in scheme: CDR QaQc Habitats Directive Article 17 Reporting
error type: ERROR

Invalid code.
type: Concept
notation: H182
definition: Please check the vocabulary reasonChange.
status: valid
status modified: 2019-03-20
accepted date: 2019-03-20
in scheme: CDR QaQc Habitats Directive Article 17 Reporting
error type: BLOCKER

Incoherent information.
type: Concept
notation: H183
definition: If 'noChange' is selected, there is no need to explain the nature of change.
status: valid
status modified: 2019-03-20
accepted date: 2019-03-20
in scheme: CDR QaQc Habitats Directive Article 17 Reporting
error type: ERROR

Incoherent information.
type: Concept
notation: H184
definition: Only one main reason is expected and should be part of the reported reasons.
status: valid
status modified: 2019-03-20
accepted date: 2019-03-20
in scheme: CDR QaQc Habitats Directive Article 17 Reporting
error type: ERROR

Mandatory information missing.
type: Concept
notation: H185
definition: Indicate if there is any change since the previous reporting period (2007-2012) in conservation status. Report 'noChange' if the answer to the question: 'Is there a change from the previous reporting round?' is 'No, there is no difference'. Provide the nature of that change (more than one option can be chosen) if the answer is 'Yes'.
status: valid
status modified: 2019-03-20
accepted date: 2019-03-20
in scheme: CDR QaQc Habitats Directive Article 17 Reporting
error type: ERROR

Invalid code.
type: Concept
notation: H186
definition: Please check the vocabulary reasonChange.
status: valid
status modified: 2019-03-20
accepted date: 2019-03-20
in scheme: CDR QaQc Habitats Directive Article 17 Reporting
error type: BLOCKER

Incoherent information.
type: Concept
notation: H187
definition: If 'noChange' is selected, there is no need to explain the nature of change.
status: valid
status modified: 2019-03-20
accepted date: 2019-03-20
in scheme: CDR QaQc Habitats Directive Article 17 Reporting
error type: ERROR

Incoherent information.
type: Concept
notation: H188
definition: Only one main reason is expected and should be part of the reported reasons.
status: valid
status modified: 2019-03-20
accepted date: 2019-03-20
in scheme: CDR QaQc Habitats Directive Article 17 Reporting
error type: ERROR

Mandatory information missing.
type: Concept
notation: H189
definition: Indicate if there is any change since the previous reporting period (2007-2012) in trend in conservation status. Report 'noChange' if the answer to the question: 'Is there a change from the previous reporting round?' is 'No, there is no difference'. Provide the nature of that change (more than one option can be chosen) if the answer is 'Yes'.
status: valid
status modified: 2019-03-20
accepted date: 2019-03-20
in scheme: CDR QaQc Habitats Directive Article 17 Reporting
error type: ERROR

Incorrect data format.
type: Concept
notation: H190
definition: Numeric field, only decimals greater or equal 0 are permitted.
status: valid
status modified: 2019-03-20
accepted date: 2019-03-20
in scheme: CDR QaQc Habitats Directive Article 17 Reporting
error type: ERROR

Incorrect data format.
type: Concept
notation: H191
definition: Numeric field, only decimals greater or equal 0 are permitted.
status: valid
status modified: 2019-03-20
accepted date: 2019-03-20
in scheme: CDR QaQc Habitats Directive Article 17 Reporting
error type: ERROR

11.1b Surface area within Natura 2000 network - max should be greater or equal min.
type: Concept
notation: H192
status: valid
status modified: 2019-03-20
accepted date: 2019-03-20
in scheme: CDR QaQc Habitats Directive Article 17 Reporting
error type: ERROR

Incorrect data format.
type: Concept
notation: H193
definition: Numeric field, only decimals greater or equal 0 are permitted.
status: valid
status modified: 2019-03-20
accepted date: 2019-03-20
in scheme: CDR QaQc Habitats Directive Article 17 Reporting
error type: ERROR

Mandatory information missing.
type: Concept
notation: H194
definition: Surface area of the habitat type within Natura 2000 network should be provided as an interval (11.1a, b) and/or a single value (11.1c). When only a minimum (or maximum) value of the surface area of the habitat type within the network is known (e.g. through expert opinion) this should be entered in the 'Best single value' field and NOT the '(a) Minimum' or '(b) Maximum' fields.
status: valid
status modified: 2019-03-20
accepted date: 2019-03-20
in scheme: CDR QaQc Habitats Directive Article 17 Reporting
error type: ERROR

Invalid code.
type: Concept
notation: H195
definition: Please check the vocabulary typeEstimate. The value 'mean - multi-year mean' is not allowed in this section.
status: valid
status modified: 2019-03-20
accepted date: 2019-03-20
in scheme: CDR QaQc Habitats Directive Article 17 Reporting
error type: BLOCKER

Incoherent information.
type: Concept
notation: H196
definition: Type of estimate was provided although there is no entry for surface area within Natura 2000 network (11.1a,b,c). Check coherence between these two fields. If both interval (11.1a 'Minimum' and 11.1b 'Maximum') and a single value (11.1c 'Best single value') are provided, field 11.2 'Type of estimate' should correspond to the more accurate estimate. This should be noted in 11.6 'Additional information'.
status: valid
status modified: 2019-03-20
accepted date: 2019-03-20
in scheme: CDR QaQc Habitats Directive Article 17 Reporting
error type: WARNING

Mandatory information missing.
type: Concept
notation: H197
definition: The type of estimate for the surface area covered by the habitat should be provided.
status: valid
status modified: 2019-03-20
accepted date: 2019-03-20
in scheme: CDR QaQc Habitats Directive Article 17 Reporting
error type: ERROR

Invalid code.
type: Concept
notation: H198
definition: Please check the vocabulary methodsUsed.
status: valid
status modified: 2019-03-20
accepted date: 2019-03-20
in scheme: CDR QaQc Habitats Directive Article 17 Reporting
error type: BLOCKER

Incoherent information.
type: Concept
notation: H199
definition: Incoherent information provided. 11.2 Type of estimate should be empty when Surface area within Natura 2000 Method used is 'AbsentData - Insufficient or no data available'. When the method is assessed as 'AbsentData - Insufficient or no data available', the type of estimate used for the surface area inside the network cannot be defined. If you want to report an estimate based on a method using limited data, please select 'estimateExpert - Based mainly on expert opinion with very limited data' for the method used.
status: valid
status modified: 2019-03-20
accepted date: 2019-03-20
in scheme: CDR QaQc Habitats Directive Article 17 Reporting
error type: WARNING

Mandatory information missing.
type: Concept
notation: H200
definition: Method should be provided. In case the information to be reported in this section is not available use 'AbsentData - Insufficient or no data available'.
status: valid
status modified: 2019-03-20
accepted date: 2019-03-20
in scheme: CDR QaQc Habitats Directive Article 17 Reporting
error type: ERROR

Invalid code.
type: Concept
notation: H201
definition: Please check the vocabulary trends.
status: valid
status modified: 2019-03-20
accepted date: 2019-03-20
in scheme: CDR QaQc Habitats Directive Article 17 Reporting
error type: BLOCKER

Mandatory information missing.
type: Concept
notation: H202
definition: The trend should be provided. In case the information to be reported in this section is not available use 'Unk - unknown'.
status: valid
status modified: 2019-03-20
accepted date: 2019-03-20
in scheme: CDR QaQc Habitats Directive Article 17 Reporting
error type: ERROR

Invalid code.
type: Concept
notation: H203
definition: Please check the vocabulary methodsUsed.
status: valid
status modified: 2019-03-20
accepted date: 2019-03-20
in scheme: CDR QaQc Habitats Directive Article 17 Reporting
error type: BLOCKER

Incoherent information.
type: Concept
notation: H204
definition: Inconsistent values provided in fields 11.4 Short-term trend Direction and 11.5 Short-term trend Method used. When the method is assessed as 'AbsentData - Insufficient or no data available', the trend cannot be defined. If you want to report a trend as stable, increasing or decreasing based on a method using limited data, please select 'estimateExpert - Based mainly on expert opinion with very limited data' for the method used.
status: valid
status modified: 2019-03-20
accepted date: 2019-03-20
in scheme: CDR QaQc Habitats Directive Article 17 Reporting
error type: WARNING

Mandatory information missing.
type: Concept
notation: H205
definition: The method should be provided. In case the information to be reported in this section is not available use 'AbsentData - Insufficient or no data available'.
status: valid
status modified: 2019-03-20
accepted date: 2019-03-20
in scheme: CDR QaQc Habitats Directive Article 17 Reporting
error type: ERROR

Invalid code.
type: Concept
notation: H500
definition: Please check the vocabulary countries.
status: valid
status modified: 2019-03-20
accepted date: 2019-03-20
in scheme: CDR QaQc Habitats Directive Article 17 Reporting
error type: BLOCKER

Mandatory information missing.
type: Concept
notation: H501
definition: The country code should be provided.
status: valid
status modified: 2019-03-20
accepted date: 2019-03-20
in scheme: CDR QaQc Habitats Directive Article 17 Reporting
error type: BLOCKER

Invalid code.
type: Concept
notation: H502
definition: Please check the vocabulary habitats.
status: valid
status modified: 2019-03-20
accepted date: 2019-03-20
in scheme: CDR QaQc Habitats Directive Article 17 Reporting
error type: BLOCKER

Mandatory information missing.
type: Concept
notation: H503
definition: The habitat code should be provided.
status: valid
status modified: 2019-03-20
accepted date: 2019-03-20
in scheme: CDR QaQc Habitats Directive Article 17 Reporting
error type: BLOCKER

Incorrect data format.
type: Concept
notation: H504
definition: Format must be YYYY or YYYY-YYYY.
status: valid
status modified: 2019-03-20
accepted date: 2019-03-20
in scheme: CDR QaQc Habitats Directive Article 17 Reporting
error type: ERROR

Incoherent information.
type: Concept
notation: H505
definition: Incoherent information provided. Year1 should be greater or equal year2.
status: valid
status modified: 2019-03-20
accepted date: 2019-03-20
in scheme: CDR QaQc Habitats Directive Article 17 Reporting
error type: ERROR

Mandatory information missing.
type: Concept
notation: H506
definition: Year or period should be provided.
status: valid
status modified: 2019-03-20
accepted date: 2019-03-20
in scheme: CDR QaQc Habitats Directive Article 17 Reporting
error type: ERROR

Invalid code.
type: Concept
notation: H507
definition: Please check the vocabulary methodsUsed.
status: valid
status modified: 2019-03-20
accepted date: 2019-03-20
in scheme: CDR QaQc Habitats Directive Article 17 Reporting
error type: BLOCKER

Mandatory information missing.
type: Concept
notation: H508
definition: Method should be provided. In case the information to be reported in this section is not available use 'AbsentData - Insufficient or no data available'.
status: valid
status modified: 2019-03-20
accepted date: 2019-03-20
in scheme: CDR QaQc Habitats Directive Article 17 Reporting
error type: ERROR

Invalid code.
type: Concept
notation: H509
definition: Please check the vocabulary bioGeoReg.
status: valid
status modified: 2019-03-20
accepted date: 2019-03-20
in scheme: CDR QaQc Habitats Directive Article 17 Reporting
error type: BLOCKER

Mandatory information missing.
type: Concept
notation: H510
definition: Information on biogeographical or marine region is expected.
status: valid
status modified: 2019-03-20
accepted date: 2019-03-20
in scheme: CDR QaQc Habitats Directive Article 17 Reporting
error type: BLOCKER

Invalid code.
type: Concept
notation: S001
definition: Please check the vocabulary countries.
status: valid
status modified: 2019-03-20
accepted date: 2019-03-20
in scheme: CDR QaQc Habitats Directive Article 17 Reporting
error type: BLOCKER

Mandatory information missing.
type: Concept
notation: S002
definition: The country code should be provided.
status: valid
status modified: 2019-03-20
accepted date: 2019-03-20
in scheme: CDR QaQc Habitats Directive Article 17 Reporting
error type: BLOCKER

Invalid code.
type: Concept
notation: S003
definition: Please check the vocabulary HDspecies.
status: valid
status modified: 2019-03-20
accepted date: 2019-03-20
in scheme: CDR QaQc Habitats Directive Article 17 Reporting
error type: BLOCKER

Mandatory information missing.
type: Concept
notation: S004
definition: The species code should be provided.
status: valid
status modified: 2019-03-20
accepted date: 2019-03-20
in scheme: CDR QaQc Habitats Directive Article 17 Reporting
error type: BLOCKER

Incoherent information.
type: Concept
notation: S005
definition: Incoherent information in this section. The combination species code/scientific name should exist in the vocabulary HDspecies.
status: valid
status modified: 2019-03-20
accepted date: 2019-03-20
in scheme: CDR QaQc Habitats Directive Article 17 Reporting
error type: WARNING

Incoherent information.
type: Concept
notation: S006
definition: Incoherent information in this section.The scientific name should be provided.
status: valid
status modified: 2019-03-20
accepted date: 2019-03-20
in scheme: CDR QaQc Habitats Directive Article 17 Reporting
error type: ERROR

Invalid code.
type: Concept
notation: S007
definition: Code should be 'Yes' or 'No'.
status: valid
status modified: 2019-03-20
accepted date: 2019-03-20
in scheme: CDR QaQc Habitats Directive Article 17 Reporting
error type: BLOCKER

Mandatory information missing.
type: Concept
notation: S008
definition: Indicate whether information on species distribution is sensitive.
status: valid
status modified: 2019-03-20
accepted date: 2019-03-20
in scheme: CDR QaQc Habitats Directive Article 17 Reporting
error type: ERROR

Incorrect data format.
type: Concept
notation: S009
definition: Incorrect data format, it must be YYYY or YYYY-YYYY.
status: valid
status modified: 2019-03-20
accepted date: 2019-03-20
in scheme: CDR QaQc Habitats Directive Article 17 Reporting
error type: ERROR

Incoherent information.
type: Concept
notation: S010
definition: Year1 should be lower or equal than year2.
status: valid
status modified: 2019-03-20
accepted date: 2019-03-20
in scheme: CDR QaQc Habitats Directive Article 17 Reporting
error type: ERROR

Mandatory information missing.
type: Concept
notation: S011
definition: Year or period should be provided.
status: valid
status modified: 2019-03-20
accepted date: 2019-03-20
in scheme: CDR QaQc Habitats Directive Article 17 Reporting
error type: ERROR

Invalid code.
type: Concept
notation: S012
definition: Please check the vocabulary methodsUsed.
status: valid
status modified: 2019-03-20
accepted date: 2019-03-20
in scheme: CDR QaQc Habitats Directive Article 17 Reporting
error type: BLOCKER

Mandatory information missing.
type: Concept
notation: S013
definition: Method should be provided. In case the information to be reported in this section is not available use 'AbsentData - Insufficient or no data available'.
status: valid
status modified: 2019-03-20
accepted date: 2019-03-20
in scheme: CDR QaQc Habitats Directive Article 17 Reporting
error type: ERROR

Invalid code.
type: Concept
notation: S014
definition: Code should be 'Yes' or 'No'.
status: valid
status modified: 2019-03-20
accepted date: 2019-03-20
in scheme: CDR QaQc Habitats Directive Article 17 Reporting
error type: BLOCKER

Mandatory information missing.
type: Concept
notation: S016
definition: Indicate whether this Annex V species is taken or exploited. Report 'No' if the answer to the question: 'Is the species taken in the wild/exploited' is 'No'.
status: valid
status modified: 2019-03-20
accepted date: 2019-03-20
in scheme: CDR QaQc Habitats Directive Article 17 Reporting
error type: ERROR

Incoherent information.
type: Concept
notation: S017
definition: Incoherent information in this section. This section Spec.3.2 should be filled when the species is taken in the wild or exploited ('Yes' reported in Spec.3.1) and the conservation status of the species is 'unfavourable' (U1 or U2) in at least one biogeographical or marine region.
status: valid
status modified: 2019-03-20
accepted date: 2019-03-20
in scheme: CDR QaQc Habitats Directive Article 17 Reporting
error type: WARNING

Mandatory information missing.
type: Concept
notation: S018
definition: This section should be filled when the species is taken in the wild or exploited ('Yes' reported in Spec.3.1) and the conservation status of the species is 'unfavourable' (U1 or U2) in at least one biogeographical or marine region.
status: valid
status modified: 2019-03-20
accepted date: 2019-03-20
in scheme: CDR QaQc Habitats Directive Article 17 Reporting
error type: ERROR

Invalid code.
type: Concept
notation: S019
definition: Code should be 'Yes' or 'No'.
status: valid
status modified: 2019-03-20
accepted date: 2019-03-20
in scheme: CDR QaQc Habitats Directive Article 17 Reporting
error type: BLOCKER

Invalid code.
type: Concept
notation: S020
definition: Code should be 'Yes' or 'No'.
status: valid
status modified: 2019-03-20
accepted date: 2019-03-20
in scheme: CDR QaQc Habitats Directive Article 17 Reporting
error type: BLOCKER

Invalid code.
type: Concept
notation: S021
definition: Code should be 'Yes' or 'No'.
status: valid
status modified: 2019-03-20
accepted date: 2019-03-20
in scheme: CDR QaQc Habitats Directive Article 17 Reporting
error type: BLOCKER

Invalid code.
type: Concept
notation: S022
definition: Code should be 'Yes' or 'No'.
status: valid
status modified: 2019-03-20
accepted date: 2019-03-20
in scheme: CDR QaQc Habitats Directive Article 17 Reporting
error type: BLOCKER

Invalid code.
type: Concept
notation: S023
definition: Code should be 'Yes' or 'No'.
status: valid
status modified: 2019-03-20
accepted date: 2019-03-20
in scheme: CDR QaQc Habitats Directive Article 17 Reporting
error type: BLOCKER

Invalid code.
type: Concept
notation: S024
definition: Code should be 'Yes' or 'No'.
status: valid
status modified: 2019-03-20
accepted date: 2019-03-20
in scheme: CDR QaQc Habitats Directive Article 17 Reporting
error type: BLOCKER

Invalid code.
type: Concept
notation: S025
definition: Code should be 'Yes' or 'No'.
status: valid
status modified: 2019-03-20
accepted date: 2019-03-20
in scheme: CDR QaQc Habitats Directive Article 17 Reporting
error type: BLOCKER

Invalid code.
type: Concept
notation: S026
definition: Code should be 'Yes' or 'No'.
status: valid
status modified: 2019-03-20
accepted date: 2019-03-20
in scheme: CDR QaQc Habitats Directive Article 17 Reporting
error type: BLOCKER

Incoherent information.
type: Concept
notation: S027
definition: The measures taken should be described only when 'yes, other measures' have been selected ('Yes' reported in Spec.3.2h1).
status: valid
status modified: 2019-03-20
accepted date: 2019-03-20
in scheme: CDR QaQc Habitats Directive Article 17 Reporting
error type: ERROR

Mandatory information missing.
type: Concept
notation: S028
definition: The measures taken should be described when other measures have been selected ('Yes' reported in Spec.3.2h1).
status: valid
status modified: 2019-03-20
accepted date: 2019-03-20
in scheme: CDR QaQc Habitats Directive Article 17 Reporting
error type: ERROR

Invalid code.
type: Concept
notation: S029
definition: Please check the vocabulary populationUnits.
status: valid
status modified: 2019-03-20
accepted date: 2019-03-20
in scheme: CDR QaQc Habitats Directive Article 17 Reporting
error type: ERROR

Mandatory information missing.
type: Concept
notation: S030
definition: Population unit for the hunting bag or quantity taken in the wild should be provided for Annex V species (Mammals and Acipenseridae), having an Unfavourable conservation status in one or more biogeographical/marine region where the species occurs.
status: valid
status modified: 2019-03-20
accepted date: 2019-03-20
in scheme: CDR QaQc Habitats Directive Article 17 Reporting
error type: ERROR

Incoherent information.
type: Concept
notation: S031
definition: If a Member State wishes to report population size using a different unit this can be reported in field 6.4, but this must be in addition to the reporting unit specified in the checklist and not as an alternative.
status: valid
status modified: 2019-03-20
accepted date: 2019-03-20
in scheme: CDR QaQc Habitats Directive Article 17 Reporting
error type: ERROR

Incoherent information.
type: Concept
notation: S032
definition: The reported additional population unit is similar to the recommended unit in the checklist on the reference portal.The reported additional population unit should be converted to the reporting unit in field 6.2.
status: valid
status modified: 2019-03-20
accepted date: 2019-03-20
in scheme: CDR QaQc Habitats Directive Article 17 Reporting
error type: WARNING

Invalid code.
type: Concept
notation: S058
definition: Please check the vocabulary methodsUsed.
status: valid
status modified: 2019-03-20
accepted date: 2019-03-20
in scheme: CDR QaQc Habitats Directive Article 17 Reporting
error type: BLOCKER

Mandatory information missing.
type: Concept
notation: S059
definition: The method should be provided. In case the information to be reported in this section is not available use 'AbsentData - Insufficient or no data available'.
status: valid
status modified: 2019-03-20
accepted date: 2019-03-20
in scheme: CDR QaQc Habitats Directive Article 17 Reporting
error type: ERROR

Invalid code.
type: Concept
notation: S060
definition: Please check the vocabulary bioGeoReg.
status: valid
status modified: 2019-03-20
accepted date: 2019-03-20
in scheme: CDR QaQc Habitats Directive Article 17 Reporting
error type: BLOCKER

Mandatory information missing.
type: Concept
notation: S061
definition: Information on biogeographical or marine region is expected.
status: valid
status modified: 2019-03-20
accepted date: 2019-03-20
in scheme: CDR QaQc Habitats Directive Article 17 Reporting
error type: BLOCKER

Incorrect data format.
type: Concept
notation: S062
definition: Numeric field, only decimals greater or equal 0 is permitted.
status: valid
status modified: 2019-03-20
accepted date: 2019-03-20
in scheme: CDR QaQc Habitats Directive Article 17 Reporting
error type: ERROR

Mandatory information missing.
type: Concept
notation: S063
definition: Surface area should be provided.
status: valid
status modified: 2019-03-20
accepted date: 2019-03-20
in scheme: CDR QaQc Habitats Directive Article 17 Reporting
error type: ERROR

Incorrect data format.
type: Concept
notation: S064
definition: Format must be YYYY-YYYY.
status: valid
status modified: 2019-03-20
accepted date: 2019-03-20
in scheme: CDR QaQc Habitats Directive Article 17 Reporting
error type: ERROR

Incoherent information.
type: Concept
notation: S065
definition: Year1 should be lower or equal than year2.
status: valid
status modified: 2019-03-20
accepted date: 2019-03-20
in scheme: CDR QaQc Habitats Directive Article 17 Reporting
error type: ERROR

Mandatory information missing.
type: Concept
notation: S066
definition: Period should be provided.
status: valid
status modified: 2019-03-20
accepted date: 2019-03-20
in scheme: CDR QaQc Habitats Directive Article 17 Reporting
error type: ERROR

Invalid code.
type: Concept
notation: S067
definition: Please check the vocabulary trends.
status: valid
status modified: 2019-03-20
accepted date: 2019-03-20
in scheme: CDR QaQc Habitats Directive Article 17 Reporting
error type: BLOCKER

Mandatory information missing.
type: Concept
notation: S068
definition: Trend should be provided. In case the information to be reported in this section is not available use 'Unk - unknown'.
status: valid
status modified: 2019-03-20
accepted date: 2019-03-20
in scheme: CDR QaQc Habitats Directive Article 17 Reporting
error type: ERROR

Incorrect data format.
type: Concept
notation: S069
definition: Numeric field, only decimals greater or equal 0 are permitted.
status: valid
status modified: 2019-03-20
accepted date: 2019-03-20
in scheme: CDR QaQc Habitats Directive Article 17 Reporting
error type: ERROR

Incorrect data format.
type: Concept
notation: S070
definition: Numeric field, only decimals greater or equal 0 are permitted.
status: valid
status modified: 2019-03-20
accepted date: 2019-03-20
in scheme: CDR QaQc Habitats Directive Article 17 Reporting
error type: ERROR

5.4b Short-term trend Magnitude - max should be greater or equal min.
type: Concept
notation: S071
status: valid
status modified: 2019-03-20
accepted date: 2019-03-20
in scheme: CDR QaQc Habitats Directive Article 17 Reporting
error type: ERROR

Invalid code.
type: Concept
notation: S072
definition: Please check the vocabulary methodsUsed.
status: valid
status modified: 2019-03-20
accepted date: 2019-03-20
in scheme: CDR QaQc Habitats Directive Article 17 Reporting
error type: BLOCKER

Incoherent information.
type: Concept
notation: S073
definition: Inconsistent values provided in fields 5.3 Short-term trend Direction and 5.5 Short-term trend Method used. When the method is 'AbsentData - Insufficient or no data available', the trend cannot be defined. If you want to report a trend as stable, increasing or decreasing based on a method using limited data, please select 'estimateExpert - Based mainly on expert opinion with very limited data' for the method used.
status: valid
status modified: 2019-03-20
accepted date: 2019-03-20
in scheme: CDR QaQc Habitats Directive Article 17 Reporting
error type: WARNING

Mandatory information missing.
type: Concept
notation: S074
definition: The method should be provided. In case the information to be reported in this section is not available use 'AbsentData - Insufficient or no data available'.
status: valid
status modified: 2019-03-20
accepted date: 2019-03-20
in scheme: CDR QaQc Habitats Directive Article 17 Reporting
error type: ERROR

Incorrect data format.
type: Concept
notation: S075
definition: Incorrect data format, it must be YYYY-YYYY.
status: valid
status modified: 2019-03-20
accepted date: 2019-03-20
in scheme: CDR QaQc Habitats Directive Article 17 Reporting
error type: ERROR

Incoherent information.
type: Concept
notation: S076
definition: Year1 should be lower or equal than year2.
status: valid
status modified: 2019-03-20
accepted date: 2019-03-20
in scheme: CDR QaQc Habitats Directive Article 17 Reporting
error type: ERROR

Invalid code.
type: Concept
notation: S077
definition: Please check the vocabulary trends.
status: valid
status modified: 2019-03-20
accepted date: 2019-03-20
in scheme: CDR QaQc Habitats Directive Article 17 Reporting
error type: BLOCKER

Incorrect data format.
type: Concept
notation: S078
definition: Numeric field, only decimals greater or equal 0 are permitted.
status: valid
status modified: 2019-03-20
accepted date: 2019-03-20
in scheme: CDR QaQc Habitats Directive Article 17 Reporting
error type: ERROR

Incorrect data format.
type: Concept
notation: S079
definition: Numeric field, only decimals greater or equal 0 are permitted.
status: valid
status modified: 2019-03-20
accepted date: 2019-03-20
in scheme: CDR QaQc Habitats Directive Article 17 Reporting
error type: ERROR

5.8b Long-term trend Magnitude - max should be greater or equal min.
type: Concept
notation: S080
status: valid
status modified: 2019-03-20
accepted date: 2019-03-20
in scheme: CDR QaQc Habitats Directive Article 17 Reporting
error type: ERROR

Invalid code.
type: Concept
notation: S081
definition: Please check the vocabulary methodsUsed.
status: valid
status modified: 2019-03-20
accepted date: 2019-03-20
in scheme: CDR QaQc Habitats Directive Article 17 Reporting
error type: BLOCKER

Only one of 5.10a, b or c Favourable reference range should be filled in.
type: Concept
notation: S082
definition: If an operator is used, there is no need to insert a value. If the value is provided for range in km2, no operator should be used. Moreover, the use of 'x - unknown' is not compatible with the use of value or operators.
status: valid
status modified: 2019-03-20
accepted date: 2019-03-20
in scheme: CDR QaQc Habitats Directive Article 17 Reporting
error type: ERROR

Mandatory information missing.
type: Concept
notation: S083
definition: Information on Favourable reference range should be provided (5.10a, b or c). In case the information to be reported in this section is not available use 'x - unknown' in 5.10c, knowing the use of operators should help to reduce the use of 'unknown' to a minimum.
status: valid
status modified: 2019-03-20
accepted date: 2019-03-20
in scheme: CDR QaQc Habitats Directive Article 17 Reporting
error type: ERROR

Incorrect data format.
type: Concept
notation: S084
definition: Numeric field, only decimals greater than 0 is permitted.
status: valid
status modified: 2019-03-20
accepted date: 2019-03-20
in scheme: CDR QaQc Habitats Directive Article 17 Reporting
error type: ERROR

Incoherent information.
type: Concept
notation: S085
definition: The Favourable reference range is smaller than 5.1 Surface area. Check whether this is on purpose.
status: valid
status modified: 2019-03-20
accepted date: 2019-03-20
in scheme: CDR QaQc Habitats Directive Article 17 Reporting
error type: WARNING

Invalid code.
type: Concept
notation: S086
definition: Please check the vocabulary favourableOperator.
status: valid
status modified: 2019-03-20
accepted date: 2019-03-20
in scheme: CDR QaQc Habitats Directive Article 17 Reporting
error type: ERROR

Invalid code.
type: Concept
notation: S087
definition: Only 'x - unknown' is allowed in this section.
status: valid
status modified: 2019-03-20
accepted date: 2019-03-20
in scheme: CDR QaQc Habitats Directive Article 17 Reporting
error type: BLOCKER

Invalid code.
type: Concept
notation: S088
definition: Please check the vocabulary reasonChange.
status: valid
status modified: 2019-03-20
accepted date: 2019-03-20
in scheme: CDR QaQc Habitats Directive Article 17 Reporting
error type: BLOCKER

Incoherent information.
type: Concept
notation: S089
definition: Incoherent information in this section. If 'noChange' is selected, there is no need to explain the nature of change.
status: valid
status modified: 2019-03-20
accepted date: 2019-03-20
in scheme: CDR QaQc Habitats Directive Article 17 Reporting
error type: ERROR

Incoherent information.
type: Concept
notation: S090
definition: Incoherent information in this section. Only one main reason is expected and should be part of the reported reasons.
status: valid
status modified: 2019-03-20
accepted date: 2019-03-20
in scheme: CDR QaQc Habitats Directive Article 17 Reporting
error type: ERROR

Mandatory information missing.
type: Concept
notation: S092
definition: Indicate if there is any change since the previous reporting period (2007-2012) in the range surface area reported. Report 'noChange' if the answer to the question: 'Is there a change between reporting periods?' is 'No'. Provide the nature of that change (more than one option can be chosen) if the answer is 'Yes'.
status: valid
status modified: 2019-03-20
accepted date: 2019-03-20
in scheme: CDR QaQc Habitats Directive Article 17 Reporting
error type: ERROR

Incorrect data format.
type: Concept
notation: S093
definition: Incorrect data format, it must be YYYY or YYYY-YYYY.
status: valid
status modified: 2019-03-20
accepted date: 2019-03-20
in scheme: CDR QaQc Habitats Directive Article 17 Reporting
error type: ERROR

Incoherent information.
type: Concept
notation: S094
definition: Year1 should be lower or equal than year2.
status: valid
status modified: 2019-03-20
accepted date: 2019-03-20
in scheme: CDR QaQc Habitats Directive Article 17 Reporting
error type: ERROR

Mandatory information missing.
type: Concept
notation: S095
definition: The year or period should be provided.
status: valid
status modified: 2019-03-20
accepted date: 2019-03-20
in scheme: CDR QaQc Habitats Directive Article 17 Reporting
error type: ERROR

Invalid code.
type: Concept
notation: S096
definition: Please check the vocabulary populationUnits.
status: valid
status modified: 2019-03-20
accepted date: 2019-03-20
in scheme: CDR QaQc Habitats Directive Article 17 Reporting
error type: BLOCKER

Incoherent information.
type: Concept
notation: S097
definition: The reported population unit differs with the recommended unit in the checklist on the reference portal. If a Member State wishes to report population size using a different unit this can be reported in field 6.4, but this must be in addition to the reporting unit specified in the checklist and not as an alternative.
status: valid
status modified: 2019-03-20
accepted date: 2019-03-20
in scheme: CDR QaQc Habitats Directive Article 17 Reporting
error type: ERROR

Incoherent information.
type: Concept
notation: S098
definition: Population size unit (6.2a) cannot be empty when Population size (6.2b,c,d) is provided.
status: valid
status modified: 2019-03-20
accepted date: 2019-03-20
in scheme: CDR QaQc Habitats Directive Article 17 Reporting
error type: ERROR

Mandatory information missing.
type: Concept
notation: S099
definition: Population size unit should be provided.
status: valid
status modified: 2019-03-20
accepted date: 2019-03-20
in scheme: CDR QaQc Habitats Directive Article 17 Reporting
error type: ERROR

Incorrect data format.
type: Concept
notation: S100
definition: Numeric field, only decimals greater or equal 0 are permitted.
status: valid
status modified: 2019-03-20
accepted date: 2019-03-20
in scheme: CDR QaQc Habitats Directive Article 17 Reporting
error type: ERROR

Incorrect data format.
type: Concept
notation: S101
definition: Numeric field, only decimals greater or equal 0 are permitted.
status: valid
status modified: 2019-03-20
accepted date: 2019-03-20
in scheme: CDR QaQc Habitats Directive Article 17 Reporting
error type: ERROR

6.2c Population size - max should be greater or equal min.
type: Concept
notation: S102
status: valid
status modified: 2019-03-20
accepted date: 2019-03-20
in scheme: CDR QaQc Habitats Directive Article 17 Reporting
error type: ERROR

Incorrect data format.
type: Concept
notation: S103
definition: Numeric field, only decimals greater or equal 0 are permitted.
status: valid
status modified: 2019-03-20
accepted date: 2019-03-20
in scheme: CDR QaQc Habitats Directive Article 17 Reporting
error type: ERROR

Mandatory information missing.
type: Concept
notation: S104
definition: Population size should be provided as interval (6.2b, c) and/or single value (6.2d). When only a minimum (or maximum) value of population size is known (e.g. through expert opinion) this should be entered in the 'Best single value' field and NOT the '(b) Minimum' or '(c) Maximum' fields.
status: valid
status modified: 2019-03-20
accepted date: 2019-03-20
in scheme: CDR QaQc Habitats Directive Article 17 Reporting
error type: ERROR

Invalid code.
type: Concept
notation: S105
definition: Please check the vocabulary typeEstimate. The value 'mean - multi-year mean' is allowed in this section.
status: valid
status modified: 2019-03-20
accepted date: 2019-03-20
in scheme: CDR QaQc Habitats Directive Article 17 Reporting
error type: BLOCKER

Incoherent information.
type: Concept
notation: S106
definition: Type of estimate was provided although there is no entry for population size (6.2b,c,d). Check coherence between these two fields. If both interval (6.2b 'Minimum' and 6.2c 'Maximum') and a single value (6.2d 'Best single value') are provided, field 6.3 'Type of estimate' should correspond to the more accurate estimate. This should be noted in 6.17 'Additional information'.
status: valid
status modified: 2019-03-20
accepted date: 2019-03-20
in scheme: CDR QaQc Habitats Directive Article 17 Reporting
error type: WARNING

Mandatory information missing.
type: Concept
notation: S107
definition: The type of estimate for population size should be provided.
status: valid
status modified: 2019-03-20
accepted date: 2019-03-20
in scheme: CDR QaQc Habitats Directive Article 17 Reporting
error type: ERROR

Invalid code.
type: Concept
notation: S108
definition: Please check the vocabulary populationUnits.
status: valid
status modified: 2019-03-20
accepted date: 2019-03-20
in scheme: CDR QaQc Habitats Directive Article 17 Reporting
error type: ERROR

Incoherent information.
type: Concept
notation: S109
definition: Additional population size unit (6.4a) cannot be empty when Additional population size (6.4b,c,d) is provided.
status: valid
status modified: 2019-03-20
accepted date: 2019-03-20
in scheme: CDR QaQc Habitats Directive Article 17 Reporting
error type: ERROR

Incorrect data format.
type: Concept
notation: S110
definition: Numeric field, only decimals greater or equal 0 are permitted.
status: valid
status modified: 2019-03-20
accepted date: 2019-03-20
in scheme: CDR QaQc Habitats Directive Article 17 Reporting
error type: ERROR

Incorrect data format.
type: Concept
notation: S111
definition: Numeric field, only decimals greater or equal 0 are permitted.
status: valid
status modified: 2019-03-20
accepted date: 2019-03-20
in scheme: CDR QaQc Habitats Directive Article 17 Reporting
error type: ERROR

6.4c Additional population size - max should be greater or equal min.
type: Concept
notation: S112
status: valid
status modified: 2019-03-20
accepted date: 2019-03-20
in scheme: CDR QaQc Habitats Directive Article 17 Reporting
error type: ERROR

Invalid code.
type: Concept
notation: S113
definition: Please check the vocabulary typeEstimate. The value 'mean - multi-year mean' is allowed in this section.
status: valid
status modified: 2019-03-20
accepted date: 2019-03-20
in scheme: CDR QaQc Habitats Directive Article 17 Reporting
error type: BLOCKER

Invalid code.
type: Concept
notation: S114
definition: Please check the vocabulary methodsUsed.
status: valid
status modified: 2019-03-20
accepted date: 2019-03-20
in scheme: CDR QaQc Habitats Directive Article 17 Reporting
error type: BLOCKER

Incoherent information.
type: Concept
notation: S115
definition: 6.3 Type of estimate should be empty when Population size Method used is 'AbsentData - Insufficient or no data available'. When the method is assessed as 'AbsentData - Insufficient or no data available', the type of estimate used for the population size cannot be defined. If you want to report an estimate based on a method using limited data, please select 'estimateExpert - Based mainly on expert opinion with very limited data' for the method used.
status: valid
status modified: 2019-03-20
accepted date: 2019-03-20
in scheme: CDR QaQc Habitats Directive Article 17 Reporting
error type: WARNING

Mandatory information missing.
type: Concept
notation: S116
definition: The method should be provided. In case the information to be reported in this section is not available use 'AbsentData - Insufficient or no data available'.
status: valid
status modified: 2019-03-20
accepted date: 2019-03-20
in scheme: CDR QaQc Habitats Directive Article 17 Reporting
error type: ERROR

Incorrect data format.
type: Concept
notation: S117
definition: Incorrect data format, it must be YYYY-YYYY.
status: valid
status modified: 2019-03-20
accepted date: 2019-03-20
in scheme: CDR QaQc Habitats Directive Article 17 Reporting
error type: ERROR

Incoherent information.
type: Concept
notation: S118
definition: Year1 should be lower or equal than year2.
status: valid
status modified: 2019-03-20
accepted date: 2019-03-20
in scheme: CDR QaQc Habitats Directive Article 17 Reporting
error type: ERROR

Mandatory information missing.
type: Concept
notation: S119
definition: The period should be provided.
status: valid
status modified: 2019-03-20
accepted date: 2019-03-20
in scheme: CDR QaQc Habitats Directive Article 17 Reporting
error type: ERROR

Invalid code.
type: Concept
notation: S120
definition: Please check the vocabulary trends.
status: valid
status modified: 2019-03-20
accepted date: 2019-03-20
in scheme: CDR QaQc Habitats Directive Article 17 Reporting
error type: BLOCKER

Mandatory information missing.
type: Concept
notation: S121
definition: Trend should be provided. In case the information to be reported in this section is not available use 'Unk - unknown'.
status: valid
status modified: 2019-03-20
accepted date: 2019-03-20
in scheme: CDR QaQc Habitats Directive Article 17 Reporting
error type: ERROR

Incorrect data format.
type: Concept
notation: S122
definition: Numeric field, only decimals greater or equal 0 are permitted.
status: valid
status modified: 2019-03-20
accepted date: 2019-03-20
in scheme: CDR QaQc Habitats Directive Article 17 Reporting
error type: ERROR

Incorrect data format.
type: Concept
notation: S123
definition: Numeric field, only decimals greater or equal 0 are permitted.
status: valid
status modified: 2019-03-20
accepted date: 2019-03-20
in scheme: CDR QaQc Habitats Directive Article 17 Reporting
error type: ERROR

6.9b Short-term trend Magnitude - max should be greater or equal min.
type: Concept
notation: S124
status: valid
status modified: 2019-03-20
accepted date: 2019-03-20
in scheme: CDR QaQc Habitats Directive Article 17 Reporting
error type: ERROR

Incorrect data format.
type: Concept
notation: S125
definition: Numeric field, only decimals greater or equal 0 are permitted.
status: valid
status modified: 2019-03-20
accepted date: 2019-03-20
in scheme: CDR QaQc Habitats Directive Article 17 Reporting
error type: ERROR

Invalid code.
type: Concept
notation: S126
definition: Please check the vocabulary methodsUsed.
status: valid
status modified: 2019-03-20
accepted date: 2019-03-20
in scheme: CDR QaQc Habitats Directive Article 17 Reporting
error type: BLOCKER

Incoherent information.
type: Concept
notation: S127
definition: Inconsistent values provided in fields 6.8 Short-term trend Direction and 6.10 Short-term trend Method used. When the method is assessed as 'AbsentData - Insufficient or no data available', the trend cannot be defined. If you want to report a trend as stable, increasing or decreasing based on a method using limited data, please select 'estimateExpert - Based mainly on expert opinion with very limited data' for the method used.
status: valid
status modified: 2019-03-20
accepted date: 2019-03-20
in scheme: CDR QaQc Habitats Directive Article 17 Reporting
error type: WARNING

Mandatory information missing.
type: Concept
notation: S128
definition: The method should be provided. In case the information to be reported in this section is not available use 'AbsentData - Insufficient or no data available'.
status: valid
status modified: 2019-03-20
accepted date: 2019-03-20
in scheme: CDR QaQc Habitats Directive Article 17 Reporting
error type: ERROR

Incorrect data format.
type: Concept
notation: S129
definition: Incorrect data format, it must be YYYY-YYYY.
status: valid
status modified: 2019-03-20
accepted date: 2019-03-20
in scheme: CDR QaQc Habitats Directive Article 17 Reporting
error type: ERROR

Incoherent information.
type: Concept
notation: S130
definition: Year1 should be lower or equal than year2.
status: valid
status modified: 2019-03-20
accepted date: 2019-03-20
in scheme: CDR QaQc Habitats Directive Article 17 Reporting
error type: ERROR

Invalid code.
type: Concept
notation: S131
definition: Please check the vocabulary trends.
status: valid
status modified: 2019-03-20
accepted date: 2019-03-20
in scheme: CDR QaQc Habitats Directive Article 17 Reporting
error type: BLOCKER

Incorrect data format.
type: Concept
notation: S132
definition: Numeric field, only decimals greater or equal 0 are permitted.
status: valid
status modified: 2019-03-20
accepted date: 2019-03-20
in scheme: CDR QaQc Habitats Directive Article 17 Reporting
error type: ERROR

Incorrect data format.
type: Concept
notation: S133
definition: Numeric field, only decimals greater or equal 0 are permitted.
status: valid
status modified: 2019-03-20
accepted date: 2019-03-20
in scheme: CDR QaQc Habitats Directive Article 17 Reporting
error type: ERROR

6.13b Long-term trend Magnitude - max should be greater or equal min.
type: Concept
notation: S134
status: valid
status modified: 2019-03-20
accepted date: 2019-03-20
in scheme: CDR QaQc Habitats Directive Article 17 Reporting
error type: ERROR

Incorrect data format.
type: Concept
notation: S135
definition: Numeric field, only decimals greater or equal 0 are permitted.
status: valid
status modified: 2019-03-20
accepted date: 2019-03-20
in scheme: CDR QaQc Habitats Directive Article 17 Reporting
error type: ERROR

Invalid code.
type: Concept
notation: S136
definition: Please check the vocabulary methodsUsed.
status: valid
status modified: 2019-03-20
accepted date: 2019-03-20
in scheme: CDR QaQc Habitats Directive Article 17 Reporting
error type: BLOCKER

Only one of 6.15a1, b or c Favourable reference population should be filled in.
type: Concept
notation: S137
definition: If an operator is used, there is no need to insert a value. If the value is provided for population size, no operator should be used. Moreover, the use of 'x - unknown' is not compatible with the use of value or operators.
status: valid
status modified: 2019-03-20
accepted date: 2019-03-20
in scheme: CDR QaQc Habitats Directive Article 17 Reporting
error type: ERROR

Mandatory information missing.
type: Concept
notation: S138
definition: Information on Favourable reference population should be provided (6.15a, b or c). In case the information to be reported in this section is not available use 'x - unknown' in 6.15c, knowing the use of operators should help to reduce the use of 'unknown' to a minimum.
status: valid
status modified: 2019-03-20
accepted date: 2019-03-20
in scheme: CDR QaQc Habitats Directive Article 17 Reporting
error type: ERROR

Incorrect data format.
type: Concept
notation: S139
definition: Numeric field, only decimals greater than 0 is permitted.
status: valid
status modified: 2019-03-20
accepted date: 2019-03-20
in scheme: CDR QaQc Habitats Directive Article 17 Reporting
error type: ERROR

Incoherent information.
type: Concept
notation: S140
definition: The Favourable reference population size is smaller than 6.2 current population size. Check whether this is on purpose.
status: valid
status modified: 2019-03-20
accepted date: 2019-03-20
in scheme: CDR QaQc Habitats Directive Article 17 Reporting
error type: WARNING

Incoherent information.
type: Concept
notation: S141
definition: The Favourable reference population size is smaller than 6.4 current additional population size. Check whether this is on purpose.
status: valid
status modified: 2019-03-20
accepted date: 2019-03-20
in scheme: CDR QaQc Habitats Directive Article 17 Reporting
error type: WARNING

Invalid code.
type: Concept
notation: S142
definition: Please check the vocabulary populationUnits.
status: valid
status modified: 2019-03-20
accepted date: 2019-03-20
in scheme: CDR QaQc Habitats Directive Article 17 Reporting
error type: ERROR

Incoherent information.
type: Concept
notation: S143
definition: The Favourable reference population size unit should correspond to the current recommended or additional population size (SpecReg.6.2a, SpecReg.6.4a).
status: valid
status modified: 2019-03-20
accepted date: 2019-03-20
in scheme: CDR QaQc Habitats Directive Article 17 Reporting
error type: ERROR

Invalid code.
type: Concept
notation: S144
definition: Please check the vocabulary favourableOperator.
status: valid
status modified: 2019-03-20
accepted date: 2019-03-20
in scheme: CDR QaQc Habitats Directive Article 17 Reporting
error type: BLOCKER

Invalid code.
type: Concept
notation: S145
definition: Only 'x - unknown' is allowed in this section.
status: valid
status modified: 2019-03-20
accepted date: 2019-03-20
in scheme: CDR QaQc Habitats Directive Article 17 Reporting
error type: BLOCKER

Invalid code.
type: Concept
notation: S146
definition: Please check the vocabulary reasonChange.
status: valid
status modified: 2019-03-20
accepted date: 2019-03-20
in scheme: CDR QaQc Habitats Directive Article 17 Reporting
error type: BLOCKER

Incoherent information.
type: Concept
notation: S147
definition: Incoherent information in this section. If 'noChange' is selected, there is no need to explain the nature of change.
status: valid
status modified: 2019-03-20
accepted date: 2019-03-20
in scheme: CDR QaQc Habitats Directive Article 17 Reporting
error type: ERROR

Incoherent information.
type: Concept
notation: S148
definition: Incoherent information in this section. Only one main reason is expected and should be part of the reported reasons.
status: valid
status modified: 2019-03-20
accepted date: 2019-03-20
in scheme: CDR QaQc Habitats Directive Article 17 Reporting
error type: ERROR

Mandatory information missing.
type: Concept
notation: S150
definition: Indicate if there is any change since the previous reporting period (2007-2012) in the population size reported. Report 'noChange' if the answer to the question: 'Is there a change between reporting periods?' is 'No'. Provide the nature of that change (more than one option can be chosen) if the answer is 'Yes'.
status: valid
status modified: 2019-03-20
accepted date: 2019-03-20
in scheme: CDR QaQc Habitats Directive Article 17 Reporting
error type: ERROR

Invalid code.
type: Concept
notation: S151
definition: Please check the vocabulary yesNoUnknown.
status: valid
status modified: 2019-03-20
accepted date: 2019-03-20
in scheme: CDR QaQc Habitats Directive Article 17 Reporting
error type: BLOCKER

Mandatory information missing.
type: Concept
notation: S152
definition: Information on the sufficiency and quality of occupied habitat area should be provided.
status: valid
status modified: 2019-03-20
accepted date: 2019-03-20
in scheme: CDR QaQc Habitats Directive Article 17 Reporting
error type: ERROR

Invalid code.
type: Concept
notation: S153
definition: Please check the vocabulary yesNoUnknown.
status: valid
status modified: 2019-03-20
accepted date: 2019-03-20
in scheme: CDR QaQc Habitats Directive Article 17 Reporting
error type: BLOCKER

Incoherent information.
type: Concept
notation: S154
definition: Incoherent information in this section. Information on unoccupied habitat area is only expected if the answer to the question: 'Are area and quality of the occupied habitat sufficient' is 'N - No'.
status: valid
status modified: 2019-03-20
accepted date: 2019-03-20
in scheme: CDR QaQc Habitats Directive Article 17 Reporting
error type: WARNING

Mandatory information missing.
type: Concept
notation: S155
definition: Information related to unoccupied habitat area should be provided.
status: valid
status modified: 2019-03-20
accepted date: 2019-03-20
in scheme: CDR QaQc Habitats Directive Article 17 Reporting
error type: ERROR

Invalid code.
type: Concept
notation: S156
definition: Please check the vocabulary methodsUsed.
status: valid
status modified: 2019-03-20
accepted date: 2019-03-20
in scheme: CDR QaQc Habitats Directive Article 17 Reporting
error type: BLOCKER

Mandatory information missing.
type: Concept
notation: S157
definition: The method should be provided. In case the information to be reported in this section is not available use 'AbsentData - Insufficient or no data available'.
status: valid
status modified: 2019-03-20
accepted date: 2019-03-20
in scheme: CDR QaQc Habitats Directive Article 17 Reporting
error type: ERROR

Incorrect data format.
type: Concept
notation: S158
definition: Incorrect data format, it must be YYYY-YYYY.
status: valid
status modified: 2019-03-20
accepted date: 2019-03-20
in scheme: CDR QaQc Habitats Directive Article 17 Reporting
error type: ERROR

Incoherent information.
type: Concept
notation: S159
definition: Year1 should be lower or equal than year2.
status: valid
status modified: 2019-03-20
accepted date: 2019-03-20
in scheme: CDR QaQc Habitats Directive Article 17 Reporting
error type: ERROR

Mandatory information missing.
type: Concept
notation: S160
definition: The period should be provided.
status: valid
status modified: 2019-03-20
accepted date: 2019-03-20
in scheme: CDR QaQc Habitats Directive Article 17 Reporting
error type: ERROR

Invalid code.
type: Concept
notation: S161
definition: Please check the vocabulary trends.
status: valid
status modified: 2019-03-20
accepted date: 2019-03-20
in scheme: CDR QaQc Habitats Directive Article 17 Reporting
error type: BLOCKER

Mandatory information missing.
type: Concept
notation: S162
definition: Trend should be provided. In case the information to be reported in this section is not available use 'Unk - unknown'.
status: valid
status modified: 2019-03-20
accepted date: 2019-03-20
in scheme: CDR QaQc Habitats Directive Article 17 Reporting
error type: ERROR

Invalid code.
type: Concept
notation: S163
definition: Please check the vocabulary methodsUsed.
status: valid
status modified: 2019-03-20
accepted date: 2019-03-20
in scheme: CDR QaQc Habitats Directive Article 17 Reporting
error type: BLOCKER

Incoherent information.
type: Concept
notation: S164
definition: Inconsistent values provided in fields 7.4 Short-term trend Direction and 7.5 Short-term trend Method used. When the method is assessed as 'AbsentData - Insufficient or no data available', the trend cannot be defined. If you want to report a trend as stable, increasing or decreasing based on a method using limited data, please select 'estimateExpert - Based mainly on expert opinion with very limited data' for the method used.
status: valid
status modified: 2019-03-20
accepted date: 2019-03-20
in scheme: CDR QaQc Habitats Directive Article 17 Reporting
error type: WARNING

Mandatory information missing.
type: Concept
notation: S165
definition: The method should be provided. In case the information to be reported in this section is not available use 'AbsentData - Insufficient or no data available'.
status: valid
status modified: 2019-03-20
accepted date: 2019-03-20
in scheme: CDR QaQc Habitats Directive Article 17 Reporting
error type: ERROR

Incorrect data format.
type: Concept
notation: S166
definition: Incorrect data format, it must be YYYY-YYYY.
status: valid
status modified: 2019-03-20
accepted date: 2019-03-20
in scheme: CDR QaQc Habitats Directive Article 17 Reporting
error type: ERROR

Incoherent information.
type: Concept
notation: S167
definition: Year1 should be lower or equal than year2.
status: valid
status modified: 2019-03-20
accepted date: 2019-03-20
in scheme: CDR QaQc Habitats Directive Article 17 Reporting
error type: ERROR

Invalid code.
type: Concept
notation: S168
definition: Please check the vocabulary trends.
status: valid
status modified: 2019-03-20
accepted date: 2019-03-20
in scheme: CDR QaQc Habitats Directive Article 17 Reporting
error type: BLOCKER

Invalid code.
type: Concept
notation: S169
definition: Please check the vocabulary methodsUsed.
status: valid
status modified: 2019-03-20
accepted date: 2019-03-20
in scheme: CDR QaQc Habitats Directive Article 17 Reporting
error type: BLOCKER

Invalid code.
type: Concept
notation: S170
definition: Please check the vocabulary threats.
status: valid
status modified: 2019-03-20
accepted date: 2019-03-20
in scheme: CDR QaQc Habitats Directive Article 17 Reporting
error type: BLOCKER

More entries than permitted.
type: Concept
notation: S171
definition: More entries than permitted. Maximum of 10 pressures per biogeographical assessment.
status: valid
status modified: 2019-03-20
accepted date: 2019-03-20
in scheme: CDR QaQc Habitats Directive Article 17 Reporting
error type: ERROR

More entries than permitted.
type: Concept
notation: S172
definition: More entries than permitted. Maximum of 10 threats per biogeographical assessment.
status: valid
status modified: 2019-03-20
accepted date: 2019-03-20
in scheme: CDR QaQc Habitats Directive Article 17 Reporting
error type: ERROR

More entries than permitted.
type: Concept
notation: S173
definition: More entries than permitted. Maximum of 5 pressures with 'H - High importance' per biogeographical assessment.
status: valid
status modified: 2019-03-20
accepted date: 2019-03-20
in scheme: CDR QaQc Habitats Directive Article 17 Reporting
error type: ERROR

More entries than permitted.
type: Concept
notation: S174
definition: More entries than permitted. Maximum of 5 threats with 'H - High importance' per biogeographical assessment.
status: valid
status modified: 2019-03-20
accepted date: 2019-03-20
in scheme: CDR QaQc Habitats Directive Article 17 Reporting
error type: ERROR

Incoherent information.
type: Concept
notation: S175
definition: Incoherent information in this section. Code 'Xu - Unknown pressure' or 'Xxp - No pressures ' should be reported as a pressure, not as a threat.
status: valid
status modified: 2019-03-20
accepted date: 2019-03-20
in scheme: CDR QaQc Habitats Directive Article 17 Reporting
error type: ERROR

Incoherent information.
type: Concept
notation: S176
definition: Incoherent information in this section. Code 'Xt - No information on threats' used but other threats listed.
status: valid
status modified: 2019-03-20
accepted date: 2019-03-20
in scheme: CDR QaQc Habitats Directive Article 17 Reporting
error type: WARNING

Incoherent information.
type: Concept
notation: S177
definition: Incoherent information in this section. Code 'Xp - No information on pressures' used but other pressures listed.
status: valid
status modified: 2019-03-20
accepted date: 2019-03-20
in scheme: CDR QaQc Habitats Directive Article 17 Reporting
error type: WARNING

Mandatory information missing.
type: Concept
notation: S178
definition: The list of pressures and/or threats should be provided. Report 'Xp - No information on pressures' and/or 'Xt - No information on threats' for missing information.
status: valid
status modified: 2019-03-20
accepted date: 2019-03-20
in scheme: CDR QaQc Habitats Directive Article 17 Reporting
error type: ERROR

Mandatory information missing.
type: Concept
notation: S179
definition: The list of threats should be provided. Report 'Xt - No information on threats' for missing information.
status: valid
status modified: 2019-03-20
accepted date: 2019-03-20
in scheme: CDR QaQc Habitats Directive Article 17 Reporting
error type: ERROR

Mandatory information missing.
type: Concept
notation: S180
definition: The list of pressures should be provided. Report 'Xp - No information on pressures' for missing information.
status: valid
status modified: 2019-03-20
accepted date: 2019-03-20
in scheme: CDR QaQc Habitats Directive Article 17 Reporting
error type: ERROR

Invalid code.
type: Concept
notation: S181
definition: Please check the vocabulary ranking.
status: valid
status modified: 2019-03-20
accepted date: 2019-03-20
in scheme: CDR QaQc Habitats Directive Article 17 Reporting
error type: BLOCKER

Incoherent information.
type: Concept
notation: S182
definition: Incoherent information in this section. Ranking is provided although no code indicated for pressure and/or threat.
status: valid
status modified: 2019-03-20
accepted date: 2019-03-20
in scheme: CDR QaQc Habitats Directive Article 17 Reporting
error type: ERROR

Mandatory information missing.
type: Concept
notation: S183
definition: This field cannot be empty unless the reported code is 'Xp', 'Xt', 'Xu', 'Xxp' or 'Xxt'.
status: valid
status modified: 2019-03-20
accepted date: 2019-03-20
in scheme: CDR QaQc Habitats Directive Article 17 Reporting
error type: ERROR

Invalid code.
type: Concept
notation: S184
definition: Code should be 'p' = pressure or 't' = threat.
status: valid
status modified: 2019-03-20
accepted date: 2019-03-20
in scheme: CDR QaQc Habitats Directive Article 17 Reporting
error type: ERROR

Incoherent information.
type: Concept
notation: S185
definition: Incoherent information in this section. Type of pressure/threat is provided although no code indicated for pressure and/or threat.
status: valid
status modified: 2019-03-20
accepted date: 2019-03-20
in scheme: CDR QaQc Habitats Directive Article 17 Reporting
error type: ERROR

Mandatory information missing.
type: Concept
notation: S186
definition: The type of pressure or threats should be systematically provided. Code should be 'p' = pressure or 't' = threat.
status: valid
status modified: 2019-03-20
accepted date: 2019-03-20
in scheme: CDR QaQc Habitats Directive Article 17 Reporting
error type: ERROR

Invalid code.
type: Concept
notation: S187
definition: Code should be 'Yes' or 'No'.
status: valid
status modified: 2019-03-20
accepted date: 2019-03-20
in scheme: CDR QaQc Habitats Directive Article 17 Reporting
error type: BLOCKER

Mandatory information missing.
type: Concept
notation: S188
definition: Indicate whether measures are needed or not.
status: valid
status modified: 2019-03-20
accepted date: 2019-03-20
in scheme: CDR QaQc Habitats Directive Article 17 Reporting
error type: ERROR

Incoherent information.
type: Concept
notation: S189
definition: Incoherent information in this section. Status of measures is not expected if no measures are needed.
status: valid
status modified: 2019-03-20
accepted date: 2019-03-20
in scheme: CDR QaQc Habitats Directive Article 17 Reporting
error type: ERROR

Invalid code.
type: Concept
notation: S190
definition: Please check the vocabulary measuresIdentified.
status: valid
status modified: 2019-03-20
accepted date: 2019-03-20
in scheme: CDR QaQc Habitats Directive Article 17 Reporting
error type: BLOCKER

Mandatory information missing.
type: Concept
notation: S191
definition: Status of measures should be provided if measures are needed.
status: valid
status modified: 2019-03-20
accepted date: 2019-03-20
in scheme: CDR QaQc Habitats Directive Article 17 Reporting
error type: ERROR

Incoherent information.
type: Concept
notation: S192
definition: Incoherent information in this section. The main purpose of measures taken is not expected if no measures are identified and taken.
status: valid
status modified: 2019-03-20
accepted date: 2019-03-20
in scheme: CDR QaQc Habitats Directive Article 17 Reporting
error type: WARNING

Invalid code.
type: Concept
notation: S193
definition: Please check the vocabulary measuresPurposeSpecies.
status: valid
status modified: 2019-03-20
accepted date: 2019-03-20
in scheme: CDR QaQc Habitats Directive Article 17 Reporting
error type: BLOCKER

Incoherent information.
type: Concept
notation: S194
definition: Incoherent information in this section. The main purpose of measures taken is expected if measures are identified and taken.
status: valid
status modified: 2019-03-20
accepted date: 2019-03-20
in scheme: CDR QaQc Habitats Directive Article 17 Reporting
error type: ERROR

Incoherent information.
type: Concept
notation: S195
definition: Incoherent information in this section. Location of measures is not expected if no measures are identified and taken.
status: valid
status modified: 2019-03-20
accepted date: 2019-03-20
in scheme: CDR QaQc Habitats Directive Article 17 Reporting
error type: WARNING

Invalid code.
type: Concept
notation: S196
definition: Please check the vocabulary measuresLocation.
status: valid
status modified: 2019-03-20
accepted date: 2019-03-20
in scheme: CDR QaQc Habitats Directive Article 17 Reporting
error type: BLOCKER

Incoherent information.
type: Concept
notation: S197
definition: Incoherent information in this section. The location of the measures is expected if measures are identified and taken.
status: valid
status modified: 2019-03-20
accepted date: 2019-03-20
in scheme: CDR QaQc Habitats Directive Article 17 Reporting
error type: ERROR

Incoherent information.
type: Concept
notation: S198
definition: Incoherent information in this section. Time frame of response to measures is not expected if no measures are identified and taken.
status: valid
status modified: 2019-03-20
accepted date: 2019-03-20
in scheme: CDR QaQc Habitats Directive Article 17 Reporting
error type: WARNING

Invalid code.
type: Concept
notation: S199
definition: Please check the vocabulary measuresResponse.
status: valid
status modified: 2019-03-20
accepted date: 2019-03-20
in scheme: CDR QaQc Habitats Directive Article 17 Reporting
error type: BLOCKER

Mandatory information missing.
type: Concept
notation: S200
definition: The time frame of the response to measures should be provided if measures are identified and taken.
status: valid
status modified: 2019-03-20
accepted date: 2019-03-20
in scheme: CDR QaQc Habitats Directive Article 17 Reporting
error type: ERROR

Invalid code.
type: Concept
notation: S201
definition: Please check the vocabulary measures.
status: valid
status modified: 2019-03-20
accepted date: 2019-03-20
in scheme: CDR QaQc Habitats Directive Article 17 Reporting
error type: BLOCKER

More entries than permitted.
type: Concept
notation: S203
definition: More entries than permitted. Maximum of 10 measures per biogeographical assessment.
status: valid
status modified: 2019-03-20
accepted date: 2019-03-20
in scheme: CDR QaQc Habitats Directive Article 17 Reporting
error type: ERROR

Mandatory information missing.
type: Concept
notation: S204
definition: The list of measures should be provided if measures are identified and taken.
status: valid
status modified: 2019-03-20
accepted date: 2019-03-20
in scheme: CDR QaQc Habitats Directive Article 17 Reporting
error type: ERROR

Invalid code.
type: Concept
notation: S205
definition: Please check the vocabulary Prospects.
status: valid
status modified: 2019-03-20
accepted date: 2019-03-20
in scheme: CDR QaQc Habitats Directive Article 17 Reporting
error type: BLOCKER

Mandatory information missing.
type: Concept
notation: S206
definition: The future prospects of each of the three parameters should be provided. In case the information to be reported in this section is not available use 'unk - unknown'.
status: valid
status modified: 2019-03-20
accepted date: 2019-03-20
in scheme: CDR QaQc Habitats Directive Article 17 Reporting
error type: ERROR

Invalid code.
type: Concept
notation: S207
definition: Please check the vocabulary Prospects.
status: valid
status modified: 2019-03-20
accepted date: 2019-03-20
in scheme: CDR QaQc Habitats Directive Article 17 Reporting
error type: BLOCKER

Mandatory information missing.
type: Concept
notation: S208
definition: The future prospects of each ofThe three parameters should be provided. In case the information to be reported in this section is not available use 'unk - unknown'.
status: valid
status modified: 2019-03-20
accepted date: 2019-03-20
in scheme: CDR QaQc Habitats Directive Article 17 Reporting
error type: ERROR

Invalid code.
type: Concept
notation: S209
definition: Please check the vocabulary Prospects.
status: valid
status modified: 2019-03-20
accepted date: 2019-03-20
in scheme: CDR QaQc Habitats Directive Article 17 Reporting
error type: BLOCKER

Mandatory information missing.
type: Concept
notation: S210
definition: The future prospects of each of the three parameters should be provided. In case the information to be reported in this section is not available use 'unk - unknown'.
status: valid
status modified: 2019-03-20
accepted date: 2019-03-20
in scheme: CDR QaQc Habitats Directive Article 17 Reporting
error type: ERROR

Invalid code.
type: Concept
notation: S211
definition: Please check the vocabulary assessments.
status: valid
status modified: 2019-03-20
accepted date: 2019-03-20
in scheme: CDR QaQc Habitats Directive Article 17 Reporting
error type: BLOCKER

Incoherent information.
type: Concept
notation: S212
definition: Incoherent information in this section. The conclusion for Range should be 'U2 - Unfavourable - Bad' when range surface area is more than 10% below favourable reference range (reported value in 5.10b is '>> - Much more than').
status: valid
status modified: 2019-03-20
accepted date: 2019-03-20
in scheme: CDR QaQc Habitats Directive Article 17 Reporting
error type: ERROR

Incoherent information.
type: Concept
notation: S213
definition: Incoherent information in this section. The conclusion for Range cannot be 'FV - Favourable' when the trend is decreasing (reported value in 5.3 is 'D - Decreasing').
status: valid
status modified: 2019-03-20
accepted date: 2019-03-20
in scheme: CDR QaQc Habitats Directive Article 17 Reporting
error type: ERROR

Mandatory information missing.
type: Concept
notation: S214
definition: The conclusion for Range should be provided.
status: valid
status modified: 2019-03-20
accepted date: 2019-03-20
in scheme: CDR QaQc Habitats Directive Article 17 Reporting
error type: ERROR

Invalid code.
type: Concept
notation: S215
definition: Please check the vocabulary assessments.
status: valid
status modified: 2019-03-20
accepted date: 2019-03-20
in scheme: CDR QaQc Habitats Directive Article 17 Reporting
error type: BLOCKER

Incoherent information.
type: Concept
notation: S216
definition: Incoherent information in this section. Conclusion for Population should be 'U2 - Unfavourable - Bad' when population size is more than 25% below favourable reference population (reported value in 6.15b is '>> - Much more than').
status: valid
status modified: 2019-03-20
accepted date: 2019-03-20
in scheme: CDR QaQc Habitats Directive Article 17 Reporting
error type: ERROR

Incoherent information.
type: Concept
notation: S217
definition: Incoherent information in this section. The conclusion for Population cannot be 'FV - Favourable' when the trend is decreasing (reported value in 6.8 is 'D - Decreasing').
status: valid
status modified: 2019-03-20
accepted date: 2019-03-20
in scheme: CDR QaQc Habitats Directive Article 17 Reporting
error type: ERROR

Mandatory information missing.
type: Concept
notation: S218
definition: The conclusion for Population should be provided.
status: valid
status modified: 2019-03-20
accepted date: 2019-03-20
in scheme: CDR QaQc Habitats Directive Article 17 Reporting
error type: ERROR

Invalid code.
type: Concept
notation: S219
definition: Please check the vocabulary assessments.
status: valid
status modified: 2019-03-20
accepted date: 2019-03-20
in scheme: CDR QaQc Habitats Directive Article 17 Reporting
error type: BLOCKER

Mandatory information missing.
type: Concept
notation: S220
definition: The conclusion for Habitat for the species should be provided.
status: valid
status modified: 2019-03-20
accepted date: 2019-03-20
in scheme: CDR QaQc Habitats Directive Article 17 Reporting
error type: ERROR

Invalid code.
type: Concept
notation: S221
definition: Please check the vocabulary assessments.
status: valid
status modified: 2019-03-20
accepted date: 2019-03-20
in scheme: CDR QaQc Habitats Directive Article 17 Reporting
error type: BLOCKER

Incoherent information.
type: Concept
notation: S222
definition: Incoherent information in this section. Conclusion for Future prospects should be 'FV - Favourable' if all parameters (10.1a,b,c) have 'good' prospects, or prospects of one parameter is 'unk - unknown' and the other prospects are 'good'.
status: valid
status modified: 2019-03-20
accepted date: 2019-03-20
in scheme: CDR QaQc Habitats Directive Article 17 Reporting
error type: ERROR

Incoherent information.
type: Concept
notation: S223
definition: Incoherent information in this section. Conclusion for Future prospects should be 'U2 - Unfavourable - Bad' if one or more parameters (10.1a,b,c) have 'bad' prospects.
status: valid
status modified: 2019-03-20
accepted date: 2019-03-20
in scheme: CDR QaQc Habitats Directive Article 17 Reporting
error type: ERROR

Incoherent information.
type: Concept
notation: S224
definition: Incoherent information in this section. Conclusion for Future prospects should be 'XX - Unknown' if two or more parameters (10.1a,b,c) are 'unk - unknown' and no parameter with 'bad' prospects.
status: valid
status modified: 2019-03-20
accepted date: 2019-03-20
in scheme: CDR QaQc Habitats Directive Article 17 Reporting
error type: ERROR

Mandatory information missing.
type: Concept
notation: S225
definition: The conclusion for Future prospects should be provided.
status: valid
status modified: 2019-03-20
accepted date: 2019-03-20
in scheme: CDR QaQc Habitats Directive Article 17 Reporting
error type: ERROR

Invalid code.
type: Concept
notation: S226
definition: Please check the vocabulary assessments.
status: valid
status modified: 2019-03-20
accepted date: 2019-03-20
in scheme: CDR QaQc Habitats Directive Article 17 Reporting
error type: BLOCKER

Incoherent information.
type: Concept
notation: S227
definition: Incoherent information in this section. Overall assessment should be 'FV - Favourable' if all assessments of parameters (11.1 to 11.4) are 'FV - Favourable', or three are 'FV - Favourable' and one is 'XX - Unknown'.
status: valid
status modified: 2019-03-20
accepted date: 2019-03-20
in scheme: CDR QaQc Habitats Directive Article 17 Reporting
error type: ERROR

Incoherent information.
type: Concept
notation: S228
definition: Incoherent information in this section. Overall assessment should be 'U2 - Unfavourable - Bad' if at least one assessment of parameters (11.1 to 11.4) is 'U2 - Unfavourable - Bad'.
status: valid
status modified: 2019-03-20
accepted date: 2019-03-20
in scheme: CDR QaQc Habitats Directive Article 17 Reporting
error type: ERROR

Incoherent information.
type: Concept
notation: S229
definition: Incoherent information in this section. Overall assessment should be 'U1 - Unfavourable - Inadequate' if at least one assessment of parameters (11.1 to 11.4) is 'U1 - Unfavourable - Inadequate' and none is 'U2 - Unfavourable - Bad'.
status: valid
status modified: 2019-03-20
accepted date: 2019-03-20
in scheme: CDR QaQc Habitats Directive Article 17 Reporting
error type: ERROR

Mandatory information missing.
type: Concept
notation: S230
definition: Conclusion for Overall assessment of Conservation Status should be provided.
status: valid
status modified: 2019-03-20
accepted date: 2019-03-20
in scheme: CDR QaQc Habitats Directive Article 17 Reporting
error type: ERROR

Mandatory information missing.
type: Concept
notation: S231
definition: Conclusion for Overall assessment of Conservation Status should be provided as other conclusions are provided (11.1 to 11.4).
status: valid
status modified: 2019-03-20
accepted date: 2019-03-20
in scheme: CDR QaQc Habitats Directive Article 17 Reporting
error type: ERROR

Invalid code.
type: Concept
notation: S232
definition: Please check the vocabulary trendsConclusion.
status: valid
status modified: 2019-03-20
accepted date: 2019-03-20
in scheme: CDR QaQc Habitats Directive Article 17 Reporting
error type: BLOCKER

Mandatory information missing.
type: Concept
notation: S233
definition: Overall trend in conservation status should be provided when 11.5 Conclusions - Overall assessment of Conservation Status is not 'XX - Unknown'.
status: valid
status modified: 2019-03-20
accepted date: 2019-03-20
in scheme: CDR QaQc Habitats Directive Article 17 Reporting
error type: ERROR

Invalid code.
type: Concept
notation: S234
definition: Please check the vocabulary reasonChange.
status: valid
status modified: 2019-03-20
accepted date: 2019-03-20
in scheme: CDR QaQc Habitats Directive Article 17 Reporting
error type: BLOCKER

Incoherent information.
type: Concept
notation: S235
definition: Incoherent information in this section. If 'noChange' is selected,There is no need to explain the nature of change.
status: valid
status modified: 2019-03-20
accepted date: 2019-03-20
in scheme: CDR QaQc Habitats Directive Article 17 Reporting
error type: ERROR

Incoherent information.
type: Concept
notation: S236
definition: Incoherent information in this section. Only one main reason is expected and should be part of the reported reasons.
status: valid
status modified: 2019-03-20
accepted date: 2019-03-20
in scheme: CDR QaQc Habitats Directive Article 17 Reporting
error type: ERROR

Mandatory information missing.
type: Concept
notation: S238
definition: Indicate if there is any change since the previous reporting period (2007-2012) in conservation status. Report 'noChange' if the answer to the question: 'Is there a change from the previous reporting round?' is 'No, there is no difference'. Provide the nature of that change (more than one option can be chosen) if the answer is 'Yes'.
status: valid
status modified: 2019-03-20
accepted date: 2019-03-20
in scheme: CDR QaQc Habitats Directive Article 17 Reporting
error type: ERROR

Invalid code.
type: Concept
notation: S239
definition: Please check the vocabulary reasonChange.
status: valid
status modified: 2019-03-20
accepted date: 2019-03-20
in scheme: CDR QaQc Habitats Directive Article 17 Reporting
error type: BLOCKER

Incoherent information.
type: Concept
notation: S240
definition: Incoherent information in this section. If 'noChange' is selected, there is no need to explain the nature of change.
status: valid
status modified: 2019-03-20
accepted date: 2019-03-20
in scheme: CDR QaQc Habitats Directive Article 17 Reporting
error type: ERROR

Incoherent information.
type: Concept
notation: S241
definition: Incoherent information in this section. Only one main reason is expected and should be part of the reported reasons.
status: valid
status modified: 2019-03-20
accepted date: 2019-03-20
in scheme: CDR QaQc Habitats Directive Article 17 Reporting
error type: ERROR

Mandatory information missing.
type: Concept
notation: S243
definition: Indicate if there is any change since the previous reporting period (2007-2012) in trend in conservation status. Report 'noChange' if the answer to the question: 'Is there a change from the previous reporting round?' is 'No,There is no difference'. Provide the nature of that change (more than one option can be chosen) if the answer is 'Yes'.
status: valid
status modified: 2019-03-20
accepted date: 2019-03-20
in scheme: CDR QaQc Habitats Directive Article 17 Reporting
error type: ERROR

Invalid code.
type: Concept
notation: S244
definition: Please check the vocabulary populationUnits.
status: valid
status modified: 2019-03-20
accepted date: 2019-03-20
in scheme: CDR QaQc Habitats Directive Article 17 Reporting
error type: BLOCKER

Incoherent information.
type: Concept
notation: S245
definition: The reported population size unit within Natura 2000 network differs with the reporting unit used in 6.2.
status: valid
status modified: 2019-03-20
accepted date: 2019-03-20
in scheme: CDR QaQc Habitats Directive Article 17 Reporting
error type: ERROR

Incoherent information.
type: Concept
notation: S246
definition: Population size unit within Natura 2000 network (12.1a) cannot be empty when Population size within within Natura 2000 network (12.1b,c,d) is provided.
status: valid
status modified: 2019-03-20
accepted date: 2019-03-20
in scheme: CDR QaQc Habitats Directive Article 17 Reporting
error type: ERROR

Mandatory information missing.
type: Concept
notation: S247
definition: Population size unit within Natura 2000 network should be provided.
status: valid
status modified: 2019-03-20
accepted date: 2019-03-20
in scheme: CDR QaQc Habitats Directive Article 17 Reporting
error type: ERROR

Incorrect data format.
type: Concept
notation: S248
definition: Numeric field, only decimals greater or equal 0 are permitted.
status: valid
status modified: 2019-03-20
accepted date: 2019-03-20
in scheme: CDR QaQc Habitats Directive Article 17 Reporting
error type: ERROR

Incorrect data format.
type: Concept
notation: S249
definition: Numeric field, only decimals greater or equal 0 are permitted.
status: valid
status modified: 2019-03-20
accepted date: 2019-03-20
in scheme: CDR QaQc Habitats Directive Article 17 Reporting
error type: ERROR

12.1c Population size within Natura 2000 network - max should be greater or equal min.
type: Concept
notation: S250
status: valid
status modified: 2019-03-20
accepted date: 2019-03-20
in scheme: CDR QaQc Habitats Directive Article 17 Reporting
error type: ERROR

Incorrect data format.
type: Concept
notation: S251
definition: Numeric field, only decimals greater or equal 0 are permitted.
status: valid
status modified: 2019-03-20
accepted date: 2019-03-20
in scheme: CDR QaQc Habitats Directive Article 17 Reporting
error type: ERROR

Mandatory information missing.
type: Concept
notation: S252
definition: Population size within Natura 2000 network should be provided as interval (12.1b, c) and/or single value (12.1d) for annex II species. When only a minimum (or maximum) value of population size is known (e.g. through expert opinion) this should be entered in the 'Best single value' field and NOT the '(b) Minimum' or '(c) Maximum' fields.
status: valid
status modified: 2019-03-20
accepted date: 2019-03-20
in scheme: CDR QaQc Habitats Directive Article 17 Reporting
error type: ERROR

Invalid code.
type: Concept
notation: S253
definition: Please check the vocabulary typeEstimate. The value 'mean - multi-year mean' is allowed in this section.
status: valid
status modified: 2019-03-20
accepted date: 2019-03-20
in scheme: CDR QaQc Habitats Directive Article 17 Reporting
error type: BLOCKER

Incoherent information.
type: Concept
notation: S254
definition: Type of estimate was provided although there is no entry for population size within Natura 2000 network (12.1b,c,d). Check coherence between these two fields. If both interval (12.1b 'Minimum' and 12.1c 'Maximum') and a single value (12.1d 'Best single value') are provided, field 12.2 'Type of estimate' should correspond to the more accurate estimate. This should be noted in 12.6 'Additional information'.
status: valid
status modified: 2019-03-20
accepted date: 2019-03-20
in scheme: CDR QaQc Habitats Directive Article 17 Reporting
error type: WARNING

Mandatory information missing.
type: Concept
notation: S255
definition: The type of estimate for the population size within Natura 2000 network should be provided.
status: valid
status modified: 2019-03-20
accepted date: 2019-03-20
in scheme: CDR QaQc Habitats Directive Article 17 Reporting
error type: ERROR

Invalid code.
type: Concept
notation: S256
definition: Please check the vocabulary methodsUsed.
status: valid
status modified: 2019-03-20
accepted date: 2019-03-20
in scheme: CDR QaQc Habitats Directive Article 17 Reporting
error type: BLOCKER

Incoherent information.
type: Concept
notation: S257
definition: 12.2 Type of estimate should be empty when Population size inside the network Method used is 'AbsentData - Insufficient or no data available'. When the method is assessed as 'AbsentData - Insufficient or no data available', the type of estimate used for the population size cannot be defined. If you want to report an estimate based on a method using limited data, please select 'estimateExpert - Based mainly on expert opinion with very limited data' for the method used.
status: valid
status modified: 2019-03-20
accepted date: 2019-03-20
in scheme: CDR QaQc Habitats Directive Article 17 Reporting
error type: WARNING

Mandatory information missing.
type: Concept
notation: S258
definition: The method should be provided. In case the information to be reported in this section is not available use 'AbsentData - Insufficient or no data available'.
status: valid
status modified: 2019-03-20
accepted date: 2019-03-20
in scheme: CDR QaQc Habitats Directive Article 17 Reporting
error type: ERROR

Invalid code.
type: Concept
notation: S259
definition: Please check the vocabulary trends.
status: valid
status modified: 2019-03-20
accepted date: 2019-03-20
in scheme: CDR QaQc Habitats Directive Article 17 Reporting
error type: BLOCKER

Mandatory information missing.
type: Concept
notation: S260
definition: The Trend should be provided. In case the information to be reported in this section is not available use 'Unk - unknown'.
status: valid
status modified: 2019-03-20
accepted date: 2019-03-20
in scheme: CDR QaQc Habitats Directive Article 17 Reporting
error type: ERROR

Invalid code.
type: Concept
notation: S261
definition: Please check the vocabulary methodsUsed.
status: valid
status modified: 2019-03-20
accepted date: 2019-03-20
in scheme: CDR QaQc Habitats Directive Article 17 Reporting
error type: BLOCKER

Incoherent information.
type: Concept
notation: S262
definition: Inconsistent values provided in fields 12.4 Short-term trend Direction and 12.5 Short-term trend Method used. When the method is assessed as 'AbsentData - Insufficient or no data available', the trend cannot be defined. If you want to report a trend as stable, increasing or decreasing based on a method using limited data, please select 'estimateExpert - Based mainly on expert opinion with very limited data' for the method used.
status: valid
status modified: 2019-03-20
accepted date: 2019-03-20
in scheme: CDR QaQc Habitats Directive Article 17 Reporting
error type: WARNING

Mandatory information missing.
type: Concept
notation: S263
definition: The method should be provided. In case the information to be reported in this section is not available use 'AbsentData - Insufficient or no data available'.
status: valid
status modified: 2019-03-20
accepted date: 2019-03-20
in scheme: CDR QaQc Habitats Directive Article 17 Reporting
error type: ERROR

Min/max value should be provided systematically for all seasons.
type: Concept
notation: S500
definition: Report '0' if no hunting bag or there was a temporary ban.
status: valid
status modified: 2019-03-20
accepted date: 2019-03-20
in scheme: CDR QaQc Habitats Directive Article 17 Reporting
error type: ERROR

Incoherent information.
type: Concept
notation: S501
definition: Only min/max or unknown value is expected for 3.3.b1 Statistics/quantity per hunting season or year over the reporting period - Season/year1.
status: valid
status modified: 2019-03-20
accepted date: 2019-03-20
in scheme: CDR QaQc Habitats Directive Article 17 Reporting
error type: ERROR

Mandatory information missing.
type: Concept
notation: S502
definition: Statistics/quantity per hunting season or year over the reporting period - Season/year1 should be provided (3.3.b1min, 3.3.b1max, 3.3.b1x) when 3.3a Hunting bag unit is reported.
status: valid
status modified: 2019-03-20
accepted date: 2019-03-20
in scheme: CDR QaQc Habitats Directive Article 17 Reporting
error type: ERROR

Incorrect data format.
type: Concept
notation: S503
definition: Numeric field, only decimals greater or equal 0 are permitted.
status: valid
status modified: 2019-03-20
accepted date: 2019-03-20
in scheme: CDR QaQc Habitats Directive Article 17 Reporting
error type: ERROR

Incorrect data format.
type: Concept
notation: S504
definition: Numeric field, only decimals greater or equal 0 are permitted.
status: valid
status modified: 2019-03-20
accepted date: 2019-03-20
in scheme: CDR QaQc Habitats Directive Article 17 Reporting
error type: ERROR

3.3b1max Statistics/quantity on season/year 1- max should be greater or equal min.
type: Concept
notation: S505
status: valid
status modified: 2019-03-20
accepted date: 2019-03-20
in scheme: CDR QaQc Habitats Directive Article 17 Reporting
error type: ERROR

Invalid code.
type: Concept
notation: S506
definition: Code should be 'Yes' or 'No'.
status: valid
status modified: 2019-03-20
accepted date: 2019-03-20
in scheme: CDR QaQc Habitats Directive Article 17 Reporting
error type: ERROR

Mandatory information missing.
type: Concept
notation: S507
definition: This field cannot be empty. Code should be 'Yes' or 'No' when 3.3a Hunting bag unit is reported.
status: valid
status modified: 2019-03-20
accepted date: 2019-03-20
in scheme: CDR QaQc Habitats Directive Article 17 Reporting
error type: ERROR

Min/max value should be provided systematically for all seasons.
type: Concept
notation: S508
definition: Report '0' if no hunting bag or there was a temporary ban.
status: valid
status modified: 2019-03-20
accepted date: 2019-03-20
in scheme: CDR QaQc Habitats Directive Article 17 Reporting
error type: ERROR

Incoherent information.
type: Concept
notation: S509
definition: Only min/max or unknown value is expected for 3.3.b2 Statistics/quantity per hunting season or year over the reporting period - Season/year2.
status: valid
status modified: 2019-03-20
accepted date: 2019-03-20
in scheme: CDR QaQc Habitats Directive Article 17 Reporting
error type: ERROR

Mandatory information missing.
type: Concept
notation: S510
definition: Statistics/quantity per hunting season or year over the reporting period - Season/year2 should be provided (3.3.b2min, 3.3.b2max, 3.3.b2x) when 3.3a Hunting bag unit is reported.
status: valid
status modified: 2019-03-20
accepted date: 2019-03-20
in scheme: CDR QaQc Habitats Directive Article 17 Reporting
error type: ERROR

Incorrect data format.
type: Concept
notation: S511
definition: Numeric field, only decimals greater or equal 0 are permitted.
status: valid
status modified: 2019-03-20
accepted date: 2019-03-20
in scheme: CDR QaQc Habitats Directive Article 17 Reporting
error type: ERROR

Incorrect data format.
type: Concept
notation: S512
definition: Numeric field, only decimals greater or equal 0 are permitted.
status: valid
status modified: 2019-03-20
accepted date: 2019-03-20
in scheme: CDR QaQc Habitats Directive Article 17 Reporting
error type: ERROR

3.3b2max Statistics/quantity on season/year 2- max should be greater or equal min.
type: Concept
notation: S513
status: valid
status modified: 2019-03-20
accepted date: 2019-03-20
in scheme: CDR QaQc Habitats Directive Article 17 Reporting
error type: ERROR

Invalid code.
type: Concept
notation: S514
definition: Code should be 'Yes' or 'No'.
status: valid
status modified: 2019-03-20
accepted date: 2019-03-20
in scheme: CDR QaQc Habitats Directive Article 17 Reporting
error type: ERROR

Mandatory information missing.
type: Concept
notation: S515
definition: This field cannot be empty. Code should be 'Yes' or 'No' when 3.3a Hunting bag unit is reported.
status: valid
status modified: 2019-03-20
accepted date: 2019-03-20
in scheme: CDR QaQc Habitats Directive Article 17 Reporting
error type: ERROR

Min/max value should be provided systematically for all seasons.
type: Concept
notation: S516
definition: Report '0' if no hunting bag or there was a temporary ban.
status: valid
status modified: 2019-03-20
accepted date: 2019-03-20
in scheme: CDR QaQc Habitats Directive Article 17 Reporting
error type: ERROR

Incoherent information.
type: Concept
notation: S517
definition: Only min/max or unknown value is expected for 3.3.b3 Statistics/quantity per hunting season or year over the reporting period - Season/year3.
status: valid
status modified: 2019-03-20
accepted date: 2019-03-20
in scheme: CDR QaQc Habitats Directive Article 17 Reporting
error type: ERROR

Mandatory information missing.
type: Concept
notation: S518
definition: Statistics/quantity per hunting season or year over the reporting period - Season/year3 should be provided (3.3.b3min, 3.3.b3max, 3.3.b3x) when 3.3a Hunting bag unit is reported.
status: valid
status modified: 2019-03-20
accepted date: 2019-03-20
in scheme: CDR QaQc Habitats Directive Article 17 Reporting
error type: ERROR

Incorrect data format.
type: Concept
notation: S519
definition: Numeric field, only decimals greater or equal 0 are permitted.
status: valid
status modified: 2019-03-20
accepted date: 2019-03-20
in scheme: CDR QaQc Habitats Directive Article 17 Reporting
error type: ERROR

Incorrect data format.
type: Concept
notation: S520
definition: Numeric field, only decimals greater or equal 0 are permitted.
status: valid
status modified: 2019-03-20
accepted date: 2019-03-20
in scheme: CDR QaQc Habitats Directive Article 17 Reporting
error type: ERROR

3.3b3max Statistics/quantity on season/year 3- max should be greater or equal min.
type: Concept
notation: S521
status: valid
status modified: 2019-03-20
accepted date: 2019-03-20
in scheme: CDR QaQc Habitats Directive Article 17 Reporting
error type: ERROR

Invalid code.
type: Concept
notation: S522
definition: Code should be 'Yes' or 'No'.
status: valid
status modified: 2019-03-20
accepted date: 2019-03-20
in scheme: CDR QaQc Habitats Directive Article 17 Reporting
error type: ERROR

Mandatory information missing.
type: Concept
notation: S523
definition: This field cannot be empty. Code should be 'Yes' or 'No' when 3.3a Hunting bag unit is reported.
status: valid
status modified: 2019-03-20
accepted date: 2019-03-20
in scheme: CDR QaQc Habitats Directive Article 17 Reporting
error type: ERROR

Min/max value should be provided systematically for all seasons.
type: Concept
notation: S524
definition: Report '0' if no hunting bag or there was a temporary ban.
status: valid
status modified: 2019-03-20
accepted date: 2019-03-20
in scheme: CDR QaQc Habitats Directive Article 17 Reporting
error type: ERROR

Incoherent information.
type: Concept
notation: S525
definition: Only min/max or unknown value is expected for 3.3.b4 Statistics/quantity per hunting season or year over the reporting period - Season/year4.
status: valid
status modified: 2019-03-20
accepted date: 2019-03-20
in scheme: CDR QaQc Habitats Directive Article 17 Reporting
error type: ERROR

Mandatory information missing.
type: Concept
notation: S526
definition: Statistics/quantity per hunting season or year over the reporting period - Season/year4 should be provided (3.3.b4min, 3.3.b4max, 3.3.b4x) when 3.3a Hunting bag unit is reported.
status: valid
status modified: 2019-03-20
accepted date: 2019-03-20
in scheme: CDR QaQc Habitats Directive Article 17 Reporting
error type: ERROR

Incorrect data format.
type: Concept
notation: S527
definition: Numeric field, only decimals greater or equal 0 are permitted.
status: valid
status modified: 2019-03-20
accepted date: 2019-03-20
in scheme: CDR QaQc Habitats Directive Article 17 Reporting
error type: ERROR

Incorrect data format.
type: Concept
notation: S528
definition: Numeric field, only decimals greater or equal 0 are permitted.
status: valid
status modified: 2019-03-20
accepted date: 2019-03-20
in scheme: CDR QaQc Habitats Directive Article 17 Reporting
error type: ERROR

3.3b4max Statistics/quantity on season/year 4- max should be greater or equal min.
type: Concept
notation: S529
status: valid
status modified: 2019-03-20
accepted date: 2019-03-20
in scheme: CDR QaQc Habitats Directive Article 17 Reporting
error type: ERROR

Invalid code.
type: Concept
notation: S530
definition: Code should be 'Yes' or 'No'.
status: valid
status modified: 2019-03-20
accepted date: 2019-03-20
in scheme: CDR QaQc Habitats Directive Article 17 Reporting
error type: ERROR

Mandatory information missing.
type: Concept
notation: S531
definition: This field cannot be empty. Code should be 'Yes' or 'No' when 3.3a Hunting bag unit is reported.
status: valid
status modified: 2019-03-20
accepted date: 2019-03-20
in scheme: CDR QaQc Habitats Directive Article 17 Reporting
error type: ERROR

Min/max value should be provided systematically for all seasons.
type: Concept
notation: S532
definition: Report '0' if no hunting bag or there was a temporary ban.
status: valid
status modified: 2019-03-20
accepted date: 2019-03-20
in scheme: CDR QaQc Habitats Directive Article 17 Reporting
error type: ERROR

Incoherent information.
type: Concept
notation: S533
definition: Only min/max or unknown value is expected for 3.3.b5 Statistics/quantity per hunting season or year over the reporting period - Season/year5.
status: valid
status modified: 2019-03-20
accepted date: 2019-03-20
in scheme: CDR QaQc Habitats Directive Article 17 Reporting
error type: ERROR

Mandatory information missing.
type: Concept
notation: S534
definition: Statistics/quantity per hunting season or year over the reporting period - Season/year5 should be provided (3.3.b5min, 3.3.b5max, 3.3.b5x) when 3.3a Hunting bag unit is reported.
status: valid
status modified: 2019-03-20
accepted date: 2019-03-20
in scheme: CDR QaQc Habitats Directive Article 17 Reporting
error type: ERROR

Incorrect data format.
type: Concept
notation: S535
definition: Numeric field, only decimals greater or equal 0 are permitted.
status: valid
status modified: 2019-03-20
accepted date: 2019-03-20
in scheme: CDR QaQc Habitats Directive Article 17 Reporting
error type: ERROR

Incorrect data format.
type: Concept
notation: S536
definition: Numeric field, only decimals greater or equal 0 are permitted.
status: valid
status modified: 2019-03-20
accepted date: 2019-03-20
in scheme: CDR QaQc Habitats Directive Article 17 Reporting
error type: ERROR

3.3b5max Statistics/quantity on season/year 5- max should be greater or equal min.
type: Concept
notation: S537
status: valid
status modified: 2019-03-20
accepted date: 2019-03-20
in scheme: CDR QaQc Habitats Directive Article 17 Reporting
error type: ERROR

Invalid code.
type: Concept
notation: S538
definition: Code should be 'Yes' or 'No'.
status: valid
status modified: 2019-03-20
accepted date: 2019-03-20
in scheme: CDR QaQc Habitats Directive Article 17 Reporting
error type: ERROR

Mandatory information missing.
type: Concept
notation: S539
definition: This field cannot be empty. Code should be 'Yes' or 'No' when 3.3a Hunting bag unit is reported.
status: valid
status modified: 2019-03-20
accepted date: 2019-03-20
in scheme: CDR QaQc Habitats Directive Article 17 Reporting
error type: ERROR

Min/max value should be provided systematically for all seasons.
type: Concept
notation: S540
definition: Report '0' if no hunting bag or there was a temporary ban.
status: valid
status modified: 2019-03-20
accepted date: 2019-03-20
in scheme: CDR QaQc Habitats Directive Article 17 Reporting
error type: ERROR

Incoherent information.
type: Concept
notation: S541
definition: Only min/max or unknown value is expected for 3.3.b6 Statistics/quantity per hunting season or year over the reporting period - Season/year6.
status: valid
status modified: 2019-03-20
accepted date: 2019-03-20
in scheme: CDR QaQc Habitats Directive Article 17 Reporting
error type: ERROR

Mandatory information missing.
type: Concept
notation: S542
definition: Statistics/quantity per hunting season or year over the reporting period - Season/year5 should be provided (3.3.b6min, 3.3.b6max, 3.3.b6x) when 3.3a Hunting bag unit is reported.
status: valid
status modified: 2019-03-20
accepted date: 2019-03-20
in scheme: CDR QaQc Habitats Directive Article 17 Reporting
error type: ERROR

Incorrect data format.
type: Concept
notation: S543
definition: Numeric field, only decimals greater or equal 0 are permitted.
status: valid
status modified: 2019-03-20
accepted date: 2019-03-20
in scheme: CDR QaQc Habitats Directive Article 17 Reporting
error type: ERROR

Incorrect data format.
type: Concept
notation: S544
definition: Numeric field, only decimals greater or equal 0 are permitted.
status: valid
status modified: 2019-03-20
accepted date: 2019-03-20
in scheme: CDR QaQc Habitats Directive Article 17 Reporting
error type: ERROR

3.3b6max Statistics/quantity on season/year 6- max should be greater or equal min.
type: Concept
notation: S545
status: valid
status modified: 2019-03-20
accepted date: 2019-03-20
in scheme: CDR QaQc Habitats Directive Article 17 Reporting
error type: ERROR

Invalid code.
type: Concept
notation: S546
definition: Code should be 'Yes' or 'No'.
status: valid
status modified: 2019-03-20
accepted date: 2019-03-20
in scheme: CDR QaQc Habitats Directive Article 17 Reporting
error type: ERROR

Mandatory information missing.
type: Concept
notation: S547
definition: This field cannot be empty. Code should be 'Yes' or 'No' when 3.3a Hunting bag unit is reported.
status: valid
status modified: 2019-03-20
accepted date: 2019-03-20
in scheme: CDR QaQc Habitats Directive Article 17 Reporting
error type: ERROR

Incoherent information.
type: Concept
notation: S548
definition: The Favourable reference population size unit (6.15a2) cannot be empty when the Favourable reference population size (6.15a1) is provided.
status: valid
status modified: 2019-03-20
accepted date: 2019-03-20
in scheme: CDR QaQc Habitats Directive Article 17 Reporting
error type: ERROR

Member States codes
type: ConceptScheme
notation: countries
is part of: Habitats directive Art. 17 reporting in year 2018
registration status: Public draft
user modified: roschsab
date modified: 2019-03-04 07:55:00.0
vocabulary type: Common
is numeric concept identifiers: false
is notations equal identifiers: false

Austria
type: Concept
notation: AT
status: valid
status modified: 2017-07-27
accepted date: 2017-07-27
in scheme: Member States codes

Belgium
type: Concept
notation: BE
status: valid
status modified: 2017-07-27
accepted date: 2017-07-27
in scheme: Member States codes

Bulgaria
type: Concept
notation: BG
status: valid
status modified: 2017-07-27
accepted date: 2017-07-27
in scheme: Member States codes

Cyprus
type: Concept
notation: CY
status: valid
status modified: 2017-07-27
accepted date: 2017-07-27
in scheme: Member States codes

Czechia
type: Concept
notation: CZ
status: valid
status modified: 2017-07-27
accepted date: 2017-07-27
in scheme: Member States codes

Germany
type: Concept
notation: DE
status: valid
status modified: 2017-07-27
accepted date: 2017-07-27
in scheme: Member States codes

Denmark
type: Concept
notation: DK
status: valid
status modified: 2017-07-27
accepted date: 2017-07-27
in scheme: Member States codes

Estonia
type: Concept
notation: EE
status: valid
status modified: 2017-07-27
accepted date: 2017-07-27
in scheme: Member States codes

Spain
type: Concept
notation: ES
status: valid
status modified: 2017-07-27
accepted date: 2017-07-27
in scheme: Member States codes

Finland
type: Concept
notation: FI
status: valid
status modified: 2017-07-27
accepted date: 2017-07-27
in scheme: Member States codes

France
type: Concept
notation: FR
status: valid
status modified: 2017-07-27
accepted date: 2017-07-27
in scheme: Member States codes

Greece
type: Concept
notation: GR
status: valid
status modified: 2017-07-27
accepted date: 2017-07-27
in scheme: Member States codes

Croatia
type: Concept
notation: HR
status: valid
status modified: 2017-07-27
accepted date: 2017-07-27
in scheme: Member States codes

Hungary
type: Concept
notation: HU
status: valid
status modified: 2017-07-27
accepted date: 2017-07-27
in scheme: Member States codes

Ireland
type: Concept
notation: IE
status: valid
status modified: 2017-07-27
accepted date: 2017-07-27
in scheme: Member States codes

Italy
type: Concept
notation: IT
status: valid
status modified: 2017-07-27
accepted date: 2017-07-27
in scheme: Member States codes

Lithuania
type: Concept
notation: LT
status: valid
status modified: 2017-07-27
accepted date: 2017-07-27
in scheme: Member States codes

Luxembourg
type: Concept
notation: LU
status: valid
status modified: 2017-07-27
accepted date: 2017-07-27
in scheme: Member States codes

Latvia
type: Concept
notation: LV
status: valid
status modified: 2017-07-27
accepted date: 2017-07-27
in scheme: Member States codes

Malta
type: Concept
notation: MT
status: valid
status modified: 2017-07-27
accepted date: 2017-07-27
in scheme: Member States codes

Netherlands
type: Concept
notation: NL
status: valid
status modified: 2017-07-27
accepted date: 2017-07-27
in scheme: Member States codes

Poland
type: Concept
notation: PL
status: valid
status modified: 2017-07-27
accepted date: 2017-07-27
in scheme: Member States codes

Portugal
type: Concept
notation: PT
status: valid
status modified: 2017-07-27
accepted date: 2017-07-27
in scheme: Member States codes

Romania
type: Concept
notation: RO
status: valid
status modified: 2017-07-27
accepted date: 2017-07-27
in scheme: Member States codes

Sweden
type: Concept
notation: SE
status: valid
status modified: 2017-07-27
accepted date: 2017-07-27
in scheme: Member States codes

Slovenia
type: Concept
notation: SI
status: valid
status modified: 2017-07-27
accepted date: 2017-07-27
in scheme: Member States codes

Slovakia
type: Concept
notation: SK
status: valid
status modified: 2017-07-27
accepted date: 2017-07-27
in scheme: Member States codes

United Kingdom
type: Concept
notation: UK
status: valid
status modified: 2017-07-27
accepted date: 2017-07-27
in scheme: Member States codes

Favourable reference value – operator
type: ConceptScheme
notation: favourableOperator
is part of: Habitats directive Art. 17 reporting in year 2018
registration status: Public draft
user modified: roschsab
date modified: 2017-10-04 13:36:06.0
vocabulary type: Common
is numeric concept identifiers: false
is notations equal identifiers: false

Approximately equal to
type: Concept
notation: aeq
status: valid
status modified: 2017-07-25
in scheme: Favourable reference value – operator

Less than
type: Concept
notation: lt
status: valid
status modified: 2017-07-25
in scheme: Favourable reference value – operator

Much more than
type: Concept
notation: mmt
status: valid
status modified: 2017-07-25
in scheme: Favourable reference value – operator

More than
type: Concept
notation: mt
status: valid
status modified: 2017-07-25
in scheme: Favourable reference value – operator

Codelist of habitat types
type: ConceptScheme
notation: habitats
is part of: Habitats directive Art. 17 reporting in year 2018
registration status: Public draft
user modified: roschsab
date modified: 2019-01-17 09:20:22.0
vocabulary type: Common
is numeric concept identifiers: false
is notations equal identifiers: false

Sandbanks which are slightly covered by sea water all the time
type: Concept
notation: 1110
definition: http://eunis.eea.europa.eu/habitats/10003
status: valid
status modified: 2017-12-22
accepted date: 2017-12-22
in scheme: Codelist of habitat types

Posidonia beds (Posidonion oceanicae)
type: Concept
notation: 1120
definition: http://eunis.eea.europa.eu/habitats/10004
status: valid
status modified: 2017-12-22
accepted date: 2017-12-22
in scheme: Codelist of habitat types

Estuaries
type: Concept
notation: 1130
definition: http://eunis.eea.europa.eu/habitats/10005
status: valid
status modified: 2017-12-22
accepted date: 2017-12-22
in scheme: Codelist of habitat types

Mudflats and sandflats not covered by seawater at low tide
type: Concept
notation: 1140
definition: http://eunis.eea.europa.eu/habitats/10006
status: valid
status modified: 2017-12-22
accepted date: 2017-12-22
in scheme: Codelist of habitat types

Coastal lagoons
type: Concept
notation: 1150
definition: http://eunis.eea.europa.eu/habitats/10007
status: valid
status modified: 2017-12-22
accepted date: 2017-12-22
in scheme: Codelist of habitat types

Large shallow inlets and bays
type: Concept
notation: 1160
definition: http://eunis.eea.europa.eu/habitats/10008
status: valid
status modified: 2017-12-22
accepted date: 2017-12-22
in scheme: Codelist of habitat types

Reefs
type: Concept
notation: 1170
definition: http://eunis.eea.europa.eu/habitats/10009
status: valid
status modified: 2017-12-22
accepted date: 2017-12-22
in scheme: Codelist of habitat types

Submarine structures made by leaking gases
type: Concept
notation: 1180
definition: http://eunis.eea.europa.eu/habitats/10010
status: valid
status modified: 2017-12-22
accepted date: 2017-12-22
in scheme: Codelist of habitat types

Annual vegetation of drift lines
type: Concept
notation: 1210
definition: http://eunis.eea.europa.eu/habitats/10012
status: valid
status modified: 2017-12-22
accepted date: 2017-12-22
in scheme: Codelist of habitat types

Perennial vegetation of stony banks
type: Concept
notation: 1220
definition: http://eunis.eea.europa.eu/habitats/10013
status: valid
status modified: 2017-12-22
accepted date: 2017-12-22
in scheme: Codelist of habitat types

Vegetated sea cliffs of the Atlantic and Baltic Coasts
type: Concept
notation: 1230
definition: http://eunis.eea.europa.eu/habitats/10014
status: valid
status modified: 2017-12-22
accepted date: 2017-12-22
in scheme: Codelist of habitat types

Vegetated sea cliffs of the Mediterranean coasts with endemic Limonium spp.
type: Concept
notation: 1240
definition: http://eunis.eea.europa.eu/habitats/10015
status: valid
status modified: 2017-12-22
accepted date: 2017-12-22
in scheme: Codelist of habitat types

Vegetated sea cliffs with endemic flora of the Macaronesian coasts
type: Concept
notation: 1250
definition: http://eunis.eea.europa.eu/habitats/10016
status: valid
status modified: 2017-12-22
accepted date: 2017-12-22
in scheme: Codelist of habitat types

Salicornia and other annuals colonizing mud and sand
type: Concept
notation: 1310
definition: http://eunis.eea.europa.eu/habitats/10018
status: valid
status modified: 2017-12-22
accepted date: 2017-12-22
in scheme: Codelist of habitat types

Spartina swards (Spartinion maritimae)
type: Concept
notation: 1320
definition: http://eunis.eea.europa.eu/habitats/10019
status: valid
status modified: 2017-12-22
accepted date: 2017-12-22
in scheme: Codelist of habitat types

Atlantic salt meadows (Glauco-Puccinellietalia maritimae)
type: Concept
notation: 1330
definition: http://eunis.eea.europa.eu/habitats/10020
status: valid
status modified: 2017-12-22
accepted date: 2017-12-22
in scheme: Codelist of habitat types

Inland salt meadows
type: Concept
notation: 1340
definition: http://eunis.eea.europa.eu/habitats/10021
status: valid
status modified: 2017-12-22
accepted date: 2017-12-22
in scheme: Codelist of habitat types

Mediterranean salt meadows (Juncetalia maritimi)
type: Concept
notation: 1410
definition: http://eunis.eea.europa.eu/habitats/10023
status: valid
status modified: 2017-12-22
accepted date: 2017-12-22
in scheme: Codelist of habitat types

Mediterranean and thermo-Atlantic halophilous scrubs (Sarcocornetea fruticosi)
type: Concept
notation: 1420
definition: http://eunis.eea.europa.eu/habitats/10024
status: valid
status modified: 2017-12-22
accepted date: 2017-12-22
in scheme: Codelist of habitat types

Halo-nitrophilous scrubs (Pegano-Salsoletea)
type: Concept
notation: 1430
definition: http://eunis.eea.europa.eu/habitats/10025
status: valid
status modified: 2017-12-22
accepted date: 2017-12-22
in scheme: Codelist of habitat types

Mediterranean salt steppes (Limonietalia)
type: Concept
notation: 1510
definition: http://eunis.eea.europa.eu/habitats/10027
status: valid
status modified: 2017-12-22
accepted date: 2017-12-22
in scheme: Codelist of habitat types

Iberian gypsum vegetation (Gypsophiletalia)
type: Concept
notation: 1520
definition: http://eunis.eea.europa.eu/habitats/10028
status: valid
status modified: 2017-12-22
accepted date: 2017-12-22
in scheme: Codelist of habitat types

Pannonic salt steppes and salt marshes
type: Concept
notation: 1530
definition: http://eunis.eea.europa.eu/habitats/10029
status: valid
status modified: 2017-12-22
accepted date: 2017-12-22
in scheme: Codelist of habitat types

Baltic esker islands with sandy, rocky and shingle beach vegetation and sublittoral vegetation
type: Concept
notation: 1610
definition: http://eunis.eea.europa.eu/habitats/10031
status: valid
status modified: 2017-12-22
accepted date: 2017-12-22
in scheme: Codelist of habitat types

Boreal Baltic islets and small islands
type: Concept
notation: 1620
definition: http://eunis.eea.europa.eu/habitats/10032
status: valid
status modified: 2017-12-22
accepted date: 2017-12-22
in scheme: Codelist of habitat types

Boreal Baltic coastal meadows
type: Concept
notation: 1630
definition: http://eunis.eea.europa.eu/habitats/10033
status: valid
status modified: 2017-12-22
accepted date: 2017-12-22
in scheme: Codelist of habitat types

Boreal Baltic sandy beaches with perennial vegetation
type: Concept
notation: 1640
definition: http://eunis.eea.europa.eu/habitats/10034
status: valid
status modified: 2017-12-22
accepted date: 2017-12-22
in scheme: Codelist of habitat types

Boreal Baltic narrow inlets
type: Concept
notation: 1650
definition: http://eunis.eea.europa.eu/habitats/10035
status: valid
status modified: 2017-12-22
accepted date: 2017-12-22
in scheme: Codelist of habitat types

Embryonic shifting dunes
type: Concept
notation: 2110
definition: http://eunis.eea.europa.eu/habitats/10038
status: valid
status modified: 2017-12-22
accepted date: 2017-12-22
in scheme: Codelist of habitat types

Shifting dunes along the shoreline with Ammophila arenaria ("white dunes")
type: Concept
notation: 2120
definition: http://eunis.eea.europa.eu/habitats/10039
status: valid
status modified: 2017-12-22
accepted date: 2017-12-22
in scheme: Codelist of habitat types

Fixed coastal dunes with herbaceous vegetation ("grey dunes")
type: Concept
notation: 2130
definition: http://eunis.eea.europa.eu/habitats/10040
status: valid
status modified: 2017-12-22
accepted date: 2017-12-22
in scheme: Codelist of habitat types

Decalcified fixed dunes with Empetrum nigrum
type: Concept
notation: 2140
definition: http://eunis.eea.europa.eu/habitats/10041
status: valid
status modified: 2017-12-22
accepted date: 2017-12-22
in scheme: Codelist of habitat types

Atlantic decalcified fixed dunes (Calluno-Ulicetea)
type: Concept
notation: 2150
definition: http://eunis.eea.europa.eu/habitats/10042
status: valid
status modified: 2017-12-22
accepted date: 2017-12-22
in scheme: Codelist of habitat types

Dunes with Hippophae rhamnoides
type: Concept
notation: 2160
definition: http://eunis.eea.europa.eu/habitats/10043
status: valid
status modified: 2017-12-22
accepted date: 2017-12-22
in scheme: Codelist of habitat types

Dunes with Salix repens ssp. argentea (Salicion arenariae)
type: Concept
notation: 2170
definition: http://eunis.eea.europa.eu/habitats/10044
status: valid
status modified: 2017-12-22
accepted date: 2017-12-22
in scheme: Codelist of habitat types

Wooded dunes of the Atlantic, Continental and Boreal region
type: Concept
notation: 2180
definition: http://eunis.eea.europa.eu/habitats/10045
status: valid
status modified: 2017-12-22
accepted date: 2017-12-22
in scheme: Codelist of habitat types

Humid dune slacks
type: Concept
notation: 2190
definition: http://eunis.eea.europa.eu/habitats/10046
status: valid
status modified: 2017-12-22
accepted date: 2017-12-22
in scheme: Codelist of habitat types

Machairs (* in Ireland)
type: Concept
notation: 21A0
definition: http://eunis.eea.europa.eu/habitats/10047
status: valid
status modified: 2017-12-22
accepted date: 2017-12-22
in scheme: Codelist of habitat types

Crucianellion maritimae fixed beach dunes
type: Concept
notation: 2210
definition: http://eunis.eea.europa.eu/habitats/10049
status: valid
status modified: 2017-12-22
accepted date: 2017-12-22
in scheme: Codelist of habitat types

Dunes with Euphorbia terracina
type: Concept
notation: 2220
definition: http://eunis.eea.europa.eu/habitats/10050
status: valid
status modified: 2017-12-22
accepted date: 2017-12-22
in scheme: Codelist of habitat types

Malcolmietalia dune grasslands
type: Concept
notation: 2230
definition: http://eunis.eea.europa.eu/habitats/10051
status: valid
status modified: 2017-12-22
accepted date: 2017-12-22
in scheme: Codelist of habitat types

Brachypodietalia dune grasslands with annuals
type: Concept
notation: 2240
definition: http://eunis.eea.europa.eu/habitats/10052
status: valid
status modified: 2017-12-22
accepted date: 2017-12-22
in scheme: Codelist of habitat types

Coastal dunes with Juniperus spp.
type: Concept
notation: 2250
definition: http://eunis.eea.europa.eu/habitats/10053
status: valid
status modified: 2017-12-22
accepted date: 2017-12-22
in scheme: Codelist of habitat types

Cisto-Lavenduletalia dune sclerophyllous scrubs
type: Concept
notation: 2260
definition: http://eunis.eea.europa.eu/habitats/10054
status: valid
status modified: 2017-12-22
accepted date: 2017-12-22
in scheme: Codelist of habitat types

Wooded dunes with Pinus pinea and/or Pinus pinaster
type: Concept
notation: 2270
definition: http://eunis.eea.europa.eu/habitats/10055
status: valid
status modified: 2017-12-22
accepted date: 2017-12-22
in scheme: Codelist of habitat types

Dry sand heaths with Calluna and Genista
type: Concept
notation: 2310
definition: http://eunis.eea.europa.eu/habitats/10057
status: valid
status modified: 2017-12-22
accepted date: 2017-12-22
in scheme: Codelist of habitat types

Dry sand heaths with Calluna and Empetrum nigrum
type: Concept
notation: 2320
definition: http://eunis.eea.europa.eu/habitats/10058
status: valid
status modified: 2017-12-22
accepted date: 2017-12-22
in scheme: Codelist of habitat types

Inland dunes with open Corynephorus and Agrostis grasslands
type: Concept
notation: 2330
definition: http://eunis.eea.europa.eu/habitats/10059
status: valid
status modified: 2017-12-22
accepted date: 2017-12-22
in scheme: Codelist of habitat types

Pannonic inland dunes
type: Concept
notation: 2340
definition: http://eunis.eea.europa.eu/habitats/10060
status: valid
status modified: 2017-12-22
accepted date: 2017-12-22
in scheme: Codelist of habitat types

Oligotrophic waters containing very few minerals of sandy plains (Littorelletalia uniflorae)
type: Concept
notation: 3110
definition: http://eunis.eea.europa.eu/habitats/10063
status: valid
status modified: 2017-12-22
accepted date: 2017-12-22
in scheme: Codelist of habitat types

Oligotrophic waters containing very few minerals generally on sandy soils of the West Mediterranean, with Isoetes spp.
type: Concept
notation: 3120
definition: http://eunis.eea.europa.eu/habitats/10064
status: valid
status modified: 2017-12-22
accepted date: 2017-12-22
in scheme: Codelist of habitat types

Oligotrophic to mesotrophic standing waters with vegetation of the Littorelletea uniflorae and/or of the Iso�to-Nanojuncetea
type: Concept
notation: 3130
definition: http://eunis.eea.europa.eu/habitats/10065
status: valid
status modified: 2017-12-22
accepted date: 2017-12-22
in scheme: Codelist of habitat types

Hard oligo-mesotrophic waters with benthic vegetation of Chara spp.
type: Concept
notation: 3140
definition: http://eunis.eea.europa.eu/habitats/10066
status: valid
status modified: 2017-12-22
accepted date: 2017-12-22
in scheme: Codelist of habitat types

Natural eutrophic lakes with Magnopotamion or Hydrocharition - type vegetation
type: Concept
notation: 3150
definition: http://eunis.eea.europa.eu/habitats/10067
status: valid
status modified: 2017-12-22
accepted date: 2017-12-22
in scheme: Codelist of habitat types

Natural dystrophic lakes and ponds
type: Concept
notation: 3160
definition: http://eunis.eea.europa.eu/habitats/10068
status: valid
status modified: 2017-12-22
accepted date: 2017-12-22
in scheme: Codelist of habitat types

Mediterranean temporary ponds
type: Concept
notation: 3170
definition: http://eunis.eea.europa.eu/habitats/10069
status: valid
status modified: 2017-12-22
accepted date: 2017-12-22
in scheme: Codelist of habitat types

Turloughs
type: Concept
notation: 3180
definition: http://eunis.eea.europa.eu/habitats/10070
status: valid
status modified: 2017-12-22
accepted date: 2017-12-22
in scheme: Codelist of habitat types

Lakes of gypsum karst
type: Concept
notation: 3190
definition: http://eunis.eea.europa.eu/habitats/10240
status: valid
status modified: 2017-12-22
accepted date: 2017-12-22
in scheme: Codelist of habitat types

Transylvanian hot-spring lotus beds
type: Concept
notation: 31A0
definition: http://eunis.eea.europa.eu/habitats/10241
status: valid
status modified: 2017-12-22
accepted date: 2017-12-22
in scheme: Codelist of habitat types

Fennoscandian natural rivers
type: Concept
notation: 3210
definition: http://eunis.eea.europa.eu/habitats/10072
status: valid
status modified: 2017-12-22
accepted date: 2017-12-22
in scheme: Codelist of habitat types

Alpine rivers and the herbaceous vegetation along their banks
type: Concept
notation: 3220
definition: http://eunis.eea.europa.eu/habitats/10073
status: valid
status modified: 2017-12-22
accepted date: 2017-12-22
in scheme: Codelist of habitat types

Alpine rivers and their ligneous vegetation with Myricaria germanica
type: Concept
notation: 3230
definition: http://eunis.eea.europa.eu/habitats/10074
status: valid
status modified: 2017-12-22
accepted date: 2017-12-22
in scheme: Codelist of habitat types

Alpine rivers and their ligneous vegetation with Salix elaeagnos
type: Concept
notation: 3240
definition: http://eunis.eea.europa.eu/habitats/10075
status: valid
status modified: 2017-12-22
accepted date: 2017-12-22
in scheme: Codelist of habitat types

Constantly flowing Mediterranean rivers with Glaucium flavum
type: Concept
notation: 3250
definition: http://eunis.eea.europa.eu/habitats/10076
status: valid
status modified: 2017-12-22
accepted date: 2017-12-22
in scheme: Codelist of habitat types

Water courses of plain to montane levels with the Ranunculion fluitantis and Callitricho-Batrachion vegetation
type: Concept
notation: 3260
definition: http://eunis.eea.europa.eu/habitats/10077
status: valid
status modified: 2017-12-22
accepted date: 2017-12-22
in scheme: Codelist of habitat types

Rivers with muddy banks with Chenopodion rubri p.p. and Bidention p.p. vegetation
type: Concept
notation: 3270
definition: http://eunis.eea.europa.eu/habitats/10078
status: valid
status modified: 2017-12-22
accepted date: 2017-12-22
in scheme: Codelist of habitat types

Constantly flowing Mediterranean rivers with Paspalo-Agrostidion species and hanging curtains of Salix and Populus alba
type: Concept
notation: 3280
definition: http://eunis.eea.europa.eu/habitats/10079
status: valid
status modified: 2017-12-22
accepted date: 2017-12-22
in scheme: Codelist of habitat types

Intermittently flowing Mediterranean rivers of the Paspalo-Agrostidion
type: Concept
notation: 3290
definition: http://eunis.eea.europa.eu/habitats/10080
status: valid
status modified: 2017-12-22
accepted date: 2017-12-22
in scheme: Codelist of habitat types

Tufa cascades of karstic rivers in the Dinaric Alps
type: Concept
notation: 32A0
definition: http://eunis.eea.europa.eu/habitats/10274
status: valid
status modified: 2017-12-22
accepted date: 2017-12-22
in scheme: Codelist of habitat types

Northern Atlantic wet heaths with Erica tetralix
type: Concept
notation: 4010
definition: http://eunis.eea.europa.eu/habitats/10082
status: valid
status modified: 2017-12-22
accepted date: 2017-12-22
in scheme: Codelist of habitat types

Temperate Atlantic wet heaths with Erica ciliaris and Erica tetralix
type: Concept
notation: 4020
definition: http://eunis.eea.europa.eu/habitats/10083
status: valid
status modified: 2017-12-22
accepted date: 2017-12-22
in scheme: Codelist of habitat types

European dry heaths
type: Concept
notation: 4030
definition: http://eunis.eea.europa.eu/habitats/10084
status: valid
status modified: 2017-12-22
accepted date: 2017-12-22
in scheme: Codelist of habitat types

Dry Atlantic coastal heaths with Erica vagans
type: Concept
notation: 4040
definition: http://eunis.eea.europa.eu/habitats/10085
status: valid
status modified: 2017-12-22
accepted date: 2017-12-22
in scheme: Codelist of habitat types

Endemic macaronesian heaths
type: Concept
notation: 4050
definition: http://eunis.eea.europa.eu/habitats/10086
status: valid
status modified: 2017-12-22
accepted date: 2017-12-22
in scheme: Codelist of habitat types

Alpine and Boreal heaths
type: Concept
notation: 4060
definition: http://eunis.eea.europa.eu/habitats/10087
status: valid
status modified: 2017-12-22
accepted date: 2017-12-22
in scheme: Codelist of habitat types

Bushes with Pinus mugo and Rhododendron hirsutum (Mugo-Rhododendretum hirsuti)
type: Concept
notation: 4070
definition: http://eunis.eea.europa.eu/habitats/10088
status: valid
status modified: 2017-12-22
accepted date: 2017-12-22
in scheme: Codelist of habitat types

Sub-Arctic Salix spp. scrub
type: Concept
notation: 4080
definition: http://eunis.eea.europa.eu/habitats/10089
status: valid
status modified: 2017-12-22
accepted date: 2017-12-22
in scheme: Codelist of habitat types

Endemic oro-Mediterranean heaths with gorse
type: Concept
notation: 4090
definition: http://eunis.eea.europa.eu/habitats/10090
status: valid
status modified: 2017-12-22
accepted date: 2017-12-22
in scheme: Codelist of habitat types

Subcontinental peri-Pannonic scrub
type: Concept
notation: 40A0
definition: http://eunis.eea.europa.eu/habitats/10242
status: valid
status modified: 2017-12-22
accepted date: 2017-12-22
in scheme: Codelist of habitat types

Rhodope Potentilla fruticosa thickets
type: Concept
notation: 40B0
definition: http://eunis.eea.europa.eu/habitats/10261
status: valid
status modified: 2017-12-22
accepted date: 2017-12-22
in scheme: Codelist of habitat types

Ponto-Sarmatic deciduous thickets
type: Concept
notation: 40C0
definition: http://eunis.eea.europa.eu/habitats/10262
status: valid
status modified: 2017-12-22
accepted date: 2017-12-22
in scheme: Codelist of habitat types

Stable xerothermophilous formations with Buxus sempervirens on rock slopes (Berberidion p.p.)
type: Concept
notation: 5110
definition: http://eunis.eea.europa.eu/habitats/10093
status: valid
status modified: 2017-12-22
accepted date: 2017-12-22
in scheme: Codelist of habitat types

Mountain Cytisus purgans formations
type: Concept
notation: 5120
definition: http://eunis.eea.europa.eu/habitats/10094
status: valid
status modified: 2017-12-22
accepted date: 2017-12-22
in scheme: Codelist of habitat types

Juniperus communis formations on heaths or calcareous grasslands
type: Concept
notation: 5130
definition: http://eunis.eea.europa.eu/habitats/10095
status: valid
status modified: 2017-12-22
accepted date: 2017-12-22
in scheme: Codelist of habitat types

Cistus palhinhae formations on maritime wet heaths
type: Concept
notation: 5140
definition: http://eunis.eea.europa.eu/habitats/10096
status: valid
status modified: 2017-12-22
accepted date: 2017-12-22
in scheme: Codelist of habitat types

Arborescent matorral with Juniperus spp.
type: Concept
notation: 5210
definition: http://eunis.eea.europa.eu/habitats/10097
status: valid
status modified: 2017-12-22
accepted date: 2017-12-22
in scheme: Codelist of habitat types

Arborescent matorral with Zyziphus
type: Concept
notation: 5220
definition: http://eunis.eea.europa.eu/habitats/10098
status: valid
status modified: 2017-12-22
accepted date: 2017-12-22
in scheme: Codelist of habitat types

Arborescent matorral with Laurus nobilis
type: Concept
notation: 5230
definition: http://eunis.eea.europa.eu/habitats/10099
status: valid
status modified: 2017-12-22
accepted date: 2017-12-22
in scheme: Codelist of habitat types

Laurus nobilis thickets
type: Concept
notation: 5310
definition: http://eunis.eea.europa.eu/habitats/10100
status: valid
status modified: 2017-12-22
accepted date: 2017-12-22
in scheme: Codelist of habitat types

Low formations of Euphorbia close to cliffs
type: Concept
notation: 5320
definition: http://eunis.eea.europa.eu/habitats/10103
status: valid
status modified: 2017-12-22
accepted date: 2017-12-22
in scheme: Codelist of habitat types

Thermo-Mediterranean and pre-desert scrub
type: Concept
notation: 5330
definition: http://eunis.eea.europa.eu/habitats/10104
status: valid
status modified: 2017-12-22
accepted date: 2017-12-22
in scheme: Codelist of habitat types

West Mediterranean clifftop phryganas (Astragalo-Plantaginetum subulatae)
type: Concept
notation: 5410
definition: http://eunis.eea.europa.eu/habitats/10106
status: valid
status modified: 2017-12-22
accepted date: 2017-12-22
in scheme: Codelist of habitat types

Sarcopoterium spinosum phryganas
type: Concept
notation: 5420
definition: http://eunis.eea.europa.eu/habitats/10107
status: valid
status modified: 2017-12-22
accepted date: 2017-12-22
in scheme: Codelist of habitat types

Endemic phryganas of the Euphorbio-Verbascion
type: Concept
notation: 5430
definition: http://eunis.eea.europa.eu/habitats/10108
status: valid
status modified: 2017-12-22
accepted date: 2017-12-22
in scheme: Codelist of habitat types

Rupicolous calcareous or basophilic grasslands of the Alysso-Sedion albi
type: Concept
notation: 6110
definition: http://eunis.eea.europa.eu/habitats/10111
status: valid
status modified: 2017-12-22
accepted date: 2017-12-22
in scheme: Codelist of habitat types

Xeric sand calcareous grasslands
type: Concept
notation: 6120
definition: http://eunis.eea.europa.eu/habitats/10112
status: valid
status modified: 2017-12-22
accepted date: 2017-12-22
in scheme: Codelist of habitat types

Calaminarian grasslands of the Violetalia calaminariae
type: Concept
notation: 6130
definition: http://eunis.eea.europa.eu/habitats/10113
status: valid
status modified: 2017-12-22
accepted date: 2017-12-22
in scheme: Codelist of habitat types

Siliceous Pyrenean Festuca eskia grasslands
type: Concept
notation: 6140
definition: http://eunis.eea.europa.eu/habitats/10114
status: valid
status modified: 2017-12-22
accepted date: 2017-12-22
in scheme: Codelist of habitat types

Siliceous alpine and boreal grasslands
type: Concept
notation: 6150
definition: http://eunis.eea.europa.eu/habitats/10115
status: valid
status modified: 2017-12-22
accepted date: 2017-12-22
in scheme: Codelist of habitat types

Oro-Iberian Festuca indigesta grasslands
type: Concept
notation: 6160
definition: http://eunis.eea.europa.eu/habitats/10116
status: valid
status modified: 2017-12-22
accepted date: 2017-12-22
in scheme: Codelist of habitat types

Alpine and subalpine calcareous grasslands
type: Concept
notation: 6170
definition: http://eunis.eea.europa.eu/habitats/10117
status: valid
status modified: 2017-12-22
accepted date: 2017-12-22
in scheme: Codelist of habitat types

Macaronesian mesophile grasslands
type: Concept
notation: 6180
definition: http://eunis.eea.europa.eu/habitats/10118
status: valid
status modified: 2017-12-22
accepted date: 2017-12-22
in scheme: Codelist of habitat types

Rupicolous pannonic grasslands (Stipo-Festucetalia pallentis)
type: Concept
notation: 6190
definition: http://eunis.eea.europa.eu/habitats/10243
status: valid
status modified: 2017-12-22
accepted date: 2017-12-22
in scheme: Codelist of habitat types

Semi-natural dry grasslands and scrubland facies on calcareous substrates (Festuco-Brometalia) (* important orchid sites)
type: Concept
notation: 6210
definition: http://eunis.eea.europa.eu/habitats/10120
status: valid
status modified: 2017-12-22
accepted date: 2017-12-22
in scheme: Codelist of habitat types

Pseudo-steppe with grasses and annuals of the Thero-Brachypodietea
type: Concept
notation: 6220
definition: http://eunis.eea.europa.eu/habitats/10121
status: valid
status modified: 2017-12-22
accepted date: 2017-12-22
in scheme: Codelist of habitat types

Species-rich Nardus grasslands, on siliceous substrates in mountain areas (and submountain areas, in Continental Europe)
type: Concept
notation: 6230
definition: http://eunis.eea.europa.eu/habitats/10122
status: valid
status modified: 2017-12-22
accepted date: 2017-12-22
in scheme: Codelist of habitat types

Sub-Pannonic steppic grasslands
type: Concept
notation: 6240
definition: http://eunis.eea.europa.eu/habitats/10123
status: valid
status modified: 2017-12-22
accepted date: 2017-12-22
in scheme: Codelist of habitat types

Pannonic loess steppic grasslands
type: Concept
notation: 6250
definition: http://eunis.eea.europa.eu/habitats/10124
status: valid
status modified: 2017-12-22
accepted date: 2017-12-22
in scheme: Codelist of habitat types

Pannonic sand steppes
type: Concept
notation: 6260
definition: http://eunis.eea.europa.eu/habitats/10125
status: valid
status modified: 2017-12-22
accepted date: 2017-12-22
in scheme: Codelist of habitat types

Fennoscandian lowland species-rich dry to mesic grasslands
type: Concept
notation: 6270
definition: http://eunis.eea.europa.eu/habitats/10126
status: valid
status modified: 2017-12-22
accepted date: 2017-12-22
in scheme: Codelist of habitat types

Nordic alvar and precambrian calcareous flatrocks
type: Concept
notation: 6280
definition: http://eunis.eea.europa.eu/habitats/10127
status: valid
status modified: 2017-12-22
accepted date: 2017-12-22
in scheme: Codelist of habitat types

Eastern sub-Mediterranean dry grasslands (Scorzoneratalia villosae)
type: Concept
notation: 62A0
definition: http://eunis.eea.europa.eu/habitats/10244
status: valid
status modified: 2017-12-22
accepted date: 2017-12-22
in scheme: Codelist of habitat types

Serpentinophilous grasslands of Cyprus
type: Concept
notation: 62B0
definition: http://eunis.eea.europa.eu/habitats/10245
status: valid
status modified: 2017-12-22
accepted date: 2017-12-22
in scheme: Codelist of habitat types

Ponto-Sarmatic steppes
type: Concept
notation: 62C0
definition: http://eunis.eea.europa.eu/habitats/10263
status: valid
status modified: 2017-12-22
accepted date: 2017-12-22
in scheme: Codelist of habitat types

Oro-Moesian acidophilous grasslands
type: Concept
notation: 62D0
definition: http://eunis.eea.europa.eu/habitats/10264
status: valid
status modified: 2017-12-22
accepted date: 2017-12-22
in scheme: Codelist of habitat types

Dehesas with evergreen Quercus spp.
type: Concept
notation: 6310
definition: http://eunis.eea.europa.eu/habitats/10129
status: valid
status modified: 2017-12-22
accepted date: 2017-12-22
in scheme: Codelist of habitat types

Molinia meadows on calcareous, peaty or clayey-silt-laden soils (Molinion caeruleae)
type: Concept
notation: 6410
definition: http://eunis.eea.europa.eu/habitats/10131
status: valid
status modified: 2017-12-22
accepted date: 2017-12-22
in scheme: Codelist of habitat types

Mediterranean tall humid grasslands of the Molinio-Holoschoenion
type: Concept
notation: 6420
definition: http://eunis.eea.europa.eu/habitats/10132
status: valid
status modified: 2017-12-22
accepted date: 2017-12-22
in scheme: Codelist of habitat types

Hydrophilous tall herb fringe communities of plains and of the montane to alpine levels
type: Concept
notation: 6430
definition: http://eunis.eea.europa.eu/habitats/10133
status: valid
status modified: 2017-12-22
accepted date: 2017-12-22
in scheme: Codelist of habitat types

Alluvial meadows of river valleys of the Cnidion dubii
type: Concept
notation: 6440
definition: http://eunis.eea.europa.eu/habitats/10134
status: valid
status modified: 2017-12-22
accepted date: 2017-12-22
in scheme: Codelist of habitat types

Northern boreal alluvial meadows
type: Concept
notation: 6450
definition: http://eunis.eea.europa.eu/habitats/10135
status: valid
status modified: 2017-12-22
accepted date: 2017-12-22
in scheme: Codelist of habitat types

Peat grasslands of Troodos
type: Concept
notation: 6460
definition: http://eunis.eea.europa.eu/habitats/10246
status: valid
status modified: 2017-12-22
accepted date: 2017-12-22
in scheme: Codelist of habitat types

Lowland hay meadows (Alopecurus pratensis, Sanguisorba officinalis)
type: Concept
notation: 6510
definition: http://eunis.eea.europa.eu/habitats/10137
status: valid
status modified: 2017-12-22
accepted date: 2017-12-22
in scheme: Codelist of habitat types

Mountain hay meadows
type: Concept
notation: 6520
definition: http://eunis.eea.europa.eu/habitats/10138
status: valid
status modified: 2017-12-22
accepted date: 2017-12-22
in scheme: Codelist of habitat types

Fennoscandian wooded meadows
type: Concept
notation: 6530
definition: http://eunis.eea.europa.eu/habitats/10139
status: valid
status modified: 2017-12-22
accepted date: 2017-12-22
in scheme: Codelist of habitat types

Sub-Mediterranean grasslands of the Molinio-Hordeion secalini
type: Concept
notation: 6540
definition: http://eunis.eea.europa.eu/habitats/10275
status: valid
status modified: 2017-12-22
accepted date: 2017-12-22
in scheme: Codelist of habitat types

Active raised bogs
type: Concept
notation: 7110
definition: http://eunis.eea.europa.eu/habitats/10142
status: valid
status modified: 2017-12-22
accepted date: 2017-12-22
in scheme: Codelist of habitat types

Degraded raised bogs still capable of natural regeneration
type: Concept
notation: 7120
definition: http://eunis.eea.europa.eu/habitats/10143
status: valid
status modified: 2017-12-22
accepted date: 2017-12-22
in scheme: Codelist of habitat types

Blanket bogs (* if active bog)
type: Concept
notation: 7130
definition: http://eunis.eea.europa.eu/habitats/10144
status: valid
status modified: 2017-12-22
accepted date: 2017-12-22
in scheme: Codelist of habitat types

Transition mires and quaking bogs
type: Concept
notation: 7140
definition: http://eunis.eea.europa.eu/habitats/10145
status: valid
status modified: 2017-12-22
accepted date: 2017-12-22
in scheme: Codelist of habitat types

Depressions on peat substrates of the Rhynchosporion
type: Concept
notation: 7150
definition: http://eunis.eea.europa.eu/habitats/10146
status: valid
status modified: 2017-12-22
accepted date: 2017-12-22
in scheme: Codelist of habitat types

Fennoscandian mineral-rich springs and springfens
type: Concept
notation: 7160
definition: http://eunis.eea.europa.eu/habitats/10147
status: valid
status modified: 2017-12-22
accepted date: 2017-12-22
in scheme: Codelist of habitat types

Calcareous fens with Cladium mariscus and species of the Caricion davallianae
type: Concept
notation: 7210
definition: http://eunis.eea.europa.eu/habitats/10149
status: valid
status modified: 2017-12-22
accepted date: 2017-12-22
in scheme: Codelist of habitat types

Petrifying springs with tufa formation (Cratoneurion)
type: Concept
notation: 7220
definition: http://eunis.eea.europa.eu/habitats/10150
status: valid
status modified: 2017-12-22
accepted date: 2017-12-22
in scheme: Codelist of habitat types

Alkaline fens
type: Concept
notation: 7230
definition: http://eunis.eea.europa.eu/habitats/10151
status: valid
status modified: 2017-12-22
accepted date: 2017-12-22
in scheme: Codelist of habitat types

Alpine pioneer formations of Caricion bicoloris-atrofuscae
type: Concept
notation: 7240
definition: http://eunis.eea.europa.eu/habitats/10152
status: valid
status modified: 2017-12-22
accepted date: 2017-12-22
in scheme: Codelist of habitat types

Aapa mires
type: Concept
notation: 7310
definition: http://eunis.eea.europa.eu/habitats/10154
status: valid
status modified: 2017-12-22
accepted date: 2017-12-22
in scheme: Codelist of habitat types

Palsa mires
type: Concept
notation: 7320
definition: http://eunis.eea.europa.eu/habitats/10155
status: valid
status modified: 2017-12-22
accepted date: 2017-12-22
in scheme: Codelist of habitat types

Siliceous scree of the montane to snow levels (Androsacetalia alpinae and Galeopsietalia ladani)
type: Concept
notation: 8110
definition: http://eunis.eea.europa.eu/habitats/10158
status: valid
status modified: 2017-12-22
accepted date: 2017-12-22
in scheme: Codelist of habitat types

Calcareous and calcshist screes of the montane to alpine levels (Thlaspietea rotundifolii)
type: Concept
notation: 8120
definition: http://eunis.eea.europa.eu/habitats/10159
status: valid
status modified: 2017-12-22
accepted date: 2017-12-22
in scheme: Codelist of habitat types

Western Mediterranean and thermophilous scree
type: Concept
notation: 8130
definition: http://eunis.eea.europa.eu/habitats/10160
status: valid
status modified: 2017-12-22
accepted date: 2017-12-22
in scheme: Codelist of habitat types

Eastern Mediterranean screes
type: Concept
notation: 8140
definition: http://eunis.eea.europa.eu/habitats/10161
status: valid
status modified: 2017-12-22
accepted date: 2017-12-22
in scheme: Codelist of habitat types

Medio-European upland siliceous screes
type: Concept
notation: 8150
definition: http://eunis.eea.europa.eu/habitats/10162
status: valid
status modified: 2017-12-22
accepted date: 2017-12-22
in scheme: Codelist of habitat types

Medio-European calcareous scree of hill and montane levels
type: Concept
notation: 8160
definition: http://eunis.eea.europa.eu/habitats/10163
status: valid
status modified: 2017-12-22
accepted date: 2017-12-22
in scheme: Codelist of habitat types

Calcareous rocky slopes with chasmophytic vegetation
type: Concept
notation: 8210
definition: http://eunis.eea.europa.eu/habitats/10165
status: valid
status modified: 2017-12-22
accepted date: 2017-12-22
in scheme: Codelist of habitat types

Siliceous rocky slopes with chasmophytic vegetation
type: Concept
notation: 8220
definition: http://eunis.eea.europa.eu/habitats/10166
status: valid
status modified: 2017-12-22
accepted date: 2017-12-22
in scheme: Codelist of habitat types

Siliceous rock with pioneer vegetation of the Sedo-Scleranthion or of the Sedo albi-Veronicion dillenii
type: Concept
notation: 8230
definition: http://eunis.eea.europa.eu/habitats/10167
status: valid
status modified: 2017-12-22
accepted date: 2017-12-22
in scheme: Codelist of habitat types

Limestone pavements
type: Concept
notation: 8240
definition: http://eunis.eea.europa.eu/habitats/10168
status: valid
status modified: 2017-12-22
accepted date: 2017-12-22
in scheme: Codelist of habitat types

Caves not open to the public
type: Concept
notation: 8310
definition: http://eunis.eea.europa.eu/habitats/10170
status: valid
status modified: 2017-12-22
accepted date: 2017-12-22
in scheme: Codelist of habitat types

Fields of lava and natural excavations
type: Concept
notation: 8320
definition: http://eunis.eea.europa.eu/habitats/10171
status: valid
status modified: 2017-12-22
accepted date: 2017-12-22
in scheme: Codelist of habitat types

Submerged or partially submerged sea caves
type: Concept
notation: 8330
definition: http://eunis.eea.europa.eu/habitats/10172
status: valid
status modified: 2017-12-22
accepted date: 2017-12-22
in scheme: Codelist of habitat types

Permanent glaciers
type: Concept
notation: 8340
definition: http://eunis.eea.europa.eu/habitats/10173
status: valid
status modified: 2017-12-22
accepted date: 2017-12-22
in scheme: Codelist of habitat types

Western Ta�ga
type: Concept
notation: 9010
definition: http://eunis.eea.europa.eu/habitats/10176
status: valid
status modified: 2017-12-22
accepted date: 2017-12-22
in scheme: Codelist of habitat types

Fennoscandian hemiboreal natural old broad-leaved deciduous forests (Quercus, Tilia, Acer, Fraxinus or Ulmus) rich in epiphytes
type: Concept
notation: 9020
definition: http://eunis.eea.europa.eu/habitats/10177
status: valid
status modified: 2017-12-22
accepted date: 2017-12-22
in scheme: Codelist of habitat types

Natural forests of primary succession stages of landupheaval coast
type: Concept
notation: 9030
definition: http://eunis.eea.europa.eu/habitats/10178
status: valid
status modified: 2017-12-22
accepted date: 2017-12-22
in scheme: Codelist of habitat types

Nordic subalpine/subarctic forests with Betula pubescens ssp. czerepanovii
type: Concept
notation: 9040
definition: http://eunis.eea.europa.eu/habitats/10179
status: valid
status modified: 2017-12-22
accepted date: 2017-12-22
in scheme: Codelist of habitat types

Fennoscandian herb-rich forests with Picea abies
type: Concept
notation: 9050
definition: http://eunis.eea.europa.eu/habitats/10180
status: valid
status modified: 2017-12-22
accepted date: 2017-12-22
in scheme: Codelist of habitat types

Coniferous forests on, or connected to, glaciofluvial eskers
type: Concept
notation: 9060
definition: http://eunis.eea.europa.eu/habitats/10181
status: valid
status modified: 2017-12-22
accepted date: 2017-12-22
in scheme: Codelist of habitat types

Fennoscandian wooded pastures
type: Concept
notation: 9070
definition: http://eunis.eea.europa.eu/habitats/10182
status: valid
status modified: 2017-12-22
accepted date: 2017-12-22
in scheme: Codelist of habitat types

Fennoscandian deciduous swamp woods
type: Concept
notation: 9080
definition: http://eunis.eea.europa.eu/habitats/10183
status: valid
status modified: 2017-12-22
accepted date: 2017-12-22
in scheme: Codelist of habitat types

Luzulo-Fagetum beech forests
type: Concept
notation: 9110
definition: http://eunis.eea.europa.eu/habitats/10185
status: valid
status modified: 2017-12-22
accepted date: 2017-12-22
in scheme: Codelist of habitat types

Atlantic acidophilous beech forests with Ilex and sometimes also Taxus in the shrublayer (Quercion robori-petraeae or Ilici-Fagenion)
type: Concept
notation: 9120
definition: http://eunis.eea.europa.eu/habitats/10186
status: valid
status modified: 2017-12-22
accepted date: 2017-12-22
in scheme: Codelist of habitat types

Asperulo-Fagetum beech forests
type: Concept
notation: 9130
definition: http://eunis.eea.europa.eu/habitats/10187
status: valid
status modified: 2017-12-22
accepted date: 2017-12-22
in scheme: Codelist of habitat types

Medio-European subalpine beech woods with Acer and Rumex arifolius
type: Concept
notation: 9140
definition: http://eunis.eea.europa.eu/habitats/10188
status: valid
status modified: 2017-12-22
accepted date: 2017-12-22
in scheme: Codelist of habitat types

Medio-European limestone beech forests of the Cephalanthero-Fagion
type: Concept
notation: 9150
definition: http://eunis.eea.europa.eu/habitats/10189
status: valid
status modified: 2017-12-22
accepted date: 2017-12-22
in scheme: Codelist of habitat types

Sub-Atlantic and medio-European oak or oak-hornbeam forests of the Carpinion betuli
type: Concept
notation: 9160
definition: http://eunis.eea.europa.eu/habitats/10190
status: valid
status modified: 2017-12-22
accepted date: 2017-12-22
in scheme: Codelist of habitat types

Galio-Carpinetum oak-hornbeam forests
type: Concept
notation: 9170
definition: http://eunis.eea.europa.eu/habitats/10191
status: valid
status modified: 2017-12-22
accepted date: 2017-12-22
in scheme: Codelist of habitat types

Tilio-Acerion forests of slopes, screes and ravines
type: Concept
notation: 9180
definition: http://eunis.eea.europa.eu/habitats/10192
status: valid
status modified: 2017-12-22
accepted date: 2017-12-22
in scheme: Codelist of habitat types

Old acidophilous oak woods with Quercus robur on sandy plains
type: Concept
notation: 9190
definition: http://eunis.eea.europa.eu/habitats/10193
status: valid
status modified: 2017-12-22
accepted date: 2017-12-22
in scheme: Codelist of habitat types

Old sessile oak woods with Ilex and Blechnum in the British Isles
type: Concept
notation: 91A0
definition: http://eunis.eea.europa.eu/habitats/10194
status: valid
status modified: 2017-12-22
accepted date: 2017-12-22
in scheme: Codelist of habitat types

Eastern white oak woods
type: Concept
notation: 91AA
definition: http://eunis.eea.europa.eu/habitats/10270
status: valid
status modified: 2017-12-22
accepted date: 2017-12-22
in scheme: Codelist of habitat types

Thermophilous Fraxinus angustifolia woods
type: Concept
notation: 91B0
definition: http://eunis.eea.europa.eu/habitats/10195
status: valid
status modified: 2017-12-22
accepted date: 2017-12-22
in scheme: Codelist of habitat types

Moesian silver fir forests
type: Concept
notation: 91BA
definition: http://eunis.eea.europa.eu/habitats/10271
status: valid
status modified: 2017-12-22
accepted date: 2017-12-22
in scheme: Codelist of habitat types

Caledonian forest
type: Concept
notation: 91C0
definition: http://eunis.eea.europa.eu/habitats/10196
status: valid
status modified: 2017-12-22
accepted date: 2017-12-22
in scheme: Codelist of habitat types

Rhodopide and Balkan Range Scots pine forests
type: Concept
notation: 91CA
definition: http://eunis.eea.europa.eu/habitats/10272
status: valid
status modified: 2017-12-22
accepted date: 2017-12-22
in scheme: Codelist of habitat types

Bog woodland
type: Concept
notation: 91D0
definition: http://eunis.eea.europa.eu/habitats/10197
status: valid
status modified: 2017-12-22
accepted date: 2017-12-22
in scheme: Codelist of habitat types

Alluvial forests with Alnus glutinosa and Fraxinus excelsior (Alno-Padion, Alnion incanae, Salicion albae)
type: Concept
notation: 91E0
definition: http://eunis.eea.europa.eu/habitats/10198
status: valid
status modified: 2017-12-22
accepted date: 2017-12-22
in scheme: Codelist of habitat types

Riparian mixed forests of Quercus robur, Ulmus laevis and Ulmus minor, Fraxinus excelsior or Fraxinus angustifolia, along the great rivers (Ulmenion minoris)
type: Concept
notation: 91F0
definition: http://eunis.eea.europa.eu/habitats/10199
status: valid
status modified: 2017-12-22
accepted date: 2017-12-22
in scheme: Codelist of habitat types

Pannonic woods with Quercus petraea and Carpinus betulus
type: Concept
notation: 91G0
definition: http://eunis.eea.europa.eu/habitats/10200
status: valid
status modified: 2017-12-22
accepted date: 2017-12-22
in scheme: Codelist of habitat types

Pannonian woods with Quercus pubescens
type: Concept
notation: 91H0
definition: http://eunis.eea.europa.eu/habitats/10201
status: valid
status modified: 2017-12-22
accepted date: 2017-12-22
in scheme: Codelist of habitat types

Euro-Siberian steppic woods with Quercus spp.
type: Concept
notation: 91I0
definition: http://eunis.eea.europa.eu/habitats/10202
status: valid
status modified: 2017-12-22
accepted date: 2017-12-22
in scheme: Codelist of habitat types

Taxus baccata woods of the British Isles
type: Concept
notation: 91J0
definition: http://eunis.eea.europa.eu/habitats/10203
status: valid
status modified: 2017-12-22
accepted date: 2017-12-22
in scheme: Codelist of habitat types

Illyrian Fagus sylvatica forests (Aremonio-Fagion)
type: Concept
notation: 91K0
definition: http://eunis.eea.europa.eu/habitats/10247
status: valid
status modified: 2017-12-22
accepted date: 2017-12-22
in scheme: Codelist of habitat types

Illyrian oak-hornbeam forests (Erythronio-Carpinion)
type: Concept
notation: 91L0
definition: http://eunis.eea.europa.eu/habitats/10248
status: valid
status modified: 2017-12-22
accepted date: 2017-12-22
in scheme: Codelist of habitat types

Pannonian-Balkanic turkey oak-sessile oak forests
type: Concept
notation: 91M0
definition: http://eunis.eea.europa.eu/habitats/10249
status: valid
status modified: 2017-12-22
accepted date: 2017-12-22
in scheme: Codelist of habitat types

Pannonic inland sand dune thicket (Junipero-Populetum albae)
type: Concept
notation: 91N0
definition: http://eunis.eea.europa.eu/habitats/10250
status: valid
status modified: 2017-12-22
accepted date: 2017-12-22
in scheme: Codelist of habitat types

Holy Cross fir forests (Abietetum polonicum)
type: Concept
notation: 91P0
definition: http://eunis.eea.europa.eu/habitats/10251
status: valid
status modified: 2017-12-22
accepted date: 2017-12-22
in scheme: Codelist of habitat types

Western Carpathian calcicolous Pinus sylvestris forests
type: Concept
notation: 91Q0
definition: http://eunis.eea.europa.eu/habitats/10252
status: valid
status modified: 2017-12-22
accepted date: 2017-12-22
in scheme: Codelist of habitat types

Dinaric dolomite Scots pine forests (Genisto januensis-Pinetum)
type: Concept
notation: 91R0
definition: http://eunis.eea.europa.eu/habitats/10253
status: valid
status modified: 2017-12-22
accepted date: 2017-12-22
in scheme: Codelist of habitat types

Western Pontic beech forests
type: Concept
notation: 91S0
definition: http://eunis.eea.europa.eu/habitats/10265
status: valid
status modified: 2017-12-22
accepted date: 2017-12-22
in scheme: Codelist of habitat types

Central European lichen Scots pine forests
type: Concept
notation: 91T0
definition: http://eunis.eea.europa.eu/habitats/10254
status: valid
status modified: 2017-12-22
accepted date: 2017-12-22
in scheme: Codelist of habitat types

Sarmatic steppe pine forest
type: Concept
notation: 91U0
definition: http://eunis.eea.europa.eu/habitats/10255
status: valid
status modified: 2017-12-22
accepted date: 2017-12-22
in scheme: Codelist of habitat types

Dacian Beech forests (Symphyto-Fagion)
type: Concept
notation: 91V0
definition: http://eunis.eea.europa.eu/habitats/10256
status: valid
status modified: 2017-12-22
accepted date: 2017-12-22
in scheme: Codelist of habitat types

Moesian beech forests
type: Concept
notation: 91W0
definition: http://eunis.eea.europa.eu/habitats/10266
status: valid
status modified: 2017-12-22
accepted date: 2017-12-22
in scheme: Codelist of habitat types

Dobrogean beech forests
type: Concept
notation: 91X0
definition: http://eunis.eea.europa.eu/habitats/10267
status: valid
status modified: 2017-12-22
accepted date: 2017-12-22
in scheme: Codelist of habitat types

Dacian oak & hornbeam forests
type: Concept
notation: 91Y0
definition: http://eunis.eea.europa.eu/habitats/10268
status: valid
status modified: 2017-12-22
accepted date: 2017-12-22
in scheme: Codelist of habitat types

Moesian silver lime woods
type: Concept
notation: 91Z0
definition: http://eunis.eea.europa.eu/habitats/10269
status: valid
status modified: 2017-12-22
accepted date: 2017-12-22
in scheme: Codelist of habitat types

Apennine beech forests with Taxus and Ilex
type: Concept
notation: 9210
definition: http://eunis.eea.europa.eu/habitats/10205
status: valid
status modified: 2017-12-22
accepted date: 2017-12-22
in scheme: Codelist of habitat types

Apennine beech forests with Abies alba and beech forests with Abies nebrodensis
type: Concept
notation: 9220
definition: http://eunis.eea.europa.eu/habitats/10206
status: valid
status modified: 2017-12-22
accepted date: 2017-12-22
in scheme: Codelist of habitat types

Galicio-Portuguese oak woods with Quercus robur and Quercus pyrenaica
type: Concept
notation: 9230
definition: http://eunis.eea.europa.eu/habitats/10207
status: valid
status modified: 2017-12-22
accepted date: 2017-12-22
in scheme: Codelist of habitat types

Quercus faginea and Quercus canariensis Iberian woods
type: Concept
notation: 9240
definition: http://eunis.eea.europa.eu/habitats/10208
status: valid
status modified: 2017-12-22
accepted date: 2017-12-22
in scheme: Codelist of habitat types

Quercus trojana woods
type: Concept
notation: 9250
definition: http://eunis.eea.europa.eu/habitats/10209
status: valid
status modified: 2017-12-22
accepted date: 2017-12-22
in scheme: Codelist of habitat types

Castanea sativa woods
type: Concept
notation: 9260
definition: http://eunis.eea.europa.eu/habitats/10210
status: valid
status modified: 2017-12-22
accepted date: 2017-12-22
in scheme: Codelist of habitat types

Hellenic beech forests with Abies borisii-regis
type: Concept
notation: 9270
definition: http://eunis.eea.europa.eu/habitats/10211
status: valid
status modified: 2017-12-22
accepted date: 2017-12-22
in scheme: Codelist of habitat types

Quercus frainetto woods
type: Concept
notation: 9280
definition: http://eunis.eea.europa.eu/habitats/10212
status: valid
status modified: 2017-12-22
accepted date: 2017-12-22
in scheme: Codelist of habitat types

Cupressus forests (Acero-Cupression)
type: Concept
notation: 9290
definition: http://eunis.eea.europa.eu/habitats/10213
status: valid
status modified: 2017-12-22
accepted date: 2017-12-22
in scheme: Codelist of habitat types

Salix alba and Populus alba galleries
type: Concept
notation: 92A0
definition: http://eunis.eea.europa.eu/habitats/10214
status: valid
status modified: 2017-12-22
accepted date: 2017-12-22
in scheme: Codelist of habitat types

Riparian formations on intermittent Mediterranean water courses with Rhododendron ponticum, Salix and others
type: Concept
notation: 92B0
definition: http://eunis.eea.europa.eu/habitats/10215
status: valid
status modified: 2017-12-22
accepted date: 2017-12-22
in scheme: Codelist of habitat types

Platanus orientalis and Liquidambar orientalis woods (Platanion orientalis)
type: Concept
notation: 92C0
definition: http://eunis.eea.europa.eu/habitats/10216
status: valid
status modified: 2017-12-22
accepted date: 2017-12-22
in scheme: Codelist of habitat types

Southern riparian galleries and thickets (Nerio-Tamaricetea and Securinegion tinctoriae)
type: Concept
notation: 92D0
definition: http://eunis.eea.europa.eu/habitats/10217
status: valid
status modified: 2017-12-22
accepted date: 2017-12-22
in scheme: Codelist of habitat types

Aegean Quercus brachyphylla woods
type: Concept
notation: 9310
definition: http://eunis.eea.europa.eu/habitats/10219
status: valid
status modified: 2017-12-22
accepted date: 2017-12-22
in scheme: Codelist of habitat types

Olea and Ceratonia forests
type: Concept
notation: 9320
definition: http://eunis.eea.europa.eu/habitats/10220
status: valid
status modified: 2017-12-22
accepted date: 2017-12-22
in scheme: Codelist of habitat types

Quercus suber forests
type: Concept
notation: 9330
definition: http://eunis.eea.europa.eu/habitats/10221
status: valid
status modified: 2017-12-22
accepted date: 2017-12-22
in scheme: Codelist of habitat types

Quercus ilex and Quercus rotundifolia forests
type: Concept
notation: 9340
definition: http://eunis.eea.europa.eu/habitats/10222
status: valid
status modified: 2017-12-22
accepted date: 2017-12-22
in scheme: Codelist of habitat types

Quercus macrolepis forests
type: Concept
notation: 9350
definition: http://eunis.eea.europa.eu/habitats/10223
status: valid
status modified: 2017-12-22
accepted date: 2017-12-22
in scheme: Codelist of habitat types

Macaronesian laurel forests (Laurus, Ocotea)
type: Concept
notation: 9360
definition: http://eunis.eea.europa.eu/habitats/10224
status: valid
status modified: 2017-12-22
accepted date: 2017-12-22
in scheme: Codelist of habitat types

Palm groves of Phoenix
type: Concept
notation: 9370
definition: http://eunis.eea.europa.eu/habitats/10225
status: valid
status modified: 2017-12-22
accepted date: 2017-12-22
in scheme: Codelist of habitat types

Forests of Ilex aquifolium
type: Concept
notation: 9380
definition: http://eunis.eea.europa.eu/habitats/10226
status: valid
status modified: 2017-12-22
accepted date: 2017-12-22
in scheme: Codelist of habitat types

Scrub and low forest vegetation with Quercus alnifolia
type: Concept
notation: 9390
definition: http://eunis.eea.europa.eu/habitats/10257
status: valid
status modified: 2017-12-22
accepted date: 2017-12-22
in scheme: Codelist of habitat types

Woodlands with Quercus infectoria (Anagyro foetidae-Quercetum infectoriae)
type: Concept
notation: 93A0
definition: http://eunis.eea.europa.eu/habitats/10258
status: valid
status modified: 2017-12-22
accepted date: 2017-12-22
in scheme: Codelist of habitat types

Acidophilous Picea forests of the montane to alpine levels (Vaccinio-Piceetea)
type: Concept
notation: 9410
definition: http://eunis.eea.europa.eu/habitats/10228
status: valid
status modified: 2017-12-22
accepted date: 2017-12-22
in scheme: Codelist of habitat types

Alpine Larix decidua and/or Pinus cembra forests
type: Concept
notation: 9420
definition: http://eunis.eea.europa.eu/habitats/10229
status: valid
status modified: 2017-12-22
accepted date: 2017-12-22
in scheme: Codelist of habitat types

Subalpine and montane Pinus uncinata forests (* if on gypsum or limestone)
type: Concept
notation: 9430
definition: http://eunis.eea.europa.eu/habitats/10230
status: valid
status modified: 2017-12-22
accepted date: 2017-12-22
in scheme: Codelist of habitat types

Southern Apennine Abies alba forests
type: Concept
notation: 9510
definition: http://eunis.eea.europa.eu/habitats/10232
status: valid
status modified: 2017-12-22
accepted date: 2017-12-22
in scheme: Codelist of habitat types

Abies pinsapo forests
type: Concept
notation: 9520
definition: http://eunis.eea.europa.eu/habitats/10233
status: valid
status modified: 2017-12-22
accepted date: 2017-12-22
in scheme: Codelist of habitat types

(Sub-) Mediterranean pine forests with endemic black pines
type: Concept
notation: 9530
definition: http://eunis.eea.europa.eu/habitats/10234
status: valid
status modified: 2017-12-22
accepted date: 2017-12-22
in scheme: Codelist of habitat types

Mediterranean pine forests with endemic Mesogean pines
type: Concept
notation: 9540
definition: http://eunis.eea.europa.eu/habitats/10235
status: valid
status modified: 2017-12-22
accepted date: 2017-12-22
in scheme: Codelist of habitat types

Canarian endemic pine forests
type: Concept
notation: 9550
definition: http://eunis.eea.europa.eu/habitats/10236
status: valid
status modified: 2017-12-22
accepted date: 2017-12-22
in scheme: Codelist of habitat types

Endemic forests with Juniperus spp.
type: Concept
notation: 9560
definition: http://eunis.eea.europa.eu/habitats/10237
status: valid
status modified: 2017-12-22
accepted date: 2017-12-22
in scheme: Codelist of habitat types

Tetraclinis articulata forests
type: Concept
notation: 9570
definition: http://eunis.eea.europa.eu/habitats/10238
status: valid
status modified: 2017-12-22
accepted date: 2017-12-22
in scheme: Codelist of habitat types

Mediterranean Taxus baccata woods
type: Concept
notation: 9580
definition: http://eunis.eea.europa.eu/habitats/10239
status: valid
status modified: 2017-12-22
accepted date: 2017-12-22
in scheme: Codelist of habitat types

Cedrus brevifolia forests (Cedrosetum brevifoliae)
type: Concept
notation: 9590
definition: http://eunis.eea.europa.eu/habitats/10259
status: valid
status modified: 2017-12-22
accepted date: 2017-12-22
in scheme: Codelist of habitat types

High oro-Mediterranean pine forests
type: Concept
notation: 95A0
definition: http://eunis.eea.europa.eu/habitats/10260
status: valid
status modified: 2017-12-22
accepted date: 2017-12-22
in scheme: Codelist of habitat types

All habitats
type: Concept
notation: HabAll
status: valid
status modified: 2017-12-22
accepted date: 2017-12-22
in scheme: Codelist of habitat types

Abyssal
type: Concept
notation: HabBenAbyssal
status: valid
status modified: 2017-12-22
accepted date: 2017-12-22
in scheme: Codelist of habitat types

All benthic habitats
type: Concept
notation: HabBenAll
status: valid
status modified: 2017-12-22
accepted date: 2017-12-22
in scheme: Codelist of habitat types

Lower bathyal rock and biogenic reef
type: Concept
notation: HabBenBathyalLowRock
status: valid
status modified: 2017-12-22
accepted date: 2017-12-22
in scheme: Codelist of habitat types

Lower bathyal sediment
type: Concept
notation: HabBenBathyalLowSed
status: valid
status modified: 2017-12-22
accepted date: 2017-12-22
in scheme: Codelist of habitat types

Upper bathyal rock and biogenic reef
type: Concept
notation: HabBenBathyalUpReef
status: valid
status modified: 2017-12-22
accepted date: 2017-12-22
in scheme: Codelist of habitat types

Upper bathyal sediment
type: Concept
notation: HabBenBathyalUpSed
status: valid
status modified: 2017-12-22
accepted date: 2017-12-22
in scheme: Codelist of habitat types

Circalittoral coarse sediment
type: Concept
notation: HabBenCircalitCoarSed
status: valid
status modified: 2017-12-22
accepted date: 2017-12-22
in scheme: Codelist of habitat types

Circalittoral mud
type: Concept
notation: HabBenCircalitMud
status: valid
status modified: 2017-12-22
accepted date: 2017-12-22
in scheme: Codelist of habitat types

Circalittoral mixed sediment
type: Concept
notation: HabBenCircalitMxdSed
status: valid
status modified: 2017-12-22
accepted date: 2017-12-22
in scheme: Codelist of habitat types

Circalittoral rock and biogenic reef
type: Concept
notation: HabBenCircalitRock
status: valid
status modified: 2017-12-22
accepted date: 2017-12-22
in scheme: Codelist of habitat types

Circalittoral sand
type: Concept
notation: HabBenCircalitSand
status: valid
status modified: 2017-12-22
accepted date: 2017-12-22
in scheme: Codelist of habitat types

Infralittoral coarse sediment
type: Concept
notation: HabBenInfralitCoarSed
status: valid
status modified: 2017-12-22
accepted date: 2017-12-22
in scheme: Codelist of habitat types

Infralittoral mud
type: Concept
notation: HabBenInfralitMud
status: valid
status modified: 2017-12-22
accepted date: 2017-12-22
in scheme: Codelist of habitat types

Infralittoral mixed sediment
type: Concept
notation: HabBenInfralitMxdSed
status: valid
status modified: 2017-12-22
accepted date: 2017-12-22
in scheme: Codelist of habitat types

Infralittoral rock and biogenic reef
type: Concept
notation: HabBenInfralitRock
status: valid
status modified: 2017-12-22
accepted date: 2017-12-22
in scheme: Codelist of habitat types

Infralittoral sand
type: Concept
notation: HabBenInfralitSand
status: valid
status modified: 2017-12-22
accepted date: 2017-12-22
in scheme: Codelist of habitat types

Littoral rock and biogenic reef
type: Concept
notation: HabBenLitRock
status: valid
status modified: 2017-12-22
accepted date: 2017-12-22
in scheme: Codelist of habitat types

Littoral sediment
type: Concept
notation: HabBenLitSed
status: valid
status modified: 2017-12-22
accepted date: 2017-12-22
in scheme: Codelist of habitat types

Offshore circalittoral coarse sediment
type: Concept
notation: HabBenOffshCoarSed
status: valid
status modified: 2017-12-22
accepted date: 2017-12-22
in scheme: Codelist of habitat types

Offshore circalittoral mud
type: Concept
notation: HabBenOffshMud
status: valid
status modified: 2017-12-22
accepted date: 2017-12-22
in scheme: Codelist of habitat types

Offshore circalittoral mixed sediment
type: Concept
notation: HabBenOffshMxdSed
status: valid
status modified: 2017-12-22
accepted date: 2017-12-22
in scheme: Codelist of habitat types

Offshore circalittoral rock and biogenic reef
type: Concept
notation: HabBenOffshRock
status: valid
status modified: 2017-12-22
accepted date: 2017-12-22
in scheme: Codelist of habitat types

Offshore circalittoral sand
type: Concept
notation: HabBenOffshSand
status: valid
status modified: 2017-12-22
accepted date: 2017-12-22
in scheme: Codelist of habitat types

Other benthic habitats
type: Concept
notation: HabBenOther
status: valid
status modified: 2017-12-22
accepted date: 2017-12-22
in scheme: Codelist of habitat types

Other habitats
type: Concept
notation: HabOther
status: valid
status modified: 2017-12-22
accepted date: 2017-12-22
in scheme: Codelist of habitat types

All pelagic habitats
type: Concept
notation: HabPelagAll
status: valid
status modified: 2017-12-22
accepted date: 2017-12-22
in scheme: Codelist of habitat types

Coastal
type: Concept
notation: HabPelagCoastal
status: valid
status modified: 2017-12-22
accepted date: 2017-12-22
in scheme: Codelist of habitat types

Oceanic/beyond shelf
type: Concept
notation: HabPelagOcean
status: valid
status modified: 2017-12-22
accepted date: 2017-12-22
in scheme: Codelist of habitat types

Other pelagic habitats
type: Concept
notation: HabPelagOther
status: valid
status modified: 2017-12-22
accepted date: 2017-12-22
in scheme: Codelist of habitat types

Shelf
type: Concept
notation: HabPelagShelf
status: valid
status modified: 2017-12-22
accepted date: 2017-12-22
in scheme: Codelist of habitat types

Variable salinity
type: Concept
notation: HabPelagVarSalinity
status: valid
status modified: 2017-12-22
accepted date: 2017-12-22
in scheme: Codelist of habitat types

Codelist of species
type: ConceptScheme
notation: HDspecies
is part of: Habitats directive Art. 17 reporting in year 2018
registration status: Public draft
user modified: roschsab
date modified: 2019-03-22 18:23:10.0
vocabulary type: Common
is numeric concept identifiers: false
is notations equal identifiers: false

Corallium rubrum
type: Concept
notation: 1001
status: valid
status modified: 2019-03-22
accepted date: 2019-03-22
in scheme: Codelist of species

Discula tabellata
type: Concept
notation: 1002
status: valid
status modified: 2019-03-22
accepted date: 2019-03-22
in scheme: Codelist of species

Discula testudinalis
type: Concept
notation: 1003
status: valid
status modified: 2019-03-22
accepted date: 2019-03-22
in scheme: Codelist of species

Geomitra moniziana
type: Concept
notation: 1006
status: valid
status modified: 2019-03-22
accepted date: 2019-03-22
in scheme: Codelist of species

Elona quimperiana
type: Concept
notation: 1007
status: valid
status modified: 2019-03-22
accepted date: 2019-03-22
in scheme: Codelist of species

Centrostephanus longispinus
type: Concept
notation: 1008
status: valid
status modified: 2019-03-22
accepted date: 2019-03-22
in scheme: Codelist of species

Caseolus calculus
type: Concept
notation: 1011
status: valid
status modified: 2019-03-22
accepted date: 2019-03-22
in scheme: Codelist of species

Patella ferruginea
type: Concept
notation: 1012
status: valid
status modified: 2019-03-22
accepted date: 2019-03-22
in scheme: Codelist of species

Vertigo geyeri
type: Concept
notation: 1013
status: valid
status modified: 2019-03-22
accepted date: 2019-03-22
in scheme: Codelist of species

Vertigo angustior
type: Concept
notation: 1014
status: valid
status modified: 2019-03-22
accepted date: 2019-03-22
in scheme: Codelist of species

Vertigo genesii
type: Concept
notation: 1015
status: valid
status modified: 2019-03-22
accepted date: 2019-03-22
in scheme: Codelist of species

Vertigo moulinsiana
type: Concept
notation: 1016
status: valid
status modified: 2019-03-22
accepted date: 2019-03-22
in scheme: Codelist of species

Leiostyla abbreviata
type: Concept
notation: 1017
status: valid
status modified: 2019-03-22
accepted date: 2019-03-22
in scheme: Codelist of species

Leiostyla cassida
type: Concept
notation: 1018
status: valid
status modified: 2019-03-22
accepted date: 2019-03-22
in scheme: Codelist of species

Leiostyla corneocostata
type: Concept
notation: 1019
status: valid
status modified: 2019-03-22
accepted date: 2019-03-22
in scheme: Codelist of species

Leiostyla gibba
type: Concept
notation: 1020
status: valid
status modified: 2019-03-22
accepted date: 2019-03-22
in scheme: Codelist of species

Leiostyla lamellosa
type: Concept
notation: 1021
status: valid
status modified: 2019-03-22
accepted date: 2019-03-22
in scheme: Codelist of species

Geomalacus maculosus
type: Concept
notation: 1024
status: valid
status modified: 2019-03-22
accepted date: 2019-03-22
in scheme: Codelist of species

Idiomela subplicata
type: Concept
notation: 1025
status: valid
status modified: 2019-03-22
accepted date: 2019-03-22
in scheme: Codelist of species

Helix pomatia
type: Concept
notation: 1026
status: valid
status modified: 2019-03-22
accepted date: 2019-03-22
in scheme: Codelist of species

Lithophaga lithophaga
type: Concept
notation: 1027
status: valid
status modified: 2019-03-22
accepted date: 2019-03-22
in scheme: Codelist of species

Pinna nobilis
type: Concept
notation: 1028
status: valid
status modified: 2019-03-22
accepted date: 2019-03-22
in scheme: Codelist of species

Margaritifera margaritifera
type: Concept
notation: 1029
status: valid
status modified: 2019-03-22
accepted date: 2019-03-22
in scheme: Codelist of species

Margaritifera auricularia
type: Concept
notation: 1030
status: valid
status modified: 2019-03-22
accepted date: 2019-03-22
in scheme: Codelist of species

Unio crassus
type: Concept
notation: 1032
status: valid
status modified: 2019-03-22
accepted date: 2019-03-22
in scheme: Codelist of species

Unio elongatulus
type: Concept
notation: 1033
status: valid
status modified: 2019-03-22
accepted date: 2019-03-22
in scheme: Codelist of species

Hirudo medicinalis
type: Concept
notation: 1034
status: valid
status modified: 2019-03-22
accepted date: 2019-03-22
in scheme: Codelist of species

Leucorrhinia caudalis
type: Concept
notation: 1035
status: valid
status modified: 2019-03-22
accepted date: 2019-03-22
in scheme: Codelist of species

Macromia splendens
type: Concept
notation: 1036
status: valid
status modified: 2019-03-22
accepted date: 2019-03-22
in scheme: Codelist of species

Ophiogomphus cecilia
type: Concept
notation: 1037
status: valid
status modified: 2019-03-22
accepted date: 2019-03-22
in scheme: Codelist of species

Leucorrhinia albifrons
type: Concept
notation: 1038
status: valid
status modified: 2019-03-22
accepted date: 2019-03-22
in scheme: Codelist of species

Stylurus flavipes
type: Concept
notation: 1040
status: valid
status modified: 2019-03-22
accepted date: 2019-03-22
in scheme: Codelist of species

Oxygastra curtisii
type: Concept
notation: 1041
status: valid
status modified: 2019-03-22
accepted date: 2019-03-22
in scheme: Codelist of species

Leucorrhinia pectoralis
type: Concept
notation: 1042
status: valid
status modified: 2019-03-22
accepted date: 2019-03-22
in scheme: Codelist of species

Lindenia tetraphylla
type: Concept
notation: 1043
status: valid
status modified: 2019-03-22
accepted date: 2019-03-22
in scheme: Codelist of species

Coenagrion mercuriale
type: Concept
notation: 1044
status: valid
status modified: 2019-03-22
accepted date: 2019-03-22
in scheme: Codelist of species

Coenagrion hylas
type: Concept
notation: 1045
status: valid
status modified: 2019-03-22
accepted date: 2019-03-22
in scheme: Codelist of species

Gomphus graslinii
type: Concept
notation: 1046
status: valid
status modified: 2019-03-22
accepted date: 2019-03-22
in scheme: Codelist of species

Cordulegaster trinacriae
type: Concept
notation: 1047
status: valid
status modified: 2019-03-22
accepted date: 2019-03-22
in scheme: Codelist of species

Aeshna viridis
type: Concept
notation: 1048
status: valid
status modified: 2019-03-22
accepted date: 2019-03-22
in scheme: Codelist of species

Baetica ustulata
type: Concept
notation: 1049
status: valid
status modified: 2019-03-22
accepted date: 2019-03-22
in scheme: Codelist of species

Saga pedo
type: Concept
notation: 1050
status: valid
status modified: 2019-03-22
accepted date: 2019-03-22
in scheme: Codelist of species

Apteromantis aptera
type: Concept
notation: 1051
status: valid
status modified: 2019-03-22
accepted date: 2019-03-22
in scheme: Codelist of species

Zerynthia polyxena
type: Concept
notation: 1053
status: valid
status modified: 2019-03-22
accepted date: 2019-03-22
in scheme: Codelist of species

Papilio alexanor
type: Concept
notation: 1054
status: valid
status modified: 2019-03-22
accepted date: 2019-03-22
in scheme: Codelist of species

Papilio hospiton
type: Concept
notation: 1055
status: valid
status modified: 2019-03-22
accepted date: 2019-03-22
in scheme: Codelist of species

Parnassius mnemosyne
type: Concept
notation: 1056
status: valid
status modified: 2019-03-22
accepted date: 2019-03-22
in scheme: Codelist of species

Parnassius apollo
type: Concept
notation: 1057
status: valid
status modified: 2019-03-22
accepted date: 2019-03-22
in scheme: Codelist of species

Lycaena dispar
type: Concept
notation: 1060
status: valid
status modified: 2019-03-22
accepted date: 2019-03-22
in scheme: Codelist of species

Melanargia arge
type: Concept
notation: 1062
status: valid
status modified: 2019-03-22
accepted date: 2019-03-22
in scheme: Codelist of species

Plebicula golgus
type: Concept
notation: 1063
status: valid
status modified: 2019-03-22
accepted date: 2019-03-22
in scheme: Codelist of species

Fabriciana elisa
type: Concept
notation: 1064
status: valid
status modified: 2019-03-22
accepted date: 2019-03-22
in scheme: Codelist of species

Euphydryas aurinia
type: Concept
notation: 1065
status: valid
status modified: 2019-03-22
accepted date: 2019-03-22
in scheme: Codelist of species

Apatura metis
type: Concept
notation: 1066
status: valid
status modified: 2019-03-22
accepted date: 2019-03-22
in scheme: Codelist of species

Lopinga achine
type: Concept
notation: 1067
status: valid
status modified: 2019-03-22
accepted date: 2019-03-22
in scheme: Codelist of species

Erebia sudetica
type: Concept
notation: 1069
status: valid
status modified: 2019-03-22
accepted date: 2019-03-22
in scheme: Codelist of species

Coenonympha hero
type: Concept
notation: 1070
status: valid
status modified: 2019-03-22
accepted date: 2019-03-22
in scheme: Codelist of species

Coenonympha oedippus
type: Concept
notation: 1071
status: valid
status modified: 2019-03-22
accepted date: 2019-03-22
in scheme: Codelist of species

Erebia calcaria
type: Concept
notation: 1072
status: valid
status modified: 2019-03-22
accepted date: 2019-03-22
in scheme: Codelist of species

Erebia christi
type: Concept
notation: 1073
status: valid
status modified: 2019-03-22
accepted date: 2019-03-22
in scheme: Codelist of species

Eriogaster catax
type: Concept
notation: 1074
status: valid
status modified: 2019-03-22
accepted date: 2019-03-22
in scheme: Codelist of species

Graellsia isabellae
type: Concept
notation: 1075
status: valid
status modified: 2019-03-22
accepted date: 2019-03-22
in scheme: Codelist of species

Proserpinus proserpina
type: Concept
notation: 1076
status: valid
status modified: 2019-03-22
accepted date: 2019-03-22
in scheme: Codelist of species

Hyles hippophaes
type: Concept
notation: 1077
status: valid
status modified: 2019-03-22
accepted date: 2019-03-22
in scheme: Codelist of species

Limoniscus violaceus
type: Concept
notation: 1079
status: valid
status modified: 2019-03-22
accepted date: 2019-03-22
in scheme: Codelist of species

Carabus olympiae
type: Concept
notation: 1080
status: valid
status modified: 2019-03-22
accepted date: 2019-03-22
in scheme: Codelist of species

Dytiscus latissimus
type: Concept
notation: 1081
status: valid
status modified: 2019-03-22
accepted date: 2019-03-22
in scheme: Codelist of species

Graphoderus bilineatus
type: Concept
notation: 1082
status: valid
status modified: 2019-03-22
accepted date: 2019-03-22
in scheme: Codelist of species

Lucanus cervus
type: Concept
notation: 1083
status: valid
status modified: 2019-03-22
accepted date: 2019-03-22
in scheme: Codelist of species

Buprestis splendens
type: Concept
notation: 1085
status: valid
status modified: 2019-03-22
accepted date: 2019-03-22
in scheme: Codelist of species

Cucujus cinnaberinus
type: Concept
notation: 1086
status: valid
status modified: 2019-03-22
accepted date: 2019-03-22
in scheme: Codelist of species

Rosalia alpina
type: Concept
notation: 1087
status: valid
status modified: 2019-03-22
accepted date: 2019-03-22
in scheme: Codelist of species

Cerambyx cerdo
type: Concept
notation: 1088
status: valid
status modified: 2019-03-22
accepted date: 2019-03-22
in scheme: Codelist of species

Scyllarides latus
type: Concept
notation: 1090
status: valid
status modified: 2019-03-22
accepted date: 2019-03-22
in scheme: Codelist of species

Astacus astacus
type: Concept
notation: 1091
status: valid
status modified: 2019-03-22
accepted date: 2019-03-22
in scheme: Codelist of species

Austropotamobius pallipes
type: Concept
notation: 1092
status: valid
status modified: 2019-03-22
accepted date: 2019-03-22
in scheme: Codelist of species

Austropotamobius torrentium
type: Concept
notation: 1093
status: valid
status modified: 2019-03-22
accepted date: 2019-03-22
in scheme: Codelist of species

Macrothele calpeiana
type: Concept
notation: 1094
status: valid
status modified: 2019-03-22
accepted date: 2019-03-22
in scheme: Codelist of species

Petromyzon marinus
type: Concept
notation: 1095
status: valid
status modified: 2019-03-22
accepted date: 2019-03-22
in scheme: Codelist of species

Lampetra planeri
type: Concept
notation: 1096
status: valid
status modified: 2019-03-22
accepted date: 2019-03-22
in scheme: Codelist of species

Lethenteron zanandreai
type: Concept
notation: 1097
status: valid
status modified: 2019-03-22
accepted date: 2019-03-22
in scheme: Codelist of species

Lampetra fluviatilis
type: Concept
notation: 1099
status: valid
status modified: 2019-03-22
accepted date: 2019-03-22
in scheme: Codelist of species

Acipenser naccarii
type: Concept
notation: 1100
status: valid
status modified: 2019-03-22
accepted date: 2019-03-22
in scheme: Codelist of species

Acipenser sturio
type: Concept
notation: 1101
status: valid
status modified: 2019-03-22
accepted date: 2019-03-22
in scheme: Codelist of species

Alosa alosa
type: Concept
notation: 1102
status: valid
status modified: 2019-03-22
accepted date: 2019-03-22
in scheme: Codelist of species

Alosa fallax
type: Concept
notation: 1103
status: valid
status modified: 2019-03-22
accepted date: 2019-03-22
in scheme: Codelist of species

Hucho hucho
type: Concept
notation: 1105
status: valid
status modified: 2019-03-22
accepted date: 2019-03-22
in scheme: Codelist of species

Salmo salar
type: Concept
notation: 1106
status: valid
status modified: 2019-03-22
accepted date: 2019-03-22
in scheme: Codelist of species

Salmo marmoratus
type: Concept
notation: 1107
status: valid
status modified: 2019-03-22
accepted date: 2019-03-22
in scheme: Codelist of species

Thymallus thymallus
type: Concept
notation: 1109
status: valid
status modified: 2019-03-22
accepted date: 2019-03-22
in scheme: Codelist of species

Coregonus oxyrhynchus
type: Concept
notation: 1113
status: valid
status modified: 2019-03-22
accepted date: 2019-03-22
in scheme: Codelist of species

Rutilus pigus
type: Concept
notation: 1114
status: valid
status modified: 2019-03-22
accepted date: 2019-03-22
in scheme: Codelist of species

Ladigesocypris ghigii
type: Concept
notation: 1117
status: valid
status modified: 2019-03-22
accepted date: 2019-03-22
in scheme: Codelist of species

Iberocypris palaciosi
type: Concept
notation: 1118
status: valid
status modified: 2019-03-22
accepted date: 2019-03-22
in scheme: Codelist of species

Alburnus albidus
type: Concept
notation: 1120
status: valid
status modified: 2019-03-22
accepted date: 2019-03-22
in scheme: Codelist of species

Scardinius graecus
type: Concept
notation: 1121
status: valid
status modified: 2019-03-22
accepted date: 2019-03-22
in scheme: Codelist of species

Aspius aspius
type: Concept
notation: 1130
status: valid
status modified: 2019-03-22
accepted date: 2019-03-22
in scheme: Codelist of species

Anaecypris hispanica
type: Concept
notation: 1133
status: valid
status modified: 2019-03-22
accepted date: 2019-03-22
in scheme: Codelist of species

Rutilus rubilio
type: Concept
notation: 1136
status: valid
status modified: 2019-03-22
accepted date: 2019-03-22
in scheme: Codelist of species

Barbus plebejus
type: Concept
notation: 1137
status: valid
status modified: 2019-03-22
accepted date: 2019-03-22
in scheme: Codelist of species

Barbus meridionalis
type: Concept
notation: 1138
status: valid
status modified: 2019-03-22
accepted date: 2019-03-22
in scheme: Codelist of species

Chondrostoma soetta
type: Concept
notation: 1140
status: valid
status modified: 2019-03-22
accepted date: 2019-03-22
in scheme: Codelist of species

Cobitis trichonica
type: Concept
notation: 1144
status: valid
status modified: 2019-03-22
accepted date: 2019-03-22
in scheme: Codelist of species

Misgurnus fossilis
type: Concept
notation: 1145
status: valid
status modified: 2019-03-22
accepted date: 2019-03-22
in scheme: Codelist of species

Silurus aristotelis
type: Concept
notation: 1150
status: valid
status modified: 2019-03-22
accepted date: 2019-03-22
in scheme: Codelist of species

Aphanius iberus
type: Concept
notation: 1151
status: valid
status modified: 2019-03-22
accepted date: 2019-03-22
in scheme: Codelist of species

Aphanius fasciatus
type: Concept
notation: 1152
status: valid
status modified: 2019-03-22
accepted date: 2019-03-22
in scheme: Codelist of species

Valencia hispanica
type: Concept
notation: 1153
status: valid
status modified: 2019-03-22
accepted date: 2019-03-22
in scheme: Codelist of species

Pomatoschistus canestrinii
type: Concept
notation: 1154
status: valid
status modified: 2019-03-22
accepted date: 2019-03-22
in scheme: Codelist of species

Knipowitschia panizzae
type: Concept
notation: 1155
status: valid
status modified: 2019-03-22
accepted date: 2019-03-22
in scheme: Codelist of species

Padogobius nigricans
type: Concept
notation: 1156
status: valid
status modified: 2019-03-22
accepted date: 2019-03-22
in scheme: Codelist of species

Gymnocephalus schraetzer
type: Concept
notation: 1157
status: valid
status modified: 2019-03-22
accepted date: 2019-03-22
in scheme: Codelist of species

Zingel asper
type: Concept
notation: 1158
status: valid
status modified: 2019-03-22
accepted date: 2019-03-22
in scheme: Codelist of species

Zingel zingel
type: Concept
notation: 1159
status: valid
status modified: 2019-03-22
accepted date: 2019-03-22
in scheme: Codelist of species

Zingel streber
type: Concept
notation: 1160
status: valid
status modified: 2019-03-22
accepted date: 2019-03-22
in scheme: Codelist of species

Cottus petiti
type: Concept
notation: 1162
status: valid
status modified: 2019-03-22
accepted date: 2019-03-22
in scheme: Codelist of species

Euproctus montanus
type: Concept
notation: 1164
status: valid
status modified: 2019-03-22
accepted date: 2019-03-22
in scheme: Codelist of species

Euproctus platycephalus
type: Concept
notation: 1165
status: valid
status modified: 2019-03-22
accepted date: 2019-03-22
in scheme: Codelist of species

Triturus cristatus
type: Concept
notation: 1166
status: valid
status modified: 2019-03-22
accepted date: 2019-03-22
in scheme: Codelist of species

Triturus carnifex
type: Concept
notation: 1167
status: valid
status modified: 2019-03-22
accepted date: 2019-03-22
in scheme: Codelist of species

Triturus karelinii
type: Concept
notation: 1171
status: valid
status modified: 2019-03-22
accepted date: 2019-03-22
in scheme: Codelist of species

Chioglossa lusitanica
type: Concept
notation: 1172
status: valid
status modified: 2019-03-22
accepted date: 2019-03-22
in scheme: Codelist of species

Triturus marmoratus
type: Concept
notation: 1174
status: valid
status modified: 2019-03-22
accepted date: 2019-03-22
in scheme: Codelist of species

Salamandrina terdigitata
type: Concept
notation: 1175
status: valid
status modified: 2019-03-22
accepted date: 2019-03-22
in scheme: Codelist of species

Mertensiella luschani
type: Concept
notation: 1176
status: valid
status modified: 2019-03-22
accepted date: 2019-03-22
in scheme: Codelist of species

Salamandra atra
type: Concept
notation: 1177
status: valid
status modified: 2019-03-22
accepted date: 2019-03-22
in scheme: Codelist of species

Salamandra atra aurorae
type: Concept
notation: 1178
status: valid
status modified: 2019-03-22
accepted date: 2019-03-22
in scheme: Codelist of species

Salamandra lanzai
type: Concept
notation: 1179
status: valid
status modified: 2019-03-22
accepted date: 2019-03-22
in scheme: Codelist of species

Proteus anguinus
type: Concept
notation: 1186
status: valid
status modified: 2019-03-22
accepted date: 2019-03-22
in scheme: Codelist of species

Alytes muletensis
type: Concept
notation: 1187
status: valid
status modified: 2019-03-22
accepted date: 2019-03-22
in scheme: Codelist of species

Bombina bombina
type: Concept
notation: 1188
status: valid
status modified: 2019-03-22
accepted date: 2019-03-22
in scheme: Codelist of species

Discoglossus pictus
type: Concept
notation: 1189
status: valid
status modified: 2019-03-22
accepted date: 2019-03-22
in scheme: Codelist of species

Discoglossus sardus
type: Concept
notation: 1190
status: valid
status modified: 2019-03-22
accepted date: 2019-03-22
in scheme: Codelist of species

Alytes obstetricans
type: Concept
notation: 1191
status: valid
status modified: 2019-03-22
accepted date: 2019-03-22
in scheme: Codelist of species

Alytes cisternasii
type: Concept
notation: 1192
status: valid
status modified: 2019-03-22
accepted date: 2019-03-22
in scheme: Codelist of species

Bombina variegata
type: Concept
notation: 1193
status: valid
status modified: 2019-03-22
accepted date: 2019-03-22
in scheme: Codelist of species

Discoglossus galganoi
type: Concept
notation: 1194
status: valid
status modified: 2019-03-22
accepted date: 2019-03-22
in scheme: Codelist of species

Discoglossus montalentii
type: Concept
notation: 1196
status: valid
status modified: 2019-03-22
accepted date: 2019-03-22
in scheme: Codelist of species

Pelobates fuscus
type: Concept
notation: 1197
status: valid
status modified: 2019-03-22
accepted date: 2019-03-22
in scheme: Codelist of species

Pelobates cultripes
type: Concept
notation: 1198
status: valid
status modified: 2019-03-22
accepted date: 2019-03-22
in scheme: Codelist of species

Pelobates fuscus insubricus
type: Concept
notation: 1199
status: valid
status modified: 2019-03-22
accepted date: 2019-03-22
in scheme: Codelist of species

Pelobates syriacus
type: Concept
notation: 1200
status: valid
status modified: 2019-03-22
accepted date: 2019-03-22
in scheme: Codelist of species

Hyla arborea
type: Concept
notation: 1203
status: valid
status modified: 2019-03-22
accepted date: 2019-03-22
in scheme: Codelist of species

Hyla sarda
type: Concept
notation: 1204
status: valid
status modified: 2019-03-22
accepted date: 2019-03-22
in scheme: Codelist of species

Hyla meridionalis
type: Concept
notation: 1205
status: valid
status modified: 2019-03-22
accepted date: 2019-03-22
in scheme: Codelist of species

Rana italica
type: Concept
notation: 1206
status: valid
status modified: 2019-03-22
accepted date: 2019-03-22
in scheme: Codelist of species

Rana graeca
type: Concept
notation: 1208
status: valid
status modified: 2019-03-22
accepted date: 2019-03-22
in scheme: Codelist of species

Rana dalmatina
type: Concept
notation: 1209
status: valid
status modified: 2019-03-22
accepted date: 2019-03-22
in scheme: Codelist of species

Rana temporaria
type: Concept
notation: 1213
status: valid
status modified: 2019-03-22
accepted date: 2019-03-22
in scheme: Codelist of species

Rana arvalis
type: Concept
notation: 1214
status: valid
status modified: 2019-03-22
accepted date: 2019-03-22
in scheme: Codelist of species

Rana latastei
type: Concept
notation: 1215
status: valid
status modified: 2019-03-22
accepted date: 2019-03-22
in scheme: Codelist of species

Rana iberica
type: Concept
notation: 1216
status: valid
status modified: 2019-03-22
accepted date: 2019-03-22
in scheme: Codelist of species

Testudo hermanni
type: Concept
notation: 1217
status: valid
status modified: 2019-03-22
accepted date: 2019-03-22
in scheme: Codelist of species

Testudo marginata
type: Concept
notation: 1218
status: valid
status modified: 2019-03-22
accepted date: 2019-03-22
in scheme: Codelist of species

Testudo graeca
type: Concept
notation: 1219
status: valid
status modified: 2019-03-22
accepted date: 2019-03-22
in scheme: Codelist of species

Emys orbicularis
type: Concept
notation: 1220
status: valid
status modified: 2019-03-22
accepted date: 2019-03-22
in scheme: Codelist of species

Mauremys leprosa
type: Concept
notation: 1221
status: valid
status modified: 2019-03-22
accepted date: 2019-03-22
in scheme: Codelist of species

Dermochelys coriacea
type: Concept
notation: 1223
status: valid
status modified: 2019-03-22
accepted date: 2019-03-22
in scheme: Codelist of species

Caretta caretta
type: Concept
notation: 1224
status: valid
status modified: 2019-03-22
accepted date: 2019-03-22
in scheme: Codelist of species

Eretmochelys imbricata
type: Concept
notation: 1225
status: valid
status modified: 2019-03-22
accepted date: 2019-03-22
in scheme: Codelist of species

Lepidochelys kempii
type: Concept
notation: 1226
status: valid
status modified: 2019-03-22
accepted date: 2019-03-22
in scheme: Codelist of species

Chelonia mydas
type: Concept
notation: 1227
status: valid
status modified: 2019-03-22
accepted date: 2019-03-22
in scheme: Codelist of species

Tarentola angustimentalis
type: Concept
notation: 1230
status: valid
status modified: 2019-03-22
accepted date: 2019-03-22
in scheme: Codelist of species

Tarentola boettgeri
type: Concept
notation: 1231
status: valid
status modified: 2019-03-22
accepted date: 2019-03-22
in scheme: Codelist of species

Tarentola delalandii
type: Concept
notation: 1232
status: valid
status modified: 2019-03-22
accepted date: 2019-03-22
in scheme: Codelist of species

Tarentola gomerensis
type: Concept
notation: 1233
status: valid
status modified: 2019-03-22
accepted date: 2019-03-22
in scheme: Codelist of species

Chamaeleo chamaeleon
type: Concept
notation: 1235
status: valid
status modified: 2019-03-22
accepted date: 2019-03-22
in scheme: Codelist of species

Podarcis filfolensis
type: Concept
notation: 1237
status: valid
status modified: 2019-03-22
accepted date: 2019-03-22
in scheme: Codelist of species

Podarcis erhardii
type: Concept
notation: 1238
status: valid
status modified: 2019-03-22
accepted date: 2019-03-22
in scheme: Codelist of species

Podarcis milensis
type: Concept
notation: 1239
status: valid
status modified: 2019-03-22
accepted date: 2019-03-22
in scheme: Codelist of species

Algyroides fitzingeri
type: Concept
notation: 1240
status: valid
status modified: 2019-03-22
accepted date: 2019-03-22
in scheme: Codelist of species

Podarcis melisellensis
type: Concept
notation: 1241
status: valid
status modified: 2019-03-22
accepted date: 2019-03-22
in scheme: Codelist of species

Gallotia simonyi
type: Concept
notation: 1242
status: valid
status modified: 2019-03-22
accepted date: 2019-03-22
in scheme: Codelist of species

Algyroides nigropunctatus
type: Concept
notation: 1243
status: valid
status modified: 2019-03-22
accepted date: 2019-03-22
in scheme: Codelist of species

Podarcis waglerianus
type: Concept
notation: 1244
status: valid
status modified: 2019-03-22
accepted date: 2019-03-22
in scheme: Codelist of species

Podarcis tiliguerta
type: Concept
notation: 1246
status: valid
status modified: 2019-03-22
accepted date: 2019-03-22
in scheme: Codelist of species

Podarcis taurica
type: Concept
notation: 1248
status: valid
status modified: 2019-03-22
accepted date: 2019-03-22
in scheme: Codelist of species

Podarcis siculus
type: Concept
notation: 1250
status: valid
status modified: 2019-03-22
accepted date: 2019-03-22
in scheme: Codelist of species

Lacerta trilineata
type: Concept
notation: 1251
status: valid
status modified: 2019-03-22
accepted date: 2019-03-22
in scheme: Codelist of species

Podarcis pityusensis
type: Concept
notation: 1252
status: valid
status modified: 2019-03-22
accepted date: 2019-03-22
in scheme: Codelist of species

Gallotia atlantica
type: Concept
notation: 1253
status: valid
status modified: 2019-03-22
accepted date: 2019-03-22
in scheme: Codelist of species

Podarcis peloponnesiaca
type: Concept
notation: 1254
status: valid
status modified: 2019-03-22
accepted date: 2019-03-22
in scheme: Codelist of species

Gallotia galloti insulanagae
type: Concept
notation: 1255
status: valid
status modified: 2019-03-22
accepted date: 2019-03-22
in scheme: Codelist of species

Podarcis muralis
type: Concept
notation: 1256
status: valid
status modified: 2019-03-22
accepted date: 2019-03-22
in scheme: Codelist of species

Algyroides moreoticus
type: Concept
notation: 1258
status: valid
status modified: 2019-03-22
accepted date: 2019-03-22
in scheme: Codelist of species

Lacerta schreiberi
type: Concept
notation: 1259
status: valid
status modified: 2019-03-22
accepted date: 2019-03-22
in scheme: Codelist of species

Gallotia galloti
type: Concept
notation: 1260
status: valid
status modified: 2019-03-22
accepted date: 2019-03-22
in scheme: Codelist of species

Lacerta agilis
type: Concept
notation: 1261
status: valid
status modified: 2019-03-22
accepted date: 2019-03-22
in scheme: Codelist of species

Lacerta viridis
type: Concept
notation: 1263
status: valid
status modified: 2019-03-22
accepted date: 2019-03-22
in scheme: Codelist of species

Algyroides marchi
type: Concept
notation: 1264
status: valid
status modified: 2019-03-22
accepted date: 2019-03-22
in scheme: Codelist of species

Podarcis lilfordi
type: Concept
notation: 1265
status: valid
status modified: 2019-03-22
accepted date: 2019-03-22
in scheme: Codelist of species

Gallotia stehlini
type: Concept
notation: 1267
status: valid
status modified: 2019-03-22
accepted date: 2019-03-22
in scheme: Codelist of species

Ophisops elegans
type: Concept
notation: 1268
status: valid
status modified: 2019-03-22
accepted date: 2019-03-22
in scheme: Codelist of species

Ophisaurus apodus
type: Concept
notation: 1269
status: valid
status modified: 2019-03-22
accepted date: 2019-03-22
in scheme: Codelist of species

Chalcides viridianus
type: Concept
notation: 1270
status: valid
status modified: 2019-03-22
accepted date: 2019-03-22
in scheme: Codelist of species

Ophiomorus punctatissimus
type: Concept
notation: 1271
status: valid
status modified: 2019-03-22
accepted date: 2019-03-22
in scheme: Codelist of species

Chalcides bedriagai
type: Concept
notation: 1272
status: valid
status modified: 2019-03-22
accepted date: 2019-03-22
in scheme: Codelist of species

Chalcides simonyi
type: Concept
notation: 1273
status: valid
status modified: 2019-03-22
accepted date: 2019-03-22
in scheme: Codelist of species

Chalcides ocellatus
type: Concept
notation: 1274
status: valid
status modified: 2019-03-22
accepted date: 2019-03-22
in scheme: Codelist of species

Chalcides sexlineatus
type: Concept
notation: 1275
status: valid
status modified: 2019-03-22
accepted date: 2019-03-22
in scheme: Codelist of species

Ablepharus kitaibelii
type: Concept
notation: 1276
status: valid
status modified: 2019-03-22
accepted date: 2019-03-22
in scheme: Codelist of species

Eryx jaculus
type: Concept
notation: 1277
status: valid
status modified: 2019-03-22
accepted date: 2019-03-22
in scheme: Codelist of species

Elaphe quatuorlineata
type: Concept
notation: 1279
status: valid
status modified: 2019-03-22
accepted date: 2019-03-22
in scheme: Codelist of species

Eirenis modesta
type: Concept
notation: 1282
status: valid
status modified: 2019-03-22
accepted date: 2019-03-22
in scheme: Codelist of species

Coronella austriaca
type: Concept
notation: 1283
status: valid
status modified: 2019-03-22
accepted date: 2019-03-22
in scheme: Codelist of species

Telescopus fallax
type: Concept
notation: 1289
status: valid
status modified: 2019-03-22
accepted date: 2019-03-22
in scheme: Codelist of species

Natrix natrix cetti
type: Concept
notation: 1290
status: valid
status modified: 2019-03-22
accepted date: 2019-03-22
in scheme: Codelist of species

Natrix natrix corsa
type: Concept
notation: 1291
status: valid
status modified: 2019-03-22
accepted date: 2019-03-22
in scheme: Codelist of species

Natrix tessellata
type: Concept
notation: 1292
status: valid
status modified: 2019-03-22
accepted date: 2019-03-22
in scheme: Codelist of species

Vipera xanthina
type: Concept
notation: 1294
status: valid
status modified: 2019-03-22
accepted date: 2019-03-22
in scheme: Codelist of species

Vipera ammodytes
type: Concept
notation: 1295
status: valid
status modified: 2019-03-22
accepted date: 2019-03-22
in scheme: Codelist of species

Macrovipera schweizeri
type: Concept
notation: 1296
status: valid
status modified: 2019-03-22
accepted date: 2019-03-22
in scheme: Codelist of species

Vipera seoanei
type: Concept
notation: 1297
status: valid
status modified: 2019-03-22
accepted date: 2019-03-22
in scheme: Codelist of species

Vipera ursinii
type: Concept
notation: 1298
status: valid
status modified: 2019-03-22
accepted date: 2019-03-22
in scheme: Codelist of species

Crocidura canariensis
type: Concept
notation: 1300
status: valid
status modified: 2019-03-22
accepted date: 2019-03-22
in scheme: Codelist of species

Galemys pyrenaicus
type: Concept
notation: 1301
status: valid
status modified: 2019-03-22
accepted date: 2019-03-22
in scheme: Codelist of species

Rhinolophus mehelyi
type: Concept
notation: 1302
status: valid
status modified: 2019-03-22
accepted date: 2019-03-22
in scheme: Codelist of species

Rhinolophus hipposideros
type: Concept
notation: 1303
status: valid
status modified: 2019-03-22
accepted date: 2019-03-22
in scheme: Codelist of species

Rhinolophus ferrumequinum
type: Concept
notation: 1304
status: valid
status modified: 2019-03-22
accepted date: 2019-03-22
in scheme: Codelist of species

Rhinolophus euryale
type: Concept
notation: 1305
status: valid
status modified: 2019-03-22
accepted date: 2019-03-22
in scheme: Codelist of species

Rhinolophus blasii
type: Concept
notation: 1306
status: valid
status modified: 2019-03-22
accepted date: 2019-03-22
in scheme: Codelist of species

Myotis blythii
type: Concept
notation: 1307
status: valid
status modified: 2019-03-22
accepted date: 2019-03-22
in scheme: Codelist of species

Barbastella barbastellus
type: Concept
notation: 1308
status: valid
status modified: 2019-03-22
accepted date: 2019-03-22
in scheme: Codelist of species

Pipistrellus pipistrellus
type: Concept
notation: 1309
status: valid
status modified: 2019-03-22
accepted date: 2019-03-22
in scheme: Codelist of species

Miniopterus schreibersii
type: Concept
notation: 1310
status: valid
status modified: 2019-03-22
accepted date: 2019-03-22
in scheme: Codelist of species

Nyctalus noctula
type: Concept
notation: 1312
status: valid
status modified: 2019-03-22
accepted date: 2019-03-22
in scheme: Codelist of species

Eptesicus nilssonii
type: Concept
notation: 1313
status: valid
status modified: 2019-03-22
accepted date: 2019-03-22
in scheme: Codelist of species

Myotis daubentonii
type: Concept
notation: 1314
status: valid
status modified: 2019-03-22
accepted date: 2019-03-22
in scheme: Codelist of species

Myotis capaccinii
type: Concept
notation: 1316
status: valid
status modified: 2019-03-22
accepted date: 2019-03-22
in scheme: Codelist of species

Pipistrellus nathusii
type: Concept
notation: 1317
status: valid
status modified: 2019-03-22
accepted date: 2019-03-22
in scheme: Codelist of species

Myotis dasycneme
type: Concept
notation: 1318
status: valid
status modified: 2019-03-22
accepted date: 2019-03-22
in scheme: Codelist of species

Myotis brandtii
type: Concept
notation: 1320
status: valid
status modified: 2019-03-22
accepted date: 2019-03-22
in scheme: Codelist of species

Myotis emarginatus
type: Concept
notation: 1321
status: valid
status modified: 2019-03-22
accepted date: 2019-03-22
in scheme: Codelist of species

Myotis nattereri
type: Concept
notation: 1322
status: valid
status modified: 2019-03-22
accepted date: 2019-03-22
in scheme: Codelist of species

Myotis bechsteinii
type: Concept
notation: 1323
status: valid
status modified: 2019-03-22
accepted date: 2019-03-22
in scheme: Codelist of species

Myotis myotis
type: Concept
notation: 1324
status: valid
status modified: 2019-03-22
accepted date: 2019-03-22
in scheme: Codelist of species

Plecotus auritus
type: Concept
notation: 1326
status: valid
status modified: 2019-03-22
accepted date: 2019-03-22
in scheme: Codelist of species

Eptesicus serotinus
type: Concept
notation: 1327
status: valid
status modified: 2019-03-22
accepted date: 2019-03-22
in scheme: Codelist of species

Nyctalus lasiopterus
type: Concept
notation: 1328
status: valid
status modified: 2019-03-22
accepted date: 2019-03-22
in scheme: Codelist of species

Plecotus austriacus
type: Concept
notation: 1329
status: valid
status modified: 2019-03-22
accepted date: 2019-03-22
in scheme: Codelist of species

Myotis mystacinus
type: Concept
notation: 1330
status: valid
status modified: 2019-03-22
accepted date: 2019-03-22
in scheme: Codelist of species

Nyctalus leisleri
type: Concept
notation: 1331
status: valid
status modified: 2019-03-22
accepted date: 2019-03-22
in scheme: Codelist of species

Vespertilio murinus
type: Concept
notation: 1332
status: valid
status modified: 2019-03-22
accepted date: 2019-03-22
in scheme: Codelist of species

Tadarida teniotis
type: Concept
notation: 1333
status: valid
status modified: 2019-03-22
accepted date: 2019-03-22
in scheme: Codelist of species

Lepus timidus
type: Concept
notation: 1334
status: valid
status modified: 2019-03-22
accepted date: 2019-03-22
in scheme: Codelist of species

Spermophilus citellus
type: Concept
notation: 1335
status: valid
status modified: 2019-03-22
accepted date: 2019-03-22
in scheme: Codelist of species

Sciurus anomalus
type: Concept
notation: 1336
status: valid
status modified: 2019-03-22
accepted date: 2019-03-22
in scheme: Codelist of species

Castor fiber
type: Concept
notation: 1337
status: valid
status modified: 2019-03-22
accepted date: 2019-03-22
in scheme: Codelist of species

Microtus cabrerae
type: Concept
notation: 1338
status: valid
status modified: 2019-03-22
accepted date: 2019-03-22
in scheme: Codelist of species

Cricetus cricetus
type: Concept
notation: 1339
status: valid
status modified: 2019-03-22
accepted date: 2019-03-22
in scheme: Codelist of species

Microtus oeconomus arenicola
type: Concept
notation: 1340
status: valid
status modified: 2019-03-22
accepted date: 2019-03-22
in scheme: Codelist of species

Muscardinus avellanarius
type: Concept
notation: 1341
status: valid
status modified: 2019-03-22
accepted date: 2019-03-22
in scheme: Codelist of species

Dryomys nitedula
type: Concept
notation: 1342
status: valid
status modified: 2019-03-22
accepted date: 2019-03-22
in scheme: Codelist of species

Sicista betulina
type: Concept
notation: 1343
status: valid
status modified: 2019-03-22
accepted date: 2019-03-22
in scheme: Codelist of species

Hystrix cristata
type: Concept
notation: 1344
status: valid
status modified: 2019-03-22
accepted date: 2019-03-22
in scheme: Codelist of species

Megaptera novaeangliae
type: Concept
notation: 1345
status: valid
status modified: 2019-03-22
accepted date: 2019-03-22
in scheme: Codelist of species

Eubalaena glacialis
type: Concept
notation: 1348
status: valid
status modified: 2019-03-22
accepted date: 2019-03-22
in scheme: Codelist of species

Tursiops truncatus
type: Concept
notation: 1349
status: valid
status modified: 2019-03-22
accepted date: 2019-03-22
in scheme: Codelist of species

Delphinus delphis
type: Concept
notation: 1350
status: valid
status modified: 2019-03-22
accepted date: 2019-03-22
in scheme: Codelist of species

Phocoena phocoena
type: Concept
notation: 1351
status: valid
status modified: 2019-03-22
accepted date: 2019-03-22
in scheme: Codelist of species

Canis lupus
type: Concept
notation: 1352
status: valid
status modified: 2019-03-22
accepted date: 2019-03-22
in scheme: Codelist of species

Canis aureus
type: Concept
notation: 1353
status: valid
status modified: 2019-03-22
accepted date: 2019-03-22
in scheme: Codelist of species

Ursus arctos
type: Concept
notation: 1354
status: valid
status modified: 2019-03-22
accepted date: 2019-03-22
in scheme: Codelist of species

Lutra lutra
type: Concept
notation: 1355
status: valid
status modified: 2019-03-22
accepted date: 2019-03-22
in scheme: Codelist of species

Mustela lutreola
type: Concept
notation: 1356
status: valid
status modified: 2019-03-22
accepted date: 2019-03-22
in scheme: Codelist of species

Martes martes
type: Concept
notation: 1357
status: valid
status modified: 2019-03-22
accepted date: 2019-03-22
in scheme: Codelist of species

Mustela putorius
type: Concept
notation: 1358
status: valid
status modified: 2019-03-22
accepted date: 2019-03-22
in scheme: Codelist of species

Herpestes ichneumon
type: Concept
notation: 1359
status: valid
status modified: 2019-03-22
accepted date: 2019-03-22
in scheme: Codelist of species

Genetta genetta
type: Concept
notation: 1360
status: valid
status modified: 2019-03-22
accepted date: 2019-03-22
in scheme: Codelist of species

Lynx lynx
type: Concept
notation: 1361
status: valid
status modified: 2019-03-22
accepted date: 2019-03-22
in scheme: Codelist of species

Lynx pardinus
type: Concept
notation: 1362
status: valid
status modified: 2019-03-22
accepted date: 2019-03-22
in scheme: Codelist of species

Felis silvestris
type: Concept
notation: 1363
status: valid
status modified: 2019-03-22
accepted date: 2019-03-22
in scheme: Codelist of species

Halichoerus grypus
type: Concept
notation: 1364
status: valid
status modified: 2019-03-22
accepted date: 2019-03-22
in scheme: Codelist of species

Phoca vitulina
type: Concept
notation: 1365
status: valid
status modified: 2019-03-22
accepted date: 2019-03-22
in scheme: Codelist of species

Monachus monachus
type: Concept
notation: 1366
status: valid
status modified: 2019-03-22
accepted date: 2019-03-22
in scheme: Codelist of species

Cervus elaphus corsicanus
type: Concept
notation: 1367
status: valid
status modified: 2019-03-22
accepted date: 2019-03-22
in scheme: Codelist of species

Capra pyrenaica
type: Concept
notation: 1368
status: valid
status modified: 2019-03-22
accepted date: 2019-03-22
in scheme: Codelist of species

Rupicapra rupicapra
type: Concept
notation: 1369
status: valid
status modified: 2019-03-22
accepted date: 2019-03-22
in scheme: Codelist of species

Capra pyrenaica pyrenaica
type: Concept
notation: 1370
status: valid
status modified: 2019-03-22
accepted date: 2019-03-22
in scheme: Codelist of species

Rupicapra rupicapra balcanica
type: Concept
notation: 1371
status: valid
status modified: 2019-03-22
accepted date: 2019-03-22
in scheme: Codelist of species

Capra aegagrus
type: Concept
notation: 1372
status: valid
status modified: 2019-03-22
accepted date: 2019-03-22
in scheme: Codelist of species

Rupicapra pyrenaica ornata
type: Concept
notation: 1374
status: valid
status modified: 2019-03-22
accepted date: 2019-03-22
in scheme: Codelist of species

Capra ibex
type: Concept
notation: 1375
status: valid
status modified: 2019-03-22
accepted date: 2019-03-22
in scheme: Codelist of species

Lithothamnium coralloides
type: Concept
notation: 1376
status: valid
status modified: 2019-03-22
accepted date: 2019-03-22
in scheme: Codelist of species

Phymatholithon calcareum
type: Concept
notation: 1377
status: valid
status modified: 2019-03-22
accepted date: 2019-03-22
in scheme: Codelist of species

Cladonia (Cladina) subsp.
type: Concept
notation: 1378
status: valid
status modified: 2019-03-22
accepted date: 2019-03-22
in scheme: Codelist of species

Mannia triandra
type: Concept
notation: 1379
status: valid
status modified: 2019-03-22
accepted date: 2019-03-22
in scheme: Codelist of species

Distichophyllum carinatum
type: Concept
notation: 1380
status: valid
status modified: 2019-03-22
accepted date: 2019-03-22
in scheme: Codelist of species

Dicranum viride
type: Concept
notation: 1381
status: valid
status modified: 2019-03-22
accepted date: 2019-03-22
in scheme: Codelist of species

Thamnobryum fernandesii
type: Concept
notation: 1382
status: valid
status modified: 2019-03-22
accepted date: 2019-03-22
in scheme: Codelist of species

Dichelyma capillaceum
type: Concept
notation: 1383
status: valid
status modified: 2019-03-22
accepted date: 2019-03-22
in scheme: Codelist of species

Riccia breidleri
type: Concept
notation: 1384
status: valid
status modified: 2019-03-22
accepted date: 2019-03-22
in scheme: Codelist of species

Bruchia vogesiaca
type: Concept
notation: 1385
status: valid
status modified: 2019-03-22
accepted date: 2019-03-22
in scheme: Codelist of species

Buxbaumia viridis
type: Concept
notation: 1386
status: valid
status modified: 2019-03-22
accepted date: 2019-03-22
in scheme: Codelist of species

Orthotrichum rogeri
type: Concept
notation: 1387
status: valid
status modified: 2019-03-22
accepted date: 2019-03-22
in scheme: Codelist of species

Bryoerythrophyllum campylocarpum
type: Concept
notation: 1388
status: valid
status modified: 2019-03-22
accepted date: 2019-03-22
in scheme: Codelist of species

Meesia longiseta
type: Concept
notation: 1389
status: valid
status modified: 2019-03-22
accepted date: 2019-03-22
in scheme: Codelist of species

Marsupella profunda
type: Concept
notation: 1390
status: valid
status modified: 2019-03-22
accepted date: 2019-03-22
in scheme: Codelist of species

Riella helicophylla
type: Concept
notation: 1391
status: valid
status modified: 2019-03-22
accepted date: 2019-03-22
in scheme: Codelist of species

Jungermannia handelii
type: Concept
notation: 1392
status: valid
status modified: 2019-03-22
accepted date: 2019-03-22
in scheme: Codelist of species

Petalophyllum ralfsii
type: Concept
notation: 1395
status: valid
status modified: 2019-03-22
accepted date: 2019-03-22
in scheme: Codelist of species

Notothylas orbicularis
type: Concept
notation: 1396
status: valid
status modified: 2019-03-22
accepted date: 2019-03-22
in scheme: Codelist of species

Echinodium spinosum
type: Concept
notation: 1397
status: valid
status modified: 2019-03-22
accepted date: 2019-03-22
in scheme: Codelist of species

Sphagnum pylaesii
type: Concept
notation: 1398
status: valid
status modified: 2019-03-22
accepted date: 2019-03-22
in scheme: Codelist of species

Tayloria rudolphiana
type: Concept
notation: 1399
status: valid
status modified: 2019-03-22
accepted date: 2019-03-22
in scheme: Codelist of species

Leucobryum glaucum
type: Concept
notation: 1400
status: valid
status modified: 2019-03-22
accepted date: 2019-03-22
in scheme: Codelist of species

Sphagnum spp.
type: Concept
notation: 1409
status: valid
status modified: 2019-03-22
accepted date: 2019-03-22
in scheme: Codelist of species

Polystichum drepanum
type: Concept
notation: 1412
status: valid
status modified: 2019-03-22
accepted date: 2019-03-22
in scheme: Codelist of species

Isoetes malinverniana
type: Concept
notation: 1415
status: valid
status modified: 2019-03-22
accepted date: 2019-03-22
in scheme: Codelist of species

Isoetes boryana
type: Concept
notation: 1416
status: valid
status modified: 2019-03-22
accepted date: 2019-03-22
in scheme: Codelist of species

Isoetes azorica
type: Concept
notation: 1417
status: valid
status modified: 2019-03-22
accepted date: 2019-03-22
in scheme: Codelist of species

Ophioglossum polyphyllum
type: Concept
notation: 1418
status: valid
status modified: 2019-03-22
accepted date: 2019-03-22
in scheme: Codelist of species

Botrychium simplex
type: Concept
notation: 1419
status: valid
status modified: 2019-03-22
accepted date: 2019-03-22
in scheme: Codelist of species

Culcita macrocarpa
type: Concept
notation: 1420
status: valid
status modified: 2019-03-22
accepted date: 2019-03-22
in scheme: Codelist of species

Hymenophyllum maderensis
type: Concept
notation: 1422
status: valid
status modified: 2019-03-22
accepted date: 2019-03-22
in scheme: Codelist of species

Asplenium jahandiezii
type: Concept
notation: 1423
status: valid
status modified: 2019-03-22
accepted date: 2019-03-22
in scheme: Codelist of species

Asplenium hemionitis
type: Concept
notation: 1424
status: valid
status modified: 2019-03-22
accepted date: 2019-03-22
in scheme: Codelist of species

Dryopteris corleyi
type: Concept
notation: 1425
status: valid
status modified: 2019-03-22
accepted date: 2019-03-22
in scheme: Codelist of species

Woodwardia radicans
type: Concept
notation: 1426
status: valid
status modified: 2019-03-22
accepted date: 2019-03-22
in scheme: Codelist of species

Marsilea batardae
type: Concept
notation: 1427
status: valid
status modified: 2019-03-22
accepted date: 2019-03-22
in scheme: Codelist of species

Marsilea quadrifolia
type: Concept
notation: 1428
status: valid
status modified: 2019-03-22
accepted date: 2019-03-22
in scheme: Codelist of species

Marsilea strigosa
type: Concept
notation: 1429
status: valid
status modified: 2019-03-22
accepted date: 2019-03-22
in scheme: Codelist of species

Marsilea azorica
type: Concept
notation: 1430
status: valid
status modified: 2019-03-22
accepted date: 2019-03-22
in scheme: Codelist of species

Abies nebrodensis
type: Concept
notation: 1431
status: valid
status modified: 2019-03-22
accepted date: 2019-03-22
in scheme: Codelist of species

Globularia stygia
type: Concept
notation: 1432
status: valid
status modified: 2019-03-22
accepted date: 2019-03-22
in scheme: Codelist of species

Hypericum aciferum
type: Concept
notation: 1433
status: valid
status modified: 2019-03-22
accepted date: 2019-03-22
in scheme: Codelist of species

Salix salvifolia subsp. australis
type: Concept
notation: 1434
status: valid
status modified: 2019-03-22
accepted date: 2019-03-22
in scheme: Codelist of species

Myrica rivas-martinezii
type: Concept
notation: 1435
status: valid
status modified: 2019-03-22
accepted date: 2019-03-22
in scheme: Codelist of species

Zelkova abelicea
type: Concept
notation: 1436
status: valid
status modified: 2019-03-22
accepted date: 2019-03-22
in scheme: Codelist of species

Thesium ebracteatum
type: Concept
notation: 1437
status: valid
status modified: 2019-03-22
accepted date: 2019-03-22
in scheme: Codelist of species

Kunkeliella subsucculenta
type: Concept
notation: 1438
status: valid
status modified: 2019-03-22
accepted date: 2019-03-22
in scheme: Codelist of species

Arceuthobium azoricum
type: Concept
notation: 1439
status: valid
status modified: 2019-03-22
accepted date: 2019-03-22
in scheme: Codelist of species

Polygonum praelongum
type: Concept
notation: 1440
status: valid
status modified: 2019-03-22
accepted date: 2019-03-22
in scheme: Codelist of species

Rumex rupestris
type: Concept
notation: 1441
status: valid
status modified: 2019-03-22
accepted date: 2019-03-22
in scheme: Codelist of species

Rumex azoricus
type: Concept
notation: 1442
status: valid
status modified: 2019-03-22
accepted date: 2019-03-22
in scheme: Codelist of species

Beta patula
type: Concept
notation: 1446
status: valid
status modified: 2019-03-22
accepted date: 2019-03-22
in scheme: Codelist of species

Dianthus cintranus subsp. cintranus
type: Concept
notation: 1447
status: valid
status modified: 2019-03-22
accepted date: 2019-03-22
in scheme: Codelist of species

Herniaria algarvica
type: Concept
notation: 1448
status: valid
status modified: 2019-03-22
accepted date: 2019-03-22
in scheme: Codelist of species

Herniaria lusitanica subsp. berlengiana
type: Concept
notation: 1449
status: valid
status modified: 2019-03-22
accepted date: 2019-03-22
in scheme: Codelist of species

Petrocoptis pseudoviscosa
type: Concept
notation: 1451
status: valid
status modified: 2019-03-22
accepted date: 2019-03-22
in scheme: Codelist of species

Silene rothmaleri
type: Concept
notation: 1452
status: valid
status modified: 2019-03-22
accepted date: 2019-03-22
in scheme: Codelist of species

Arenaria provincialis
type: Concept
notation: 1453
status: valid
status modified: 2019-03-22
accepted date: 2019-03-22
in scheme: Codelist of species

Petrocoptis montsicciana
type: Concept
notation: 1454
status: valid
status modified: 2019-03-22
accepted date: 2019-03-22
in scheme: Codelist of species

Silene mariana
type: Concept
notation: 1455
status: valid
status modified: 2019-03-22
accepted date: 2019-03-22
in scheme: Codelist of species

Petrocoptis grandiflora
type: Concept
notation: 1456
status: valid
status modified: 2019-03-22
accepted date: 2019-03-22
in scheme: Codelist of species

Silene longicilia
type: Concept
notation: 1457
status: valid
status modified: 2019-03-22
accepted date: 2019-03-22
in scheme: Codelist of species

Moehringia tommasinii
type: Concept
notation: 1458
status: valid
status modified: 2019-03-22
accepted date: 2019-03-22
in scheme: Codelist of species

Silene holzmannii
type: Concept
notation: 1459
status: valid
status modified: 2019-03-22
accepted date: 2019-03-22
in scheme: Codelist of species

Silene hicesiae
type: Concept
notation: 1461
status: valid
status modified: 2019-03-22
accepted date: 2019-03-22
in scheme: Codelist of species

Herniaria maritima
type: Concept
notation: 1462
status: valid
status modified: 2019-03-22
accepted date: 2019-03-22
in scheme: Codelist of species

Silene orphanidis
type: Concept
notation: 1463
status: valid
status modified: 2019-03-22
accepted date: 2019-03-22
in scheme: Codelist of species

Silene hifacensis
type: Concept
notation: 1464
status: valid
status modified: 2019-03-22
accepted date: 2019-03-22
in scheme: Codelist of species

Silene velutina
type: Concept
notation: 1465
status: valid
status modified: 2019-03-22
accepted date: 2019-03-22
in scheme: Codelist of species

Gypsophila papillosa
type: Concept
notation: 1467
status: valid
status modified: 2019-03-22
accepted date: 2019-03-22
in scheme: Codelist of species

Dianthus rupicola
type: Concept
notation: 1468
status: valid
status modified: 2019-03-22
accepted date: 2019-03-22
in scheme: Codelist of species

Arenaria nevadensis
type: Concept
notation: 1470
status: valid
status modified: 2019-03-22
accepted date: 2019-03-22
in scheme: Codelist of species

Spergularia azorica
type: Concept
notation: 1471
status: valid
status modified: 2019-03-22
accepted date: 2019-03-22
in scheme: Codelist of species

Aquilegia pyrenaica subsp. cazorlensis
type: Concept
notation: 1472
status: valid
status modified: 2019-03-22
accepted date: 2019-03-22
in scheme: Codelist of species

Aquilegia kitaibelii
type: Concept
notation: 1473
status: valid
status modified: 2019-03-22
accepted date: 2019-03-22
in scheme: Codelist of species

Aquilegia bertolonii
type: Concept
notation: 1474
status: valid
status modified: 2019-03-22
accepted date: 2019-03-22
in scheme: Codelist of species

Aconitum corsicum
type: Concept
notation: 1475
status: valid
status modified: 2019-03-22
accepted date: 2019-03-22
in scheme: Codelist of species

Ranunculus weyleri
type: Concept
notation: 1476
status: valid
status modified: 2019-03-22
accepted date: 2019-03-22
in scheme: Codelist of species

Pulsatilla patens
type: Concept
notation: 1477
status: valid
status modified: 2019-03-22
accepted date: 2019-03-22
in scheme: Codelist of species

Consolida samia
type: Concept
notation: 1478
status: valid
status modified: 2019-03-22
accepted date: 2019-03-22
in scheme: Codelist of species

Adonis distorta
type: Concept
notation: 1479
status: valid
status modified: 2019-03-22
accepted date: 2019-03-22
in scheme: Codelist of species

Aquilegia alpina
type: Concept
notation: 1480
status: valid
status modified: 2019-03-22
accepted date: 2019-03-22
in scheme: Codelist of species

Paeonia clusii subsp. rhodia
type: Concept
notation: 1481
status: valid
status modified: 2019-03-22
accepted date: 2019-03-22
in scheme: Codelist of species

Paeonia parnassica
type: Concept
notation: 1482
status: valid
status modified: 2019-03-22
accepted date: 2019-03-22
in scheme: Codelist of species

Paeonia cambessedesii
type: Concept
notation: 1483
status: valid
status modified: 2019-03-22
accepted date: 2019-03-22
in scheme: Codelist of species

Berberis maderensis
type: Concept
notation: 1484
status: valid
status modified: 2019-03-22
accepted date: 2019-03-22
in scheme: Codelist of species

Diplotaxis siettiana
type: Concept
notation: 1485
status: valid
status modified: 2019-03-22
accepted date: 2019-03-22
in scheme: Codelist of species

Diplotaxis ibicensis
type: Concept
notation: 1486
status: valid
status modified: 2019-03-22
accepted date: 2019-03-22
in scheme: Codelist of species

Jonopsidium acaule
type: Concept
notation: 1487
status: valid
status modified: 2019-03-22
accepted date: 2019-03-22
in scheme: Codelist of species

Coronopus navasii
type: Concept
notation: 1488
status: valid
status modified: 2019-03-22
accepted date: 2019-03-22
in scheme: Codelist of species

Malcolmia lacera subsp. gracilima
type: Concept
notation: 1489
status: valid
status modified: 2019-03-22
accepted date: 2019-03-22
in scheme: Codelist of species

Coincya rupestris
type: Concept
notation: 1490
status: valid
status modified: 2019-03-22
accepted date: 2019-03-22
in scheme: Codelist of species

Murbeckiella sousae
type: Concept
notation: 1491
status: valid
status modified: 2019-03-22
accepted date: 2019-03-22
in scheme: Codelist of species

Rhynchosinapis erucastrum subsp. cintrana
type: Concept
notation: 1492
status: valid
status modified: 2019-03-22
accepted date: 2019-03-22
in scheme: Codelist of species

Sisymbrium supinum
type: Concept
notation: 1493
status: valid
status modified: 2019-03-22
accepted date: 2019-03-22
in scheme: Codelist of species

Brassica macrocarpa
type: Concept
notation: 1494
status: valid
status modified: 2019-03-22
accepted date: 2019-03-22
in scheme: Codelist of species

Brassica insularis
type: Concept
notation: 1496
status: valid
status modified: 2019-03-22
accepted date: 2019-03-22
in scheme: Codelist of species

Brassica glabrescens
type: Concept
notation: 1498
status: valid
status modified: 2019-03-22
accepted date: 2019-03-22
in scheme: Codelist of species

Boleum asperum
type: Concept
notation: 1500
status: valid
status modified: 2019-03-22
accepted date: 2019-03-22
in scheme: Codelist of species

Sisymbrium cavanillesianum
type: Concept
notation: 1501
status: valid
status modified: 2019-03-22
accepted date: 2019-03-22
in scheme: Codelist of species

Erucastrum palustre
type: Concept
notation: 1502
status: valid
status modified: 2019-03-22
accepted date: 2019-03-22
in scheme: Codelist of species

Iberis procumbens subsp. microcarpa
type: Concept
notation: 1503
status: valid
status modified: 2019-03-22
accepted date: 2019-03-22
in scheme: Codelist of species

Biscutella neustriaca
type: Concept
notation: 1506
status: valid
status modified: 2019-03-22
accepted date: 2019-03-22
in scheme: Codelist of species

Arabis sadina
type: Concept
notation: 1507
status: valid
status modified: 2019-03-22
accepted date: 2019-03-22
in scheme: Codelist of species

Alyssum pintodasilvae
type: Concept
notation: 1509
status: valid
status modified: 2019-03-22
accepted date: 2019-03-22
in scheme: Codelist of species

Crambe laevigata
type: Concept
notation: 1510
status: valid
status modified: 2019-03-22
accepted date: 2019-03-22
in scheme: Codelist of species

Crambe arborea
type: Concept
notation: 1511
status: valid
status modified: 2019-03-22
accepted date: 2019-03-22
in scheme: Codelist of species

Sinapidendron rupestre
type: Concept
notation: 1512
status: valid
status modified: 2019-03-22
accepted date: 2019-03-22
in scheme: Codelist of species

Crambe sventenii
type: Concept
notation: 1513
status: valid
status modified: 2019-03-22
accepted date: 2019-03-22
in scheme: Codelist of species

Parolinia schizogynoides
type: Concept
notation: 1514
status: valid
status modified: 2019-03-22
accepted date: 2019-03-22
in scheme: Codelist of species

Aldrovanda vesiculosa
type: Concept
notation: 1516
status: valid
status modified: 2019-03-22
accepted date: 2019-03-22
in scheme: Codelist of species

Aeonium gomerense
type: Concept
notation: 1517
status: valid
status modified: 2019-03-22
accepted date: 2019-03-22
in scheme: Codelist of species

Aeonium saundersii
type: Concept
notation: 1518
status: valid
status modified: 2019-03-22
accepted date: 2019-03-22
in scheme: Codelist of species

Aichryson dumosum
type: Concept
notation: 1519
status: valid
status modified: 2019-03-22
accepted date: 2019-03-22
in scheme: Codelist of species

Monanthes wildpretii
type: Concept
notation: 1520
status: valid
status modified: 2019-03-22
accepted date: 2019-03-22
in scheme: Codelist of species

Sedum brissemoretii
type: Concept
notation: 1521
status: valid
status modified: 2019-03-22
accepted date: 2019-03-22
in scheme: Codelist of species

Saxifraga valdensis
type: Concept
notation: 1522
status: valid
status modified: 2019-03-22
accepted date: 2019-03-22
in scheme: Codelist of species

Saxifraga cintrana
type: Concept
notation: 1523
status: valid
status modified: 2019-03-22
accepted date: 2019-03-22
in scheme: Codelist of species

Saxifraga tombeanensis
type: Concept
notation: 1524
status: valid
status modified: 2019-03-22
accepted date: 2019-03-22
in scheme: Codelist of species

Saxifraga berica
type: Concept
notation: 1525
status: valid
status modified: 2019-03-22
accepted date: 2019-03-22
in scheme: Codelist of species

Saxifraga vayredana
type: Concept
notation: 1526
status: valid
status modified: 2019-03-22
accepted date: 2019-03-22
in scheme: Codelist of species

Saxifraga florulenta
type: Concept
notation: 1527
status: valid
status modified: 2019-03-22
accepted date: 2019-03-22
in scheme: Codelist of species

Saxifraga hirculus
type: Concept
notation: 1528
status: valid
status modified: 2019-03-22
accepted date: 2019-03-22
in scheme: Codelist of species

Saxifraga portosanctana
type: Concept
notation: 1529
status: valid
status modified: 2019-03-22
accepted date: 2019-03-22
in scheme: Codelist of species

Saxifraga presolanensis
type: Concept
notation: 1530
status: valid
status modified: 2019-03-22
accepted date: 2019-03-22
in scheme: Codelist of species

Ribes sardoum
type: Concept
notation: 1531
status: valid
status modified: 2019-03-22
accepted date: 2019-03-22
in scheme: Codelist of species

Pittosporum coriaceum
type: Concept
notation: 1532
status: valid
status modified: 2019-03-22
accepted date: 2019-03-22
in scheme: Codelist of species

Rubus genevierii subsp. herminicus
type: Concept
notation: 1533
status: valid
status modified: 2019-03-22
accepted date: 2019-03-22
in scheme: Codelist of species

Potentilla delphinensis
type: Concept
notation: 1534
status: valid
status modified: 2019-03-22
accepted date: 2019-03-22
in scheme: Codelist of species

Bencomia brachystachya
type: Concept
notation: 1535
status: valid
status modified: 2019-03-22
accepted date: 2019-03-22
in scheme: Codelist of species

Bencomia sphaerocarpa
type: Concept
notation: 1536
status: valid
status modified: 2019-03-22
accepted date: 2019-03-22
in scheme: Codelist of species

Chamaemeles coriacea
type: Concept
notation: 1537
status: valid
status modified: 2019-03-22
accepted date: 2019-03-22
in scheme: Codelist of species

Dendriopoterium pulidoi
type: Concept
notation: 1538
status: valid
status modified: 2019-03-22
accepted date: 2019-03-22
in scheme: Codelist of species

Marcetella maderensis
type: Concept
notation: 1539
status: valid
status modified: 2019-03-22
accepted date: 2019-03-22
in scheme: Codelist of species

Sorbus maderensis
type: Concept
notation: 1541
status: valid
status modified: 2019-03-22
accepted date: 2019-03-22
in scheme: Codelist of species

Dorycnium pentaphyllum subsp. transmontanum
type: Concept
notation: 1542
status: valid
status modified: 2019-03-22
accepted date: 2019-03-22
in scheme: Codelist of species

Astragalus algarbiensis
type: Concept
notation: 1543
status: valid
status modified: 2019-03-22
accepted date: 2019-03-22
in scheme: Codelist of species

Astragalus tremolsianus
type: Concept
notation: 1544
status: valid
status modified: 2019-03-22
accepted date: 2019-03-22
in scheme: Codelist of species

Trifolium saxatile
type: Concept
notation: 1545
status: valid
status modified: 2019-03-22
accepted date: 2019-03-22
in scheme: Codelist of species

Cytisus aeolicus
type: Concept
notation: 1546
status: valid
status modified: 2019-03-22
accepted date: 2019-03-22
in scheme: Codelist of species

Genista holopetala
type: Concept
notation: 1547
status: valid
status modified: 2019-03-22
accepted date: 2019-03-22
in scheme: Codelist of species

Astragalus maritimus
type: Concept
notation: 1548
status: valid
status modified: 2019-03-22
accepted date: 2019-03-22
in scheme: Codelist of species

Genista dorycnifolia
type: Concept
notation: 1550
status: valid
status modified: 2019-03-22
accepted date: 2019-03-22
in scheme: Codelist of species

Ulex densus
type: Concept
notation: 1551
status: valid
status modified: 2019-03-22
accepted date: 2019-03-22
in scheme: Codelist of species

Vicia bifoliolata
type: Concept
notation: 1552
status: valid
status modified: 2019-03-22
accepted date: 2019-03-22
in scheme: Codelist of species

Anthyllis hystrix
type: Concept
notation: 1553
status: valid
status modified: 2019-03-22
accepted date: 2019-03-22
in scheme: Codelist of species

Anthyllis lusitanica
type: Concept
notation: 1554
status: valid
status modified: 2019-03-22
accepted date: 2019-03-22
in scheme: Codelist of species

Astragalus verrucosus
type: Concept
notation: 1555
status: valid
status modified: 2019-03-22
accepted date: 2019-03-22
in scheme: Codelist of species

Melilotus segetalis subsp. fallax
type: Concept
notation: 1556
status: valid
status modified: 2019-03-22
accepted date: 2019-03-22
in scheme: Codelist of species

Astragalus aquilanus
type: Concept
notation: 1558
status: valid
status modified: 2019-03-22
accepted date: 2019-03-22
in scheme: Codelist of species

Anagyris latifolia
type: Concept
notation: 1559
status: valid
status modified: 2019-03-22
accepted date: 2019-03-22
in scheme: Codelist of species

Anthyllis lemanniana
type: Concept
notation: 1560
status: valid
status modified: 2019-03-22
accepted date: 2019-03-22
in scheme: Codelist of species

Dorycnium spectabile
type: Concept
notation: 1561
status: valid
status modified: 2019-03-22
accepted date: 2019-03-22
in scheme: Codelist of species

Lotus azoricus
type: Concept
notation: 1562
status: valid
status modified: 2019-03-22
accepted date: 2019-03-22
in scheme: Codelist of species

Lotus callis-viridis
type: Concept
notation: 1563
status: valid
status modified: 2019-03-22
accepted date: 2019-03-22
in scheme: Codelist of species

Lotus kunkelii
type: Concept
notation: 1564
status: valid
status modified: 2019-03-22
accepted date: 2019-03-22
in scheme: Codelist of species

Teline rosmarinifolia
type: Concept
notation: 1565
status: valid
status modified: 2019-03-22
accepted date: 2019-03-22
in scheme: Codelist of species

Teline salsoloides
type: Concept
notation: 1566
status: valid
status modified: 2019-03-22
accepted date: 2019-03-22
in scheme: Codelist of species

Vicia dennesiana
type: Concept
notation: 1567
status: valid
status modified: 2019-03-22
accepted date: 2019-03-22
in scheme: Codelist of species

Erodium rupicola
type: Concept
notation: 1568
status: valid
status modified: 2019-03-22
accepted date: 2019-03-22
in scheme: Codelist of species

Erodium paularense
type: Concept
notation: 1569
status: valid
status modified: 2019-03-22
accepted date: 2019-03-22
in scheme: Codelist of species

Erodium astragaloides
type: Concept
notation: 1570
status: valid
status modified: 2019-03-22
accepted date: 2019-03-22
in scheme: Codelist of species

Geranium maderense
type: Concept
notation: 1571
status: valid
status modified: 2019-03-22
accepted date: 2019-03-22
in scheme: Codelist of species

Linum mulleri
type: Concept
notation: 1572
status: valid
status modified: 2019-03-22
accepted date: 2019-03-22
in scheme: Codelist of species

Euphorbia transtagana
type: Concept
notation: 1573
status: valid
status modified: 2019-03-22
accepted date: 2019-03-22
in scheme: Codelist of species

Euphorbia nevadensis
type: Concept
notation: 1574
status: valid
status modified: 2019-03-22
accepted date: 2019-03-22
in scheme: Codelist of species

Euphorbia margalidiana
type: Concept
notation: 1575
status: valid
status modified: 2019-03-22
accepted date: 2019-03-22
in scheme: Codelist of species

Euphorbia stygiana
type: Concept
notation: 1577
status: valid
status modified: 2019-03-22
accepted date: 2019-03-22
in scheme: Codelist of species

Euphorbia handiensis
type: Concept
notation: 1578
status: valid
status modified: 2019-03-22
accepted date: 2019-03-22
in scheme: Codelist of species

Maytenus umbellata
type: Concept
notation: 1579
status: valid
status modified: 2019-03-22
accepted date: 2019-03-22
in scheme: Codelist of species

Frangula azorica
type: Concept
notation: 1580
status: valid
status modified: 2019-03-22
accepted date: 2019-03-22
in scheme: Codelist of species

Kosteletzkya pentacarpos
type: Concept
notation: 1581
status: valid
status modified: 2019-03-22
accepted date: 2019-03-22
in scheme: Codelist of species

Thymelaea broteriana
type: Concept
notation: 1582
status: valid
status modified: 2019-03-22
accepted date: 2019-03-22
in scheme: Codelist of species

Daphne petraea
type: Concept
notation: 1583
status: valid
status modified: 2019-03-22
accepted date: 2019-03-22
in scheme: Codelist of species

Daphne rodriguezii
type: Concept
notation: 1584
status: valid
status modified: 2019-03-22
accepted date: 2019-03-22
in scheme: Codelist of species

Viola hispida
type: Concept
notation: 1585
status: valid
status modified: 2019-03-22
accepted date: 2019-03-22
in scheme: Codelist of species

Viola paradoxa
type: Concept
notation: 1586
status: valid
status modified: 2019-03-22
accepted date: 2019-03-22
in scheme: Codelist of species

Viola cazorlensis
type: Concept
notation: 1587
status: valid
status modified: 2019-03-22
accepted date: 2019-03-22
in scheme: Codelist of species

Viola athois
type: Concept
notation: 1588
status: valid
status modified: 2019-03-22
accepted date: 2019-03-22
in scheme: Codelist of species

Viola jaubertiana
type: Concept
notation: 1589
status: valid
status modified: 2019-03-22
accepted date: 2019-03-22
in scheme: Codelist of species

Viola delphinantha
type: Concept
notation: 1590
status: valid
status modified: 2019-03-22
accepted date: 2019-03-22
in scheme: Codelist of species

Helianthemum caput-felis
type: Concept
notation: 1591
status: valid
status modified: 2019-03-22
accepted date: 2019-03-22
in scheme: Codelist of species

Cistus palhinhae
type: Concept
notation: 1592
status: valid
status modified: 2019-03-22
accepted date: 2019-03-22
in scheme: Codelist of species

Halimium verticillatum
type: Concept
notation: 1593
status: valid
status modified: 2019-03-22
accepted date: 2019-03-22
in scheme: Codelist of species

Helianthemum alypoides
type: Concept
notation: 1594
status: valid
status modified: 2019-03-22
accepted date: 2019-03-22
in scheme: Codelist of species

Tuberaria major
type: Concept
notation: 1595
status: valid
status modified: 2019-03-22
accepted date: 2019-03-22
in scheme: Codelist of species

Cistus chinamadensis
type: Concept
notation: 1596
status: valid
status modified: 2019-03-22
accepted date: 2019-03-22
in scheme: Codelist of species

Helianthemum bystropogophyllum
type: Concept
notation: 1597
status: valid
status modified: 2019-03-22
accepted date: 2019-03-22
in scheme: Codelist of species

Lythrum flexuosum
type: Concept
notation: 1598
status: valid
status modified: 2019-03-22
accepted date: 2019-03-22
in scheme: Codelist of species

Laserpitium longiradium
type: Concept
notation: 1599
status: valid
status modified: 2019-03-22
accepted date: 2019-03-22
in scheme: Codelist of species

Naufraga balearica
type: Concept
notation: 1600
status: valid
status modified: 2019-03-22
accepted date: 2019-03-22
in scheme: Codelist of species

Oenanthe conioides
type: Concept
notation: 1601
status: valid
status modified: 2019-03-22
accepted date: 2019-03-22
in scheme: Codelist of species

Eryngium viviparum
type: Concept
notation: 1603
status: valid
status modified: 2019-03-22
accepted date: 2019-03-22
in scheme: Codelist of species

Eryngium alpinum
type: Concept
notation: 1604
status: valid
status modified: 2019-03-22
accepted date: 2019-03-22
in scheme: Codelist of species

Bupleurum capillare
type: Concept
notation: 1605
status: valid
status modified: 2019-03-22
accepted date: 2019-03-22
in scheme: Codelist of species

Bupleurum kakiskalae
type: Concept
notation: 1606
status: valid
status modified: 2019-03-22
accepted date: 2019-03-22
in scheme: Codelist of species

Angelica heterocarpa
type: Concept
notation: 1607
status: valid
status modified: 2019-03-22
accepted date: 2019-03-22
in scheme: Codelist of species

Rouya polygama
type: Concept
notation: 1608
status: valid
status modified: 2019-03-22
accepted date: 2019-03-22
in scheme: Codelist of species

Chaerophyllum azoricum
type: Concept
notation: 1609
status: valid
status modified: 2019-03-22
accepted date: 2019-03-22
in scheme: Codelist of species

Ferula latipinna
type: Concept
notation: 1610
status: valid
status modified: 2019-03-22
accepted date: 2019-03-22
in scheme: Codelist of species

Seseli intricatum
type: Concept
notation: 1611
status: valid
status modified: 2019-03-22
accepted date: 2019-03-22
in scheme: Codelist of species

Melanoselinum decipiens
type: Concept
notation: 1612
status: valid
status modified: 2019-03-22
accepted date: 2019-03-22
in scheme: Codelist of species

Athamanta cortiana
type: Concept
notation: 1613
status: valid
status modified: 2019-03-22
accepted date: 2019-03-22
in scheme: Codelist of species

Apium repens
type: Concept
notation: 1614
status: valid
status modified: 2019-03-22
accepted date: 2019-03-22
in scheme: Codelist of species

Ammi trifoliatum
type: Concept
notation: 1615
status: valid
status modified: 2019-03-22
accepted date: 2019-03-22
in scheme: Codelist of species

Bupleurum handiense
type: Concept
notation: 1616
status: valid
status modified: 2019-03-22
accepted date: 2019-03-22
in scheme: Codelist of species

Angelica palustris
type: Concept
notation: 1617
status: valid
status modified: 2019-03-22
accepted date: 2019-03-22
in scheme: Codelist of species

Apium bermejoi
type: Concept
notation: 1619
status: valid
status modified: 2019-03-22
accepted date: 2019-03-22
in scheme: Codelist of species

Monizia edulis
type: Concept
notation: 1620
status: valid
status modified: 2019-03-22
accepted date: 2019-03-22
in scheme: Codelist of species

Oenanthe divaricata
type: Concept
notation: 1621
status: valid
status modified: 2019-03-22
accepted date: 2019-03-22
in scheme: Codelist of species

Sanicula azorica
type: Concept
notation: 1622
status: valid
status modified: 2019-03-22
accepted date: 2019-03-22
in scheme: Codelist of species

Bunium brevifolium
type: Concept
notation: 1623
status: valid
status modified: 2019-03-22
accepted date: 2019-03-22
in scheme: Codelist of species

Soldanella villosa
type: Concept
notation: 1625
status: valid
status modified: 2019-03-22
accepted date: 2019-03-22
in scheme: Codelist of species

Primula apennina
type: Concept
notation: 1627
status: valid
status modified: 2019-03-22
accepted date: 2019-03-22
in scheme: Codelist of species

Primula palinuri
type: Concept
notation: 1628
status: valid
status modified: 2019-03-22
accepted date: 2019-03-22
in scheme: Codelist of species

Primula glaucescens
type: Concept
notation: 1629
status: valid
status modified: 2019-03-22
accepted date: 2019-03-22
in scheme: Codelist of species

Androsace mathildae
type: Concept
notation: 1630
status: valid
status modified: 2019-03-22
accepted date: 2019-03-22
in scheme: Codelist of species

Androsace cylindrica
type: Concept
notation: 1631
status: valid
status modified: 2019-03-22
accepted date: 2019-03-22
in scheme: Codelist of species

Androsace pyrenaica
type: Concept
notation: 1632
status: valid
status modified: 2019-03-22
accepted date: 2019-03-22
in scheme: Codelist of species

Limonium dodartii subsp. lusitanicum
type: Concept
notation: 1633
status: valid
status modified: 2019-03-22
accepted date: 2019-03-22
in scheme: Codelist of species

Limonium insulare
type: Concept
notation: 1634
status: valid
status modified: 2019-03-22
accepted date: 2019-03-22
in scheme: Codelist of species

Armeria velutina
type: Concept
notation: 1635
status: valid
status modified: 2019-03-22
accepted date: 2019-03-22
in scheme: Codelist of species

Armeria soleirolii
type: Concept
notation: 1636
status: valid
status modified: 2019-03-22
accepted date: 2019-03-22
in scheme: Codelist of species

Armeria neglecta
type: Concept
notation: 1637
status: valid
status modified: 2019-03-22
accepted date: 2019-03-22
in scheme: Codelist of species

Armeria pseudoarmeria
type: Concept
notation: 1638
status: valid
status modified: 2019-03-22
accepted date: 2019-03-22
in scheme: Codelist of species

Limonium multiflorum
type: Concept
notation: 1640
status: valid
status modified: 2019-03-22
accepted date: 2019-03-22
in scheme: Codelist of species

Armeria sampaioi
type: Concept
notation: 1641
status: valid
status modified: 2019-03-22
accepted date: 2019-03-22
in scheme: Codelist of species

Limonium pseudolaetum
type: Concept
notation: 1642
status: valid
status modified: 2019-03-22
accepted date: 2019-03-22
in scheme: Codelist of species

Limonium strictissimum
type: Concept
notation: 1643
status: valid
status modified: 2019-03-22
accepted date: 2019-03-22
in scheme: Codelist of species

Armeria rouyana
type: Concept
notation: 1644
status: valid
status modified: 2019-03-22
accepted date: 2019-03-22
in scheme: Codelist of species

Armeria berlengensis
type: Concept
notation: 1645
status: valid
status modified: 2019-03-22
accepted date: 2019-03-22
in scheme: Codelist of species

Armeria helodes
type: Concept
notation: 1646
status: valid
status modified: 2019-03-22
accepted date: 2019-03-22
in scheme: Codelist of species

Limonium spectabile
type: Concept
notation: 1647
status: valid
status modified: 2019-03-22
accepted date: 2019-03-22
in scheme: Codelist of species

Limonium sventenii
type: Concept
notation: 1648
status: valid
status modified: 2019-03-22
accepted date: 2019-03-22
in scheme: Codelist of species

Limonium arborescens
type: Concept
notation: 1649
status: valid
status modified: 2019-03-22
accepted date: 2019-03-22
in scheme: Codelist of species

Limonium dendroides
type: Concept
notation: 1650
status: valid
status modified: 2019-03-22
accepted date: 2019-03-22
in scheme: Codelist of species

Jasminum azoricum
type: Concept
notation: 1652
status: valid
status modified: 2019-03-22
accepted date: 2019-03-22
in scheme: Codelist of species

Picconia azorica
type: Concept
notation: 1653
status: valid
status modified: 2019-03-22
accepted date: 2019-03-22
in scheme: Codelist of species

Gentianella anglica
type: Concept
notation: 1654
status: valid
status modified: 2019-03-22
accepted date: 2019-03-22
in scheme: Codelist of species

Gentiana ligustica
type: Concept
notation: 1656
status: valid
status modified: 2019-03-22
accepted date: 2019-03-22
in scheme: Codelist of species

Gentiana lutea
type: Concept
notation: 1657
status: valid
status modified: 2019-03-22
accepted date: 2019-03-22
in scheme: Codelist of species

Centaurium somedanum
type: Concept
notation: 1658
status: valid
status modified: 2019-03-22
accepted date: 2019-03-22
in scheme: Codelist of species

Caralluma burchardii
type: Concept
notation: 1659
status: valid
status modified: 2019-03-22
accepted date: 2019-03-22
in scheme: Codelist of species

Galium litorale
type: Concept
notation: 1661
status: valid
status modified: 2019-03-22
accepted date: 2019-03-22
in scheme: Codelist of species

Galium viridiflorum
type: Concept
notation: 1662
status: valid
status modified: 2019-03-22
accepted date: 2019-03-22
in scheme: Codelist of species

Convolvulus argyrothamnus
type: Concept
notation: 1663
status: valid
status modified: 2019-03-22
accepted date: 2019-03-22
in scheme: Codelist of species

Convolvulus fernandesii
type: Concept
notation: 1664
status: valid
status modified: 2019-03-22
accepted date: 2019-03-22
in scheme: Codelist of species

Convolvulus massonii
type: Concept
notation: 1665
status: valid
status modified: 2019-03-22
accepted date: 2019-03-22
in scheme: Codelist of species

Convolvulus caput-medusae
type: Concept
notation: 1666
status: valid
status modified: 2019-03-22
accepted date: 2019-03-22
in scheme: Codelist of species

Convolvulus lopez-socasii
type: Concept
notation: 1667
status: valid
status modified: 2019-03-22
accepted date: 2019-03-22
in scheme: Codelist of species

Lithodora nitida
type: Concept
notation: 1668
status: valid
status modified: 2019-03-22
accepted date: 2019-03-22
in scheme: Codelist of species

Myosotis lusitanica
type: Concept
notation: 1669
status: valid
status modified: 2019-03-22
accepted date: 2019-03-22
in scheme: Codelist of species

Myosotis rehsteineri
type: Concept
notation: 1670
status: valid
status modified: 2019-03-22
accepted date: 2019-03-22
in scheme: Codelist of species

Solenanthus albanicus
type: Concept
notation: 1671
status: valid
status modified: 2019-03-22
accepted date: 2019-03-22
in scheme: Codelist of species

Symphytum cycladense
type: Concept
notation: 1672
status: valid
status modified: 2019-03-22
accepted date: 2019-03-22
in scheme: Codelist of species

Myosotis retusifolia
type: Concept
notation: 1673
status: valid
status modified: 2019-03-22
accepted date: 2019-03-22
in scheme: Codelist of species

Anchusa crispa
type: Concept
notation: 1674
status: valid
status modified: 2019-03-22
accepted date: 2019-03-22
in scheme: Codelist of species

Omphalodes kuzinskyanae
type: Concept
notation: 1675
status: valid
status modified: 2019-03-22
accepted date: 2019-03-22
in scheme: Codelist of species

Omphalodes littoralis
type: Concept
notation: 1676
status: valid
status modified: 2019-03-22
accepted date: 2019-03-22
in scheme: Codelist of species

Echium gentianoides
type: Concept
notation: 1677
status: valid
status modified: 2019-03-22
accepted date: 2019-03-22
in scheme: Codelist of species

Myosotis azorica
type: Concept
notation: 1678
status: valid
status modified: 2019-03-22
accepted date: 2019-03-22
in scheme: Codelist of species

Myosotis maritima
type: Concept
notation: 1679
status: valid
status modified: 2019-03-22
accepted date: 2019-03-22
in scheme: Codelist of species

Echium candicans
type: Concept
notation: 1680
status: valid
status modified: 2019-03-22
accepted date: 2019-03-22
in scheme: Codelist of species

Thymus carnosus
type: Concept
notation: 1681
status: valid
status modified: 2019-03-22
accepted date: 2019-03-22
in scheme: Codelist of species

Thymus lotocephalus
type: Concept
notation: 1682
status: valid
status modified: 2019-03-22
accepted date: 2019-03-22
in scheme: Codelist of species

Nepeta sphaciotica
type: Concept
notation: 1684
status: valid
status modified: 2019-03-22
accepted date: 2019-03-22
in scheme: Codelist of species

Origanum dictamnus
type: Concept
notation: 1685
status: valid
status modified: 2019-03-22
accepted date: 2019-03-22
in scheme: Codelist of species

Rosmarinus tomentosus
type: Concept
notation: 1686
status: valid
status modified: 2019-03-22
accepted date: 2019-03-22
in scheme: Codelist of species

Sideritis javalambrensis
type: Concept
notation: 1687
status: valid
status modified: 2019-03-22
accepted date: 2019-03-22
in scheme: Codelist of species

Sideritis incana subsp. glauca
type: Concept
notation: 1688
status: valid
status modified: 2019-03-22
accepted date: 2019-03-22
in scheme: Codelist of species

Dracocephalum austriacum
type: Concept
notation: 1689
status: valid
status modified: 2019-03-22
accepted date: 2019-03-22
in scheme: Codelist of species

Teucrium charidemi
type: Concept
notation: 1690
status: valid
status modified: 2019-03-22
accepted date: 2019-03-22
in scheme: Codelist of species

Teucrium salviastrum subsp. salviastrum
type: Concept
notation: 1691
status: valid
status modified: 2019-03-22
accepted date: 2019-03-22
in scheme: Codelist of species

Sideritis serrata
type: Concept
notation: 1692
status: valid
status modified: 2019-03-22
accepted date: 2019-03-22
in scheme: Codelist of species

Teucrium lepicephalum
type: Concept
notation: 1693
status: valid
status modified: 2019-03-22
accepted date: 2019-03-22
in scheme: Codelist of species

Teucrium turredanum
type: Concept
notation: 1694
status: valid
status modified: 2019-03-22
accepted date: 2019-03-22
in scheme: Codelist of species

Thymus camphoratus
type: Concept
notation: 1695
status: valid
status modified: 2019-03-22
accepted date: 2019-03-22
in scheme: Codelist of species

Thymus capitellatus
type: Concept
notation: 1696
status: valid
status modified: 2019-03-22
accepted date: 2019-03-22
in scheme: Codelist of species

Thymus villosus subsp. villosus
type: Concept
notation: 1698
status: valid
status modified: 2019-03-22
accepted date: 2019-03-22
in scheme: Codelist of species

Sideritis discolor
type: Concept
notation: 1699
status: valid
status modified: 2019-03-22
accepted date: 2019-03-22
in scheme: Codelist of species

Sideritis infernalis
type: Concept
notation: 1700
status: valid
status modified: 2019-03-22
accepted date: 2019-03-22
in scheme: Codelist of species

Teucrium abutiloides
type: Concept
notation: 1701
status: valid
status modified: 2019-03-22
accepted date: 2019-03-22
in scheme: Codelist of species

Teucrium betonicum
type: Concept
notation: 1702
status: valid
status modified: 2019-03-22
accepted date: 2019-03-22
in scheme: Codelist of species

Sideritis cystosiphon
type: Concept
notation: 1703
status: valid
status modified: 2019-03-22
accepted date: 2019-03-22
in scheme: Codelist of species

Sideritis marmorea
type: Concept
notation: 1704
status: valid
status modified: 2019-03-22
accepted date: 2019-03-22
in scheme: Codelist of species

Solanum lidii
type: Concept
notation: 1705
status: valid
status modified: 2019-03-22
accepted date: 2019-03-22
in scheme: Codelist of species

Mandragora officinarum
type: Concept
notation: 1706
status: valid
status modified: 2019-03-22
accepted date: 2019-03-22
in scheme: Codelist of species

Atropa baetica
type: Concept
notation: 1707
status: valid
status modified: 2019-03-22
accepted date: 2019-03-22
in scheme: Codelist of species

Odontites granatensis
type: Concept
notation: 1709
status: valid
status modified: 2019-03-22
accepted date: 2019-03-22
in scheme: Codelist of species

Linaria tonzigii
type: Concept
notation: 1710
status: valid
status modified: 2019-03-22
accepted date: 2019-03-22
in scheme: Codelist of species

Scrophularia herminii
type: Concept
notation: 1711
status: valid
status modified: 2019-03-22
accepted date: 2019-03-22
in scheme: Codelist of species

Euphrasia mendoncae
type: Concept
notation: 1712
status: valid
status modified: 2019-03-22
accepted date: 2019-03-22
in scheme: Codelist of species

Linaria ricardoi
type: Concept
notation: 1713
status: valid
status modified: 2019-03-22
accepted date: 2019-03-22
in scheme: Codelist of species

Euphrasia marchesettii
type: Concept
notation: 1714
status: valid
status modified: 2019-03-22
accepted date: 2019-03-22
in scheme: Codelist of species

Linaria flava
type: Concept
notation: 1715
status: valid
status modified: 2019-03-22
accepted date: 2019-03-22
in scheme: Codelist of species

Linaria coutinhoi
type: Concept
notation: 1716
status: valid
status modified: 2019-03-22
accepted date: 2019-03-22
in scheme: Codelist of species

Linaria tursica
type: Concept
notation: 1717
status: valid
status modified: 2019-03-22
accepted date: 2019-03-22
in scheme: Codelist of species

Linaria hellenica
type: Concept
notation: 1718
status: valid
status modified: 2019-03-22
accepted date: 2019-03-22
in scheme: Codelist of species

Linaria ficalhoana
type: Concept
notation: 1719
status: valid
status modified: 2019-03-22
accepted date: 2019-03-22
in scheme: Codelist of species

Chaenorhinum serpyllifolium subsp. lusitanicum
type: Concept
notation: 1721
status: valid
status modified: 2019-03-22
accepted date: 2019-03-22
in scheme: Codelist of species

Antirrhinum lopesianum
type: Concept
notation: 1722
status: valid
status modified: 2019-03-22
accepted date: 2019-03-22
in scheme: Codelist of species

Antirrhinum charidemi
type: Concept
notation: 1723
status: valid
status modified: 2019-03-22
accepted date: 2019-03-22
in scheme: Codelist of species

Anarrhinum longipedicellatum
type: Concept
notation: 1724
status: valid
status modified: 2019-03-22
accepted date: 2019-03-22
in scheme: Codelist of species

Lindernia procumbens
type: Concept
notation: 1725
status: valid
status modified: 2019-03-22
accepted date: 2019-03-22
in scheme: Codelist of species

Linaria algarviana
type: Concept
notation: 1726
status: valid
status modified: 2019-03-22
accepted date: 2019-03-22
in scheme: Codelist of species

Isoplexis chalcantha
type: Concept
notation: 1727
status: valid
status modified: 2019-03-22
accepted date: 2019-03-22
in scheme: Codelist of species

Isoplexis isabelliana
type: Concept
notation: 1728
status: valid
status modified: 2019-03-22
accepted date: 2019-03-22
in scheme: Codelist of species

Odontites holliana
type: Concept
notation: 1729
status: valid
status modified: 2019-03-22
accepted date: 2019-03-22
in scheme: Codelist of species

Sibthorpia peregrina
type: Concept
notation: 1730
status: valid
status modified: 2019-03-22
accepted date: 2019-03-22
in scheme: Codelist of species

Verbascum litigiosum
type: Concept
notation: 1731
status: valid
status modified: 2019-03-22
accepted date: 2019-03-22
in scheme: Codelist of species

Veronica oetaea
type: Concept
notation: 1732
status: valid
status modified: 2019-03-22
accepted date: 2019-03-22
in scheme: Codelist of species

Veronica micrantha
type: Concept
notation: 1733
status: valid
status modified: 2019-03-22
accepted date: 2019-03-22
in scheme: Codelist of species

Euphrasia grandiflora
type: Concept
notation: 1734
status: valid
status modified: 2019-03-22
accepted date: 2019-03-22
in scheme: Codelist of species

Scrophularia sublyrata
type: Concept
notation: 1735
status: valid
status modified: 2019-03-22
accepted date: 2019-03-22
in scheme: Codelist of species

Euphrasia azorica
type: Concept
notation: 1736
status: valid
status modified: 2019-03-22
accepted date: 2019-03-22
in scheme: Codelist of species

Globularia ascanii
type: Concept
notation: 1737
status: valid
status modified: 2019-03-22
accepted date: 2019-03-22
in scheme: Codelist of species

Globularia sarcophylla
type: Concept
notation: 1738
status: valid
status modified: 2019-03-22
accepted date: 2019-03-22
in scheme: Codelist of species

Ramonda serbica
type: Concept
notation: 1739
status: valid
status modified: 2019-03-22
accepted date: 2019-03-22
in scheme: Codelist of species

Jankaea heldreichii
type: Concept
notation: 1740
status: valid
status modified: 2019-03-22
accepted date: 2019-03-22
in scheme: Codelist of species

Pinguicula nevadensis
type: Concept
notation: 1741
status: valid
status modified: 2019-03-22
accepted date: 2019-03-22
in scheme: Codelist of species

Plantago algarbiensis
type: Concept
notation: 1742
status: valid
status modified: 2019-03-22
accepted date: 2019-03-22
in scheme: Codelist of species

Plantago almogravensis
type: Concept
notation: 1743
status: valid
status modified: 2019-03-22
accepted date: 2019-03-22
in scheme: Codelist of species

Plantago malato-belizii
type: Concept
notation: 1744
status: valid
status modified: 2019-03-22
accepted date: 2019-03-22
in scheme: Codelist of species

Sambucus palmensis
type: Concept
notation: 1745
status: valid
status modified: 2019-03-22
accepted date: 2019-03-22
in scheme: Codelist of species

Centranthus trinervis
type: Concept
notation: 1746
status: valid
status modified: 2019-03-22
accepted date: 2019-03-22
in scheme: Codelist of species

Scabiosa nitens
type: Concept
notation: 1747
status: valid
status modified: 2019-03-22
accepted date: 2019-03-22
in scheme: Codelist of species

Asyneuma giganteum
type: Concept
notation: 1748
status: valid
status modified: 2019-03-22
accepted date: 2019-03-22
in scheme: Codelist of species

Physoplexis comosa
type: Concept
notation: 1749
status: valid
status modified: 2019-03-22
accepted date: 2019-03-22
in scheme: Codelist of species

Campanula morettiana
type: Concept
notation: 1750
status: valid
status modified: 2019-03-22
accepted date: 2019-03-22
in scheme: Codelist of species

Campanula sabatia
type: Concept
notation: 1751
status: valid
status modified: 2019-03-22
accepted date: 2019-03-22
in scheme: Codelist of species

Jasione crispa subsp. serpentinica
type: Concept
notation: 1752
status: valid
status modified: 2019-03-22
accepted date: 2019-03-22
in scheme: Codelist of species

Musschia aurea
type: Concept
notation: 1754
status: valid
status modified: 2019-03-22
accepted date: 2019-03-22
in scheme: Codelist of species

Azorina vidalii
type: Concept
notation: 1755
status: valid
status modified: 2019-03-22
accepted date: 2019-03-22
in scheme: Codelist of species

Musschia wollastonii
type: Concept
notation: 1756
status: valid
status modified: 2019-03-22
accepted date: 2019-03-22
in scheme: Codelist of species

Ligularia sibirica
type: Concept
notation: 1758
status: valid
status modified: 2019-03-22
accepted date: 2019-03-22
in scheme: Codelist of species

Leontodon microcephalus
type: Concept
notation: 1759
status: valid
status modified: 2019-03-22
accepted date: 2019-03-22
in scheme: Codelist of species

Carduus myriacanthus
type: Concept
notation: 1760
status: valid
status modified: 2019-03-22
accepted date: 2019-03-22
in scheme: Codelist of species

Argyranthemum pinnatifidum subsp. succulentum
type: Concept
notation: 1761
status: valid
status modified: 2019-03-22
accepted date: 2019-03-22
in scheme: Codelist of species

Arnica montana
type: Concept
notation: 1762
status: valid
status modified: 2019-03-22
accepted date: 2019-03-22
in scheme: Codelist of species

Artemisia eriantha
type: Concept
notation: 1763
status: valid
status modified: 2019-03-22
accepted date: 2019-03-22
in scheme: Codelist of species

Artemisia genipi
type: Concept
notation: 1764
status: valid
status modified: 2019-03-22
accepted date: 2019-03-22
in scheme: Codelist of species

Artemisia granatensis
type: Concept
notation: 1765
status: valid
status modified: 2019-03-22
accepted date: 2019-03-22
in scheme: Codelist of species

Anthemis glaberrima
type: Concept
notation: 1766
status: valid
status modified: 2019-03-22
accepted date: 2019-03-22
in scheme: Codelist of species

Lamyropsis microcephala
type: Concept
notation: 1768
status: valid
status modified: 2019-03-22
accepted date: 2019-03-22
in scheme: Codelist of species

Senecio lagascanus subsp. lusitanicus
type: Concept
notation: 1769
status: valid
status modified: 2019-03-22
accepted date: 2019-03-22
in scheme: Codelist of species

Helichrysum sibthorpii
type: Concept
notation: 1771
status: valid
status modified: 2019-03-22
accepted date: 2019-03-22
in scheme: Codelist of species

Centaurea citricolor
type: Concept
notation: 1772
status: valid
status modified: 2019-03-22
accepted date: 2019-03-22
in scheme: Codelist of species

Senecio caespitosus
type: Concept
notation: 1773
status: valid
status modified: 2019-03-22
accepted date: 2019-03-22
in scheme: Codelist of species

Centaurea gadorensis
type: Concept
notation: 1774
status: valid
status modified: 2019-03-22
accepted date: 2019-03-22
in scheme: Codelist of species

Santolina semidentata
type: Concept
notation: 1775
status: valid
status modified: 2019-03-22
accepted date: 2019-03-22
in scheme: Codelist of species

Centaurea kalambakensis
type: Concept
notation: 1776
status: valid
status modified: 2019-03-22
accepted date: 2019-03-22
in scheme: Codelist of species

Santolina impressa
type: Concept
notation: 1777
status: valid
status modified: 2019-03-22
accepted date: 2019-03-22
in scheme: Codelist of species

Centaurea lactiflora
type: Concept
notation: 1778
status: valid
status modified: 2019-03-22
accepted date: 2019-03-22
in scheme: Codelist of species

Hymenostemma pseudanthemis
type: Concept
notation: 1779
status: valid
status modified: 2019-03-22
accepted date: 2019-03-22
in scheme: Codelist of species

Centaurea niederi
type: Concept
notation: 1780
status: valid
status modified: 2019-03-22
accepted date: 2019-03-22
in scheme: Codelist of species

Santolina elegans
type: Concept
notation: 1781
status: valid
status modified: 2019-03-22
accepted date: 2019-03-22
in scheme: Codelist of species

Centaurea pinnata
type: Concept
notation: 1782
status: valid
status modified: 2019-03-22
accepted date: 2019-03-22
in scheme: Codelist of species

Picris willkommii
type: Concept
notation: 1783
status: valid
status modified: 2019-03-22
accepted date: 2019-03-22
in scheme: Codelist of species

Centaurea rothmalerana
type: Concept
notation: 1784
status: valid
status modified: 2019-03-22
accepted date: 2019-03-22
in scheme: Codelist of species

Crepis crocifolia
type: Concept
notation: 1786
status: valid
status modified: 2019-03-22
accepted date: 2019-03-22
in scheme: Codelist of species

Crepis granatensis
type: Concept
notation: 1787
status: valid
status modified: 2019-03-22
accepted date: 2019-03-22
in scheme: Codelist of species

Leuzea longifolia
type: Concept
notation: 1788
status: valid
status modified: 2019-03-22
accepted date: 2019-03-22
in scheme: Codelist of species

Erigeron frigidus
type: Concept
notation: 1789
status: valid
status modified: 2019-03-22
accepted date: 2019-03-22
in scheme: Codelist of species

Leontodon siculus
type: Concept
notation: 1790
status: valid
status modified: 2019-03-22
accepted date: 2019-03-22
in scheme: Codelist of species

Centaurea horrida
type: Concept
notation: 1791
status: valid
status modified: 2019-03-22
accepted date: 2019-03-22
in scheme: Codelist of species

Leontodon boryi
type: Concept
notation: 1792
status: valid
status modified: 2019-03-22
accepted date: 2019-03-22
in scheme: Codelist of species

Centaurea micrantha subsp. herminii
type: Concept
notation: 1793
status: valid
status modified: 2019-03-22
accepted date: 2019-03-22
in scheme: Codelist of species

Centaurea balearica
type: Concept
notation: 1794
status: valid
status modified: 2019-03-22
accepted date: 2019-03-22
in scheme: Codelist of species

Centaurea pulvinata
type: Concept
notation: 1795
status: valid
status modified: 2019-03-22
accepted date: 2019-03-22
in scheme: Codelist of species

Centaurea borjae
type: Concept
notation: 1796
status: valid
status modified: 2019-03-22
accepted date: 2019-03-22
in scheme: Codelist of species

Doronicum plantagineum subsp. tournefortii
type: Concept
notation: 1797
status: valid
status modified: 2019-03-22
accepted date: 2019-03-22
in scheme: Codelist of species

Centaurea kartschiana
type: Concept
notation: 1798
status: valid
status modified: 2019-03-22
accepted date: 2019-03-22
in scheme: Codelist of species

Centaurea peucedanifolia
type: Concept
notation: 1799
status: valid
status modified: 2019-03-22
accepted date: 2019-03-22
in scheme: Codelist of species

Jurinea fontqueri
type: Concept
notation: 1800
status: valid
status modified: 2019-03-22
accepted date: 2019-03-22
in scheme: Codelist of species

Centaurea corymbosa
type: Concept
notation: 1801
status: valid
status modified: 2019-03-22
accepted date: 2019-03-22
in scheme: Codelist of species

Aster pyrenaeus
type: Concept
notation: 1802
status: valid
status modified: 2019-03-22
accepted date: 2019-03-22
in scheme: Codelist of species

Senecio nevadensis
type: Concept
notation: 1803
status: valid
status modified: 2019-03-22
accepted date: 2019-03-22
in scheme: Codelist of species

Senecio elodes
type: Concept
notation: 1804
status: valid
status modified: 2019-03-22
accepted date: 2019-03-22
in scheme: Codelist of species

Jurinea cyanoides
type: Concept
notation: 1805
status: valid
status modified: 2019-03-22
accepted date: 2019-03-22
in scheme: Codelist of species

Centaurea attica subsp. megarensis
type: Concept
notation: 1806
status: valid
status modified: 2019-03-22
accepted date: 2019-03-22
in scheme: Codelist of species

Andryala crithmifolia
type: Concept
notation: 1807
status: valid
status modified: 2019-03-22
accepted date: 2019-03-22
in scheme: Codelist of species

Cheirolophus junonianus
type: Concept
notation: 1808
status: valid
status modified: 2019-03-22
accepted date: 2019-03-22
in scheme: Codelist of species

Cheirolophus massonianus
type: Concept
notation: 1809
status: valid
status modified: 2019-03-22
accepted date: 2019-03-22
in scheme: Codelist of species

Calendula maderensis
type: Concept
notation: 1810
status: valid
status modified: 2019-03-22
accepted date: 2019-03-22
in scheme: Codelist of species

Atractylis preauxiana
type: Concept
notation: 1811
status: valid
status modified: 2019-03-22
accepted date: 2019-03-22
in scheme: Codelist of species

Argyranthemum lidii
type: Concept
notation: 1812
status: valid
status modified: 2019-03-22
accepted date: 2019-03-22
in scheme: Codelist of species

Leuzea rhaponticoides
type: Concept
notation: 1813
status: valid
status modified: 2019-03-22
accepted date: 2019-03-22
in scheme: Codelist of species

Cheirolophus duranii
type: Concept
notation: 1814
status: valid
status modified: 2019-03-22
accepted date: 2019-03-22
in scheme: Codelist of species

Onopordum carduelium
type: Concept
notation: 1815
status: valid
status modified: 2019-03-22
accepted date: 2019-03-22
in scheme: Codelist of species

Pericallis hadrosoma
type: Concept
notation: 1816
status: valid
status modified: 2019-03-22
accepted date: 2019-03-22
in scheme: Codelist of species

Stemmacantha cynaroides
type: Concept
notation: 1818
status: valid
status modified: 2019-03-22
accepted date: 2019-03-22
in scheme: Codelist of species

Sventenia bupleuroides
type: Concept
notation: 1819
status: valid
status modified: 2019-03-22
accepted date: 2019-03-22
in scheme: Codelist of species

Tanacetum ptarmiciflorum
type: Concept
notation: 1820
status: valid
status modified: 2019-03-22
accepted date: 2019-03-22
in scheme: Codelist of species

Onopordum nogalesii
type: Concept
notation: 1821
status: valid
status modified: 2019-03-22
accepted date: 2019-03-22
in scheme: Codelist of species

Atractylis arbuscula
type: Concept
notation: 1822
status: valid
status modified: 2019-03-22
accepted date: 2019-03-22
in scheme: Codelist of species

Argyranthemum winteri
type: Concept
notation: 1823
status: valid
status modified: 2019-03-22
accepted date: 2019-03-22
in scheme: Codelist of species

Argyranthemum thalassophilum
type: Concept
notation: 1824
status: valid
status modified: 2019-03-22
accepted date: 2019-03-22
in scheme: Codelist of species

Lactuca watsoniana
type: Concept
notation: 1825
status: valid
status modified: 2019-03-22
accepted date: 2019-03-22
in scheme: Codelist of species

Cirsium latifolium
type: Concept
notation: 1826
status: valid
status modified: 2019-03-22
accepted date: 2019-03-22
in scheme: Codelist of species

Helichrysum gossypinum
type: Concept
notation: 1827
status: valid
status modified: 2019-03-22
accepted date: 2019-03-22
in scheme: Codelist of species

Cheirolophus ghomerytus
type: Concept
notation: 1828
status: valid
status modified: 2019-03-22
accepted date: 2019-03-22
in scheme: Codelist of species

Helichrysum monogynum
type: Concept
notation: 1829
status: valid
status modified: 2019-03-22
accepted date: 2019-03-22
in scheme: Codelist of species

Luronium natans
type: Concept
notation: 1831
status: valid
status modified: 2019-03-22
accepted date: 2019-03-22
in scheme: Codelist of species

Caldesia parnassifolia
type: Concept
notation: 1832
status: valid
status modified: 2019-03-22
accepted date: 2019-03-22
in scheme: Codelist of species

Najas flexilis
type: Concept
notation: 1833
status: valid
status modified: 2019-03-22
accepted date: 2019-03-22
in scheme: Codelist of species

Fritillaria conica
type: Concept
notation: 1834
status: valid
status modified: 2019-03-22
accepted date: 2019-03-22
in scheme: Codelist of species

Colchicum corsicum
type: Concept
notation: 1836
status: valid
status modified: 2019-03-22
accepted date: 2019-03-22
in scheme: Codelist of species

Scilla beirana
type: Concept
notation: 1837
status: valid
status modified: 2019-03-22
accepted date: 2019-03-22
in scheme: Codelist of species

Bellevalia hackelii
type: Concept
notation: 1838
status: valid
status modified: 2019-03-22
accepted date: 2019-03-22
in scheme: Codelist of species

Ornithogalum reverchonii
type: Concept
notation: 1839
status: valid
status modified: 2019-03-22
accepted date: 2019-03-22
in scheme: Codelist of species

Asphodelus bento-rainhae
type: Concept
notation: 1840
status: valid
status modified: 2019-03-22
accepted date: 2019-03-22
in scheme: Codelist of species

Androcymbium rechingeri
type: Concept
notation: 1842
status: valid
status modified: 2019-03-22
accepted date: 2019-03-22
in scheme: Codelist of species

Fritillaria rhodocanakis
type: Concept
notation: 1843
status: valid
status modified: 2019-03-22
accepted date: 2019-03-22
in scheme: Codelist of species

Androcymbium europaeum
type: Concept
notation: 1844
status: valid
status modified: 2019-03-22
accepted date: 2019-03-22
in scheme: Codelist of species

Fritillaria gussichiae
type: Concept
notation: 1845
status: valid
status modified: 2019-03-22
accepted date: 2019-03-22
in scheme: Codelist of species

Fritillaria drenovskii
type: Concept
notation: 1846
status: valid
status modified: 2019-03-22
accepted date: 2019-03-22
in scheme: Codelist of species

Allium grosii
type: Concept
notation: 1847
status: valid
status modified: 2019-03-22
accepted date: 2019-03-22
in scheme: Codelist of species

Scilla odorata
type: Concept
notation: 1848
status: valid
status modified: 2019-03-22
accepted date: 2019-03-22
in scheme: Codelist of species

Ruscus aculeatus
type: Concept
notation: 1849
status: valid
status modified: 2019-03-22
accepted date: 2019-03-22
in scheme: Codelist of species

Hyacinthoides vincentina
type: Concept
notation: 1851
status: valid
status modified: 2019-03-22
accepted date: 2019-03-22
in scheme: Codelist of species

Fritillaria obliqua
type: Concept
notation: 1852
status: valid
status modified: 2019-03-22
accepted date: 2019-03-22
in scheme: Codelist of species

Scilla maderensis
type: Concept
notation: 1854
status: valid
status modified: 2019-03-22
accepted date: 2019-03-22
in scheme: Codelist of species

Androcymbium psammophilum
type: Concept
notation: 1855
status: valid
status modified: 2019-03-22
accepted date: 2019-03-22
in scheme: Codelist of species

Dracaena draco
type: Concept
notation: 1856
status: valid
status modified: 2019-03-22
accepted date: 2019-03-22
in scheme: Codelist of species

Narcissus pseudonarcissus subsp. nobilis
type: Concept
notation: 1857
status: valid
status modified: 2019-03-22
accepted date: 2019-03-22
in scheme: Codelist of species

Narcissus nevadensis
type: Concept
notation: 1858
status: valid
status modified: 2019-03-22
accepted date: 2019-03-22
in scheme: Codelist of species

Narcissus fernandesii
type: Concept
notation: 1860
status: valid
status modified: 2019-03-22
accepted date: 2019-03-22
in scheme: Codelist of species

Narcissus cyclamineus
type: Concept
notation: 1862
status: valid
status modified: 2019-03-22
accepted date: 2019-03-22
in scheme: Codelist of species

Narcissus calcicola
type: Concept
notation: 1863
status: valid
status modified: 2019-03-22
accepted date: 2019-03-22
in scheme: Codelist of species

Narcissus bulbocodium
type: Concept
notation: 1864
status: valid
status modified: 2019-03-22
accepted date: 2019-03-22
in scheme: Codelist of species

Narcissus asturiensis
type: Concept
notation: 1865
status: valid
status modified: 2019-03-22
accepted date: 2019-03-22
in scheme: Codelist of species

Galanthus nivalis
type: Concept
notation: 1866
status: valid
status modified: 2019-03-22
accepted date: 2019-03-22
in scheme: Codelist of species

Narcissus longispathus
type: Concept
notation: 1867
status: valid
status modified: 2019-03-22
accepted date: 2019-03-22
in scheme: Codelist of species

Narcissus triandrus subsp. capax
type: Concept
notation: 1868
status: valid
status modified: 2019-03-22
accepted date: 2019-03-22
in scheme: Codelist of species

Narcissus viridiflorus
type: Concept
notation: 1869
status: valid
status modified: 2019-03-22
accepted date: 2019-03-22
in scheme: Codelist of species

Narcissus scaberulus
type: Concept
notation: 1870
status: valid
status modified: 2019-03-22
accepted date: 2019-03-22
in scheme: Codelist of species

Borderea chouardii
type: Concept
notation: 1872
status: valid
status modified: 2019-03-22
accepted date: 2019-03-22
in scheme: Codelist of species

Crocus etruscus
type: Concept
notation: 1873
status: valid
status modified: 2019-03-22
accepted date: 2019-03-22
in scheme: Codelist of species

Iris boissieri
type: Concept
notation: 1874
status: valid
status modified: 2019-03-22
accepted date: 2019-03-22
in scheme: Codelist of species

Iris lusitanica
type: Concept
notation: 1875
status: valid
status modified: 2019-03-22
accepted date: 2019-03-22
in scheme: Codelist of species

Iris marsica
type: Concept
notation: 1876
status: valid
status modified: 2019-03-22
accepted date: 2019-03-22
in scheme: Codelist of species

Juncus valvatus
type: Concept
notation: 1877
status: valid
status modified: 2019-03-22
accepted date: 2019-03-22
in scheme: Codelist of species

Pseudarrhenatherum pallens
type: Concept
notation: 1878
status: valid
status modified: 2019-03-22
accepted date: 2019-03-22
in scheme: Codelist of species

Micropyropsis tuberosa
type: Concept
notation: 1879
status: valid
status modified: 2019-03-22
accepted date: 2019-03-22
in scheme: Codelist of species

Stipa veneta
type: Concept
notation: 1880
status: valid
status modified: 2019-03-22
accepted date: 2019-03-22
in scheme: Codelist of species

Stipa bavarica
type: Concept
notation: 1881
status: valid
status modified: 2019-03-22
accepted date: 2019-03-22
in scheme: Codelist of species

Bromus grossus
type: Concept
notation: 1882
status: valid
status modified: 2019-03-22
accepted date: 2019-03-22
in scheme: Codelist of species

Stipa austroitalica
type: Concept
notation: 1883
status: valid
status modified: 2019-03-22
accepted date: 2019-03-22
in scheme: Codelist of species

Festuca brigantina
type: Concept
notation: 1884
status: valid
status modified: 2019-03-22
accepted date: 2019-03-22
in scheme: Codelist of species

Festuca elegans
type: Concept
notation: 1885
status: valid
status modified: 2019-03-22
accepted date: 2019-03-22
in scheme: Codelist of species

Avenula hackelii
type: Concept
notation: 1886
status: valid
status modified: 2019-03-22
accepted date: 2019-03-22
in scheme: Codelist of species

Coleanthus subtilis
type: Concept
notation: 1887
status: valid
status modified: 2019-03-22
accepted date: 2019-03-22
in scheme: Codelist of species

Festuca duriotagana
type: Concept
notation: 1888
status: valid
status modified: 2019-03-22
accepted date: 2019-03-22
in scheme: Codelist of species

Puccinellia pungens
type: Concept
notation: 1889
status: valid
status modified: 2019-03-22
accepted date: 2019-03-22
in scheme: Codelist of species

Festuca henriquesii
type: Concept
notation: 1890
status: valid
status modified: 2019-03-22
accepted date: 2019-03-22
in scheme: Codelist of species

Festuca summilusitana
type: Concept
notation: 1891
status: valid
status modified: 2019-03-22
accepted date: 2019-03-22
in scheme: Codelist of species

Holcus setiglumis subsp. duriensis
type: Concept
notation: 1892
status: valid
status modified: 2019-03-22
accepted date: 2019-03-22
in scheme: Codelist of species

Gaudinia hispanica
type: Concept
notation: 1893
status: valid
status modified: 2019-03-22
accepted date: 2019-03-22
in scheme: Codelist of species

Phalaris maderensis
type: Concept
notation: 1894
status: valid
status modified: 2019-03-22
accepted date: 2019-03-22
in scheme: Codelist of species

Deschampsia maderensis
type: Concept
notation: 1895
status: valid
status modified: 2019-03-22
accepted date: 2019-03-22
in scheme: Codelist of species

Phoenix theophrasti
type: Concept
notation: 1896
status: valid
status modified: 2019-03-22
accepted date: 2019-03-22
in scheme: Codelist of species

Carex panormitana
type: Concept
notation: 1897
status: valid
status modified: 2019-03-22
accepted date: 2019-03-22
in scheme: Codelist of species

Eleocharis carniolica
type: Concept
notation: 1898
status: valid
status modified: 2019-03-22
accepted date: 2019-03-22
in scheme: Codelist of species

Carex malato-belizii
type: Concept
notation: 1899
status: valid
status modified: 2019-03-22
accepted date: 2019-03-22
in scheme: Codelist of species

Spiranthes aestivalis
type: Concept
notation: 1900
status: valid
status modified: 2019-03-22
accepted date: 2019-03-22
in scheme: Codelist of species

Cephalanthera cucullata
type: Concept
notation: 1901
status: valid
status modified: 2019-03-22
accepted date: 2019-03-22
in scheme: Codelist of species

Cypripedium calceolus
type: Concept
notation: 1902
status: valid
status modified: 2019-03-22
accepted date: 2019-03-22
in scheme: Codelist of species

Liparis loeselii
type: Concept
notation: 1903
status: valid
status modified: 2019-03-22
accepted date: 2019-03-22
in scheme: Codelist of species

Ophrys lunulata
type: Concept
notation: 1905
status: valid
status modified: 2019-03-22
accepted date: 2019-03-22
in scheme: Codelist of species

Orchis scopulorum
type: Concept
notation: 1906
status: valid
status modified: 2019-03-22
accepted date: 2019-03-22
in scheme: Codelist of species

Goodyera macrophylla
type: Concept
notation: 1907
status: valid
status modified: 2019-03-22
accepted date: 2019-03-22
in scheme: Codelist of species

Pteromys volans
type: Concept
notation: 1910
status: valid
status modified: 2019-03-22
accepted date: 2019-03-22
in scheme: Codelist of species

Alopex lagopus
type: Concept
notation: 1911
status: valid
status modified: 2019-03-22
accepted date: 2019-03-22
in scheme: Codelist of species

Gulo gulo
type: Concept
notation: 1912
status: valid
status modified: 2019-03-22
accepted date: 2019-03-22
in scheme: Codelist of species

Carabus menetriesi pacholei
type: Concept
notation: 1914
status: valid
status modified: 2019-03-22
accepted date: 2019-03-22
in scheme: Codelist of species

Helicopsis striata austriaca
type: Concept
notation: 1915
status: valid
status modified: 2019-03-22
accepted date: 2019-03-22
in scheme: Codelist of species

Artemisia laciniata
type: Concept
notation: 1916
status: valid
status modified: 2019-03-22
accepted date: 2019-03-22
in scheme: Codelist of species

Artemisia pancicii
type: Concept
notation: 1917
status: valid
status modified: 2019-03-22
accepted date: 2019-03-22
in scheme: Codelist of species

Stipa styriaca
type: Concept
notation: 1918
status: valid
status modified: 2019-03-22
accepted date: 2019-03-22
in scheme: Codelist of species

Agathidium pulchellum
type: Concept
notation: 1919
status: valid
status modified: 2019-03-22
accepted date: 2019-03-22
in scheme: Codelist of species

Boros schneideri
type: Concept
notation: 1920
status: valid
status modified: 2019-03-22
accepted date: 2019-03-22
in scheme: Codelist of species

Corticaria planula
type: Concept
notation: 1921
status: valid
status modified: 2019-03-22
accepted date: 2019-03-22
in scheme: Codelist of species

Macroplea pubipennis
type: Concept
notation: 1922
status: valid
status modified: 2019-03-22
accepted date: 2019-03-22
in scheme: Codelist of species

Mesosa myops
type: Concept
notation: 1923
status: valid
status modified: 2019-03-22
accepted date: 2019-03-22
in scheme: Codelist of species

Oxyporus mannerheimii
type: Concept
notation: 1924
status: valid
status modified: 2019-03-22
accepted date: 2019-03-22
in scheme: Codelist of species

Pytho kolwensis
type: Concept
notation: 1925
status: valid
status modified: 2019-03-22
accepted date: 2019-03-22
in scheme: Codelist of species

Stephanopachys linearis
type: Concept
notation: 1926
status: valid
status modified: 2019-03-22
accepted date: 2019-03-22
in scheme: Codelist of species

Stephanopachys substriatus
type: Concept
notation: 1927
status: valid
status modified: 2019-03-22
accepted date: 2019-03-22
in scheme: Codelist of species

Xyletinus tremulicola
type: Concept
notation: 1928
status: valid
status modified: 2019-03-22
accepted date: 2019-03-22
in scheme: Codelist of species

Aradus angularis
type: Concept
notation: 1929
status: valid
status modified: 2019-03-22
accepted date: 2019-03-22
in scheme: Codelist of species

Agriades glandon aquilo
type: Concept
notation: 1930
status: valid
status modified: 2019-03-22
accepted date: 2019-03-22
in scheme: Codelist of species

Clossiana improba
type: Concept
notation: 1931
status: valid
status modified: 2019-03-22
accepted date: 2019-03-22
in scheme: Codelist of species

Erebia medusa polaris
type: Concept
notation: 1932
status: valid
status modified: 2019-03-22
accepted date: 2019-03-22
in scheme: Codelist of species

Hesperia comma catena
type: Concept
notation: 1933
status: valid
status modified: 2019-03-22
accepted date: 2019-03-22
in scheme: Codelist of species

Xestia borealis
type: Concept
notation: 1934
status: valid
status modified: 2019-03-22
accepted date: 2019-03-22
in scheme: Codelist of species

Xestia brunneopicta
type: Concept
notation: 1935
status: valid
status modified: 2019-03-22
accepted date: 2019-03-22
in scheme: Codelist of species

Anthrenochernes stellae
type: Concept
notation: 1936
status: valid
status modified: 2019-03-22
accepted date: 2019-03-22
in scheme: Codelist of species

Rangifer tarandus fennicus
type: Concept
notation: 1937
status: valid
status modified: 2019-03-22
accepted date: 2019-03-22
in scheme: Codelist of species

Agrimonia pilosa
type: Concept
notation: 1939
status: valid
status modified: 2019-03-22
accepted date: 2019-03-22
in scheme: Codelist of species

Alisma wahlenbergii
type: Concept
notation: 1940
status: valid
status modified: 2019-03-22
accepted date: 2019-03-22
in scheme: Codelist of species

Arctagrostis latifolia
type: Concept
notation: 1941
status: valid
status modified: 2019-03-22
accepted date: 2019-03-22
in scheme: Codelist of species

Arctophila fulva
type: Concept
notation: 1942
status: valid
status modified: 2019-03-22
accepted date: 2019-03-22
in scheme: Codelist of species

Arenaria ciliata subsp. pseudofrigida
type: Concept
notation: 1943
status: valid
status modified: 2019-03-22
accepted date: 2019-03-22
in scheme: Codelist of species

Arenaria humifusa
type: Concept
notation: 1944
status: valid
status modified: 2019-03-22
accepted date: 2019-03-22
in scheme: Codelist of species

Artemisia campestris subsp. bottnica
type: Concept
notation: 1945
status: valid
status modified: 2019-03-22
accepted date: 2019-03-22
in scheme: Codelist of species

Artemisia oelandica
type: Concept
notation: 1946
status: valid
status modified: 2019-03-22
accepted date: 2019-03-22
in scheme: Codelist of species

Braya linearis
type: Concept
notation: 1947
status: valid
status modified: 2019-03-22
accepted date: 2019-03-22
in scheme: Codelist of species

Calamagrostis chalybaea
type: Concept
notation: 1948
status: valid
status modified: 2019-03-22
accepted date: 2019-03-22
in scheme: Codelist of species

Calypso bulbosa
type: Concept
notation: 1949
status: valid
status modified: 2019-03-22
accepted date: 2019-03-22
in scheme: Codelist of species

Carex holostoma
type: Concept
notation: 1950
status: valid
status modified: 2019-03-22
accepted date: 2019-03-22
in scheme: Codelist of species

Cinna latifolia
type: Concept
notation: 1951
status: valid
status modified: 2019-03-22
accepted date: 2019-03-22
in scheme: Codelist of species

Corydalis gotlandica
type: Concept
notation: 1952
status: valid
status modified: 2019-03-22
accepted date: 2019-03-22
in scheme: Codelist of species

Crepis tectorum subsp. nigrescens
type: Concept
notation: 1953
status: valid
status modified: 2019-03-22
accepted date: 2019-03-22
in scheme: Codelist of species

Dianthus arenarius subsp. arenarius
type: Concept
notation: 1954
status: valid
status modified: 2019-03-22
accepted date: 2019-03-22
in scheme: Codelist of species

Diplazium sibiricum
type: Concept
notation: 1955
status: valid
status modified: 2019-03-22
accepted date: 2019-03-22
in scheme: Codelist of species

Draba cacuminum
type: Concept
notation: 1956
status: valid
status modified: 2019-03-22
accepted date: 2019-03-22
in scheme: Codelist of species

Draba cinerea
type: Concept
notation: 1957
status: valid
status modified: 2019-03-22
accepted date: 2019-03-22
in scheme: Codelist of species

Dryopteris fragans
type: Concept
notation: 1958
status: valid
status modified: 2019-03-22
accepted date: 2019-03-22
in scheme: Codelist of species

Gymnigritella runei
type: Concept
notation: 1959
status: valid
status modified: 2019-03-22
accepted date: 2019-03-22
in scheme: Codelist of species

Hippuris tetraphylla
type: Concept
notation: 1960
status: valid
status modified: 2019-03-22
accepted date: 2019-03-22
in scheme: Codelist of species

Luzula arctica
type: Concept
notation: 1961
status: valid
status modified: 2019-03-22
accepted date: 2019-03-22
in scheme: Codelist of species

Moehringia lateriflora
type: Concept
notation: 1962
status: valid
status modified: 2019-03-22
accepted date: 2019-03-22
in scheme: Codelist of species

Najas tenuissima
type: Concept
notation: 1963
status: valid
status modified: 2019-03-22
accepted date: 2019-03-22
in scheme: Codelist of species

Persicaria foliosa
type: Concept
notation: 1966
status: valid
status modified: 2019-03-22
accepted date: 2019-03-22
in scheme: Codelist of species

Platanthera obtusata subsp. oligantha
type: Concept
notation: 1967
status: valid
status modified: 2019-03-22
accepted date: 2019-03-22
in scheme: Codelist of species

Primula nutans
type: Concept
notation: 1968
status: valid
status modified: 2019-03-22
accepted date: 2019-03-22
in scheme: Codelist of species

Primula scandinavica
type: Concept
notation: 1969
status: valid
status modified: 2019-03-22
accepted date: 2019-03-22
in scheme: Codelist of species

Pulsatilla vulgaris subsp. gotlandica
type: Concept
notation: 1970
status: valid
status modified: 2019-03-22
accepted date: 2019-03-22
in scheme: Codelist of species

Puccinellia phryganodes
type: Concept
notation: 1971
status: valid
status modified: 2019-03-22
accepted date: 2019-03-22
in scheme: Codelist of species

Ranunculus lapponicus
type: Concept
notation: 1972
status: valid
status modified: 2019-03-22
accepted date: 2019-03-22
in scheme: Codelist of species

Saxifraga osloensis
type: Concept
notation: 1973
status: valid
status modified: 2019-03-22
accepted date: 2019-03-22
in scheme: Codelist of species

Sorbus teodori
type: Concept
notation: 1976
status: valid
status modified: 2019-03-22
accepted date: 2019-03-22
in scheme: Codelist of species

Trisetum subalpestre
type: Concept
notation: 1977
status: valid
status modified: 2019-03-22
accepted date: 2019-03-22
in scheme: Codelist of species

Viola rupestris subsp. relicta
type: Concept
notation: 1978
status: valid
status modified: 2019-03-22
accepted date: 2019-03-22
in scheme: Codelist of species

Bryhnia novae-angliae
type: Concept
notation: 1979
status: valid
status modified: 2019-03-22
accepted date: 2019-03-22
in scheme: Codelist of species

Cephalozia macounii
type: Concept
notation: 1980
status: valid
status modified: 2019-03-22
accepted date: 2019-03-22
in scheme: Codelist of species

Cynodontium suecicum
type: Concept
notation: 1981
status: valid
status modified: 2019-03-22
accepted date: 2019-03-22
in scheme: Codelist of species

Encalypta mutica
type: Concept
notation: 1982
status: valid
status modified: 2019-03-22
accepted date: 2019-03-22
in scheme: Codelist of species

Hamatocaulis lapponicus
type: Concept
notation: 1983
status: valid
status modified: 2019-03-22
accepted date: 2019-03-22
in scheme: Codelist of species

Herzogiella turfacea
type: Concept
notation: 1984
status: valid
status modified: 2019-03-22
accepted date: 2019-03-22
in scheme: Codelist of species

Hygrohypnum montanum
type: Concept
notation: 1985
status: valid
status modified: 2019-03-22
accepted date: 2019-03-22
in scheme: Codelist of species

Orthothecium lapponicum
type: Concept
notation: 1986
status: valid
status modified: 2019-03-22
accepted date: 2019-03-22
in scheme: Codelist of species

Plagiomnium drummondii
type: Concept
notation: 1987
status: valid
status modified: 2019-03-22
accepted date: 2019-03-22
in scheme: Codelist of species

Tortella rigens
type: Concept
notation: 1988
status: valid
status modified: 2019-03-22
accepted date: 2019-03-22
in scheme: Codelist of species

Margaritifera durrovensis
type: Concept
notation: 1990
status: valid
status modified: 2019-03-22
accepted date: 2019-03-22
in scheme: Codelist of species

Sabanejewia larvata
type: Concept
notation: 1991
status: valid
status modified: 2019-03-22
accepted date: 2019-03-22
in scheme: Codelist of species

Valencia letourneuxi
type: Concept
notation: 1992
status: valid
status modified: 2019-03-22
accepted date: 2019-03-22
in scheme: Codelist of species

Triturus dobrogicus
type: Concept
notation: 1993
status: valid
status modified: 2019-03-22
accepted date: 2019-03-22
in scheme: Codelist of species

Narcissus triandrus
type: Concept
notation: 1996
status: valid
status modified: 2019-03-22
accepted date: 2019-03-22
in scheme: Codelist of species

Romanichthys valsanicola
type: Concept
notation: 1998
status: valid
status modified: 2019-03-22
accepted date: 2019-03-22
in scheme: Codelist of species

Triturus montandoni
type: Concept
notation: 2001
status: valid
status modified: 2019-03-22
accepted date: 2019-03-22
in scheme: Codelist of species

Umbra krameri
type: Concept
notation: 2011
status: valid
status modified: 2019-03-22
accepted date: 2019-03-22
in scheme: Codelist of species

Nyctalus azoreum
type: Concept
notation: 2015
status: valid
status modified: 2019-03-22
accepted date: 2019-03-22
in scheme: Codelist of species

Pipistrellus kuhlii
type: Concept
notation: 2016
status: valid
status modified: 2019-03-22
accepted date: 2019-03-22
in scheme: Codelist of species

Pipistrellus maderensis
type: Concept
notation: 2017
status: valid
status modified: 2019-03-22
accepted date: 2019-03-22
in scheme: Codelist of species

Sicista subtilis
type: Concept
notation: 2021
status: valid
status modified: 2019-03-22
accepted date: 2019-03-22
in scheme: Codelist of species

Orcinus orca
type: Concept
notation: 2027
status: valid
status modified: 2019-03-22
accepted date: 2019-03-22
in scheme: Codelist of species

Pseudorca crassidens
type: Concept
notation: 2028
status: valid
status modified: 2019-03-22
accepted date: 2019-03-22
in scheme: Codelist of species

Globicephala melas
type: Concept
notation: 2029
status: valid
status modified: 2019-03-22
accepted date: 2019-03-22
in scheme: Codelist of species

Grampus griseus
type: Concept
notation: 2030
status: valid
status modified: 2019-03-22
accepted date: 2019-03-22
in scheme: Codelist of species

Lagenorhynchus acutus
type: Concept
notation: 2031
status: valid
status modified: 2019-03-22
accepted date: 2019-03-22
in scheme: Codelist of species

Lagenorhynchus albirostris
type: Concept
notation: 2032
status: valid
status modified: 2019-03-22
accepted date: 2019-03-22
in scheme: Codelist of species

Steno bredanensis
type: Concept
notation: 2033
status: valid
status modified: 2019-03-22
accepted date: 2019-03-22
in scheme: Codelist of species

Stenella coeruleoalba
type: Concept
notation: 2034
status: valid
status modified: 2019-03-22
accepted date: 2019-03-22
in scheme: Codelist of species

Ziphius cavirostris
type: Concept
notation: 2035
status: valid
status modified: 2019-03-22
accepted date: 2019-03-22
in scheme: Codelist of species

Mesoplodon mirus
type: Concept
notation: 2037
status: valid
status modified: 2019-03-22
accepted date: 2019-03-22
in scheme: Codelist of species

Mesoplodon bidens
type: Concept
notation: 2038
status: valid
status modified: 2019-03-22
accepted date: 2019-03-22
in scheme: Codelist of species

Cerastium alsinifolium
type: Concept
notation: 2071
status: valid
status modified: 2019-03-22
accepted date: 2019-03-22
in scheme: Codelist of species

Dianthus nitidus
type: Concept
notation: 2074
status: valid
status modified: 2019-03-22
accepted date: 2019-03-22
in scheme: Codelist of species

Minuartia smejkalii
type: Concept
notation: 2077
status: valid
status modified: 2019-03-22
accepted date: 2019-03-22
in scheme: Codelist of species

Moehringia jankae
type: Concept
notation: 2079
status: valid
status modified: 2019-03-22
accepted date: 2019-03-22
in scheme: Codelist of species

Delphinium caseyi
type: Concept
notation: 2092
status: valid
status modified: 2019-03-22
accepted date: 2019-03-22
in scheme: Codelist of species

Pulsatilla grandis
type: Concept
notation: 2093
status: valid
status modified: 2019-03-22
accepted date: 2019-03-22
in scheme: Codelist of species

Pulsatilla slavica
type: Concept
notation: 2094
status: valid
status modified: 2019-03-22
accepted date: 2019-03-22
in scheme: Codelist of species

Ranunculus kykkoensis
type: Concept
notation: 2096
status: valid
status modified: 2019-03-22
accepted date: 2019-03-22
in scheme: Codelist of species

Paeonia officinalis subsp. banatica
type: Concept
notation: 2097
status: valid
status modified: 2019-03-22
accepted date: 2019-03-22
in scheme: Codelist of species

Arabis kennedyae
type: Concept
notation: 2103
status: valid
status modified: 2019-03-22
accepted date: 2019-03-22
in scheme: Codelist of species

Brassica hilarionis
type: Concept
notation: 2106
status: valid
status modified: 2019-03-22
accepted date: 2019-03-22
in scheme: Codelist of species

Cochlearia polonica
type: Concept
notation: 2109
status: valid
status modified: 2019-03-22
accepted date: 2019-03-22
in scheme: Codelist of species

Draba dorneri
type: Concept
notation: 2113
status: valid
status modified: 2019-03-22
accepted date: 2019-03-22
in scheme: Codelist of species

Erysimum pieninicum
type: Concept
notation: 2114
status: valid
status modified: 2019-03-22
accepted date: 2019-03-22
in scheme: Codelist of species

Thlaspi jankae
type: Concept
notation: 2120
status: valid
status modified: 2019-03-22
accepted date: 2019-03-22
in scheme: Codelist of species

Potentilla emilii-popii
type: Concept
notation: 2125
status: valid
status modified: 2019-03-22
accepted date: 2019-03-22
in scheme: Codelist of species

Astragalus macrocarpus subsp. lefkarensis
type: Concept
notation: 2131
status: valid
status modified: 2019-03-22
accepted date: 2019-03-22
in scheme: Codelist of species

Astragalus peterfii
type: Concept
notation: 2132
status: valid
status modified: 2019-03-22
accepted date: 2019-03-22
in scheme: Codelist of species

Linum dolomiticum
type: Concept
notation: 2156
status: valid
status modified: 2019-03-22
accepted date: 2019-03-22
in scheme: Codelist of species

Daphne arbuscula
type: Concept
notation: 2159
status: valid
status modified: 2019-03-22
accepted date: 2019-03-22
in scheme: Codelist of species

Ferula sadleriana
type: Concept
notation: 2170
status: valid
status modified: 2019-03-22
accepted date: 2019-03-22
in scheme: Codelist of species

Syringa josikaea
type: Concept
notation: 2186
status: valid
status modified: 2019-03-22
accepted date: 2019-03-22
in scheme: Codelist of species

Vincetoxicum pannonicum
type: Concept
notation: 2188
status: valid
status modified: 2019-03-22
accepted date: 2019-03-22
in scheme: Codelist of species

Galium cracoviense
type: Concept
notation: 2189
status: valid
status modified: 2019-03-22
accepted date: 2019-03-22
in scheme: Codelist of species

Galium moldavicum
type: Concept
notation: 2191
status: valid
status modified: 2019-03-22
accepted date: 2019-03-22
in scheme: Codelist of species

Onosma tornensis
type: Concept
notation: 2203
status: valid
status modified: 2019-03-22
accepted date: 2019-03-22
in scheme: Codelist of species

Phlomis brevibracteata
type: Concept
notation: 2209
status: valid
status modified: 2019-03-22
accepted date: 2019-03-22
in scheme: Codelist of species

Phlomis cypria
type: Concept
notation: 2210
status: valid
status modified: 2019-03-22
accepted date: 2019-03-22
in scheme: Codelist of species

Sideritis cypria
type: Concept
notation: 2213
status: valid
status modified: 2019-03-22
accepted date: 2019-03-22
in scheme: Codelist of species

Linaria loeselii
type: Concept
notation: 2216
status: valid
status modified: 2019-03-22
accepted date: 2019-03-22
in scheme: Codelist of species

Pedicularis sudetica
type: Concept
notation: 2217
status: valid
status modified: 2019-03-22
accepted date: 2019-03-22
in scheme: Codelist of species

Pinguicula crystallina
type: Concept
notation: 2227
status: valid
status modified: 2019-03-22
accepted date: 2019-03-22
in scheme: Codelist of species

Campanula gelida
type: Concept
notation: 2233
status: valid
status modified: 2019-03-22
accepted date: 2019-03-22
in scheme: Codelist of species

Campanula romanica
type: Concept
notation: 2236
status: valid
status modified: 2019-03-22
accepted date: 2019-03-22
in scheme: Codelist of species

Carlina onopordifolia
type: Concept
notation: 2249
status: valid
status modified: 2019-03-22
accepted date: 2019-03-22
in scheme: Codelist of species

Centaurea akamantis
type: Concept
notation: 2250
status: valid
status modified: 2019-03-22
accepted date: 2019-03-22
in scheme: Codelist of species

Centaurea jankae
type: Concept
notation: 2253
status: valid
status modified: 2019-03-22
accepted date: 2019-03-22
in scheme: Codelist of species

Centaurea pontica
type: Concept
notation: 2255
status: valid
status modified: 2019-03-22
accepted date: 2019-03-22
in scheme: Codelist of species

Hypochoeris oligocephala
type: Concept
notation: 2266
status: valid
status modified: 2019-03-22
accepted date: 2019-03-22
in scheme: Codelist of species

Chionodoxa lochiae
type: Concept
notation: 2283
status: valid
status modified: 2019-03-22
accepted date: 2019-03-22
in scheme: Codelist of species

Colchicum arenarium
type: Concept
notation: 2285
status: valid
status modified: 2019-03-22
accepted date: 2019-03-22
in scheme: Codelist of species

Scilla morrisii
type: Concept
notation: 2296
status: valid
status modified: 2019-03-22
accepted date: 2019-03-22
in scheme: Codelist of species

Tulipa cypria
type: Concept
notation: 2298
status: valid
status modified: 2019-03-22
accepted date: 2019-03-22
in scheme: Codelist of species

Tulipa hungarica
type: Concept
notation: 2300
status: valid
status modified: 2019-03-22
accepted date: 2019-03-22
in scheme: Codelist of species

Crocus cyprius
type: Concept
notation: 2306
status: valid
status modified: 2019-03-22
accepted date: 2019-03-22
in scheme: Codelist of species

Crocus hartmannianus
type: Concept
notation: 2307
status: valid
status modified: 2019-03-22
accepted date: 2019-03-22
in scheme: Codelist of species

Poa riphaea
type: Concept
notation: 2317
status: valid
status modified: 2019-03-22
accepted date: 2019-03-22
in scheme: Codelist of species

Stipa danubialis
type: Concept
notation: 2318
status: valid
status modified: 2019-03-22
accepted date: 2019-03-22
in scheme: Codelist of species

Hyla savignyi
type: Concept
notation: 2362
status: valid
status modified: 2019-03-22
accepted date: 2019-03-22
in scheme: Codelist of species

Mauremys rivulata
type: Concept
notation: 2373
status: valid
status modified: 2019-03-22
accepted date: 2019-03-22
in scheme: Codelist of species

Eudontomyzon hellenicus
type: Concept
notation: 2483
status: valid
status modified: 2019-03-22
accepted date: 2019-03-22
in scheme: Codelist of species

Eudontomyzon mariae
type: Concept
notation: 2484
status: valid
status modified: 2019-03-22
accepted date: 2019-03-22
in scheme: Codelist of species

Eudontomyzon vladykovi
type: Concept
notation: 2485
status: valid
status modified: 2019-03-22
accepted date: 2019-03-22
in scheme: Codelist of species

Acipenser ruthenus
type: Concept
notation: 2487
status: valid
status modified: 2019-03-22
accepted date: 2019-03-22
in scheme: Codelist of species

Acipenser stellatus
type: Concept
notation: 2488
status: valid
status modified: 2019-03-22
accepted date: 2019-03-22
in scheme: Codelist of species

Huso huso
type: Concept
notation: 2489
status: valid
status modified: 2019-03-22
accepted date: 2019-03-22
in scheme: Codelist of species

Alosa macedonica
type: Concept
notation: 2490
status: valid
status modified: 2019-03-22
accepted date: 2019-03-22
in scheme: Codelist of species

Coregonus albula
type: Concept
notation: 2492
status: valid
status modified: 2019-03-22
accepted date: 2019-03-22
in scheme: Codelist of species

Pelecus cultratus
type: Concept
notation: 2522
status: valid
status modified: 2019-03-22
accepted date: 2019-03-22
in scheme: Codelist of species

Cobitis elongata
type: Concept
notation: 2533
status: valid
status modified: 2019-03-22
accepted date: 2019-03-22
in scheme: Codelist of species

Gymnocephalus baloni
type: Concept
notation: 2555
status: valid
status modified: 2019-03-22
accepted date: 2019-03-22
in scheme: Codelist of species

Gibbula nivosa
type: Concept
notation: 2578
status: valid
status modified: 2019-03-22
accepted date: 2019-03-22
in scheme: Codelist of species

Spermophilus suslicus
type: Concept
notation: 2608
status: valid
status modified: 2019-03-22
accepted date: 2019-03-22
in scheme: Codelist of species

Mesocricetus newtoni
type: Concept
notation: 2609
status: valid
status modified: 2019-03-22
accepted date: 2019-03-22
in scheme: Codelist of species

Microtus tatricus
type: Concept
notation: 2612
status: valid
status modified: 2019-03-22
accepted date: 2019-03-22
in scheme: Codelist of species

Myomimus roachi
type: Concept
notation: 2617
status: valid
status modified: 2019-03-22
accepted date: 2019-03-22
in scheme: Codelist of species

Balaenoptera acutorostrata
type: Concept
notation: 2618
status: valid
status modified: 2019-03-22
accepted date: 2019-03-22
in scheme: Codelist of species

Balaenoptera borealis
type: Concept
notation: 2619
status: valid
status modified: 2019-03-22
accepted date: 2019-03-22
in scheme: Codelist of species

Balaenoptera edeni
type: Concept
notation: 2620
status: valid
status modified: 2019-03-22
accepted date: 2019-03-22
in scheme: Codelist of species

Balaenoptera physalus
type: Concept
notation: 2621
status: valid
status modified: 2019-03-22
accepted date: 2019-03-22
in scheme: Codelist of species

Kogia breviceps
type: Concept
notation: 2622
status: valid
status modified: 2019-03-22
accepted date: 2019-03-22
in scheme: Codelist of species

Kogia simus
type: Concept
notation: 2623
status: valid
status modified: 2019-03-22
accepted date: 2019-03-22
in scheme: Codelist of species

Physeter macrocephalus
type: Concept
notation: 2624
status: valid
status modified: 2019-03-22
accepted date: 2019-03-22
in scheme: Codelist of species

Mesoplodon densirostris
type: Concept
notation: 2625
status: valid
status modified: 2019-03-22
accepted date: 2019-03-22
in scheme: Codelist of species

Monodon monoceros
type: Concept
notation: 2626
status: valid
status modified: 2019-03-22
accepted date: 2019-03-22
in scheme: Codelist of species

Globicephala macrorhynchus
type: Concept
notation: 2627
status: valid
status modified: 2019-03-22
accepted date: 2019-03-22
in scheme: Codelist of species

Stenella frontalis
type: Concept
notation: 2628
status: valid
status modified: 2019-03-22
accepted date: 2019-03-22
in scheme: Codelist of species

Mustela eversmanii
type: Concept
notation: 2633
status: valid
status modified: 2019-03-22
accepted date: 2019-03-22
in scheme: Codelist of species

Vormela peregusna
type: Concept
notation: 2635
status: valid
status modified: 2019-03-22
accepted date: 2019-03-22
in scheme: Codelist of species

Cystophora cristata
type: Concept
notation: 2637
status: valid
status modified: 2019-03-22
accepted date: 2019-03-22
in scheme: Codelist of species

Erignathus barbatus
type: Concept
notation: 2638
status: valid
status modified: 2019-03-22
accepted date: 2019-03-22
in scheme: Codelist of species

Pagophilus groenlandicus
type: Concept
notation: 2639
status: valid
status modified: 2019-03-22
accepted date: 2019-03-22
in scheme: Codelist of species

Bison bonasus
type: Concept
notation: 2647
status: valid
status modified: 2019-03-22
accepted date: 2019-03-22
in scheme: Codelist of species

Crocidura sicula
type: Concept
notation: 4001
status: valid
status modified: 2019-03-22
accepted date: 2019-03-22
in scheme: Codelist of species

Rousettus aegyptiacus
type: Concept
notation: 4002
status: valid
status modified: 2019-03-22
accepted date: 2019-03-22
in scheme: Codelist of species

Marmota marmota latirostris
type: Concept
notation: 4003
status: valid
status modified: 2019-03-22
accepted date: 2019-03-22
in scheme: Codelist of species

Microtus oeconomus mehelyi
type: Concept
notation: 4004
status: valid
status modified: 2019-03-22
accepted date: 2019-03-22
in scheme: Codelist of species

Ovis orientalis ophion
type: Concept
notation: 4005
status: valid
status modified: 2019-03-22
accepted date: 2019-03-22
in scheme: Codelist of species

Rupicapra rupicapra tatrica
type: Concept
notation: 4006
status: valid
status modified: 2019-03-22
accepted date: 2019-03-22
in scheme: Codelist of species

Natrix natrix cypriaca
type: Concept
notation: 4007
status: valid
status modified: 2019-03-22
accepted date: 2019-03-22
in scheme: Codelist of species

Triturus vulgaris ampelensis
type: Concept
notation: 4008
status: valid
status modified: 2019-03-22
accepted date: 2019-03-22
in scheme: Codelist of species

Armadillidium ghardalamensis
type: Concept
notation: 4010
status: valid
status modified: 2019-03-22
accepted date: 2019-03-22
in scheme: Codelist of species

Bolbelasmus unicornis
type: Concept
notation: 4011
status: valid
status modified: 2019-03-22
accepted date: 2019-03-22
in scheme: Codelist of species

Carabus hampei
type: Concept
notation: 4012
status: valid
status modified: 2019-03-22
accepted date: 2019-03-22
in scheme: Codelist of species

Carabus hungaricus
type: Concept
notation: 4013
status: valid
status modified: 2019-03-22
accepted date: 2019-03-22
in scheme: Codelist of species

Carabus variolosus
type: Concept
notation: 4014
status: valid
status modified: 2019-03-22
accepted date: 2019-03-22
in scheme: Codelist of species

Carabus zawadzkii
type: Concept
notation: 4015
status: valid
status modified: 2019-03-22
accepted date: 2019-03-22
in scheme: Codelist of species

Dorcadion fulvum cervae
type: Concept
notation: 4016
status: valid
status modified: 2019-03-22
accepted date: 2019-03-22
in scheme: Codelist of species

Duvalius gebhardti
type: Concept
notation: 4017
status: valid
status modified: 2019-03-22
accepted date: 2019-03-22
in scheme: Codelist of species

Duvalius hungaricus
type: Concept
notation: 4018
status: valid
status modified: 2019-03-22
accepted date: 2019-03-22
in scheme: Codelist of species

Leptodirus hochenwartii
type: Concept
notation: 4019
status: valid
status modified: 2019-03-22
accepted date: 2019-03-22
in scheme: Codelist of species

Pilemia tigrina
type: Concept
notation: 4020
status: valid
status modified: 2019-03-22
accepted date: 2019-03-22
in scheme: Codelist of species

Phryganophilus ruficollis
type: Concept
notation: 4021
status: valid
status modified: 2019-03-22
accepted date: 2019-03-22
in scheme: Codelist of species

Probaticus subrugosus
type: Concept
notation: 4022
status: valid
status modified: 2019-03-22
accepted date: 2019-03-22
in scheme: Codelist of species

Propomacrus cypriacus
type: Concept
notation: 4023
status: valid
status modified: 2019-03-22
accepted date: 2019-03-22
in scheme: Codelist of species

Pseudogaurotina excellens
type: Concept
notation: 4024
status: valid
status modified: 2019-03-22
accepted date: 2019-03-22
in scheme: Codelist of species

Pseudoseriscius cameroni
type: Concept
notation: 4025
status: valid
status modified: 2019-03-22
accepted date: 2019-03-22
in scheme: Codelist of species

Rhysodes sulcatus
type: Concept
notation: 4026
status: valid
status modified: 2019-03-22
accepted date: 2019-03-22
in scheme: Codelist of species

Arytrura musculus
type: Concept
notation: 4027
status: valid
status modified: 2019-03-22
accepted date: 2019-03-22
in scheme: Codelist of species

Catopta thrips
type: Concept
notation: 4028
status: valid
status modified: 2019-03-22
accepted date: 2019-03-22
in scheme: Codelist of species

Chondrosoma fiduciarium
type: Concept
notation: 4029
status: valid
status modified: 2019-03-22
accepted date: 2019-03-22
in scheme: Codelist of species

Colias myrmidone
type: Concept
notation: 4030
status: valid
status modified: 2019-03-22
accepted date: 2019-03-22
in scheme: Codelist of species

Cucullia mixta
type: Concept
notation: 4031
status: valid
status modified: 2019-03-22
accepted date: 2019-03-22
in scheme: Codelist of species

Dioszeghyana schmidtii
type: Concept
notation: 4032
status: valid
status modified: 2019-03-22
accepted date: 2019-03-22
in scheme: Codelist of species

Erannis ankeraria
type: Concept
notation: 4033
status: valid
status modified: 2019-03-22
accepted date: 2019-03-22
in scheme: Codelist of species

Glyphipterix loricatella
type: Concept
notation: 4034
status: valid
status modified: 2019-03-22
accepted date: 2019-03-22
in scheme: Codelist of species

Gortyna borelii lunata
type: Concept
notation: 4035
status: valid
status modified: 2019-03-22
accepted date: 2019-03-22
in scheme: Codelist of species

Leptidea morsei
type: Concept
notation: 4036
status: valid
status modified: 2019-03-22
accepted date: 2019-03-22
in scheme: Codelist of species

Lignyoptera fumidaria
type: Concept
notation: 4037
status: valid
status modified: 2019-03-22
accepted date: 2019-03-22
in scheme: Codelist of species

Lycaena helle
type: Concept
notation: 4038
status: valid
status modified: 2019-03-22
accepted date: 2019-03-22
in scheme: Codelist of species

Nymphalis vaualbum
type: Concept
notation: 4039
status: valid
status modified: 2019-03-22
accepted date: 2019-03-22
in scheme: Codelist of species

Phyllometra culminaria
type: Concept
notation: 4040
status: valid
status modified: 2019-03-22
accepted date: 2019-03-22
in scheme: Codelist of species

Polymixis rufocincta isolata
type: Concept
notation: 4041
status: valid
status modified: 2019-03-22
accepted date: 2019-03-22
in scheme: Codelist of species

Polyommatus eroides
type: Concept
notation: 4042
status: valid
status modified: 2019-03-22
accepted date: 2019-03-22
in scheme: Codelist of species

Pseudophilotes bavius
type: Concept
notation: 4043
status: valid
status modified: 2019-03-22
accepted date: 2019-03-22
in scheme: Codelist of species

Xylomoia strix
type: Concept
notation: 4044
status: valid
status modified: 2019-03-22
accepted date: 2019-03-22
in scheme: Codelist of species

Coenagrion ornatum
type: Concept
notation: 4045
status: valid
status modified: 2019-03-22
accepted date: 2019-03-22
in scheme: Codelist of species

Cordulegaster heros
type: Concept
notation: 4046
status: valid
status modified: 2019-03-22
accepted date: 2019-03-22
in scheme: Codelist of species

Brachytrupes megacephalus
type: Concept
notation: 4047
status: valid
status modified: 2019-03-22
accepted date: 2019-03-22
in scheme: Codelist of species

Isophya costata
type: Concept
notation: 4048
status: valid
status modified: 2019-03-22
accepted date: 2019-03-22
in scheme: Codelist of species

Isophya harzi
type: Concept
notation: 4049
status: valid
status modified: 2019-03-22
accepted date: 2019-03-22
in scheme: Codelist of species

Isophya stysi
type: Concept
notation: 4050
status: valid
status modified: 2019-03-22
accepted date: 2019-03-22
in scheme: Codelist of species

Myrmecophilus baronii
type: Concept
notation: 4051
status: valid
status modified: 2019-03-22
accepted date: 2019-03-22
in scheme: Codelist of species

Odontopodisma rubripes
type: Concept
notation: 4052
status: valid
status modified: 2019-03-22
accepted date: 2019-03-22
in scheme: Codelist of species

Paracaloptenus caloptenoides
type: Concept
notation: 4053
status: valid
status modified: 2019-03-22
accepted date: 2019-03-22
in scheme: Codelist of species

Pholidoptera transsylvanica
type: Concept
notation: 4054
status: valid
status modified: 2019-03-22
accepted date: 2019-03-22
in scheme: Codelist of species

Stenobothrus eurasius
type: Concept
notation: 4055
status: valid
status modified: 2019-03-22
accepted date: 2019-03-22
in scheme: Codelist of species

Anisus vorticulus
type: Concept
notation: 4056
status: valid
status modified: 2019-03-22
accepted date: 2019-03-22
in scheme: Codelist of species

Chilostoma banaticum
type: Concept
notation: 4057
status: valid
status modified: 2019-03-22
accepted date: 2019-03-22
in scheme: Codelist of species

Hygromia kovacsi
type: Concept
notation: 4059
status: valid
status modified: 2019-03-22
accepted date: 2019-03-22
in scheme: Codelist of species

Lampedusa imitatrix
type: Concept
notation: 4060
status: valid
status modified: 2019-03-22
accepted date: 2019-03-22
in scheme: Codelist of species

Lampedusa melitensis
type: Concept
notation: 4061
status: valid
status modified: 2019-03-22
accepted date: 2019-03-22
in scheme: Codelist of species

Paladilhia hungarica
type: Concept
notation: 4062
status: valid
status modified: 2019-03-22
accepted date: 2019-03-22
in scheme: Codelist of species

Sadleriana pannonica
type: Concept
notation: 4063
status: valid
status modified: 2019-03-22
accepted date: 2019-03-22
in scheme: Codelist of species

Theodoxus transversalis
type: Concept
notation: 4064
status: valid
status modified: 2019-03-22
accepted date: 2019-03-22
in scheme: Codelist of species

Congeria kusceri
type: Concept
notation: 4065
status: valid
status modified: 2019-03-22
accepted date: 2019-03-22
in scheme: Codelist of species

Asplenium adulterinum
type: Concept
notation: 4066
status: valid
status modified: 2019-03-22
accepted date: 2019-03-22
in scheme: Codelist of species

Adenophora lilifolia
type: Concept
notation: 4068
status: valid
status modified: 2019-03-22
accepted date: 2019-03-22
in scheme: Codelist of species

Campanula bohemica
type: Concept
notation: 4069
status: valid
status modified: 2019-03-22
accepted date: 2019-03-22
in scheme: Codelist of species

Campanula serrata
type: Concept
notation: 4070
status: valid
status modified: 2019-03-22
accepted date: 2019-03-22
in scheme: Codelist of species

Campanula zoysii
type: Concept
notation: 4071
status: valid
status modified: 2019-03-22
accepted date: 2019-03-22
in scheme: Codelist of species

Cerastium dinaricum
type: Concept
notation: 4072
status: valid
status modified: 2019-03-22
accepted date: 2019-03-22
in scheme: Codelist of species

Dianthus arenarius subsp. bohemicus
type: Concept
notation: 4073
status: valid
status modified: 2019-03-22
accepted date: 2019-03-22
in scheme: Codelist of species

Dianthus diutinus
type: Concept
notation: 4074
status: valid
status modified: 2019-03-22
accepted date: 2019-03-22
in scheme: Codelist of species

Dianthus lumnitzeri
type: Concept
notation: 4075
status: valid
status modified: 2019-03-22
accepted date: 2019-03-22
in scheme: Codelist of species

Dianthus moravicus
type: Concept
notation: 4076
status: valid
status modified: 2019-03-22
accepted date: 2019-03-22
in scheme: Codelist of species

Dianthus plumarius subsp. regis-stephani
type: Concept
notation: 4077
status: valid
status modified: 2019-03-22
accepted date: 2019-03-22
in scheme: Codelist of species

Moehringia villosa
type: Concept
notation: 4078
status: valid
status modified: 2019-03-22
accepted date: 2019-03-22
in scheme: Codelist of species

Cremnophyton lanfrancoi
type: Concept
notation: 4079
status: valid
status modified: 2019-03-22
accepted date: 2019-03-22
in scheme: Codelist of species

Centaurea immanuelis-loewii
type: Concept
notation: 4080
status: valid
status modified: 2019-03-22
accepted date: 2019-03-22
in scheme: Codelist of species

Cirsium brachycephalum
type: Concept
notation: 4081
status: valid
status modified: 2019-03-22
accepted date: 2019-03-22
in scheme: Codelist of species

Crepis pusilla
type: Concept
notation: 4082
status: valid
status modified: 2019-03-22
accepted date: 2019-03-22
in scheme: Codelist of species

Helichrysum melitense
type: Concept
notation: 4083
status: valid
status modified: 2019-03-22
accepted date: 2019-03-22
in scheme: Codelist of species

Hyoseris frutescens
type: Concept
notation: 4084
status: valid
status modified: 2019-03-22
accepted date: 2019-03-22
in scheme: Codelist of species

Palaeocyanus crassifolius
type: Concept
notation: 4085
status: valid
status modified: 2019-03-22
accepted date: 2019-03-22
in scheme: Codelist of species

Saussurea alpina subsp. esthonica
type: Concept
notation: 4086
status: valid
status modified: 2019-03-22
accepted date: 2019-03-22
in scheme: Codelist of species

Tephroseris longifolia subsp. moravica
type: Concept
notation: 4088
status: valid
status modified: 2019-03-22
accepted date: 2019-03-22
in scheme: Codelist of species

Arabis scopoliana
type: Concept
notation: 4089
status: valid
status modified: 2019-03-22
accepted date: 2019-03-22
in scheme: Codelist of species

Cochlearia tatrae
type: Concept
notation: 4090
status: valid
status modified: 2019-03-22
accepted date: 2019-03-22
in scheme: Codelist of species

Crambe tataria
type: Concept
notation: 4091
status: valid
status modified: 2019-03-22
accepted date: 2019-03-22
in scheme: Codelist of species

Elatine gussonei
type: Concept
notation: 4092
status: valid
status modified: 2019-03-22
accepted date: 2019-03-22
in scheme: Codelist of species

Rhododendron luteum
type: Concept
notation: 4093
status: valid
status modified: 2019-03-22
accepted date: 2019-03-22
in scheme: Codelist of species

Gentianella bohemica
type: Concept
notation: 4094
status: valid
status modified: 2019-03-22
accepted date: 2019-03-22
in scheme: Codelist of species

Stipa zalesskii
type: Concept
notation: 4095
status: valid
status modified: 2019-03-22
accepted date: 2019-03-22
in scheme: Codelist of species

Gladiolus palustris
type: Concept
notation: 4096
status: valid
status modified: 2019-03-22
accepted date: 2019-03-22
in scheme: Codelist of species

Iris aphylla subsp. hungarica
type: Concept
notation: 4097
status: valid
status modified: 2019-03-22
accepted date: 2019-03-22
in scheme: Codelist of species

Iris humilis subsp. arenaria
type: Concept
notation: 4098
status: valid
status modified: 2019-03-22
accepted date: 2019-03-22
in scheme: Codelist of species

Salvia veneris
type: Concept
notation: 4099
status: valid
status modified: 2019-03-22
accepted date: 2019-03-22
in scheme: Codelist of species

Scilla litardierei
type: Concept
notation: 4101
status: valid
status modified: 2019-03-22
accepted date: 2019-03-22
in scheme: Codelist of species

Anacamptis urvilleana
type: Concept
notation: 4102
status: valid
status modified: 2019-03-22
accepted date: 2019-03-22
in scheme: Codelist of species

Himantoglossum adriaticum
type: Concept
notation: 4104
status: valid
status modified: 2019-03-22
accepted date: 2019-03-22
in scheme: Codelist of species

Ophrys melitensis
type: Concept
notation: 4105
status: valid
status modified: 2019-03-22
accepted date: 2019-03-22
in scheme: Codelist of species

Orobanche densiflora
type: Concept
notation: 4106
status: valid
status modified: 2019-03-22
accepted date: 2019-03-22
in scheme: Codelist of species

Cyclamen fatrense
type: Concept
notation: 4107
status: valid
status modified: 2019-03-22
accepted date: 2019-03-22
in scheme: Codelist of species

Primula carniolica
type: Concept
notation: 4108
status: valid
status modified: 2019-03-22
accepted date: 2019-03-22
in scheme: Codelist of species

Aconitum firmum subsp. moravicum
type: Concept
notation: 4109
status: valid
status modified: 2019-03-22
accepted date: 2019-03-22
in scheme: Codelist of species

Pulsatilla pratensis subsp. hungarica
type: Concept
notation: 4110
status: valid
status modified: 2019-03-22
accepted date: 2019-03-22
in scheme: Codelist of species

Pulsatilla subslavica
type: Concept
notation: 4111
status: valid
status modified: 2019-03-22
accepted date: 2019-03-22
in scheme: Codelist of species

Pyrus magyarica
type: Concept
notation: 4112
status: valid
status modified: 2019-03-22
accepted date: 2019-03-22
in scheme: Codelist of species

Galium sudeticum
type: Concept
notation: 4113
status: valid
status modified: 2019-03-22
accepted date: 2019-03-22
in scheme: Codelist of species

Linaria pseudolaxiflora
type: Concept
notation: 4114
status: valid
status modified: 2019-03-22
accepted date: 2019-03-22
in scheme: Codelist of species

Rhinanthus osiliensis
type: Concept
notation: 4115
status: valid
status modified: 2019-03-22
accepted date: 2019-03-22
in scheme: Codelist of species

Tozzia carpathica
type: Concept
notation: 4116
status: valid
status modified: 2019-03-22
accepted date: 2019-03-22
in scheme: Codelist of species

Hladnikia pastinacifolia
type: Concept
notation: 4117
status: valid
status modified: 2019-03-22
accepted date: 2019-03-22
in scheme: Codelist of species

Seseli leucospermum
type: Concept
notation: 4118
status: valid
status modified: 2019-03-22
accepted date: 2019-03-22
in scheme: Codelist of species

Ochyraea tatrensis
type: Concept
notation: 4119
status: valid
status modified: 2019-03-22
accepted date: 2019-03-22
in scheme: Codelist of species

Vipera ursinii rakosiensis
type: Concept
notation: 4121
status: valid
status modified: 2019-03-22
accepted date: 2019-03-22
in scheme: Codelist of species

Poa granitica subsp. disparilis
type: Concept
notation: 4122
status: valid
status modified: 2019-03-22
accepted date: 2019-03-22
in scheme: Codelist of species

Eudontomyzon danfordi
type: Concept
notation: 4123
status: valid
status modified: 2019-03-22
accepted date: 2019-03-22
in scheme: Codelist of species

Alosa agone
type: Concept
notation: 4124
status: valid
status modified: 2019-03-22
accepted date: 2019-03-22
in scheme: Codelist of species

Alosa immaculata
type: Concept
notation: 4125
status: valid
status modified: 2019-03-22
accepted date: 2019-03-22
in scheme: Codelist of species

Alosa tanaica
type: Concept
notation: 4127
status: valid
status modified: 2019-03-22
accepted date: 2019-03-22
in scheme: Codelist of species

Myotis alcathoe
type: Concept
notation: 5003
status: valid
status modified: 2019-03-22
accepted date: 2019-03-22
in scheme: Codelist of species

Myotis aurascens
type: Concept
notation: 5004
status: valid
status modified: 2019-03-22
accepted date: 2019-03-22
in scheme: Codelist of species

Myotis punicus
type: Concept
notation: 5005
status: valid
status modified: 2019-03-22
accepted date: 2019-03-22
in scheme: Codelist of species

Pipistrellus pygmaeus
type: Concept
notation: 5009
status: valid
status modified: 2019-03-22
accepted date: 2019-03-22
in scheme: Codelist of species

Plecotus kolombatovici
type: Concept
notation: 5011
status: valid
status modified: 2019-03-22
accepted date: 2019-03-22
in scheme: Codelist of species

Plecotus macrobullaris
type: Concept
notation: 5012
status: valid
status modified: 2019-03-22
accepted date: 2019-03-22
in scheme: Codelist of species

Plecotus sardus
type: Concept
notation: 5013
status: valid
status modified: 2019-03-22
accepted date: 2019-03-22
in scheme: Codelist of species

Plecotus teneriffae
type: Concept
notation: 5014
status: valid
status modified: 2019-03-22
accepted date: 2019-03-22
in scheme: Codelist of species

Balaenoptera musculus
type: Concept
notation: 5020
status: valid
status modified: 2019-03-22
accepted date: 2019-03-22
in scheme: Codelist of species

Lagenodelphis hosei
type: Concept
notation: 5023
status: valid
status modified: 2019-03-22
accepted date: 2019-03-22
in scheme: Codelist of species

Delphinapterus leucas
type: Concept
notation: 5029
status: valid
status modified: 2019-03-22
accepted date: 2019-03-22
in scheme: Codelist of species

Hyperoodon ampullatus
type: Concept
notation: 5033
status: valid
status modified: 2019-03-22
accepted date: 2019-03-22
in scheme: Codelist of species

Mesoplodon europaeus
type: Concept
notation: 5034
status: valid
status modified: 2019-03-22
accepted date: 2019-03-22
in scheme: Codelist of species

Lacerta vivipara pannonica
type: Concept
notation: 5037
status: valid
status modified: 2019-03-22
accepted date: 2019-03-22
in scheme: Codelist of species

Acipenser gueldenstaedtii
type: Concept
notation: 5040
status: valid
status modified: 2019-03-22
accepted date: 2019-03-22
in scheme: Codelist of species

Acipenser nudiventris
type: Concept
notation: 5041
status: valid
status modified: 2019-03-22
accepted date: 2019-03-22
in scheme: Codelist of species

Acipenser oxyrinchus
type: Concept
notation: 5042
status: valid
status modified: 2019-03-22
accepted date: 2019-03-22
in scheme: Codelist of species

Alosa killarnensis
type: Concept
notation: 5046
status: valid
status modified: 2019-03-22
accepted date: 2019-03-22
in scheme: Codelist of species

Alosa vistonica
type: Concept
notation: 5048
status: valid
status modified: 2019-03-22
accepted date: 2019-03-22
in scheme: Codelist of species

Coregonus fontanae
type: Concept
notation: 5060
status: valid
status modified: 2019-03-22
accepted date: 2019-03-22
in scheme: Codelist of species

Coregonus lucinensis
type: Concept
notation: 5066
status: valid
status modified: 2019-03-22
accepted date: 2019-03-22
in scheme: Codelist of species

Coregonus pollan
type: Concept
notation: 5076
status: valid
status modified: 2019-03-22
accepted date: 2019-03-22
in scheme: Codelist of species

Coregonus trybomi
type: Concept
notation: 5080
status: valid
status modified: 2019-03-22
accepted date: 2019-03-22
in scheme: Codelist of species

Coregonus vandesius
type: Concept
notation: 5081
status: valid
status modified: 2019-03-22
accepted date: 2019-03-22
in scheme: Codelist of species

Barbus barbus
type: Concept
notation: 5085
status: valid
status modified: 2019-03-22
accepted date: 2019-03-22
in scheme: Codelist of species

Barbus caninus
type: Concept
notation: 5086
status: valid
status modified: 2019-03-22
accepted date: 2019-03-22
in scheme: Codelist of species

Barbus cyclolepis
type: Concept
notation: 5088
status: valid
status modified: 2019-03-22
accepted date: 2019-03-22
in scheme: Codelist of species

Barbus euboicus
type: Concept
notation: 5089
status: valid
status modified: 2019-03-22
accepted date: 2019-03-22
in scheme: Codelist of species

Barbus macedonicus
type: Concept
notation: 5093
status: valid
status modified: 2019-03-22
accepted date: 2019-03-22
in scheme: Codelist of species

Barbus peloponnesius
type: Concept
notation: 5094
status: valid
status modified: 2019-03-22
accepted date: 2019-03-22
in scheme: Codelist of species

Barbus prespensis
type: Concept
notation: 5095
status: valid
status modified: 2019-03-22
accepted date: 2019-03-22
in scheme: Codelist of species

Barbus tyberinus
type: Concept
notation: 5097
status: valid
status modified: 2019-03-22
accepted date: 2019-03-22
in scheme: Codelist of species

Theodoxus prevostianus
type: Concept
notation: 5102
status: valid
status modified: 2019-03-22
accepted date: 2019-03-22
in scheme: Codelist of species

Rupicapra pyrenaica
type: Concept
notation: 5178
status: valid
status modified: 2019-03-22
accepted date: 2019-03-22
in scheme: Codelist of species

Lacerta bilineata
type: Concept
notation: 5179
status: valid
status modified: 2019-03-22
accepted date: 2019-03-22
in scheme: Codelist of species

Barbus albanicus
type: Concept
notation: 5180
status: valid
status modified: 2019-03-22
accepted date: 2019-03-22
in scheme: Codelist of species

Elaphe sauromates
type: Concept
notation: 5194
status: valid
status modified: 2019-03-22
accepted date: 2019-03-22
in scheme: Codelist of species

Aphanius baeticus
type: Concept
notation: 5196
status: valid
status modified: 2019-03-22
accepted date: 2019-03-22
in scheme: Codelist of species

Sabanejewia balcanica
type: Concept
notation: 5197
status: valid
status modified: 2019-03-22
accepted date: 2019-03-22
in scheme: Codelist of species

Pipistrellus hanaki
type: Concept
notation: 5253
status: valid
status modified: 2019-03-22
accepted date: 2019-03-22
in scheme: Codelist of species

Barbus pergamonensis
type: Concept
notation: 5254
status: valid
status modified: 2019-03-22
accepted date: 2019-03-22
in scheme: Codelist of species

Barbus sperchiensis
type: Concept
notation: 5256
status: valid
status modified: 2019-03-22
accepted date: 2019-03-22
in scheme: Codelist of species

Iberolacerta aranica
type: Concept
notation: 5257
status: valid
status modified: 2019-03-22
accepted date: 2019-03-22
in scheme: Codelist of species

Iberolacerta aurelioi
type: Concept
notation: 5258
status: valid
status modified: 2019-03-22
accepted date: 2019-03-22
in scheme: Codelist of species

Iberolacerta bonnali
type: Concept
notation: 5259
status: valid
status modified: 2019-03-22
accepted date: 2019-03-22
in scheme: Codelist of species

Eudontomyzon graecus
type: Concept
notation: 5260
status: valid
status modified: 2019-03-22
accepted date: 2019-03-22
in scheme: Codelist of species

Barbus balcanicus
type: Concept
notation: 5261
status: valid
status modified: 2019-03-22
accepted date: 2019-03-22
in scheme: Codelist of species

Barbus haasi
type: Concept
notation: 5262
status: valid
status modified: 2019-03-22
accepted date: 2019-03-22
in scheme: Codelist of species

Barbus strumicae
type: Concept
notation: 5263
status: valid
status modified: 2019-03-22
accepted date: 2019-03-22
in scheme: Codelist of species

Barbus carpathicus
type: Concept
notation: 5264
status: valid
status modified: 2019-03-22
accepted date: 2019-03-22
in scheme: Codelist of species

Barbus bergi
type: Concept
notation: 5265
status: valid
status modified: 2019-03-22
accepted date: 2019-03-22
in scheme: Codelist of species

Barbus waleckii
type: Concept
notation: 5267
status: valid
status modified: 2019-03-22
accepted date: 2019-03-22
in scheme: Codelist of species

Alburnus volviticus
type: Concept
notation: 5268
status: valid
status modified: 2019-03-22
accepted date: 2019-03-22
in scheme: Codelist of species

Alburnus vistonicus
type: Concept
notation: 5269
status: valid
status modified: 2019-03-22
accepted date: 2019-03-22
in scheme: Codelist of species

Aphanius almiriensis
type: Concept
notation: 5276
status: valid
status modified: 2019-03-22
accepted date: 2019-03-22
in scheme: Codelist of species

Eptesicus isabellinus
type: Concept
notation: 5277
status: valid
status modified: 2019-03-22
accepted date: 2019-03-22
in scheme: Codelist of species

Pelasgus thesproticus
type: Concept
notation: 5279
status: valid
status modified: 2019-03-22
accepted date: 2019-03-22
in scheme: Codelist of species

Luciobarbus bocagei
type: Concept
notation: 5281
status: valid
status modified: 2019-03-22
accepted date: 2019-03-22
in scheme: Codelist of species

Luciobarbus graecus
type: Concept
notation: 5282
status: valid
status modified: 2019-03-22
accepted date: 2019-03-22
in scheme: Codelist of species

Luciobarbus graellsii
type: Concept
notation: 5283
status: valid
status modified: 2019-03-22
accepted date: 2019-03-22
in scheme: Codelist of species

Luciobarbus guiraonis
type: Concept
notation: 5284
status: valid
status modified: 2019-03-22
accepted date: 2019-03-22
in scheme: Codelist of species

Luciobarbus microcephalus
type: Concept
notation: 5285
status: valid
status modified: 2019-03-22
accepted date: 2019-03-22
in scheme: Codelist of species

Luciobarbus sclateri
type: Concept
notation: 5286
status: valid
status modified: 2019-03-22
accepted date: 2019-03-22
in scheme: Codelist of species

Luciobarbus steindachneri
type: Concept
notation: 5287
status: valid
status modified: 2019-03-22
accepted date: 2019-03-22
in scheme: Codelist of species

Alburnus mandrensis
type: Concept
notation: 5288
status: valid
status modified: 2019-03-22
accepted date: 2019-03-22
in scheme: Codelist of species

Alburnus mento
type: Concept
notation: 5289
status: valid
status modified: 2019-03-22
accepted date: 2019-03-22
in scheme: Codelist of species

Alburnus schischkovi
type: Concept
notation: 5290
status: valid
status modified: 2019-03-22
accepted date: 2019-03-22
in scheme: Codelist of species

Alburnus sarmaticus
type: Concept
notation: 5291
status: valid
status modified: 2019-03-22
accepted date: 2019-03-22
in scheme: Codelist of species

Parachondrostoma miegii
type: Concept
notation: 5292
status: valid
status modified: 2019-03-22
accepted date: 2019-03-22
in scheme: Codelist of species

Parachondrostoma turiense
type: Concept
notation: 5293
status: valid
status modified: 2019-03-22
accepted date: 2019-03-22
in scheme: Codelist of species

Parachondrostoma arrigonis
type: Concept
notation: 5294
status: valid
status modified: 2019-03-22
accepted date: 2019-03-22
in scheme: Codelist of species

Iberochondrostoma almacai
type: Concept
notation: 5295
status: valid
status modified: 2019-03-22
accepted date: 2019-03-22
in scheme: Codelist of species

Pseudochondrostoma duriense
type: Concept
notation: 5296
status: valid
status modified: 2019-03-22
accepted date: 2019-03-22
in scheme: Codelist of species

Cobitis vettonica
type: Concept
notation: 5301
status: valid
status modified: 2019-03-22
accepted date: 2019-03-22
in scheme: Codelist of species

Cobitis paludica
type: Concept
notation: 5302
status: valid
status modified: 2019-03-22
accepted date: 2019-03-22
in scheme: Codelist of species

Cobitis calderoni
type: Concept
notation: 5303
status: valid
status modified: 2019-03-22
accepted date: 2019-03-22
in scheme: Codelist of species

Cobitis bilineata
type: Concept
notation: 5304
status: valid
status modified: 2019-03-22
accepted date: 2019-03-22
in scheme: Codelist of species

Cobitis zanandreai
type: Concept
notation: 5305
status: valid
status modified: 2019-03-22
accepted date: 2019-03-22
in scheme: Codelist of species

Cobitis punctilineata
type: Concept
notation: 5306
status: valid
status modified: 2019-03-22
accepted date: 2019-03-22
in scheme: Codelist of species

Cobitis stephanidisi
type: Concept
notation: 5307
status: valid
status modified: 2019-03-22
accepted date: 2019-03-22
in scheme: Codelist of species

Cobitis ohridana
type: Concept
notation: 5308
status: valid
status modified: 2019-03-22
accepted date: 2019-03-22
in scheme: Codelist of species

Cobitis vardarensis
type: Concept
notation: 5309
status: valid
status modified: 2019-03-22
accepted date: 2019-03-22
in scheme: Codelist of species

Cobitis meridionalis
type: Concept
notation: 5310
status: valid
status modified: 2019-03-22
accepted date: 2019-03-22
in scheme: Codelist of species

Cobitis puncticulata
type: Concept
notation: 5311
status: valid
status modified: 2019-03-22
accepted date: 2019-03-22
in scheme: Codelist of species

Cobitis arachthosensis
type: Concept
notation: 5312
status: valid
status modified: 2019-03-22
accepted date: 2019-03-22
in scheme: Codelist of species

Cobitis hellenica
type: Concept
notation: 5313
status: valid
status modified: 2019-03-22
accepted date: 2019-03-22
in scheme: Codelist of species

Cottus rondeleti
type: Concept
notation: 5314
status: valid
status modified: 2019-03-22
accepted date: 2019-03-22
in scheme: Codelist of species

Cottus duranii
type: Concept
notation: 5316
status: valid
status modified: 2019-03-22
accepted date: 2019-03-22
in scheme: Codelist of species

Cottus hispaniolensis
type: Concept
notation: 5317
status: valid
status modified: 2019-03-22
accepted date: 2019-03-22
in scheme: Codelist of species

Cottus aturi
type: Concept
notation: 5318
status: valid
status modified: 2019-03-22
accepted date: 2019-03-22
in scheme: Codelist of species

Cottus transsilvaniae
type: Concept
notation: 5323
status: valid
status modified: 2019-03-22
accepted date: 2019-03-22
in scheme: Codelist of species

Cottus sabaudicus
type: Concept
notation: 5326
status: valid
status modified: 2019-03-22
accepted date: 2019-03-22
in scheme: Codelist of species

Romanogobio belingi
type: Concept
notation: 5328
status: valid
status modified: 2019-03-22
accepted date: 2019-03-22
in scheme: Codelist of species

Romanogobio vladykovi
type: Concept
notation: 5329
status: valid
status modified: 2019-03-22
accepted date: 2019-03-22
in scheme: Codelist of species

Romanogobio elimeius
type: Concept
notation: 5330
status: valid
status modified: 2019-03-22
accepted date: 2019-03-22
in scheme: Codelist of species

Telestes muticellus
type: Concept
notation: 5331
status: valid
status modified: 2019-03-22
accepted date: 2019-03-22
in scheme: Codelist of species

Squalius keadicus
type: Concept
notation: 5332
status: valid
status modified: 2019-03-22
accepted date: 2019-03-22
in scheme: Codelist of species

Pelasgus stymphalicus
type: Concept
notation: 5333
status: valid
status modified: 2019-03-22
accepted date: 2019-03-22
in scheme: Codelist of species

Telestes pleurobipunctatus
type: Concept
notation: 5334
status: valid
status modified: 2019-03-22
accepted date: 2019-03-22
in scheme: Codelist of species

Telestes beoticus
type: Concept
notation: 5335
status: valid
status modified: 2019-03-22
accepted date: 2019-03-22
in scheme: Codelist of species

Pelasgus marathonicus
type: Concept
notation: 5336
status: valid
status modified: 2019-03-22
accepted date: 2019-03-22
in scheme: Codelist of species

Economidichthys pygmaeus
type: Concept
notation: 5337
status: valid
status modified: 2019-03-22
accepted date: 2019-03-22
in scheme: Codelist of species

Economidichthys trichonis
type: Concept
notation: 5338
status: valid
status modified: 2019-03-22
accepted date: 2019-03-22
in scheme: Codelist of species

Rhodeus amarus
type: Concept
notation: 5339
status: valid
status modified: 2019-03-22
accepted date: 2019-03-22
in scheme: Codelist of species

Rhodeus meridionalis
type: Concept
notation: 5340
status: valid
status modified: 2019-03-22
accepted date: 2019-03-22
in scheme: Codelist of species

Tropidophoxinellus hellenicus
type: Concept
notation: 5341
status: valid
status modified: 2019-03-22
accepted date: 2019-03-22
in scheme: Codelist of species

Rutilus prespensis
type: Concept
notation: 5342
status: valid
status modified: 2019-03-22
accepted date: 2019-03-22
in scheme: Codelist of species

Rutilus ylikiensis
type: Concept
notation: 5343
status: valid
status modified: 2019-03-22
accepted date: 2019-03-22
in scheme: Codelist of species

Rutilus panosi
type: Concept
notation: 5344
status: valid
status modified: 2019-03-22
accepted date: 2019-03-22
in scheme: Codelist of species

Rutilus virgo
type: Concept
notation: 5345
status: valid
status modified: 2019-03-22
accepted date: 2019-03-22
in scheme: Codelist of species

Sabanejewia vallachica
type: Concept
notation: 5346
status: valid
status modified: 2019-03-22
accepted date: 2019-03-22
in scheme: Codelist of species

Sabanejewia bulgarica
type: Concept
notation: 5347
status: valid
status modified: 2019-03-22
accepted date: 2019-03-22
in scheme: Codelist of species

Sabanejewia baltica
type: Concept
notation: 5348
status: valid
status modified: 2019-03-22
accepted date: 2019-03-22
in scheme: Codelist of species

Salmo cetti
type: Concept
notation: 5349
status: valid
status modified: 2019-03-22
accepted date: 2019-03-22
in scheme: Codelist of species

Salmo farioides
type: Concept
notation: 5350
status: valid
status modified: 2019-03-22
accepted date: 2019-03-22
in scheme: Codelist of species

Salmo louroensis
type: Concept
notation: 5352
status: valid
status modified: 2019-03-22
accepted date: 2019-03-22
in scheme: Codelist of species

Salmo macedonicus
type: Concept
notation: 5353
status: valid
status modified: 2019-03-22
accepted date: 2019-03-22
in scheme: Codelist of species

Salmo pelagonicus
type: Concept
notation: 5354
status: valid
status modified: 2019-03-22
accepted date: 2019-03-22
in scheme: Codelist of species

Salmo peristericus
type: Concept
notation: 5355
status: valid
status modified: 2019-03-22
accepted date: 2019-03-22
in scheme: Codelist of species

Zingel balcanicus
type: Concept
notation: 5356
status: valid
status modified: 2019-03-22
accepted date: 2019-03-22
in scheme: Codelist of species

Bombina pachypus
type: Concept
notation: 5357
status: valid
status modified: 2019-03-22
accepted date: 2019-03-22
in scheme: Codelist of species

Hyla intermedia
type: Concept
notation: 5358
status: valid
status modified: 2019-03-22
accepted date: 2019-03-22
in scheme: Codelist of species

Lyciasalamandra helverseni
type: Concept
notation: 5359
status: valid
status modified: 2019-03-22
accepted date: 2019-03-22
in scheme: Codelist of species

Triturus macedonicus
type: Concept
notation: 5364
status: valid
status modified: 2019-03-22
accepted date: 2019-03-22
in scheme: Codelist of species

Hypsugo savii
type: Concept
notation: 5365
status: valid
status modified: 2019-03-22
accepted date: 2019-03-22
in scheme: Codelist of species

Zamenis lineatus
type: Concept
notation: 5369
status: valid
status modified: 2019-03-22
accepted date: 2019-03-22
in scheme: Codelist of species

Emys trinacris
type: Concept
notation: 5370
status: valid
status modified: 2019-03-22
accepted date: 2019-03-22
in scheme: Codelist of species

Iberolacerta monticola
type: Concept
notation: 5371
status: valid
status modified: 2019-03-22
accepted date: 2019-03-22
in scheme: Codelist of species

Anatololacerta oertzeni
type: Concept
notation: 5372
status: valid
status modified: 2019-03-22
accepted date: 2019-03-22
in scheme: Codelist of species

Anatololacerta anatolica
type: Concept
notation: 5373
status: valid
status modified: 2019-03-22
accepted date: 2019-03-22
in scheme: Codelist of species

Podarcis cretensis
type: Concept
notation: 5375
status: valid
status modified: 2019-03-22
accepted date: 2019-03-22
in scheme: Codelist of species

Podarcis levendis
type: Concept
notation: 5376
status: valid
status modified: 2019-03-22
accepted date: 2019-03-22
in scheme: Codelist of species

Carabus (variolosus) nodulosus
type: Concept
notation: 5377
status: valid
status modified: 2019-03-22
accepted date: 2019-03-22
in scheme: Codelist of species

Osmoderma cristinae
type: Concept
notation: 5380
status: valid
status modified: 2019-03-22
accepted date: 2019-03-22
in scheme: Codelist of species

Osmoderma italicum
type: Concept
notation: 5381
status: valid
status modified: 2019-03-22
accepted date: 2019-03-22
in scheme: Codelist of species

Unio tumidiformis
type: Concept
notation: 5382
status: valid
status modified: 2019-03-22
accepted date: 2019-03-22
in scheme: Codelist of species

Hierophis gemonensis
type: Concept
notation: 5669
status: valid
status modified: 2019-03-22
accepted date: 2019-03-22
in scheme: Codelist of species

Iberolacerta horvathi
type: Concept
notation: 5676
status: valid
status modified: 2019-03-22
accepted date: 2019-03-22
in scheme: Codelist of species

Podarcis raffoneae
type: Concept
notation: 5795
status: valid
status modified: 2019-03-22
accepted date: 2019-03-22
in scheme: Codelist of species

Rana pyrenaica
type: Concept
notation: 5813
status: valid
status modified: 2019-03-22
accepted date: 2019-03-22
in scheme: Codelist of species

Salmo fibreni
type: Concept
notation: 5828
status: valid
status modified: 2019-03-22
accepted date: 2019-03-22
in scheme: Codelist of species

Triturus pygmaeus
type: Concept
notation: 5896
status: valid
status modified: 2019-03-22
accepted date: 2019-03-22
in scheme: Codelist of species

Archaeolacerta bedriagae
type: Concept
notation: 5912
status: valid
status modified: 2019-03-22
accepted date: 2019-03-22
in scheme: Codelist of species

Iberochondrostoma lemmingii
type: Concept
notation: 5926
status: valid
status modified: 2019-03-22
accepted date: 2019-03-22
in scheme: Codelist of species

Protochondrostoma genei
type: Concept
notation: 5962
status: valid
status modified: 2019-03-22
accepted date: 2019-03-22
in scheme: Codelist of species

Erinaceus algirus
type: Concept
notation: 5978
status: valid
status modified: 2019-03-22
accepted date: 2019-03-22
in scheme: Codelist of species

Hellenolacerta graeca
type: Concept
notation: 6079
status: valid
status modified: 2019-03-22
accepted date: 2019-03-22
in scheme: Codelist of species

Dolichophis jugularis
type: Concept
notation: 6089
status: valid
status modified: 2019-03-22
accepted date: 2019-03-22
in scheme: Codelist of species

Zamenis longissimus
type: Concept
notation: 6091
status: valid
status modified: 2019-03-22
accepted date: 2019-03-22
in scheme: Codelist of species

Platyceps najadum
type: Concept
notation: 6092
status: valid
status modified: 2019-03-22
accepted date: 2019-03-22
in scheme: Codelist of species

Zamenis situla
type: Concept
notation: 6095
status: valid
status modified: 2019-03-22
accepted date: 2019-03-22
in scheme: Codelist of species

Euleptes europaea
type: Concept
notation: 6137
status: valid
status modified: 2019-03-22
accepted date: 2019-03-22
in scheme: Codelist of species

Dolichophis caspius
type: Concept
notation: 6138
status: valid
status modified: 2019-03-22
accepted date: 2019-03-22
in scheme: Codelist of species

Laudakia stellio
type: Concept
notation: 6139
status: valid
status modified: 2019-03-22
accepted date: 2019-03-22
in scheme: Codelist of species

Romanogobio kesslerii
type: Concept
notation: 6143
status: valid
status modified: 2019-03-22
accepted date: 2019-03-22
in scheme: Codelist of species

Romanogobio uranoscopus
type: Concept
notation: 6145
status: valid
status modified: 2019-03-22
accepted date: 2019-03-22
in scheme: Codelist of species

Rutilus meidingeri
type: Concept
notation: 6146
status: valid
status modified: 2019-03-22
accepted date: 2019-03-22
in scheme: Codelist of species

Telestes souffia
type: Concept
notation: 6147
status: valid
status modified: 2019-03-22
accepted date: 2019-03-22
in scheme: Codelist of species

Squalius lucumonis
type: Concept
notation: 6148
status: valid
status modified: 2019-03-22
accepted date: 2019-03-22
in scheme: Codelist of species

Pseudochondrostoma polylepis
type: Concept
notation: 6149
status: valid
status modified: 2019-03-22
accepted date: 2019-03-22
in scheme: Codelist of species

Parachondrostoma toxostoma
type: Concept
notation: 6150
status: valid
status modified: 2019-03-22
accepted date: 2019-03-22
in scheme: Codelist of species

Iberochondrostoma lusitanicum
type: Concept
notation: 6151
status: valid
status modified: 2019-03-22
accepted date: 2019-03-22
in scheme: Codelist of species

Hemorrhois nummifer
type: Concept
notation: 6153
status: valid
status modified: 2019-03-22
accepted date: 2019-03-22
in scheme: Codelist of species

Achondrostoma arcasii
type: Concept
notation: 6155
status: valid
status modified: 2019-03-22
accepted date: 2019-03-22
in scheme: Codelist of species

Achondrostoma oligolepis
type: Concept
notation: 6156
status: valid
status modified: 2019-03-22
accepted date: 2019-03-22
in scheme: Codelist of species

Pseudochondrostoma willkommii
type: Concept
notation: 6162
status: valid
status modified: 2019-03-22
accepted date: 2019-03-22
in scheme: Codelist of species

Scapania carinthiaca
type: Concept
notation: 6166
status: valid
status modified: 2019-03-22
accepted date: 2019-03-22
in scheme: Codelist of species

Luciobarbus comizo
type: Concept
notation: 6168
status: valid
status modified: 2019-03-22
accepted date: 2019-03-22
in scheme: Codelist of species

Euphydryas maturna
type: Concept
notation: 6169
status: valid
status modified: 2019-03-22
accepted date: 2019-03-22
in scheme: Codelist of species

Euphorbia bourgeana
type: Concept
notation: 6173
status: valid
status modified: 2019-03-22
accepted date: 2019-03-22
in scheme: Codelist of species

Biscutella sempervirens subsp. vicentina
type: Concept
notation: 6174
status: valid
status modified: 2019-03-22
accepted date: 2019-03-22
in scheme: Codelist of species

Acis nicaeensis
type: Concept
notation: 6176
status: valid
status modified: 2019-03-22
accepted date: 2019-03-22
in scheme: Codelist of species

Silene involucrata subsp. tenella
type: Concept
notation: 6181
status: valid
status modified: 2019-03-22
accepted date: 2019-03-22
in scheme: Codelist of species

Sympecma paedisca
type: Concept
notation: 6182
status: valid
status modified: 2019-03-22
accepted date: 2019-03-22
in scheme: Codelist of species

Iberis runemarkii
type: Concept
notation: 6194
status: valid
status modified: 2019-03-22
accepted date: 2019-03-22
in scheme: Codelist of species

Rhaponticoides fraylensis
type: Concept
notation: 6196
status: valid
status modified: 2019-03-22
accepted date: 2019-03-22
in scheme: Codelist of species

Centaurea heldreichii
type: Concept
notation: 6197
status: valid
status modified: 2019-03-22
accepted date: 2019-03-22
in scheme: Codelist of species

Centaurea princeps
type: Concept
notation: 6198
status: valid
status modified: 2019-03-22
accepted date: 2019-03-22
in scheme: Codelist of species

Euplagia quadripunctaria
type: Concept
notation: 6199
status: valid
status modified: 2019-03-22
accepted date: 2019-03-22
in scheme: Codelist of species

Teira dugesii
type: Concept
notation: 6201
status: valid
status modified: 2019-03-22
accepted date: 2019-03-22
in scheme: Codelist of species

Speleomantes genei
type: Concept
notation: 6205
status: valid
status modified: 2019-03-22
accepted date: 2019-03-22
in scheme: Codelist of species

Speleomantes ambrosii
type: Concept
notation: 6206
status: valid
status modified: 2019-03-22
accepted date: 2019-03-22
in scheme: Codelist of species

Speleomantes flavus
type: Concept
notation: 6207
status: valid
status modified: 2019-03-22
accepted date: 2019-03-22
in scheme: Codelist of species

Speleomantes supramontis
type: Concept
notation: 6208
status: valid
status modified: 2019-03-22
accepted date: 2019-03-22
in scheme: Codelist of species

Speleomantes imperialis
type: Concept
notation: 6209
status: valid
status modified: 2019-03-22
accepted date: 2019-03-22
in scheme: Codelist of species

Speleomantes strinatii
type: Concept
notation: 6211
status: valid
status modified: 2019-03-22
accepted date: 2019-03-22
in scheme: Codelist of species

Dianthus laricifolius subsp. marizii
type: Concept
notation: 6213
status: valid
status modified: 2019-03-22
accepted date: 2019-03-22
in scheme: Codelist of species

Hamatocaulis vernicosus
type: Concept
notation: 6216
status: valid
status modified: 2019-03-22
accepted date: 2019-03-22
in scheme: Codelist of species

Herniaria litardierei
type: Concept
notation: 6217
status: valid
status modified: 2019-03-22
accepted date: 2019-03-22
in scheme: Codelist of species

Lilium pomponium
type: Concept
notation: 6223
status: valid
status modified: 2019-03-22
accepted date: 2019-03-22
in scheme: Codelist of species

Ononis maweana
type: Concept
notation: 6231
status: valid
status modified: 2019-03-22
accepted date: 2019-03-22
in scheme: Codelist of species

Phagnalon saxatile
type: Concept
notation: 6234
status: valid
status modified: 2019-03-22
accepted date: 2019-03-22
in scheme: Codelist of species

Rhynchocypris percnurus
type: Concept
notation: 6236
status: valid
status modified: 2019-03-22
accepted date: 2019-03-22
in scheme: Codelist of species

Pelasgus epiroticus
type: Concept
notation: 6263
status: valid
status modified: 2019-03-22
accepted date: 2019-03-22
in scheme: Codelist of species

Pelasgus prespensis
type: Concept
notation: 6264
status: valid
status modified: 2019-03-22
accepted date: 2019-03-22
in scheme: Codelist of species

Astragalus alopecurus
type: Concept
notation: 6269
status: valid
status modified: 2019-03-22
accepted date: 2019-03-22
in scheme: Codelist of species

Narcissus cavanillesii
type: Concept
notation: 6276
status: valid
status modified: 2019-03-22
accepted date: 2019-03-22
in scheme: Codelist of species

Leopoldia gussonei
type: Concept
notation: 6281
status: valid
status modified: 2019-03-22
accepted date: 2019-03-22
in scheme: Codelist of species

Klasea lycopifolia
type: Concept
notation: 6282
status: valid
status modified: 2019-03-22
accepted date: 2019-03-22
in scheme: Codelist of species

Nepeta argolica subsp. dirphya
type: Concept
notation: 6283
status: valid
status modified: 2019-03-22
accepted date: 2019-03-22
in scheme: Codelist of species

Epidalea calamita
type: Concept
notation: 6284
status: valid
status modified: 2019-03-22
accepted date: 2019-03-22
in scheme: Codelist of species

Jacobaea vulgaris subsp. gotlandica
type: Concept
notation: 6288
status: valid
status modified: 2019-03-22
accepted date: 2019-03-22
in scheme: Codelist of species

Tropidophoxinellus spartiaticus
type: Concept
notation: 6289
status: valid
status modified: 2019-03-22
accepted date: 2019-03-22
in scheme: Codelist of species

Pelasgus laconicus
type: Concept
notation: 6291
status: valid
status modified: 2019-03-22
accepted date: 2019-03-22
in scheme: Codelist of species

Knipowitschia goerneri
type: Concept
notation: 6292
status: valid
status modified: 2019-03-22
accepted date: 2019-03-22
in scheme: Codelist of species

Knipowitschia milleri
type: Concept
notation: 6293
status: valid
status modified: 2019-03-22
accepted date: 2019-03-22
in scheme: Codelist of species

Ceropegia dichotoma subsp. krainzii
type: Concept
notation: 6295
status: valid
status modified: 2019-03-22
accepted date: 2019-03-22
in scheme: Codelist of species

Peponocephala electra
type: Concept
notation: 6298
status: valid
status modified: 2019-03-22
accepted date: 2019-03-22
in scheme: Codelist of species

Pusa hispida
type: Concept
notation: 6305
status: valid
status modified: 2019-03-22
accepted date: 2019-03-22
in scheme: Codelist of species

Pusa hispida saimensis
type: Concept
notation: 6306
status: valid
status modified: 2019-03-22
accepted date: 2019-03-22
in scheme: Codelist of species

Pusa hispida botnica
type: Concept
notation: 6307
status: valid
status modified: 2019-03-22
accepted date: 2019-03-22
in scheme: Codelist of species

Vipera ursinii macrops
type: Concept
notation: 6337
status: valid
status modified: 2019-03-22
accepted date: 2019-03-22
in scheme: Codelist of species

Dinaromys bogdanovi
type: Concept
notation: 6338
status: valid
status modified: 2019-03-22
accepted date: 2019-03-22
in scheme: Codelist of species

Salmothymus obtusirostris
type: Concept
notation: 6339
status: valid
status modified: 2019-03-22
accepted date: 2019-03-22
in scheme: Codelist of species

Dalmatolacerta oxycephala
type: Concept
notation: 6341
status: valid
status modified: 2019-03-22
accepted date: 2019-03-22
in scheme: Codelist of species

Dinarolacerta mosorensis
type: Concept
notation: 6342
status: valid
status modified: 2019-03-22
accepted date: 2019-03-22
in scheme: Codelist of species

Aulopyge huegelii
type: Concept
notation: 6343
status: valid
status modified: 2019-03-22
accepted date: 2019-03-22
in scheme: Codelist of species

Chondrostoma knerii
type: Concept
notation: 6344
status: valid
status modified: 2019-03-22
accepted date: 2019-03-22
in scheme: Codelist of species

Chondrostoma phoxinus
type: Concept
notation: 6345
status: valid
status modified: 2019-03-22
accepted date: 2019-03-22
in scheme: Codelist of species

Squalius microlepis
type: Concept
notation: 6346
status: valid
status modified: 2019-03-22
accepted date: 2019-03-22
in scheme: Codelist of species

Squalius svallize
type: Concept
notation: 6347
status: valid
status modified: 2019-03-22
accepted date: 2019-03-22
in scheme: Codelist of species

Knipowitschia croatica
type: Concept
notation: 6348
status: valid
status modified: 2019-03-22
accepted date: 2019-03-22
in scheme: Codelist of species

Proterebia afra dalmata
type: Concept
notation: 6350
status: valid
status modified: 2019-03-22
accepted date: 2019-03-22
in scheme: Codelist of species

Degenia velebitica
type: Concept
notation: 6351
status: valid
status modified: 2019-03-22
accepted date: 2019-03-22
in scheme: Codelist of species

Coregonus lavaretus Complex
type: Concept
notation: 6353
status: valid
status modified: 2019-03-22
accepted date: 2019-03-22
in scheme: Codelist of species

Delminichthys jadovensis
type: Concept
notation: 6894
status: valid
status modified: 2019-03-22
accepted date: 2019-03-22
in scheme: Codelist of species

Delminichthys krbavensis
type: Concept
notation: 6895
status: valid
status modified: 2019-03-22
accepted date: 2019-03-22
in scheme: Codelist of species

Telestes croaticus
type: Concept
notation: 6896
status: valid
status modified: 2019-03-22
accepted date: 2019-03-22
in scheme: Codelist of species

Delminichthys adspersus
type: Concept
notation: 6897
status: valid
status modified: 2019-03-22
accepted date: 2019-03-22
in scheme: Codelist of species

Delminichthys ghetaldii
type: Concept
notation: 6898
status: valid
status modified: 2019-03-22
accepted date: 2019-03-22
in scheme: Codelist of species

Phoxinellus alepidotus
type: Concept
notation: 6899
status: valid
status modified: 2019-03-22
accepted date: 2019-03-22
in scheme: Codelist of species

Phoxinellus dalmaticus
type: Concept
notation: 6900
status: valid
status modified: 2019-03-22
accepted date: 2019-03-22
in scheme: Codelist of species

Cobitis dalmatina
type: Concept
notation: 6902
status: valid
status modified: 2019-03-22
accepted date: 2019-03-22
in scheme: Codelist of species

Cobitis illyrica
type: Concept
notation: 6903
status: valid
status modified: 2019-03-22
accepted date: 2019-03-22
in scheme: Codelist of species

Cobitis jadovaensis
type: Concept
notation: 6904
status: valid
status modified: 2019-03-22
accepted date: 2019-03-22
in scheme: Codelist of species

Cobitis narentana
type: Concept
notation: 6905
status: valid
status modified: 2019-03-22
accepted date: 2019-03-22
in scheme: Codelist of species

Alytes dickhilleni
type: Concept
notation: 6906
status: valid
status modified: 2019-03-22
accepted date: 2019-03-22
in scheme: Codelist of species

Morimus asper funereus
type: Concept
notation: 6908
status: valid
status modified: 2019-03-22
accepted date: 2019-03-22
in scheme: Codelist of species

Centranthus amazonum
type: Concept
notation: 6909
status: valid
status modified: 2019-03-22
accepted date: 2019-03-22
in scheme: Codelist of species

Ablepharus budaki
type: Concept
notation: 6912
status: valid
status modified: 2019-03-22
accepted date: 2019-03-22
in scheme: Codelist of species

Achondrostoma salamantinum
type: Concept
notation: 6913
status: valid
status modified: 2019-03-22
accepted date: 2019-03-22
in scheme: Codelist of species

Achondrostoma occidentale
type: Concept
notation: 6914
status: valid
status modified: 2019-03-22
accepted date: 2019-03-22
in scheme: Codelist of species

Bufotes boulengeri
type: Concept
notation: 6917
status: valid
status modified: 2019-03-22
accepted date: 2019-03-22
in scheme: Codelist of species

Bufotes siculus
type: Concept
notation: 6919
status: valid
status modified: 2019-03-22
accepted date: 2019-03-22
in scheme: Codelist of species

Calotriton arnoldi
type: Concept
notation: 6920
status: valid
status modified: 2019-03-22
accepted date: 2019-03-22
in scheme: Codelist of species

Chalcides coeruleopunctatus
type: Concept
notation: 6921
status: valid
status modified: 2019-03-22
accepted date: 2019-03-22
in scheme: Codelist of species

Congeria jalzici
type: Concept
notation: 6922
status: valid
status modified: 2019-03-22
accepted date: 2019-03-22
in scheme: Codelist of species

Eptesicus anatolicus
type: Concept
notation: 6924
status: valid
status modified: 2019-03-22
accepted date: 2019-03-22
in scheme: Codelist of species

Himantoglossum jankae
type: Concept
notation: 6927
status: valid
status modified: 2019-03-22
accepted date: 2019-03-22
in scheme: Codelist of species

Hirudo verbana
type: Concept
notation: 6928
status: valid
status modified: 2019-03-22
accepted date: 2019-03-22
in scheme: Codelist of species

Hyla molleri
type: Concept
notation: 6929
status: valid
status modified: 2019-03-22
accepted date: 2019-03-22
in scheme: Codelist of species

Iberochondrostoma oretanum
type: Concept
notation: 6930
status: valid
status modified: 2019-03-22
accepted date: 2019-03-22
in scheme: Codelist of species

Iberolacerta cyreni
type: Concept
notation: 6931
status: valid
status modified: 2019-03-22
accepted date: 2019-03-22
in scheme: Codelist of species

Iberolacerta galani
type: Concept
notation: 6932
status: valid
status modified: 2019-03-22
accepted date: 2019-03-22
in scheme: Codelist of species

Iberolacerta martinezricai
type: Concept
notation: 6933
status: valid
status modified: 2019-03-22
accepted date: 2019-03-22
in scheme: Codelist of species

Narcissus yepesii
type: Concept
notation: 6935
status: valid
status modified: 2019-03-22
accepted date: 2019-03-22
in scheme: Codelist of species

Plecotus gaisleri
type: Concept
notation: 6936
status: valid
status modified: 2019-03-22
accepted date: 2019-03-22
in scheme: Codelist of species

Podarcis gaigeae
type: Concept
notation: 6937
status: valid
status modified: 2019-03-22
accepted date: 2019-03-22
in scheme: Codelist of species

Pelophylax ridibundus
type: Concept
notation: 6938
status: valid
status modified: 2019-03-22
accepted date: 2019-03-22
in scheme: Codelist of species

Speleomantes sarrabusensis
type: Concept
notation: 6939
status: valid
status modified: 2019-03-22
accepted date: 2019-03-22
in scheme: Codelist of species

Sideroxylon canariensis
type: Concept
notation: 6940
status: valid
status modified: 2019-03-22
accepted date: 2019-03-22
in scheme: Codelist of species

Unio ravoisieri
type: Concept
notation: 6942
status: valid
status modified: 2019-03-22
accepted date: 2019-03-22
in scheme: Codelist of species

Zerynthia cassandra
type: Concept
notation: 6943
status: valid
status modified: 2019-03-22
accepted date: 2019-03-22
in scheme: Codelist of species

Calotriton asper
type: Concept
notation: 6944
status: valid
status modified: 2019-03-22
accepted date: 2019-03-22
in scheme: Codelist of species

Pelophylax perezi
type: Concept
notation: 6945
status: valid
status modified: 2019-03-22
accepted date: 2019-03-22
in scheme: Codelist of species

Podarcis liolepis atrata
type: Concept
notation: 6946
status: valid
status modified: 2019-03-22
accepted date: 2019-03-22
in scheme: Codelist of species

Euphrasia nana
type: Concept
notation: 6947
status: valid
status modified: 2019-03-22
accepted date: 2019-03-22
in scheme: Codelist of species

Pontechium maculatum subsp. maculatum
type: Concept
notation: 6948
status: valid
status modified: 2019-03-22
accepted date: 2019-03-22
in scheme: Codelist of species

Arenaria funiculata
type: Concept
notation: 6949
status: valid
status modified: 2019-03-22
accepted date: 2019-03-22
in scheme: Codelist of species

Petagnaea gussonei
type: Concept
notation: 6950
status: valid
status modified: 2019-03-22
accepted date: 2019-03-22
in scheme: Codelist of species

Narcissus assoanus
type: Concept
notation: 6951
status: valid
status modified: 2019-03-22
accepted date: 2019-03-22
in scheme: Codelist of species

Papaver radicatum�subsp.�laestadianum
type: Concept
notation: 6952
status: valid
status modified: 2019-03-22
accepted date: 2019-03-22
in scheme: Codelist of species

Papaver radicatum subsp. radicatum
type: Concept
notation: 6953
status: valid
status modified: 2019-03-22
accepted date: 2019-03-22
in scheme: Codelist of species

Pelophylax kurtmuelleri
type: Concept
notation: 6954
status: valid
status modified: 2019-03-22
accepted date: 2019-03-22
in scheme: Codelist of species

Eokochia saxicola
type: Concept
notation: 6955
status: valid
status modified: 2019-03-22
accepted date: 2019-03-22
in scheme: Codelist of species

Lissotriton italicus
type: Concept
notation: 6956
status: valid
status modified: 2019-03-22
accepted date: 2019-03-22
in scheme: Codelist of species

Mediodactylus kotschyi
type: Concept
notation: 6958
status: valid
status modified: 2019-03-22
accepted date: 2019-03-22
in scheme: Codelist of species

Ovis aries musimon
type: Concept
notation: 6959
status: valid
status modified: 2019-03-22
accepted date: 2019-03-22
in scheme: Codelist of species

Narcissus segurensis
type: Concept
notation: 6960
status: valid
status modified: 2019-03-22
accepted date: 2019-03-22
in scheme: Codelist of species

Bufotes viridis Complex
type: Concept
notation: 6962
status: valid
status modified: 2019-03-22
accepted date: 2019-03-22
in scheme: Codelist of species

Cobitis taenia Complex
type: Concept
notation: 6963
status: valid
status modified: 2019-03-22
accepted date: 2019-03-22
in scheme: Codelist of species

Barbus meridionalis all others
type: Concept
notation: 6964
status: valid
status modified: 2019-03-22
accepted date: 2019-03-22
in scheme: Codelist of species

Cottus gobio all others
type: Concept
notation: 6965
status: valid
status modified: 2019-03-22
accepted date: 2019-03-22
in scheme: Codelist of species

Osmoderma eremita Complex
type: Concept
notation: 6966
status: valid
status modified: 2019-03-22
accepted date: 2019-03-22
in scheme: Codelist of species

Telestes fontinalis
type: Concept
notation: 6967
status: valid
status modified: 2019-03-22
accepted date: 2019-03-22
in scheme: Codelist of species

Telestes miloradi
type: Concept
notation: 6968
status: valid
status modified: 2019-03-22
accepted date: 2019-03-22
in scheme: Codelist of species

Atlantica calathoides
type: Concept
notation: 6969
status: valid
status modified: 2019-03-22
accepted date: 2019-03-22
in scheme: Codelist of species

Atlantica gueriniana
type: Concept
notation: 6970
status: valid
status modified: 2019-03-22
accepted date: 2019-03-22
in scheme: Codelist of species

Hystricella turricula
type: Concept
notation: 6971
status: valid
status modified: 2019-03-22
accepted date: 2019-03-22
in scheme: Codelist of species

Hystricella leacockiana
type: Concept
notation: 6972
status: valid
status modified: 2019-03-22
accepted date: 2019-03-22
in scheme: Codelist of species

Caseolus commixtus
type: Concept
notation: 6973
status: valid
status modified: 2019-03-22
accepted date: 2019-03-22
in scheme: Codelist of species

Caseolus subcalliferus
type: Concept
notation: 6974
status: valid
status modified: 2019-03-22
accepted date: 2019-03-22
in scheme: Codelist of species

Squalius alburnoides
type: Concept
notation: 6975
status: valid
status modified: 2019-03-22
accepted date: 2019-03-22
in scheme: Codelist of species

Pelophylax esculentus
type: Concept
notation: 6976
status: valid
status modified: 2019-03-22
accepted date: 2019-03-22
in scheme: Codelist of species

Lampetra alavariensis
type: Concept
notation: 6977
status: valid
status modified: 2019-03-22
accepted date: 2019-03-22
in scheme: Codelist of species

Lampetra auremensis
type: Concept
notation: 6978
status: valid
status modified: 2019-03-22
accepted date: 2019-03-22
in scheme: Codelist of species

Lampetra lusitanica
type: Concept
notation: 6979
status: valid
status modified: 2019-03-22
accepted date: 2019-03-22
in scheme: Codelist of species

Diplotaxis siifolia subsp. vicentina
type: Concept
notation: 6980
status: valid
status modified: 2019-03-22
accepted date: 2019-03-22
in scheme: Codelist of species

Pelophylax lessonae
type: Concept
notation: 6981
status: valid
status modified: 2019-03-22
accepted date: 2019-03-22
in scheme: Codelist of species

Jasione maritima var. sabularia
type: Concept
notation: 6982
status: valid
status modified: 2019-03-22
accepted date: 2019-03-22
in scheme: Codelist of species

Scrophularia grandiflora
type: Concept
notation: 6983
status: valid
status modified: 2019-03-22
accepted date: 2019-03-22
in scheme: Codelist of species

Caropsis verticillato-inundata
type: Concept
notation: 6984
status: valid
status modified: 2019-03-22
accepted date: 2019-03-22
in scheme: Codelist of species

Vandenboschia speciosa
type: Concept
notation: 6985
status: valid
status modified: 2019-03-22
accepted date: 2019-03-22
in scheme: Codelist of species

Sideroxylon mirmulans
type: Concept
notation: 6986
status: valid
status modified: 2019-03-22
accepted date: 2019-03-22
in scheme: Codelist of species

Angelica lignescens
type: Concept
notation: 6987
status: valid
status modified: 2019-03-22
accepted date: 2019-03-22
in scheme: Codelist of species

Microcondylaea bonellii
type: Concept
notation: 6988
status: valid
status modified: 2019-03-22
accepted date: 2019-03-22
in scheme: Codelist of species

Aquilegia reuteri
type: Concept
notation: 6989
status: valid
status modified: 2019-03-22
accepted date: 2019-03-22
in scheme: Codelist of species

Pelophylax bedriagae
type: Concept
notation: 6990
status: valid
status modified: 2019-03-22
accepted date: 2019-03-22
in scheme: Codelist of species

Pelophylax cretensis
type: Concept
notation: 6991
status: valid
status modified: 2019-03-22
accepted date: 2019-03-22
in scheme: Codelist of species

Pelophylax cerigensis
type: Concept
notation: 6992
status: valid
status modified: 2019-03-22
accepted date: 2019-03-22
in scheme: Codelist of species

Tripolium sorrentinoi
type: Concept
notation: 6994
status: valid
status modified: 2019-03-22
accepted date: 2019-03-22
in scheme: Codelist of species

Dactylorhiza kalopissii subsp. kalopissii
type: Concept
notation: 6996
status: valid
status modified: 2019-03-22
accepted date: 2019-03-22
in scheme: Codelist of species

Bufotes viridis
type: Concept
notation: 6997
status: valid
status modified: 2019-03-22
accepted date: 2019-03-22
in scheme: Codelist of species

Hormathophylla pyrenaica
type: Concept
notation: 6998
status: valid
status modified: 2019-03-22
accepted date: 2019-03-22
in scheme: Codelist of species

Clinopodium taygeteum
type: Concept
notation: 6999
status: valid
status modified: 2019-03-22
accepted date: 2019-03-22
in scheme: Codelist of species

Erica azorica
type: Concept
notation: 7000
status: valid
status modified: 2019-03-22
accepted date: 2019-03-22
in scheme: Codelist of species

Prunus azorica
type: Concept
notation: 7001
status: valid
status modified: 2019-03-22
accepted date: 2019-03-22
in scheme: Codelist of species

Ophrys argolica subsp. argolica
type: Concept
notation: 7002
status: valid
status modified: 2019-03-22
accepted date: 2019-03-22
in scheme: Codelist of species

Centaurea lancifolia
type: Concept
notation: 7003
status: valid
status modified: 2019-03-22
accepted date: 2019-03-22
in scheme: Codelist of species

Ionopsidium savianum
type: Concept
notation: 7004
status: valid
status modified: 2019-03-22
accepted date: 2019-03-22
in scheme: Codelist of species

Dolichophis cypriensis
type: Concept
notation: 7007
status: valid
status modified: 2019-03-22
accepted date: 2019-03-22
in scheme: Codelist of species

Ophrys kotschyi subsp. kotschyi
type: Concept
notation: 7009
status: valid
status modified: 2019-03-22
accepted date: 2019-03-22
in scheme: Codelist of species

Primula polliniana
type: Concept
notation: 7010
status: valid
status modified: 2019-03-22
accepted date: 2019-03-22
in scheme: Codelist of species

Maculinea arion
type: Concept
notation: 1058
status: valid
status modified: 2019-03-22
accepted date: 2019-03-22
in scheme: Codelist of species

Maculinea teleius
type: Concept
notation: 1059
status: valid
status modified: 2019-03-22
accepted date: 2019-03-22
in scheme: Codelist of species

Maculinea nausithous
type: Concept
notation: 1061
status: valid
status modified: 2019-03-22
accepted date: 2019-03-22
in scheme: Codelist of species

Hemorrhois hippocrepis
type: Concept
notation: 5668
status: valid
status modified: 2019-03-22
accepted date: 2019-03-22
in scheme: Codelist of species

Hierophis viridiflavus
type: Concept
notation: 5670
status: valid
status modified: 2019-03-22
accepted date: 2019-03-22
in scheme: Codelist of species

Discus defloratus
type: Concept
notation: 1022
status: valid
status modified: 2019-03-22
accepted date: 2019-03-22
in scheme: Codelist of species

Cobitis taenia
type: Concept
notation: 1149
status: valid
status modified: 2019-03-22
accepted date: 2019-03-22
in scheme: Codelist of species

Cottus gobio
type: Concept
notation: 1163
status: valid
status modified: 2019-03-22
accepted date: 2019-03-22
in scheme: Codelist of species

Lycopodium spp.
type: Concept
notation: 1413
status: valid
status modified: 2019-03-22
accepted date: 2019-03-22
in scheme: Codelist of species

Salicornia veneta
type: Concept
notation: 1443
status: valid
status modified: 2019-03-22
accepted date: 2019-03-22
in scheme: Codelist of species

Murbeckiella pinnatifida subsp. herminii
type: Concept
notation: 1504
status: valid
status modified: 2019-03-22
accepted date: 2019-03-22
in scheme: Codelist of species

Reseda decursiva
type: Concept
notation: 1515
status: valid
status modified: 2019-03-22
accepted date: 2019-03-22
in scheme: Codelist of species

Limonium lanceolatum
type: Concept
notation: 1639
status: valid
status modified: 2019-03-22
accepted date: 2019-03-22
in scheme: Codelist of species

Centaurium rigualii
type: Concept
notation: 1655
status: valid
status modified: 2019-03-22
accepted date: 2019-03-22
in scheme: Codelist of species

Colchicum cousturieri
type: Concept
notation: 1835
status: valid
status modified: 2019-03-22
accepted date: 2019-03-22
in scheme: Codelist of species

Semele maderensis
type: Concept
notation: 1853
status: valid
status modified: 2019-03-22
accepted date: 2019-03-22
in scheme: Codelist of species

Coregonus lavaretus
type: Concept
notation: 2494
status: valid
status modified: 2019-03-22
accepted date: 2019-03-22
in scheme: Codelist of species

Coregonus pidschian
type: Concept
notation: 2496
status: valid
status modified: 2019-03-22
accepted date: 2019-03-22
in scheme: Codelist of species

Coregonus arenicolus
type: Concept
notation: 5050
status: valid
status modified: 2019-03-22
accepted date: 2019-03-22
in scheme: Codelist of species

Coregonus atterensis
type: Concept
notation: 5051
status: valid
status modified: 2019-03-22
accepted date: 2019-03-22
in scheme: Codelist of species

Coregonus bavaricus
type: Concept
notation: 5054
status: valid
status modified: 2019-03-22
accepted date: 2019-03-22
in scheme: Codelist of species

Coregonus clupeoides
type: Concept
notation: 5057
status: valid
status modified: 2019-03-22
accepted date: 2019-03-22
in scheme: Codelist of species

Coregonus danneri
type: Concept
notation: 5058
status: valid
status modified: 2019-03-22
accepted date: 2019-03-22
in scheme: Codelist of species

Coregonus hoferi
type: Concept
notation: 5063
status: valid
status modified: 2019-03-22
accepted date: 2019-03-22
in scheme: Codelist of species

Coregonus macrophthalmus
type: Concept
notation: 5067
status: valid
status modified: 2019-03-22
accepted date: 2019-03-22
in scheme: Codelist of species

Coregonus maraena
type: Concept
notation: 5068
status: valid
status modified: 2019-03-22
accepted date: 2019-03-22
in scheme: Codelist of species

Coregonus maxillaris
type: Concept
notation: 5070
status: valid
status modified: 2019-03-22
accepted date: 2019-03-22
in scheme: Codelist of species

Coregonus megalops
type: Concept
notation: 5071
status: valid
status modified: 2019-03-22
accepted date: 2019-03-22
in scheme: Codelist of species

Coregonus nilssoni
type: Concept
notation: 5073
status: valid
status modified: 2019-03-22
accepted date: 2019-03-22
in scheme: Codelist of species

Coregonus pallasii
type: Concept
notation: 5074
status: valid
status modified: 2019-03-22
accepted date: 2019-03-22
in scheme: Codelist of species

Coregonus pennantii
type: Concept
notation: 5075
status: valid
status modified: 2019-03-22
accepted date: 2019-03-22
in scheme: Codelist of species

Coregonus renke
type: Concept
notation: 5077
status: valid
status modified: 2019-03-22
accepted date: 2019-03-22
in scheme: Codelist of species

Coregonus stigmaticus
type: Concept
notation: 5079
status: valid
status modified: 2019-03-22
accepted date: 2019-03-22
in scheme: Codelist of species

Coregonus wartmanni
type: Concept
notation: 5083
status: valid
status modified: 2019-03-22
accepted date: 2019-03-22
in scheme: Codelist of species

Coregonus widegreni
type: Concept
notation: 5084
status: valid
status modified: 2019-03-22
accepted date: 2019-03-22
in scheme: Codelist of species

Lycopodium annotinum
type: Concept
notation: 5104
status: valid
status modified: 2019-03-22
accepted date: 2019-03-22
in scheme: Codelist of species

Lycopodium clavatum
type: Concept
notation: 5105
status: valid
status modified: 2019-03-22
accepted date: 2019-03-22
in scheme: Codelist of species

Lycopodium zeilleri
type: Concept
notation: 5107
status: valid
status modified: 2019-03-22
accepted date: 2019-03-22
in scheme: Codelist of species

Diphasiastrum alpinum
type: Concept
notation: 5183
status: valid
status modified: 2019-03-22
accepted date: 2019-03-22
in scheme: Codelist of species

Diphasiastrum complanatum
type: Concept
notation: 5184
status: valid
status modified: 2019-03-22
accepted date: 2019-03-22
in scheme: Codelist of species

Diphasiastrum madeirense
type: Concept
notation: 5185
status: valid
status modified: 2019-03-22
accepted date: 2019-03-22
in scheme: Codelist of species

Diphasiastrum oellgaardii
type: Concept
notation: 5186
status: valid
status modified: 2019-03-22
accepted date: 2019-03-22
in scheme: Codelist of species

Diphasiastrum tristachyum
type: Concept
notation: 5187
status: valid
status modified: 2019-03-22
accepted date: 2019-03-22
in scheme: Codelist of species

Huperzia dentata
type: Concept
notation: 5188
status: valid
status modified: 2019-03-22
accepted date: 2019-03-22
in scheme: Codelist of species

Huperzia selago
type: Concept
notation: 5189
status: valid
status modified: 2019-03-22
accepted date: 2019-03-22
in scheme: Codelist of species

Lycopodiella cernua
type: Concept
notation: 5190
status: valid
status modified: 2019-03-22
accepted date: 2019-03-22
in scheme: Codelist of species

Lycopodiella inundata
type: Concept
notation: 5191
status: valid
status modified: 2019-03-22
accepted date: 2019-03-22
in scheme: Codelist of species

Diphasiastrum issleri
type: Concept
notation: 5198
status: valid
status modified: 2019-03-22
accepted date: 2019-03-22
in scheme: Codelist of species

Huperzia suberecta
type: Concept
notation: 5199
status: valid
status modified: 2019-03-22
accepted date: 2019-03-22
in scheme: Codelist of species

Sphagnum angustifolium
type: Concept
notation: 5200
status: valid
status modified: 2019-03-22
accepted date: 2019-03-22
in scheme: Codelist of species

Sphagnum cuspidatum
type: Concept
notation: 5201
status: valid
status modified: 2019-03-22
accepted date: 2019-03-22
in scheme: Codelist of species

Cladonia arbuscula
type: Concept
notation: 5203
status: valid
status modified: 2019-03-22
accepted date: 2019-03-22
in scheme: Codelist of species

Cladonia ciliata
type: Concept
notation: 5204
status: valid
status modified: 2019-03-22
accepted date: 2019-03-22
in scheme: Codelist of species

Cladonia mediterranea
type: Concept
notation: 5205
status: valid
status modified: 2019-03-22
accepted date: 2019-03-22
in scheme: Codelist of species

Cladonia mitis
type: Concept
notation: 5206
status: valid
status modified: 2019-03-22
accepted date: 2019-03-22
in scheme: Codelist of species

Cladonia portentosa
type: Concept
notation: 5207
status: valid
status modified: 2019-03-22
accepted date: 2019-03-22
in scheme: Codelist of species

Cladonia rangiferina
type: Concept
notation: 5208
status: valid
status modified: 2019-03-22
accepted date: 2019-03-22
in scheme: Codelist of species

Cladonia stellaris
type: Concept
notation: 5209
status: valid
status modified: 2019-03-22
accepted date: 2019-03-22
in scheme: Codelist of species

Cladonia stygia
type: Concept
notation: 5210
status: valid
status modified: 2019-03-22
accepted date: 2019-03-22
in scheme: Codelist of species

Sphagnum affine
type: Concept
notation: 5211
status: valid
status modified: 2019-03-22
accepted date: 2019-03-22
in scheme: Codelist of species

Sphagnum angermanicum
type: Concept
notation: 5212
status: valid
status modified: 2019-03-22
accepted date: 2019-03-22
in scheme: Codelist of species

Sphagnum austinii
type: Concept
notation: 5213
status: valid
status modified: 2019-03-22
accepted date: 2019-03-22
in scheme: Codelist of species

Sphagnum balticum
type: Concept
notation: 5214
status: valid
status modified: 2019-03-22
accepted date: 2019-03-22
in scheme: Codelist of species

Sphagnum capillifolium
type: Concept
notation: 5215
status: valid
status modified: 2019-03-22
accepted date: 2019-03-22
in scheme: Codelist of species

Sphagnum centrale
type: Concept
notation: 5216
status: valid
status modified: 2019-03-22
accepted date: 2019-03-22
in scheme: Codelist of species

Sphagnum compactum
type: Concept
notation: 5217
status: valid
status modified: 2019-03-22
accepted date: 2019-03-22
in scheme: Codelist of species

Sphagnum contortum
type: Concept
notation: 5218
status: valid
status modified: 2019-03-22
accepted date: 2019-03-22
in scheme: Codelist of species

Sphagnum fallax
type: Concept
notation: 5220
status: valid
status modified: 2019-03-22
accepted date: 2019-03-22
in scheme: Codelist of species

Sphagnum fimbriatum
type: Concept
notation: 5221
status: valid
status modified: 2019-03-22
accepted date: 2019-03-22
in scheme: Codelist of species

Sphagnum flexuosum
type: Concept
notation: 5222
status: valid
status modified: 2019-03-22
accepted date: 2019-03-22
in scheme: Codelist of species

Sphagnum fuscum
type: Concept
notation: 5223
status: valid
status modified: 2019-03-22
accepted date: 2019-03-22
in scheme: Codelist of species

Sphagnum girgensohnii
type: Concept
notation: 5224
status: valid
status modified: 2019-03-22
accepted date: 2019-03-22
in scheme: Codelist of species

Sphagnum lindbergii
type: Concept
notation: 5225
status: valid
status modified: 2019-03-22
accepted date: 2019-03-22
in scheme: Codelist of species

Sphagnum magellanicum
type: Concept
notation: 5226
status: valid
status modified: 2019-03-22
accepted date: 2019-03-22
in scheme: Codelist of species

Sphagnum majus
type: Concept
notation: 5227
status: valid
status modified: 2019-03-22
accepted date: 2019-03-22
in scheme: Codelist of species

Sphagnum molle
type: Concept
notation: 5228
status: valid
status modified: 2019-03-22
accepted date: 2019-03-22
in scheme: Codelist of species

Sphagnum obtusum
type: Concept
notation: 5229
status: valid
status modified: 2019-03-22
accepted date: 2019-03-22
in scheme: Codelist of species

Sphagnum palustre
type: Concept
notation: 5230
status: valid
status modified: 2019-03-22
accepted date: 2019-03-22
in scheme: Codelist of species

Sphagnum papillosum
type: Concept
notation: 5231
status: valid
status modified: 2019-03-22
accepted date: 2019-03-22
in scheme: Codelist of species

Sphagnum platyphyllum
type: Concept
notation: 5232
status: valid
status modified: 2019-03-22
accepted date: 2019-03-22
in scheme: Codelist of species

Sphagnum pulchrum
type: Concept
notation: 5233
status: valid
status modified: 2019-03-22
accepted date: 2019-03-22
in scheme: Codelist of species

Sphagnum quinquefarium
type: Concept
notation: 5234
status: valid
status modified: 2019-03-22
accepted date: 2019-03-22
in scheme: Codelist of species

Sphagnum riparium
type: Concept
notation: 5235
status: valid
status modified: 2019-03-22
accepted date: 2019-03-22
in scheme: Codelist of species

Sphagnum rubellum
type: Concept
notation: 5236
status: valid
status modified: 2019-03-22
accepted date: 2019-03-22
in scheme: Codelist of species

Sphagnum russowii
type: Concept
notation: 5237
status: valid
status modified: 2019-03-22
accepted date: 2019-03-22
in scheme: Codelist of species

Sphagnum squarrosum
type: Concept
notation: 5238
status: valid
status modified: 2019-03-22
accepted date: 2019-03-22
in scheme: Codelist of species

Sphagnum subnitens
type: Concept
notation: 5239
status: valid
status modified: 2019-03-22
accepted date: 2019-03-22
in scheme: Codelist of species

Sphagnum subsecundum
type: Concept
notation: 5240
status: valid
status modified: 2019-03-22
accepted date: 2019-03-22
in scheme: Codelist of species

Sphagnum tenellum
type: Concept
notation: 5241
status: valid
status modified: 2019-03-22
accepted date: 2019-03-22
in scheme: Codelist of species

Sphagnum teres
type: Concept
notation: 5242
status: valid
status modified: 2019-03-22
accepted date: 2019-03-22
in scheme: Codelist of species

Sphagnum warnstorfii
type: Concept
notation: 5243
status: valid
status modified: 2019-03-22
accepted date: 2019-03-22
in scheme: Codelist of species

Sphagnum wulfianum
type: Concept
notation: 5244
status: valid
status modified: 2019-03-22
accepted date: 2019-03-22
in scheme: Codelist of species

Barbus petenyi
type: Concept
notation: 5266
status: valid
status modified: 2019-03-22
accepted date: 2019-03-22
in scheme: Codelist of species

Coregonus holsatus
type: Concept
notation: 5273
status: valid
status modified: 2019-03-22
accepted date: 2019-03-22
in scheme: Codelist of species

Myotis escalerai
type: Concept
notation: 5278
status: valid
status modified: 2019-03-22
accepted date: 2019-03-22
in scheme: Codelist of species

Cobitis elongatoides
type: Concept
notation: 5297
status: valid
status modified: 2019-03-22
accepted date: 2019-03-22
in scheme: Codelist of species

Cobitis tanaitica
type: Concept
notation: 5298
status: valid
status modified: 2019-03-22
accepted date: 2019-03-22
in scheme: Codelist of species

Cobitis strumicae
type: Concept
notation: 5299
status: valid
status modified: 2019-03-22
accepted date: 2019-03-22
in scheme: Codelist of species

Cobitis pontica
type: Concept
notation: 5300
status: valid
status modified: 2019-03-22
accepted date: 2019-03-22
in scheme: Codelist of species

Cottus perifretum
type: Concept
notation: 5315
status: valid
status modified: 2019-03-22
accepted date: 2019-03-22
in scheme: Codelist of species

Cottus koshewnikowi
type: Concept
notation: 5319
status: valid
status modified: 2019-03-22
accepted date: 2019-03-22
in scheme: Codelist of species

Cottus microstomus
type: Concept
notation: 5320
status: valid
status modified: 2019-03-22
accepted date: 2019-03-22
in scheme: Codelist of species

Cottus haemusi
type: Concept
notation: 5322
status: valid
status modified: 2019-03-22
accepted date: 2019-03-22
in scheme: Codelist of species

Cottus metae
type: Concept
notation: 5324
status: valid
status modified: 2019-03-22
accepted date: 2019-03-22
in scheme: Codelist of species

Cottus rhenanus
type: Concept
notation: 5325
status: valid
status modified: 2019-03-22
accepted date: 2019-03-22
in scheme: Codelist of species

Sphagnum subfulvum
type: Concept
notation: 5383
status: valid
status modified: 2019-03-22
accepted date: 2019-03-22
in scheme: Codelist of species

Sphagnum tundrae
type: Concept
notation: 5385
status: valid
status modified: 2019-03-22
accepted date: 2019-03-22
in scheme: Codelist of species

Sphagnum troendelagicum
type: Concept
notation: 5386
status: valid
status modified: 2019-03-22
accepted date: 2019-03-22
in scheme: Codelist of species

Sphagnum strictum
type: Concept
notation: 5388
status: valid
status modified: 2019-03-22
accepted date: 2019-03-22
in scheme: Codelist of species

Sphagnum skyense
type: Concept
notation: 5390
status: valid
status modified: 2019-03-22
accepted date: 2019-03-22
in scheme: Codelist of species

Sphagnum rubiginosum
type: Concept
notation: 5391
status: valid
status modified: 2019-03-22
accepted date: 2019-03-22
in scheme: Codelist of species

Sphagnum recurvum
type: Concept
notation: 5392
status: valid
status modified: 2019-03-22
accepted date: 2019-03-22
in scheme: Codelist of species

Sphagnum olafii
type: Concept
notation: 5396
status: valid
status modified: 2019-03-22
accepted date: 2019-03-22
in scheme: Codelist of species

Sphagnum annulatum
type: Concept
notation: 5398
status: valid
status modified: 2019-03-22
accepted date: 2019-03-22
in scheme: Codelist of species

Sphagnum nitidulum
type: Concept
notation: 5399
status: valid
status modified: 2019-03-22
accepted date: 2019-03-22
in scheme: Codelist of species

Sphagnum aongstroemii
type: Concept
notation: 5401
status: valid
status modified: 2019-03-22
accepted date: 2019-03-22
in scheme: Codelist of species

Sphagnum arcticum
type: Concept
notation: 5402
status: valid
status modified: 2019-03-22
accepted date: 2019-03-22
in scheme: Codelist of species

Sphagnum jensenii
type: Concept
notation: 5406
status: valid
status modified: 2019-03-22
accepted date: 2019-03-22
in scheme: Codelist of species

Sphagnum lenense
type: Concept
notation: 5407
status: valid
status modified: 2019-03-22
accepted date: 2019-03-22
in scheme: Codelist of species

Sphagnum auriculatum
type: Concept
notation: 5409
status: valid
status modified: 2019-03-22
accepted date: 2019-03-22
in scheme: Codelist of species

Sphagnum fimbriatum subsp. concinnum
type: Concept
notation: 5410
status: valid
status modified: 2019-03-22
accepted date: 2019-03-22
in scheme: Codelist of species

Sphagnum fimbriatum subsp. fimbriatum
type: Concept
notation: 5411
status: valid
status modified: 2019-03-22
accepted date: 2019-03-22
in scheme: Codelist of species

Sphagnum majus subsp. majus
type: Concept
notation: 5412
status: valid
status modified: 2019-03-22
accepted date: 2019-03-22
in scheme: Codelist of species

Sphagnum majus subsp. norvegicum
type: Concept
notation: 5413
status: valid
status modified: 2019-03-22
accepted date: 2019-03-22
in scheme: Codelist of species

Sphagnum subfulvum subsp. purpureum
type: Concept
notation: 5414
status: valid
status modified: 2019-03-22
accepted date: 2019-03-22
in scheme: Codelist of species

Sphagnum subfulvum subsp. subfulvum
type: Concept
notation: 5415
status: valid
status modified: 2019-03-22
accepted date: 2019-03-22
in scheme: Codelist of species

Sphagnum subnitens subsp. ferrugineum
type: Concept
notation: 5416
status: valid
status modified: 2019-03-22
accepted date: 2019-03-22
in scheme: Codelist of species

Sphagnum subnitens subsp. subnitens
type: Concept
notation: 5417
status: valid
status modified: 2019-03-22
accepted date: 2019-03-22
in scheme: Codelist of species

Cladonia conspicua
type: Concept
notation: 5424
status: valid
status modified: 2019-03-22
accepted date: 2019-03-22
in scheme: Codelist of species

Diphasiastrum zeilleri
type: Concept
notation: 6352
status: valid
status modified: 2019-03-22
accepted date: 2019-03-22
in scheme: Codelist of species

Bufotes balearicus
type: Concept
notation: 6918
status: valid
status modified: 2019-03-22
accepted date: 2019-03-22
in scheme: Codelist of species

Salamandra atra pasubiensis
type: Concept
notation: 6957
status: valid
status modified: 2019-03-22
accepted date: 2019-03-22
in scheme: Codelist of species

Sphagnum inundatum
type: Concept
notation: 7011
status: valid
status modified: 2019-03-22
accepted date: 2019-03-22
in scheme: Codelist of species

Barbus biharicus
type: Concept
notation: 7013
status: valid
status modified: 2019-03-22
accepted date: 2019-03-22
in scheme: Codelist of species

Conservation measures
type: ConceptScheme
notation: measures
is part of: Habitats directive Art. 17 reporting in year 2018
registration status: Public draft
user modified: roschsab
date modified: 2018-05-14 15:56:06.0
vocabulary type: Common
is numeric concept identifiers: false
is notations equal identifiers: false

Prevent conversion of natural and semi-natural habitats, and habitats of species into agricultural land
type: Concept
notation: CA01
definition: Preventing the conversion of natural and semi-natural habitats, and habitats of species targeted by the nature directives, into agricultural land for production (arable or pasture) or into more intensively farmed land. Includes, for example, the conversion of grasslands or wetlands into arable land.
status: valid
status modified: 2018-05-14
accepted date: 2018-05-14
in scheme: Conservation measures

Restore small landscape features on agricultural land
type: Concept
notation: CA02
definition: The restoration of small landscape features present on agricultural land that are important to wild fauna and flora for migration, dispersal, genetic exchange or as breeding/feeding habitats. Such features can be hedges, stone walls, ponds, small woods, ecotone zones, edges around fields, ditches, natural pathways.
status: valid
status modified: 2018-05-14
accepted date: 2018-05-14
in scheme: Conservation measures

Maintain existing extensive agricultural practices and agricultural landscape features
type: Concept
notation: CA03
definition: Maintaining extensive agricultural management practices such as extensive grazing/mowing or traditional burning, and protecting small landscape features or elements (e.g. ecotone zones, hedges, stone walls, ponds small woods, edges around fields, ditches, ground paths). This also includes 'wildlife-friendly' management of hedges.
status: valid
status modified: 2018-05-14
accepted date: 2018-05-14
in scheme: Conservation measures

Reinstate appropriate agricultural practices to address abandonment, including mowing, grazing, burning or equivalent measures
type: Concept
notation: CA04
definition: Reinstating agricultural practices to stop or slow down natural succession caused by the abandonment of agricultural land and/or insufficient land use. These practices can be of an agricultural nature, such as the re-introduction of grazing, or a substitute of those (e.g. use machinery to keep open habitats). This can also include conservation grazing (i.e. ecological management using agricultural practices such as grazing by domestic animals � goats, sheep, cattle, horses � without a farming purpose).
status: valid
status modified: 2018-05-14
accepted date: 2018-05-14
in scheme: Conservation measures

Adapt mowing, grazing and other equivalent agricultural activities
type: Concept
notation: CA05
definition: Adapting the frequency, methods used and/or the timing of mowing/cutting of grasslands or of grazing by livestock in order to maintain/restore habitats or to avoid damage to species (e.g. nesting birds). This also includes the adaption and management of other equivalent activities (e.g. burning). Includes, for example, converting from intensively managed grassland to more extensive or reducing trampling by livestock.
status: valid
status modified: 2018-05-14
accepted date: 2018-05-14
in scheme: Conservation measures

Stop mowing, grazing and other equivalent agricultural activities
type: Concept
notation: CA06
definition: Stopping (or avoiding) the mowing or cutting of grasslands or grazing by livestock in order to restore habitats or to avoid damage to species (e.g. nesting birds); stopping (or avoiding) other equivalent activities.
status: valid
status modified: 2018-05-14
accepted date: 2018-05-14
in scheme: Conservation measures

Recreate Annex I agricultural habitats
type: Concept
notation: CA07
definition: Land previously used for either agriculture (e.g. arable land), forestry (e.g. popular plantation) or another use being (re)created/restored as an Annex I agricultural habitat type. Includes, for example, the recreation of an Annex I grassland from a forest plantation. This is a process that could take a long time to fully restore the habitats structure and functions.
status: valid
status modified: 2018-05-14
accepted date: 2018-05-14
in scheme: Conservation measures

Adapt soil management practices in agriculture
type: Concept
notation: CA08
definition: Adaptating soil management practices (including tillage) to minimize or prevent loss of soil and its biodiversity.
status: valid
status modified: 2018-05-14
accepted date: 2018-05-14
in scheme: Conservation measures

Manage the use of natural fertilisers and chemicals in agricultural (plant and animal) production
type: Concept
notation: CA09
definition: Managing (reducing or eliminating) the use of: - fertilisers (e.g. mineral, manure, sludge) - pesticides, fungicides, seed coatings, herbicides, growth retardants, hormones and other chemicals used in plant production - rodenticides and other pest control products -wormers and other veterinary products used in animal production (e.g. diclofenac and/or other similar veterinary products). Alos includes developing and maintaining the conservation headlands or field margins.
status: valid
status modified: 2018-05-14
accepted date: 2018-05-14
in scheme: Conservation measures

Reduce/eliminate point pollution to surface or ground waters from agricultural activities
type: Concept
notation: CA10
definition: Reducing or eliminating point source pollution from agricultural activities to surface and ground waters (e.g. due to large scale animal breeding or storage of farmyard waste and/or checmical products).
status: valid
status modified: 2018-05-14
accepted date: 2018-05-14
in scheme: Conservation measures

Reduce diffuse pollution to surface or ground waters from agricultural activities
type: Concept
notation: CA11
definition: Reducing diffuse pollution to surface and ground waters due to agricultural activities. This can also include developing and maintaining riparian buffer strips along water courses as a (spatially restricted) way of reducing 'diffuse' pollution to surface waters.
status: valid
status modified: 2018-05-14
accepted date: 2018-05-14
in scheme: Conservation measures

Reduce/eliminate air pollution from agricultural activities
type: Concept
notation: CA12
definition: Reducing or eliminating air pollution due to agricultural activities.
status: valid
status modified: 2018-05-14
accepted date: 2018-05-14
in scheme: Conservation measures

Reduce/eliminate marine pollution from agricultural activities
type: Concept
notation: CA13
definition: Reducing or eliminating marine pollution due to agricultural activities.
status: valid
status modified: 2018-05-14
accepted date: 2018-05-14
in scheme: Conservation measures

Reduce/eliminate soil pollution from agricultural activities
type: Concept
notation: CA14
definition: Reducing or eliminating soil pollution due to agricultural activities.
status: valid
status modified: 2018-05-14
accepted date: 2018-05-14
in scheme: Conservation measures

Manage drainage and irrigation operations and infrastructures in agriculture
type: Concept
notation: CA15
definition: Managing drainage and irrigation operations and infrastructures (such as surface and groundwater abstraction, construction and operation of dams or altering of hydrological flow of rivers) as well as managing or restoring the hydrological regime of drained agricultural areas (e.g. restoration of hydrological regimes of drained peatlands, hydrologically altered wetlands and freshwater habitats in agricultural areas). The management of drainage and irrigation can include the possible cessation of these activities. This measure also includes restoring other freshwater habitats or wetlands impacted by changes of hydrological functioning through activities such as building dams or surface water abstraction for agriculture.
status: valid
status modified: 2018-05-14
accepted date: 2018-05-14
in scheme: Conservation measures

Other measures related to agricultural practices
type: Concept
notation: CA16
definition: Other measures related to agricultural practices or agriculture-related habitats not covered by the other CA measures e.g. adapting the methods and/or timing of harvesting to avoid disturbance of nesting birds.
status: valid
status modified: 2018-05-14
accepted date: 2018-05-14
in scheme: Conservation measures

Prevent conversion of (semi-) natural habitats into forests and of (semi-)natural forests into intensive forest plantation
type: Concept
notation: CB01
definition: Preventing the conversion of natural and semi-natural habitats, as well as habitats of species targeted by the nature directives, into forest (e.g. afforestation), preventing the conversion of natural and semi-natural forests into intensive forest plantations or monocultures.
status: valid
status modified: 2018-05-14
accepted date: 2018-05-14
in scheme: Conservation measures

Maintain existing traditional forest management and exploitation practices
type: Concept
notation: CB02
definition: Maintaining existing (traditional or extensive) forest management and exploitation practices to preserve habitats or habitats for species or to avoid species disturbance. This includes maintaining traditional or extensive management, for example, to secure or develop old tree stocks, the old-growth and natural decay stages of forests (that are clearly beyond regular harvesting age), coppices, pollarding or secondary forest habitats (such as oak-hornbeam forest on potential beech habitats); this also includes maintaining the measures to favour the opening of closed woodlands, to preserve or restore habitat continuity, to manage species composition, or to retain habitat tree groups. Includes also keeping aside wilderness areas. .
status: valid
status modified: 2018-05-14
accepted date: 2018-05-14
in scheme: Conservation measures

Reinstate forest management and exploitation practices
type: Concept
notation: CB03
definition: Reinstating (traditional or extensive) forest management and exploitation practices to preserve or to restore habitats or habitats for species targeted by the nature directives impacted by abandonment of traditional forestry use.
status: valid
status modified: 2018-05-14
accepted date: 2018-05-14
in scheme: Conservation measures

Adapt/manage reforestation and forest regeneration
type: Concept
notation: CB04
definition: Adaptating or managing reforestation to restore habitats and habitats of species including for example the conversion of clear-fell plantations to long-term native woodland or the adaptation of reforestation techniques such as using natural regeneration or fire.
status: valid
status modified: 2018-05-14
accepted date: 2018-05-14
in scheme: Conservation measures

Adapt/change forest management and exploitation practices
type: Concept
notation: CB05
definition: Adapting or changing forest management and exploitation practices to preserve or to restore habitats/habitats of species targeted by the nature directives or to avoid species disturbance. This can involve adapting and changing management practices in order to secure or develop old stocks of trees, to maintain coppices, to retain dead and dying trees and stumps, to favour opening of closed woodlands, to preserve or restore habitat continuity, to manage species composition, to prevent forest wildfires; but also adapting the time and duration of forestry activities to avoid disturbance of species. However this excludes the management of drainage and irrigation, which are included under CB14.
status: valid
status modified: 2018-05-14
accepted date: 2018-05-14
in scheme: Conservation measures

Stop forest management and exploitation practices
type: Concept
notation: CB06
definition: Stopping (or avoiding) forest management and exploitation practices to preserve or to restore habitats or habitats for species targeted by the nature directives, or to avoid species disturbance. Includes the application of non-intervention management.
status: valid
status modified: 2018-05-14
accepted date: 2018-05-14
in scheme: Conservation measures

Combat illegal logging
type: Concept
notation: CB07
definition: Taking measures to stop and prevent illegal logging and pressures from this illegal activity.
status: valid
status modified: 2018-05-14
accepted date: 2018-05-14
in scheme: Conservation measures

Restoration of Annex I forest habitats
type: Concept
notation: CB08
definition: Land previously used for agriculture (e.g. arable land), for industrial forestry plantations (e.g. poplar or eucalyptus plantations), or other land cover being restored or (re)created as an Annex I forest habitat type. This could be, for example, recreating an Annex I alluvial forest from farmland. It could take decades to fully restore the habitats structure and functions and it can includes active restoration (seed sowing or planting new vegetation) or passive allowing natural succession.
status: valid
status modified: 2018-05-14
accepted date: 2018-05-14
in scheme: Conservation measures

Manage the use of chemicals for fertilisation, liming and pest control in forestry
type: Concept
notation: CB09
definition: Managing(reducing or eliminating) of the use of: -pesticides, herbicides and pest control products - fertilisers (mineral, manure, sludge) - liming.
status: valid
status modified: 2018-05-14
accepted date: 2018-05-14
in scheme: Conservation measures

Reduce diffuse pollution to surface or ground waters from forestry activities
type: Concept
notation: CB10
definition: Reducing diffuse pollution to surface and ground waters due to forestry activities.
status: valid
status modified: 2018-05-14
accepted date: 2018-05-14
in scheme: Conservation measures

Reduce air pollution from forestry activities
type: Concept
notation: CB11
definition: Reducing air pollution due to forestry activities.
status: valid
status modified: 2018-05-14
accepted date: 2018-05-14
in scheme: Conservation measures

Reduce marine pollution from forestry activities
type: Concept
notation: CB12
definition: Reducing marine pollution due to forestry activities.
status: valid
status modified: 2018-05-14
accepted date: 2018-05-14
in scheme: Conservation measures

Reduce soil pollution from forestry activities
type: Concept
notation: CB13
definition: Reducing soil pollution due to forestry activities.
status: valid
status modified: 2018-05-14
accepted date: 2018-05-14
in scheme: Conservation measures

Manage drainage and irrigation operations and infrastructures
type: Concept
notation: CB14
definition: Managing drainage and irrigation operations and infrastructure (including surface and groundwater abstraction, construction and operation of dams and altering of hydrological flow of rivers) as well as managing or restoring the hydrological regime of drained forest areas. The management of drainage and irrigation can include the possible cessation of these activities. This measure also includes restoring freshwater habitats impacted by changes of hydrological functioning due to drainage for forestry.
status: valid
status modified: 2018-05-14
accepted date: 2018-05-14
in scheme: Conservation measures

Other measures related to forestry practices
type: Concept
notation: CB15
definition: Other measures related to forestry practices or forest habitats not covered by the other CB measures.
status: valid
status modified: 2018-05-14
accepted date: 2018-05-14
in scheme: Conservation measures

Adapt/manage extraction of non-energy resources
type: Concept
notation: CC01
definition: Adapting and managing (including stopping and avoiding) the extraction of minerals and non-energy resources (e.g. sand, gravel, loam, clay and peat extraction for plant compost or other horticultural purposes) as well as adapting and managing the extaction of salt. Alos includes reducing the impact from geotechnical surveying and other preparatory work for extraction.
status: valid
status modified: 2018-05-14
accepted date: 2018-05-14
in scheme: Conservation measures

Adapt/manage exploitation of energy resources
type: Concept
notation: CC02
definition: Adapting and managing (including stopping and avoiding) the exploitation of energy resources (coal mining, incl. open-cast mining, peat extraction, oil and gas exploration and drilling). Alos includes reducing the impact from geotechnical surveying and other preparatory works for extraction.
status: valid
status modified: 2018-05-14
accepted date: 2018-05-14
in scheme: Conservation measures

Adapt/manage renewable energy installation, facilities and operation
type: Concept
notation: CC03
definition: Adapting and managing (including stopping and avoiding) installation and operation of renewable energy infrastructure (excluding hydropower). This also includes measures to mitigate impact of wind farms such as avoiding building turbines at sensitive sites (e.g. migration bottlenecks), turning off turbines under certain conditions and/or particularly problematic times of year (e.g. peak migration).
status: valid
status modified: 2018-05-14
accepted date: 2018-05-14
in scheme: Conservation measures

Reduce impact of hydropower operation and infrastructure
type: Concept
notation: CC04
definition: Reducing/minimizing the impact of hydropower infrastructures (such as dams, weirs, reservoirs) and their operation (e.g. hydropeaking) on freshwater habitats and species. This can include building and managing fish passages or regulating water flows. Alos includes restoring freshwater habitats impacted by changes of hydrological functioning like building dams for energy production.
status: valid
status modified: 2018-05-14
accepted date: 2018-05-14
in scheme: Conservation measures

Adapt/manage fossil energy installation, facilities and operation
type: Concept
notation: CC05
definition: Adapting and managing the installation of and operation of fossil energy infrastructure excluding oil and gas pipelines(CC06).
status: valid
status modified: 2018-05-14
accepted date: 2018-05-14
in scheme: Conservation measures

Reduce impact of service corridors and networks
type: Concept
notation: CC06
definition: Reducing the impact of service corridors and networks (electricity, telecommunications, oil and gas pipelines) on habitats and species targeted by the nature directives. This includes for example modifying power lines to prevent bird electrocution or developing green/blue infrastructure to improve connectivity.
status: valid
status modified: 2018-05-14
accepted date: 2018-05-14
in scheme: Conservation measures

Habitat restoration/creation from resources, exploitation areas or areas damaged due to installation of renewable energy infrastructure
type: Concept
notation: CC07
definition: Land previously used or prepared for mineral extraction (e.g. gravel extraction, quarry), energy resources extraction (e.g. coal or peat) or damaged due to depositing of extraction material or due to construction and operation of renewable energy infrastructure being restored as Annex I habitat type and/or habitat of a species targeted by the nature directives. This includes both active or passive restoration allowing for natural succession. Exlcudes restoration of agricultural and forest habitats which should be reported under CA07 or CB08 respectively and restoration of habitats damaged due to construction and operation of hydropower infrastructure, which should be reported under CC04.
status: valid
status modified: 2018-05-14
accepted date: 2018-05-14
in scheme: Conservation measures

Manage/reduce/eliminate point pollution to surface or ground waters from resource exploitation and energy production
type: Concept
notation: CC08
definition: Managing, reducing or eliminating point source pollution to surface or ground waters caused by the extraction and exploitation of minerals and energy resources (e.g. from mine waters), and energy production.
status: valid
status modified: 2018-05-14
accepted date: 2018-05-14
in scheme: Conservation measures

Manage/reduce/eliminate diffuse pollution to surface or ground waters from resource exploitation and energy production
type: Concept
notation: CC09
definition: Managing, reducing or eliminating diffuse pollution to surface and ground waters caused by the extraction and exploitation of minerals and energy resources (e.g. due to mining activities), and energy production .
status: valid
status modified: 2018-05-14
accepted date: 2018-05-14
in scheme: Conservation measures

Manage/reduce/eliminate air pollution from resource exploitation and energy production
type: Concept
notation: CC10
definition: Managing, reducing or eliminating air pollution related to resource exploitation and energy production such as the combustion of fossil or bioenergy fuels.
status: valid
status modified: 2018-05-14
accepted date: 2018-05-14
in scheme: Conservation measures

Manage/reduce/eliminate marine pollution from resource exploitation and energy production
type: Concept
notation: CC11
definition: Managing, reducing or eliminating marine pollution related to resource exploitation and energy production.
status: valid
status modified: 2018-05-14
accepted date: 2018-05-14
in scheme: Conservation measures

Reduce/eliminate noise, light, thermal and other forms of pollution related to resource exploitation and energy production
type: Concept
notation: CC12
definition: Reducing or eliminating noise and light pollution, electromagnetic pollution, thermal heating of water bodies or localised heating of the sea related to resource exploitation and energy production. Includes also the reduction/elimination of noise pollution from sonar and geological surveys at sea.
status: valid
status modified: 2018-05-14
accepted date: 2018-05-14
in scheme: Conservation measures

Manage water abstraction for resource extraction and energy production
type: Concept
notation: CC13
definition: Managing surface and ground water abstraction for extraction/exploitation of resources and energy production (excluding management of drainage and water abstraction activities related to extraction and exploitation (e.g. peat drainage - CC02 or abstraction of mine waters - CC01).
status: valid
status modified: 2018-05-14
accepted date: 2018-05-14
in scheme: Conservation measures

Other measures related to extraction and energy exploitation activities
type: Concept
notation: CC14
definition: Other measures related to the extraction and energy exploitation activities.
status: valid
status modified: 2018-05-14
accepted date: 2018-05-14
in scheme: Conservation measures

Reduce impact of transport operation and infrastructure
type: Concept
notation: CE01
definition: Reducing the impact of transport infrastructures (roads, railroads, bridges, viaducts, tunnels, shipping lanes and canals, locks, ports, airfields) and transport operations on habitats and species targeted by the nature directives. This include,s for example, building and managing passages for animals, developing green/blue infrastructure, managing marine and fluvial traffic and infrastructure to, for example, reduce erosion of banks and deterring (e.g. by letting grass grow long or employing active 'scaring' tactics) birds from using airfield/airports. Also includes any measures to reduce noise and light pollution. Regulating traffic or construction of traffic infrastructure in order to reduce chemical/particulate pollution should be reported under code CE03.
status: valid
status modified: 2018-05-14
accepted date: 2018-05-14
in scheme: Conservation measures

Manage/reduce/eliminate pollution to surface or ground water from transport
type: Concept
notation: CE02
definition: Managing, reducing or eliminating point or diffuse pollution to surface and ground waters due to land, water, and air-based transport (e.g. cars, boats, airplanes).
status: valid
status modified: 2018-05-14
accepted date: 2018-05-14
in scheme: Conservation measures

Manage/reduce/eliminate air pollution from transport
type: Concept
notation: CE03
definition: Managing, reducing or eliminating air pollution due to land, water or air-based transport (e.g. cars, boats, airplanes).
status: valid
status modified: 2018-05-14
accepted date: 2018-05-14
in scheme: Conservation measures

Manage/reduce/eliminate marine pollution from transport
type: Concept
notation: CE04
definition: Managing, reducing or eliminating marine pollution due to transport activities and infrastructure.
status: valid
status modified: 2018-05-14
accepted date: 2018-05-14
in scheme: Conservation measures

Manage/reduce/eliminate noise, light and other forms of pollution from transport
type: Concept
notation: CE05
definition: Managing, reducing or eliminating noise, light and other forms of pollution related to land, waterand air-based transport (e.g. cars, boats, airplanes).
status: valid
status modified: 2018-05-14
accepted date: 2018-05-14
in scheme: Conservation measures

Habitat restoration of areas impacted by transport
type: Concept
notation: CE06
definition: Restore habitats damaged by transport e.g. restoring freshwater habitats impacted by changes in hydrological functioning like canalisation, or coastal habitats destroyed as a result of the dredging of ship lanes.
status: valid
status modified: 2018-05-14
accepted date: 2018-05-14
in scheme: Conservation measures

Other measures related to transport
type: Concept
notation: CE07
definition: Other measures related to transport
status: valid
status modified: 2018-05-14
accepted date: 2018-05-14
in scheme: Conservation measures

Manage conversion of land for construction and development of infrastructure
type: Concept
notation: CF01
definition: Managing (i.e. preventing, minimizing effects of) conversion of land to the construction and development of residential, commercial, industrial and recreational areas and infrastructures.
status: valid
status modified: 2018-05-14
accepted date: 2018-05-14
in scheme: Conservation measures

Habitat restoration of areas impacted by residential, commercial, industrial and recreational infrastructure, operations and activities
type: Concept
notation: CF02
definition: Restoring habitats in areas negatively impacted by residential, commercial, industrial and recreational infrastructure, including the operation of these infrastructures. Includes, for example, the restoration of dune habitats impacted by the protection of urban and recreational zones. This excludes the restoration of agricultural and forest habitats which should be reported under CA07 or CB08 respectively.
status: valid
status modified: 2018-05-14
accepted date: 2018-05-14
in scheme: Conservation measures

Reduce impact of outdoor sports, leisure and recreational activities
type: Concept
notation: CF03
definition: Reducing the impact of outdoor sports, leisure and recreational activities (e.g. camping, skiing, mountaineering, boating, wildlife watching - bird and whale watching) on terrestrial, freshwater and marine habitats and species, and managing these activities. Also includes restoration of habitats impacted by outdoor sports, leisure and recreational activities.
status: valid
status modified: 2018-05-14
accepted date: 2018-05-14
in scheme: Conservation measures

Reduce/eliminate point source pollution to surface or ground waters from industrial, commercial, residential and recreational areas and activities
type: Concept
notation: CF04
definition: Reducing or eliminating point source pollution to surface and ground waters from industrial, commercial, residential and recreational areas and activities. This includes reducing/eliminating discharges from industrial and urban waste water treatment plants, or reducing/eliminating point source pollution from contaminated or abandoned industrial sites or from household waste dumps.
status: valid
status modified: 2018-05-14
accepted date: 2018-05-14
in scheme: Conservation measures

Reduce/eliminate diffuse pollution to surface or ground waters from industrial, commercial, residential and recreational areas and activities
type: Concept
notation: CF05
definition: Reducing or eliminating diffuse pollution to surface and ground waters from industrial, commercial, residential and recreational areas and activities (e.g. reducing/eliminating diffuse pollution due to sewage not connected to the sewage network or diffuse source pollution from contaminated or abandoned industrial sites or leakages from waste disposal sites).
status: valid
status modified: 2018-05-14
accepted date: 2018-05-14
in scheme: Conservation measures

Reduce/eliminate air pollution from industrial, commercial, residential and recreational areas and activities
type: Concept
notation: CF06
definition: Reducing or eliminating chemical and micro-particulate point and diffuse pollution to air from industrial, commercial, residential and recreational areas and activities.
status: valid
status modified: 2018-05-14
accepted date: 2018-05-14
in scheme: Conservation measures

Reduce/eliminate marine pollution from industrial, commercial, residential and recreational areas and activities
type: Concept
notation: CF07
definition: Reducing or eliminating chemical point and diffuse source pollution to marine waters from industrial, commercial, residential and recreational areas and activities.
status: valid
status modified: 2018-05-14
accepted date: 2018-05-14
in scheme: Conservation measures

Reduce/eliminate marine contamination with litter
type: Concept
notation: CF08
definition: Reducing or eliminating the input and subsequent contamination of marine ecosystems with litter from all possible sources, including from the fishing industry.
status: valid
status modified: 2018-05-14
accepted date: 2018-05-14
in scheme: Conservation measures

Reduce/eliminate noise, light, heat or other forms pollution from industrial, commercial, residential and recreational areas and activities
type: Concept
notation: CF09
definition: Reducing or eliminating noise, light, heat, electromagnetic or other types of pollution from industrial, commercial, residential and recreational areas and activities. Excludes measure to reduce noise and light pollution from sport and leisure activities (CF03).
status: valid
status modified: 2018-05-14
accepted date: 2018-05-14
in scheme: Conservation measures

Manage changes in hydrological and coastal systems and regimes for construction and development
type: Concept
notation: CF10
definition: Managing acitvities causing changes in hydrological conditions and coastal systesm (e.g. drainage, land reclamation, conversion of wetlands, modification of flooding regimes, flood protection infrastructure and operations, building of dams and reservoirs, coastal protection and sea defence) associated with residential, commercial, industrial and recreational areas and activities. This includes restoring freshwater habitats and wetlands impacted by changes of hydrological functioning like building dams or canalisation for flood protection.
status: valid
status modified: 2018-05-14
accepted date: 2018-05-14
in scheme: Conservation measures

Manage water abstraction for public supply and for industrial and commercial use
type: Concept
notation: CF11
definition: Managing the abstraction of ground and surface water for industrial and commercial use, as well as for public water supply (including, for example, drinking water, water for urban watering of parks and gardens and irrigation of golf courses). This includes also restoring freshwater habitats impacted by changes of hydrological functioning like building dams for surface water abstraction.
status: valid
status modified: 2018-05-14
accepted date: 2018-05-14
in scheme: Conservation measures

Other measures related to residential, commercial, industrial and recreational infrastructures, operations and activities
type: Concept
notation: CF12
definition: Other measures related to residential, commercial, industrial and recreational infrastructures, operations and activities. Includes, for example, measures to regulate/adapt the reconstruction and renovation of buildings (important for nesting and sheltering of bats and birds) for example, by regulating timing of those interventions. Includes reducing the use of pesticides and fertilisers on lawns, hedges and fences.
status: valid
status modified: 2018-05-14
accepted date: 2018-05-14
in scheme: Conservation measures

Management of professional/commercial fishing (including shellfish and seaweed harvesting)
type: Concept
notation: CG01
definition: Managing of e.g. quantities, methods, periods, areas, and species for professional fishing; and shellfish and seaweed harvesting in marine, coastal and inland waters. This can include enforcement and control of e.g. fishing quotas and other regulations or stopping/avoiding fishing. Managing methods and periods for fishing to reduce bycatch and/or incidental killing should be included under CG05. Also includes the restoration of habitats damaged due to commercial fishing.
status: valid
status modified: 2018-05-14
accepted date: 2018-05-14
in scheme: Conservation measures

Management of hunting, recreational fishing and recreational or commercial harvesting or collection of plants
type: Concept
notation: CG02
definition: Managing methods, periods, areas, quotas and species for hunting, recreational angling, recreational shellfish harvesting and recreational or commercial harvesting of plants (including fruits) and mushrooms. This can include stopping or avoiding hunting, recreational fishing, harvesting or collecting. Also includes the restoration of habitats damaged due to exploitation of species, for example, human trampling due to harvesting of shellfish or collection of plants, habitats damaged by game.
status: valid
status modified: 2018-05-14
accepted date: 2018-05-14
in scheme: Conservation measures

Reducing the impact of (re-) stocking for fishing and hunting, of artificial feeding and predator control
type: Concept
notation: CG03
definition: Reducing the impact of (re-) stocking fish and game species, of artificial game feeding, of the culling of possible predators or competitors of game species (illegal persecution of predators such as raptor persecution should be reported under CG04) and reducing the impact of other similar activities related to management of game and fishing stocks.
status: valid
status modified: 2018-05-14
accepted date: 2018-05-14
in scheme: Conservation measures

Control/eradication of illegal killing, fishing and harvesting
type: Concept
notation: CG04
definition: Controlling, though enforcement, the illegal killing, fishing and harvesting of fish, shellfish or plant species, including the use of illegal methods or the taking protected species.
status: valid
status modified: 2018-05-14
accepted date: 2018-05-14
in scheme: Conservation measures

Reduce bycatch and incidental killing of non-target species
type: Concept
notation: CG05
definition: Introducing or adapting practices to reduce bycatch or incidental killing from commercial and recreational use and exploitation of species (e.g. by adapting methods or periods for fishing).
status: valid
status modified: 2018-05-14
accepted date: 2018-05-14
in scheme: Conservation measures

Reduce impact of lead poisoning
type: Concept
notation: CG06
definition: Reducing impact of lead ammunition or fishing weights.
status: valid
status modified: 2018-05-14
accepted date: 2018-05-14
in scheme: Conservation measures

Manage changes in coastal conditions for marine aquaculture
type: Concept
notation: CG07
definition: Managing changes to coastal conditions due to the installation, maintenance and operation of marine/coastal aquaculture facilities for fish, shellfish, plants or algae. This can include, for example, regulating or minimising the effect of dredging. This also includes restoring coastal habitats and wetlands impacted by changes of coastal conditions due to marine aquaculture.
status: valid
status modified: 2018-05-14
accepted date: 2018-05-14
in scheme: Conservation measures

Reduce/eliminate marine pollution from marine aquaculture
type: Concept
notation: CG08
definition: Reducing or eliminating pollution to marine waters from marine/coastal aquaculture (fish, shellfish, plants, algae).
status: valid
status modified: 2018-05-14
accepted date: 2018-05-14
in scheme: Conservation measures

Other measures to reduce impacts from marine aquaculture infrastructures and operation
type: Concept
notation: CG09
definition: Other measures to reduce the impact from marine/coastal aquaculture such as impacts from the introduction of new species. Includes maintaining existing extensive aquaculture.
status: valid
status modified: 2018-05-14
accepted date: 2018-05-14
in scheme: Conservation measures

Manage water abstraction and modifications of hydrological conditions for freshwater aquaculture
type: Concept
notation: CG10
definition: Managing water abstraction and modification of hydrological conditions (e.g. weirs, canals, small dams, water deviation) due to to installation, maintenance and operation of freshwater aquaculture of fish, plants and algae.
status: valid
status modified: 2018-05-14
accepted date: 2018-05-14
in scheme: Conservation measures

Reduce/eliminate point source pollution to surface waters from freshwater aquaculture
type: Concept
notation: CG11
definition: Reducing or eliminating point source pollution to surface waters from freshwater aquaculture (e.g. due to feeding, use of antibiotics or fertilisation).
status: valid
status modified: 2018-05-14
accepted date: 2018-05-14
in scheme: Conservation measures

Reduce/eliminate diffuse pollution to surface waters from freshwater aquaculture
type: Concept
notation: CG12
definition: Reducing or eliminating diffuse pollution to surface waters from freshwater aquaculture (e.g. due to feeding, use of antibiotics or fertilisation).
status: valid
status modified: 2018-05-14
accepted date: 2018-05-14
in scheme: Conservation measures

Reduce/eliminate marine pollution from freshwater aquaculture
type: Concept
notation: CG13
definition: Reducing or eliminating pollution to marine waters from freshwater aquaculture (e.g. due to feeding, use of antibiotics or fertilisation).
status: valid
status modified: 2018-05-14
accepted date: 2018-05-14
in scheme: Conservation measures

Other measures to reduce impacts of freshwater aquaculture infrastructures and operation
type: Concept
notation: CG14
definition: Other measures to reduce impact from freshwater aquaculture such as the impacts from the introduction of new species. Includes maintaining existing extensive aquaculture.
status: valid
status modified: 2018-05-14
accepted date: 2018-05-14
in scheme: Conservation measures

Other measures related to exploitation of species
type: Concept
notation: CG15
definition: Other measures related to the exploitation of species (e.g. deliberate, non-lethal disturbance/deterrence of 'pest' species such as Phalacrocorax spp., to reduce conflicts with aquaculture).
status: valid
status modified: 2018-05-14
accepted date: 2018-05-14
in scheme: Conservation measures

Reduce impact of military installations and activities
type: Concept
notation: CH01
definition: Reducing the impact of military sites, infrastructures, exercises and operations.
status: valid
status modified: 2018-05-14
accepted date: 2018-05-14
in scheme: Conservation measures

Adapt/maintain military activities
type: Concept
notation: CH02
definition: Adapting or maintaining military activities for nature protection objectives; use of military activity to maintain or restore habitats (e.g. use disturbance from military exercises to maintain open habitats).
status: valid
status modified: 2018-05-14
accepted date: 2018-05-14
in scheme: Conservation measures

Reduce impact of other specific human actions
type: Concept
notation: CH03
definition: Reducing the impact from specific human actions not included in other categories. (e.g. from property fences and walls, closure of caves and gallery entrances, felling roadside trees or from civil unrest and vandalism).
status: valid
status modified: 2018-05-14
accepted date: 2018-05-14
in scheme: Conservation measures

Early detection and rapid eradication of invasive alien species of Union concern
type: Concept
notation: CI01
definition: Establishing and operating the system of early detection and rapid eradication of invasive alien species of Union concern (under Regulation (EU) No 1143/2014). This also includes measures to prevent, or reduce the likelihood of the establishment and entry of invasive alien species.
status: valid
status modified: 2018-05-14
accepted date: 2018-05-14
in scheme: Conservation measures

Management, control or eradication of established invasive alien species of Union concern
type: Concept
notation: CI02
definition: Managing, controlling or eradicating established invasive alien species of Union concern (under Regulation (EU) No 1143/2014) (e.g. culling of Ruddy duck - Oxyura jamaicensis).
status: valid
status modified: 2018-05-14
accepted date: 2018-05-14
in scheme: Conservation measures

Management, control or eradication of other invasive alien species
type: Concept
notation: CI03
definition: Managing, controlling the spread of other 'invasive' alien species ( i.e. any species introduced in modern period that is established in the wild outside its natural range and whose introduction and/or spread represents a threat or a potential threat to habitats and species, regardless of the invasive population dynamics (e.g. controlling Acacia spp.)) or eradicating established populations of other alien species.
status: valid
status modified: 2018-05-14
accepted date: 2018-05-14
in scheme: Conservation measures

DO NOT USE Management, control or eradication of other alien species
type: Concept
notation: CI04
definition: This code should not be used for new entries. It has been restored for technical reasons.
status: valid
status modified: 2018-05-14
accepted date: 2018-05-14
in scheme: Conservation measures

Management of problematic native species
type: Concept
notation: CI05
definition: Managing native plants and animals that have become out-of-balance directly or indirectly due to human activities and, in certain regions, may be causing damage to particular habitats (e.g. deer jeopardising forest restoration) or threatening population of target species (e.g. gulls predating on eggs and chicks of a threatened bird). This also includes managing impacts of feral populations.
status: valid
status modified: 2018-05-14
accepted date: 2018-05-14
in scheme: Conservation measures

Other measures related to problematic species
type: Concept
notation: CI06
definition: Other measures related to problematic species.
status: valid
status modified: 2018-05-14
accepted date: 2018-05-14
in scheme: Conservation measures

Controlling and eradicating plant and animal diseases, pathogens and pests
type: Concept
notation: CI07
definition: Controlling and eradicating plant and animal diseases, pathogens and pests (including insect and nematode pests).
status: valid
status modified: 2018-05-14
accepted date: 2018-05-14
in scheme: Conservation measures

Reduce impact of mixed source pollution
type: Concept
notation: CJ01
definition: Reducing the impact of pollution in situations where no specific driver can be identified.
status: valid
status modified: 2018-05-14
accepted date: 2018-05-14
in scheme: Conservation measures

Reduce impact of multi-purpose hydrological changes
type: Concept
notation: CJ02
definition: Reducing the impact of landfilling, removal of sediments, canalisation, water deviation, flooding regime modification and other modifications of hydrological functioning or physical chracteristics of water bodies, which cannot be easily associated with one of the categories above.
status: valid
status modified: 2018-05-14
accepted date: 2018-05-14
in scheme: Conservation measures

Restore habitats impacted by multi-purpose hydrological changes
type: Concept
notation: CJ03
definition: Restoring freshwater, wetlands and coastal habitats impacted by multi-purpose hydrological modifications. This excludes restoration of agricultural and forest habitats which should be reported under CA10 or CB10 respectively.
status: valid
status modified: 2018-05-14
accepted date: 2018-05-14
in scheme: Conservation measures

Other measures related to mixed source pollution and multi-purpose human-induced changes in hydraulic conditions
type: Concept
notation: CJ04
definition: Other measures related to mixed source pollution and multi-purpose human-induced changes in hydraulic conditions.
status: valid
status modified: 2018-05-14
accepted date: 2018-05-14
in scheme: Conservation measures

Management of habitats (others than agriculture and forest) to slow, stop or reverse natural processes
type: Concept
notation: CL01
definition: Managing habitats (biotic and abiotic factors), excluding agriculture and forest-related habitats, to slow down, stop or reverse natural processes. This can include abiotic natural processes (e.g. erosion, silting up, drying out, salinization, eutrophication or acidification), natural succession of vegetation (in open early succsession stage habitats), natural accumulation of organic material, which is not a result of human activitiy, or lack of human activities. For example, if measures adress drying out which is a result of a human induced modification of hydrological conditions, it should not be reported under this category. Includes, for example, managing and restoring natural open (early-succession stage) habitats impacted by natural processes (e.g. maintaining heathland to prevent them from being overgrown by trees by grazing, conservation burning).
status: valid
status modified: 2018-05-14
accepted date: 2018-05-14
in scheme: Conservation measures

Minimise/prevent impacts of geological and natural catastrophes
type: Concept
notation: CL02
definition: Minimising (and when possible preventing) the impacts of geological events (e.g. volcanic activity) and extreme natural events (e.g. tidal waves, storms, landslides, flooding, wild fires) on habitats and species.
status: valid
status modified: 2018-05-14
accepted date: 2018-05-14
in scheme: Conservation measures

Restore habitats following geological and natural catastrophes
type: Concept
notation: CL03
definition: Restoring habitats and species after the occurrence of geological events (e.g. volcanic activity) and extreme natural events (e.g. tidal waves, storms, landslides, flooding, wild fires).
status: valid
status modified: 2018-05-14
accepted date: 2018-05-14
in scheme: Conservation measures

Other measures related to natural processes
type: Concept
notation: CL04
definition: Other measures related to natural processes e.g. control of natural competitors, predators or diseases of species targeted by the nature directives.
status: valid
status modified: 2018-05-14
accepted date: 2018-05-14
in scheme: Conservation measures

Adopt climate change mitigation measures
type: Concept
notation: CN01
definition: Adoption and implementation of general climate change mitigation measures. These are generally taken in a broader scale and not specifically for alleviating pressure on habitats and species. Therefore,this 'conservation measure' should only be noted when the main pressure is climate change and mitigation measures are being implemented.
status: valid
status modified: 2018-05-14
accepted date: 2018-05-14
in scheme: Conservation measures

Implement climate change adaptation measures
type: Concept
notation: CN02
definition: Implementation of specific climate change adaptation measures to address specific pressures on habitats and species (e.g. managing an interconnected network of habitats / protected areas, to facilitate the adaptive dispersal of key species in the context of shifts in suitable 'climate envelopes').
status: valid
status modified: 2018-05-14
accepted date: 2018-05-14
in scheme: Conservation measures

Support conservation measures in another EU Member State
type: Concept
notation: CX01
definition: Supporting the implementation of conservation measures in other EU Member States, for example, through financing or capacity building.
status: valid
status modified: 2018-05-14
accepted date: 2018-05-14
in scheme: Conservation measures

Support conservation measures in countries outside the EU
type: Concept
notation: CX02
definition: Supporting the implementation of measures in countries outside the EU (e.g. financing, capacity building).
status: valid
status modified: 2018-05-14
accepted date: 2018-05-14
in scheme: Conservation measures

Reinforce populations of species from the directives
type: Concept
notation: CS01
definition: Reinforcing populations of species targeted by the nature directives, including population enhancement through restocking, strengthening of extant populations by seeding, relocation and transfer from captivity or through cultivation. Excludes restoring habitats for species (see e.g. CS03).
status: valid
status modified: 2018-05-14
accepted date: 2018-05-14
in scheme: Conservation measures

Reintroduce species from the directives
type: Concept
notation: CS02
definition: Reintroduction of species targeted by the nature directives to former sites from other populations or ex-situ conservation through specific reintroduction programmes. Excludes restoring habitats for species (see e.g. CS03).
status: valid
status modified: 2018-05-14
accepted date: 2018-05-14
in scheme: Conservation measures

Improvement of habitat of species from the directives
type: Concept
notation: CS03
definition: Improvement of conditions for the species from the directives through specific measures that cannot be readily achieved by other pressure specific measures or pressure specific measures can not be identified. This includes, for example, the creation of ponds for amphibians, boosting reproductive success by installing nest boxes and platforms (as a substitue measure for lack of natural nesting cavities due to innapropriate forest management practices) or supplementary feeding (possibly carried out to mitigate a particular threat, such as 'natural' carcasses containing diclofenac, but also often carried out at as a broader measure to compensate for cumulative human pressures on natural habitats and food resources).
status: valid
status modified: 2018-05-14
accepted date: 2018-05-14
in scheme: Conservation measures

Manage other native species
type: Concept
notation: CS04
definition: Managing native plants and animals important for the restoration of habitats (e.g. managing keystone species of habitats) or for the survival of certain species (e.g. managing prey and their habitat, like wild rabbits as prey for Iberian lynx and Spanish Imperial Eagle Aquila adalberti). Includes reintroduction of crucial host species or other positively interacting species (like pollinators).
status: valid
status modified: 2018-05-14
accepted date: 2018-05-14
in scheme: Conservation measures

Status of measures
type: ConceptScheme
notation: measuresIdentified
is part of: Habitats directive Art. 17 reporting in year 2018
registration status: Public draft
user modified: roschsab
date modified: 2017-10-04 13:39:00.0
vocabulary type: Common
is numeric concept identifiers: false
is notations equal identifiers: false

Measures identified, but none yet taken
type: Concept
notation: ident
status: valid
status modified: 2017-07-25
in scheme: Status of measures

Measures needed but cannot be identified
type: Concept
notation: notIdent
status: valid
status modified: 2017-07-25
in scheme: Status of measures

Measures identified and taken
type: Concept
notation: taken
status: valid
status modified: 2017-07-25
in scheme: Status of measures

Locations of the measures
type: ConceptScheme
notation: measuresLocation
is part of: Habitats directive Art. 17 reporting in year 2018
registration status: Public draft
user modified: roschsab
date modified: 2017-10-04 13:41:09.0
vocabulary type: Common
is numeric concept identifiers: false
is notations equal identifiers: false

Only inside Natura 2000
type: Concept
notation: in
status: valid
status modified: 2017-07-25
in scheme: Locations of the measures

Both inside and outside Natura 2000
type: Concept
notation: inOut
status: valid
status modified: 2017-07-25
in scheme: Locations of the measures

Only outside Natura 2000
type: Concept
notation: out
status: valid
status modified: 2017-07-25
in scheme: Locations of the measures

Purpose of measures taken for habitat
type: ConceptScheme
notation: measuresPurposeHabitats
is part of: Habitats directive Art. 17 reporting in year 2018
registration status: Public draft
user modified: roschsab
date modified: 2017-10-04 13:39:57.0
vocabulary type: Common
is numeric concept identifiers: false
is notations equal identifiers: false

Expand the current range of the habitat type (related to ‘Range’)
type: Concept
notation: expand
status: valid
status modified: 2017-07-25
in scheme: Purpose of measures taken for habitat

Increase the surface area of the habitat type (related to ‘Area covered by habitat’)
type: Concept
notation: increase
status: valid
status modified: 2017-07-25
in scheme: Purpose of measures taken for habitat

Maintain the current range, surface area or structure and functions of the habitat type
type: Concept
notation: maintain
status: valid
status modified: 2017-07-25
in scheme: Purpose of measures taken for habitat

Restore the structure and functions, including the status of typical species (related to ‘Specific structure and functions’)
type: Concept
notation: restore
status: valid
status modified: 2017-07-25
in scheme: Purpose of measures taken for habitat

Purpose of measures taken for species
type: ConceptScheme
notation: measuresPurposeSpecies
is part of: Habitats directive Art. 17 reporting in year 2018
registration status: Public draft
user modified: roschsab
date modified: 2017-10-04 13:40:33.0
vocabulary type: Common
is numeric concept identifiers: false
is notations equal identifiers: false

Expand the current range of the species (related to ‘Range’)
type: Concept
notation: expand
status: valid
status modified: 2017-07-25
in scheme: Purpose of measures taken for species

Increase the population size and/or improve population dynamics (improve reproduction success, reduce mortality, improve age/sex structure) (related to ‘Population’)
type: Concept
notation: increase
status: valid
status modified: 2017-07-25
in scheme: Purpose of measures taken for species

Maintain the current range, population and/or habitat for the species
type: Concept
notation: maintain
status: valid
status modified: 2017-07-25
in scheme: Purpose of measures taken for species

Restore the habitat of the species (related to ‘Habitat for the species’)
type: Concept
notation: restore
status: valid
status modified: 2017-07-25
in scheme: Purpose of measures taken for species

Response to the measures
type: ConceptScheme
notation: measuresResponse
is part of: Habitats directive Art. 17 reporting in year 2018
registration status: Public draft
user modified: roschsab
date modified: 2017-10-04 13:45:10.0
vocabulary type: Common
is numeric concept identifiers: false
is notations equal identifiers: false

Long-term results (after 2030)
type: Concept
notation: lonTerm
status: valid
status modified: 2017-07-25
in scheme: Response to the measures

Medium-term results (within the next two reporting periods, 2019-2030)
type: Concept
notation: medTerm
status: valid
status modified: 2017-07-25
in scheme: Response to the measures

Short-term results (within the current reporting period, 2013-2018)
type: Concept
notation: srtTerm
status: valid
status modified: 2017-07-25
in scheme: Response to the measures

Methods used
type: ConceptScheme
notation: methodsUsed
is part of: Habitats directive Art. 17 reporting in year 2018
registration status: Public draft
user modified: roschsab
date modified: 2017-07-27 14:58:41.0
vocabulary type: Common
is numeric concept identifiers: false
is notations equal identifiers: false

Insufficient or no data available
type: Concept
notation: absentData
status: valid
status modified: 2017-07-25
in scheme: Methods used

Complete survey or a statistically robust estimate
type: Concept
notation: completeSurvey
status: valid
status modified: 2017-07-25
in scheme: Methods used

Based mainly on expert opinion with very limited data
type: Concept
notation: estimateExpert
status: valid
status modified: 2017-07-25
in scheme: Methods used

Based mainly on extrapolation from a limited amount of data
type: Concept
notation: estimatePartial
status: valid
status modified: 2017-07-25
in scheme: Methods used

Valid population units for additional population size
type: ConceptScheme
notation: populationUnits
is part of: Habitats directive Art. 17 reporting in year 2018
registration status: Public draft
user modified: roschsab
date modified: 2018-01-17 15:52:23.0
vocabulary type: Common
is numeric concept identifiers: false
is notations equal identifiers: false

number of adults
type: Concept
notation: adults
status: valid
status modified: 2017-08-01
accepted date: 2017-08-01
in scheme: Valid population units for additional population size

area covered by population in m2
type: Concept
notation: area
status: valid
status modified: 2017-08-01
accepted date: 2017-08-01
in scheme: Valid population units for additional population size

number of breeding females
type: Concept
notation: bfemales
status: valid
status modified: 2017-08-01
accepted date: 2017-08-01
in scheme: Valid population units for additional population size

number of calling males
type: Concept
notation: cmales
status: valid
status modified: 2017-08-01
accepted date: 2017-08-01
in scheme: Valid population units for additional population size

number of colonies
type: Concept
notation: colonies
status: valid
status modified: 2017-08-01
accepted date: 2017-08-01
in scheme: Valid population units for additional population size

number of flowering stems
type: Concept
notation: fstems
status: valid
status modified: 2017-08-01
accepted date: 2017-08-01
in scheme: Valid population units for additional population size

number of map 10x10 km grid cells
type: Concept
notation: grids10x10
status: valid
status modified: 2017-08-01
accepted date: 2017-08-01
in scheme: Valid population units for additional population size

number of map 1x1 km grid cells
type: Concept
notation: grids1x1
status: valid
status modified: 2017-08-01
accepted date: 2017-08-01
in scheme: Valid population units for additional population size

number of map 5x5 km grid cells
type: Concept
notation: grids5x5
status: valid
status modified: 2017-08-01
accepted date: 2017-08-01
in scheme: Valid population units for additional population size

number of individuals
type: Concept
notation: i
status: valid
status modified: 2017-08-01
accepted date: 2017-08-01
in scheme: Valid population units for additional population size

length of inhabited feature in km
type: Concept
notation: length
status: valid
status modified: 2017-08-01
accepted date: 2017-08-01
in scheme: Valid population units for additional population size

number of localities
type: Concept
notation: localities
status: valid
status modified: 2017-08-01
accepted date: 2017-08-01
in scheme: Valid population units for additional population size

number of inhabited logs
type: Concept
notation: logs
status: valid
status modified: 2017-08-01
accepted date: 2017-08-01
in scheme: Valid population units for additional population size

number of males
type: Concept
notation: males
status: valid
status modified: 2017-08-01
accepted date: 2017-08-01
in scheme: Valid population units for additional population size

number of pairs
type: Concept
notation: p
status: valid
status modified: 2017-08-01
accepted date: 2017-08-01
in scheme: Valid population units for additional population size

number of shoots
type: Concept
notation: shoots
status: valid
status modified: 2017-08-01
accepted date: 2017-08-01
in scheme: Valid population units for additional population size

number of inhabited stones/boulders
type: Concept
notation: stones
status: valid
status modified: 2017-08-01
accepted date: 2017-08-01
in scheme: Valid population units for additional population size

number of subadults
type: Concept
notation: subadults
status: valid
status modified: 2017-08-01
accepted date: 2017-08-01
in scheme: Valid population units for additional population size

number of inhabited trees
type: Concept
notation: trees
status: valid
status modified: 2017-08-01
accepted date: 2017-08-01
in scheme: Valid population units for additional population size

number of tufts
type: Concept
notation: tufts
status: valid
status modified: 2017-08-01
accepted date: 2017-08-01
in scheme: Valid population units for additional population size

number of map 2x2 km grid cells
type: Concept
notation: grids2x2
status: valid
status modified: 2018-01-17
in scheme: Valid population units for additional population size

number of wintering individuals
type: Concept
notation: iwintering
status: valid
status modified: 2018-01-17
in scheme: Valid population units for additional population size

Occurrence categories in the habitat checklist
type: ConceptScheme
notation: presenceHabitats
is part of: Habitats directive Art. 17 reporting in year 2018
registration status: Public draft
user modified: roschsab
date modified: 2018-06-13 07:16:37.0
vocabulary type: Common
is numeric concept identifiers: false
is notations equal identifiers: false
label: Occurrence categories used in the species checklist
notation: presenceSpecies
date modified: 2018-03-20 10:17:02.0

Not present - delete from the check-list
type: Concept
notation: DEL
status: valid
status modified: 2017-11-30
in scheme: Occurrence categories in the habitat checklist

Marginal
type: Concept
notation: MAR
status: valid
status modified: 2017-07-27
accepted date: 2017-07-27
in scheme: Occurrence categories in the habitat checklist

Present regularly
type: Concept
notation: PRE
status: valid
status modified: 2017-07-27
accepted date: 2017-07-27
in scheme: Occurrence categories in the habitat checklist

Scientific reserve
type: Concept
notation: SCR
status: valid
status modified: 2017-07-27
accepted date: 2017-07-27
in scheme: Occurrence categories in the habitat checklist

Not present - reserve
type: Concept
notation: NPRE
status: valid
status modified: 2018-06-13
in scheme: Occurrence categories in the habitat checklist
status modified: 2017-07-27
accepted date: 2017-07-27

Optional report
type: Concept
notation: OPT
status: valid
status modified: 2018-06-13
in scheme: Occurrence categories in the habitat checklist
status modified: 2018-03-20

Newly arriving species
type: Concept
notation: ARR
status: valid
status modified: 2017-07-27
accepted date: 2017-07-27
in scheme: Occurrence categories in the habitat checklist

Species extinct after entry into force of the Habitats Directive
type: Concept
notation: EXa
status: valid
status modified: 2017-07-27
accepted date: 2017-07-27
in scheme: Occurrence categories in the habitat checklist

Species extinct prior to entry into force of the Habitats Directive
type: Concept
notation: EXp
status: valid
status modified: 2017-07-27
accepted date: 2017-07-27
in scheme: Occurrence categories in the habitat checklist

Taxonomical error
type: Concept
notation: NTAX
status: valid
status modified: 2017-07-27
accepted date: 2017-07-27
in scheme: Occurrence categories in the habitat checklist

Occasional
type: Concept
notation: OCC
status: valid
status modified: 2017-07-27
accepted date: 2017-07-27
in scheme: Occurrence categories in the habitat checklist

Taxonomical uncertainty
type: Concept
notation: TAX
status: valid
status modified: 2017-07-27
accepted date: 2017-07-27
in scheme: Occurrence categories in the habitat checklist

Future prospects of parameters
type: ConceptScheme
notation: prospects
is part of: Habitats directive Art. 17 reporting in year 2018
registration status: Public draft
user modified: roschsab
date modified: 2017-10-04 13:36:48.0
vocabulary type: Common
is numeric concept identifiers: false
is notations equal identifiers: false

Bad
type: Concept
notation: bad
status: valid
status modified: 2017-07-25
in scheme: Future prospects of parameters

Good
type: Concept
notation: good
status: valid
status modified: 2017-07-25
in scheme: Future prospects of parameters

Poor
type: Concept
notation: poor
status: valid
status modified: 2017-07-25
in scheme: Future prospects of parameters

Unknown
type: Concept
notation: unk
status: valid
status modified: 2017-07-25
in scheme: Future prospects of parameters

QaQc
type: ConceptScheme
notation: qaqc
is part of: Habitats directive Art. 17 reporting in year 2018
registration status: Public draft
user modified: roschsab
date modified: 2017-11-23 11:24:02.0
vocabulary type: Common
working user: roschsab
is numeric concept identifiers: false
is notations equal identifiers: false

Incoherent information.
type: Concept
notation: S216
definition: Incoherent information in this section. Conclusion for Population should be 'U2 - Unfavourable - Bad' when population size is more than 25% below favourable reference population (reported value in 6.15b is '>> - Much more than').
status: valid
status modified: 2017-11-23
accepted date: 2017-11-23
in scheme: QaQc
error type: ERROR

Incoherent information.
type: Concept
notation: S217
definition: Incoherent information in this section.The conclusion for Population cannot be 'FV - Favourable' when the trend is decreasing (reported value in 6.8 is 'D - Decreasing').
status: valid
status modified: 2017-11-23
accepted date: 2017-11-23
in scheme: QaQc
error type: ERROR

Mandatory information missing.
type: Concept
notation: S218
definition: The conclusion for Population should be provided.
status: valid
status modified: 2017-11-23
accepted date: 2017-11-23
in scheme: QaQc
error type: ERROR

Invalid code.
type: Concept
notation: S219
definition: Please check the vocabulary assessments.
status: valid
status modified: 2017-11-23
accepted date: 2017-11-23
in scheme: QaQc
error type: BLOCKER

Mandatory information missing.
type: Concept
notation: S220
definition: The conclusion for Habitat for the species should be provided.
status: valid
status modified: 2017-11-23
accepted date: 2017-11-23
in scheme: QaQc
error type: ERROR

Invalid code.
type: Concept
notation: S221
definition: Please check the vocabulary assessments.
status: valid
status modified: 2017-11-23
accepted date: 2017-11-23
in scheme: QaQc
error type: BLOCKER

Incoherent information.
type: Concept
notation: S222
definition: Incoherent information in this section. Conclusion for Future prospects should be 'FV - Favourable' if all parameters (10.1a,b,c) have 'good' prospects, or prospects of one parameter is 'unk - unknown' and the other prospects are 'good'.
status: valid
status modified: 2017-11-23
accepted date: 2017-11-23
in scheme: QaQc
error type: ERROR

Incoherent information.
type: Concept
notation: S223
definition: Incoherent information in this section. Conclusion for Future prospects should be 'U2 - Unfavourable - Bad' if one or more parameters (10.1a,b,c) have 'bad' prospects.
status: valid
status modified: 2017-11-23
accepted date: 2017-11-23
in scheme: QaQc
error type: ERROR

Incoherent information.
type: Concept
notation: S224
definition: Incoherent information in this section. Conclusion for Future prospects should be 'XX - Unknown' if two or more parameters (10.1a,b,c) are 'unk - unknown' and no parameter with 'bad' prospects.
status: valid
status modified: 2017-11-23
accepted date: 2017-11-23
in scheme: QaQc
error type: ERROR

Mandatory information missing.
type: Concept
notation: S225
definition: The conclusion for Future prospects should be provided.
status: valid
status modified: 2017-11-23
accepted date: 2017-11-23
in scheme: QaQc
error type: ERROR

Invalid code.
type: Concept
notation: S226
definition: Please check the vocabulary assessments.
status: valid
status modified: 2017-11-23
accepted date: 2017-11-23
in scheme: QaQc
error type: BLOCKER

Incoherent information.
type: Concept
notation: S227
definition: Incoherent information in this section. Overall assessment should be 'FV - Favourable' if all assessments of parameters (11.1 to 11.4) are 'FV - Favourable', or three are 'FV - Favourable' and one is 'XX - Unknown'.
status: valid
status modified: 2017-11-23
accepted date: 2017-11-23
in scheme: QaQc
error type: ERROR

Incoherent information.
type: Concept
notation: S228
definition: Incoherent information in this section. Overall assessment should be 'U2 - Unfavourable - Bad' if at least one assessment of parameters (11.1 to 11.4) is 'U2 - Unfavourable - Bad'.
status: valid
status modified: 2017-11-23
accepted date: 2017-11-23
in scheme: QaQc
error type: ERROR

Incoherent information.
type: Concept
notation: S229
definition: Incoherent information in this section. Overall assessment should be 'U1 - Unfavourable - Inadequate' if at least one assessment of parameters (11.1 to 11.4) is 'U1 - Unfavourable - Inadequate' and none is 'U2 - Unfavourable - Bad'.
status: valid
status modified: 2017-11-23
accepted date: 2017-11-23
in scheme: QaQc
error type: ERROR

Mandatory information missing.
type: Concept
notation: S230
definition: Conclusion for Overall assessment of Conservation Status should be provided.
status: valid
status modified: 2017-11-23
accepted date: 2017-11-23
in scheme: QaQc
error type: ERROR

Mandatory information missing.
type: Concept
notation: S231
definition: Conclusion for Overall assessment of Conservation Status should be provided as other conclusions are provided (11.1 to 11.4).
status: valid
status modified: 2017-11-23
accepted date: 2017-11-23
in scheme: QaQc
error type: ERROR

Invalid code.
type: Concept
notation: S232
definition: Please check the vocabulary trendsConclusion.
status: valid
status modified: 2017-11-23
accepted date: 2017-11-23
in scheme: QaQc
error type: BLOCKER

Mandatory information missing.
type: Concept
notation: S233
definition: Overall trend in conservation status should be provided when 11.5 Conclusions - Overall assessment of Conservation Status is not 'XX - Unknown'.
status: valid
status modified: 2017-11-23
accepted date: 2017-11-23
in scheme: QaQc
error type: ERROR

Invalid code.
type: Concept
notation: S234
definition: Please check the vocabulary reasonChange.
status: valid
status modified: 2017-11-23
accepted date: 2017-11-23
in scheme: QaQc
error type: BLOCKER

Incoherent information.
type: Concept
notation: S235
definition: Incoherent information in this section. If 'noChange' is selected,There is no need to explain the nature of change.
status: valid
status modified: 2017-11-23
accepted date: 2017-11-23
in scheme: QaQc
error type: ERROR

Invalid code.
type: Concept
notation: S001
definition: Please check the vocabulary countries.
status: valid
status modified: 2017-11-23
accepted date: 2017-11-23
in scheme: QaQc
error type: BLOCKER

Incoherent information.
type: Concept
notation: S236
definition: Incoherent information in this section. Only one main reason is expected.
status: valid
status modified: 2017-11-23
accepted date: 2017-11-23
in scheme: QaQc
error type: ERROR

Mandatory information missing.
type: Concept
notation: S002
definition: The country code should be provided.
status: valid
status modified: 2017-11-23
accepted date: 2017-11-23
in scheme: QaQc
error type: BLOCKER

Mandatory information missing.
type: Concept
notation: S238
definition: Indicate if there is any change sinceThe previous reporting period (2007 - 2012) in conservation status. Report 'noChange' if the answer to the question: 'Is there a change fromThe previous reporting round?' is 'No,There is no difference'. ProvideThe nature of that change (more than one option can be chosen) if the answer is 'Yes'.
status: valid
status modified: 2017-11-23
accepted date: 2017-11-23
in scheme: QaQc
error type: ERROR

Invalid code.
type: Concept
notation: S003
definition: Please check the vocabulary HDspecies.
status: valid
status modified: 2017-11-23
accepted date: 2017-11-23
in scheme: QaQc
error type: BLOCKER

Invalid code.
type: Concept
notation: S239
definition: Please check the vocabulary reasonChange.
status: valid
status modified: 2017-11-23
accepted date: 2017-11-23
in scheme: QaQc
error type: BLOCKER

Mandatory information missing.
type: Concept
notation: S004
definition: The species code should be provided.
status: valid
status modified: 2017-11-23
accepted date: 2017-11-23
in scheme: QaQc
error type: BLOCKER

Incoherent information.
type: Concept
notation: S240
definition: Incoherent information in this section. If 'noChange' is selected,There is no need to explain the nature of change.
status: valid
status modified: 2017-11-23
accepted date: 2017-11-23
in scheme: QaQc
error type: ERROR

Incoherent information.
type: Concept
notation: S005
definition: Incoherent information in this section.The combination species code/scientific name should exist in the vocabulary HDspecies.
status: valid
status modified: 2017-11-23
accepted date: 2017-11-23
in scheme: QaQc
error type: WARNING

Incoherent information.
type: Concept
notation: S241
definition: Incoherent information in this section. Only one main reason is expected.
status: valid
status modified: 2017-11-23
accepted date: 2017-11-23
in scheme: QaQc
error type: ERROR

Incoherent information.
type: Concept
notation: S006
definition: Incoherent information in this section.The scientific name should be provided.
status: valid
status modified: 2017-11-23
accepted date: 2017-11-23
in scheme: QaQc
error type: ERROR

Mandatory information missing.
type: Concept
notation: S243
definition: Indicate if there is any change sinceThe previous reporting period (2007 - 2012) in trend in conservation status. Report 'noChange' if the answer to the question: 'Is there a change fromThe previous reporting round?' is 'No,There is no difference'. ProvideThe nature of that change (more than one option can be chosen) if the answer is 'Yes'.
status: valid
status modified: 2017-11-23
accepted date: 2017-11-23
in scheme: QaQc
error type: ERROR

Invalid code.
type: Concept
notation: S007
definition: Code should be 'Yes' or 'No'.
status: valid
status modified: 2017-11-23
accepted date: 2017-11-23
in scheme: QaQc
error type: BLOCKER

Invalid code.
type: Concept
notation: S244
definition: Please check the vocabulary populationUnits.
status: valid
status modified: 2017-11-23
accepted date: 2017-11-23
in scheme: QaQc
error type: BLOCKER

Mandatory information missing.
type: Concept
notation: S008
definition: Indicate whether information on species distribution is sensitive.
status: valid
status modified: 2017-11-23
accepted date: 2017-11-23
in scheme: QaQc
error type: ERROR

Incoherent information.
type: Concept
notation: S245
definition: The reported population size unit within Natura 2000 network differs withThe reporting unit used in 6.2.
status: valid
status modified: 2017-11-23
accepted date: 2017-11-23
in scheme: QaQc
error type: ERROR

Incorrect data format.
type: Concept
notation: S009
definition: Incorrect data format, it must be YYYY or YYYY-YYYY.
status: valid
status modified: 2017-11-23
accepted date: 2017-11-23
in scheme: QaQc
error type: ERROR

Incoherent information.
type: Concept
notation: S246
definition: Population size unit within Natura 2000 network (12.1a) cannot be empty when Population size within within Natura 2000 network (12.1b,c,d) is provided.
status: valid
status modified: 2017-11-23
accepted date: 2017-11-23
in scheme: QaQc
error type: ERROR

Incoherent information.
type: Concept
notation: S010
definition: Year1 should be lower or equal than year2.
status: valid
status modified: 2017-11-23
accepted date: 2017-11-23
in scheme: QaQc
error type: ERROR

Mandatory information missing.
type: Concept
notation: S247
definition: Population size unit within Natura 2000 network should be provided.
status: valid
status modified: 2017-11-23
accepted date: 2017-11-23
in scheme: QaQc
error type: ERROR

Mandatory information missing.
type: Concept
notation: S011
definition: Year or period should be provided.
status: valid
status modified: 2017-11-23
accepted date: 2017-11-23
in scheme: QaQc
error type: ERROR

Incorrect data format.
type: Concept
notation: S248
definition: Numeric field, only decimals greater or equal 0 are permitted.
status: valid
status modified: 2017-11-23
accepted date: 2017-11-23
in scheme: QaQc
error type: ERROR

Invalid code.
type: Concept
notation: S012
definition: Please check the vocabulary methodsUsed.
status: valid
status modified: 2017-11-23
accepted date: 2017-11-23
in scheme: QaQc
error type: BLOCKER

Incorrect data format.
type: Concept
notation: S249
definition: Numeric field, only decimals greater or equal 0 are permitted.
status: valid
status modified: 2017-11-23
accepted date: 2017-11-23
in scheme: QaQc
error type: ERROR

Mandatory information missing.
type: Concept
notation: S013
definition: Method should be provided. In case the information to be reported in this section is not available use 'AbsentData - Insufficient or no data available'.
status: valid
status modified: 2017-11-23
accepted date: 2017-11-23
in scheme: QaQc
error type: ERROR

12.1c Population size within Natura 2000 network - max should be �?� min.
type: Concept
notation: S250
status: valid
status modified: 2017-11-23
accepted date: 2017-11-23
in scheme: QaQc
error type: ERROR

Invalid code.
type: Concept
notation: S014
definition: Code should be 'Yes' or 'No'.
status: valid
status modified: 2017-11-23
accepted date: 2017-11-23
in scheme: QaQc
error type: BLOCKER

Incorrect data format.
type: Concept
notation: S251
definition: Numeric field, only decimals greater or equal 0 are permitted.
status: valid
status modified: 2017-11-23
accepted date: 2017-11-23
in scheme: QaQc
error type: ERROR

Incoherent information.
type: Concept
notation: S015
definition: Incoherent information in this section. This section is to report on Annex V species only.
status: valid
status modified: 2017-11-23
accepted date: 2017-11-23
in scheme: QaQc
error type: WARNING

Mandatory information missing.
type: Concept
notation: S252
definition: Population size within Natura 2000 network should be provided as interval (12.1b, c) and/or single value (12.1d) for annex II species.
status: valid
status modified: 2017-11-23
accepted date: 2017-11-23
in scheme: QaQc
error type: ERROR

Mandatory information missing.
type: Concept
notation: S016
definition: Indicate whether this Annex V species is taken or exploited. Report 'No' if the answer to the question: 'Is the species taken in the wild/exploited' is 'No'.
status: valid
status modified: 2017-11-23
accepted date: 2017-11-23
in scheme: QaQc
error type: ERROR

Invalid code.
type: Concept
notation: S253
definition: Please check the vocabulary typeEstimate.
status: valid
status modified: 2017-11-23
accepted date: 2017-11-23
in scheme: QaQc
error type: BLOCKER

Incoherent information.
type: Concept
notation: S017
definition: Incoherent information in this section. This section Spec.3.2 should be filled when the species is taken in the wild or exploited ('Yes' reported in Spec.3.1) and the conservation status ofThe species is 'unfavourable' (U1 or U2) in at least one biogeographical or marine region.
status: valid
status modified: 2017-11-23
accepted date: 2017-11-23
in scheme: QaQc
error type: WARNING

Incoherent information.
type: Concept
notation: S254
definition: The value 'mean - multi-year mean' is allowed in this section.
status: valid
status modified: 2017-11-23
accepted date: 2017-11-23
in scheme: QaQc
error type: WARNING

Mandatory information missing.
type: Concept
notation: S018
definition: This section should be filled when the species is taken in the wild or exploited ('Yes' reported in Spec.3.1) and the conservation status ofThe species is 'unfavourable' (U1 or U2) in at least one biogeographical or marine region.
status: valid
status modified: 2017-11-23
accepted date: 2017-11-23
in scheme: QaQc
error type: ERROR

Mandatory information missing.
type: Concept
notation: S255
definition: The type of estimate for the population size within Natura 2000 network should be provided.
status: valid
status modified: 2017-11-23
accepted date: 2017-11-23
in scheme: QaQc
error type: ERROR

Invalid code.
type: Concept
notation: S019
definition: Code should be 'Yes' or 'No'.
status: valid
status modified: 2017-11-23
accepted date: 2017-11-23
in scheme: QaQc
error type: BLOCKER

Invalid code.
type: Concept
notation: S256
definition: Please check the vocabulary methodsUsed.
status: valid
status modified: 2017-11-23
accepted date: 2017-11-23
in scheme: QaQc
error type: BLOCKER

Invalid code.
type: Concept
notation: S020
definition: Code should be 'Yes' or 'No'.
status: valid
status modified: 2017-11-23
accepted date: 2017-11-23
in scheme: QaQc
error type: BLOCKER

Incoherent information.
type: Concept
notation: S257
definition: 12.2 Type of estimate should be empty when Population size insideThe network Method used is 'AbsentData - Insufficient or no data available'.
status: valid
status modified: 2017-11-23
accepted date: 2017-11-23
in scheme: QaQc
error type: WARNING

Invalid code.
type: Concept
notation: S021
definition: Code should be 'Yes' or 'No'.
status: valid
status modified: 2017-11-23
accepted date: 2017-11-23
in scheme: QaQc
error type: BLOCKER

Mandatory information missing.
type: Concept
notation: S258
definition: The method should be provided. In case the information to be reported in this section is not available use 'AbsentData - Insufficient or no data available'.
status: valid
status modified: 2017-11-23
accepted date: 2017-11-23
in scheme: QaQc
error type: ERROR

Invalid code.
type: Concept
notation: S022
definition: Code should be 'Yes' or 'No'.
status: valid
status modified: 2017-11-23
accepted date: 2017-11-23
in scheme: QaQc
error type: BLOCKER

Invalid code.
type: Concept
notation: S259
definition: Please check the vocabulary trends.
status: valid
status modified: 2017-11-23
accepted date: 2017-11-23
in scheme: QaQc
error type: BLOCKER

Invalid code.
type: Concept
notation: S023
definition: Code should be 'Yes' or 'No'.
status: valid
status modified: 2017-11-23
accepted date: 2017-11-23
in scheme: QaQc
error type: BLOCKER

Mandatory information missing.
type: Concept
notation: S260
definition: The Trend should be provided. In case the information to be reported in this section is not available use 'Unk - unknown'.
status: valid
status modified: 2017-11-23
accepted date: 2017-11-23
in scheme: QaQc
error type: ERROR

Invalid code.
type: Concept
notation: S024
definition: Code should be 'Yes' or 'No'.
status: valid
status modified: 2017-11-23
accepted date: 2017-11-23
in scheme: QaQc
error type: BLOCKER

Invalid code.
type: Concept
notation: S261
definition: Please check the vocabulary methodsUsed.
status: valid
status modified: 2017-11-23
accepted date: 2017-11-23
in scheme: QaQc
error type: BLOCKER

Invalid code.
type: Concept
notation: S025
definition: Code should be 'Yes' or 'No'.
status: valid
status modified: 2017-11-23
accepted date: 2017-11-23
in scheme: QaQc
error type: BLOCKER

Incoherent information.
type: Concept
notation: S262
definition: Inconsistent values provided in fields 12.4 Short-term trend Direction and 12.5 Short-term trend Method used. when the method is assessed as 'AbsentData - Insufficient or no data available',The trend cannot be defined. If you want to report a trend as stable, increasing or decreasing based on a method using limited data,Please select 'estimateExpert - Based mainly on expert opinion with very limited data' for the method used.
status: valid
status modified: 2017-11-23
accepted date: 2017-11-23
in scheme: QaQc
error type: WARNING

Invalid code.
type: Concept
notation: S026
definition: Code should be 'Yes' or 'No'.
status: valid
status modified: 2017-11-23
accepted date: 2017-11-23
in scheme: QaQc
error type: BLOCKER

Mandatory information missing.
type: Concept
notation: S263
definition: The method should be provided. In case the information to be reported in this section is not available use 'AbsentData - Insufficient or no data available'.
status: valid
status modified: 2017-11-23
accepted date: 2017-11-23
in scheme: QaQc
error type: ERROR

Incoherent information.
type: Concept
notation: S027
definition: The measures taken should be described only when 'yes, other measures' have been selected ('Yes' reported in Spec.3.2h1).
status: valid
status modified: 2017-11-23
accepted date: 2017-11-23
in scheme: QaQc
error type: ERROR

Invalid code.
type: Concept
notation: G001
definition: Please check the vocabulary countries.
status: valid
status modified: 2017-11-23
accepted date: 2017-11-23
in scheme: QaQc
error type: BLOCKER

Mandatory information missing.
type: Concept
notation: S028
definition: The measures taken should be described when other measures have been selected ('Yes' reported in Spec.3.2h1).
status: valid
status modified: 2017-11-23
accepted date: 2017-11-23
in scheme: QaQc
error type: ERROR

Mandatory information missing.
type: Concept
notation: G002
definition: Information on country code is expected.
status: valid
status modified: 2017-11-23
accepted date: 2017-11-23
in scheme: QaQc
error type: BLOCKER

Invalid code.
type: Concept
notation: S029
definition: Please check the vocabulary populationUnits.
status: valid
status modified: 2017-11-23
accepted date: 2017-11-23
in scheme: QaQc
error type: ERROR

Mandatory information missing.
type: Concept
notation: G003
definition: Information on main achievements under the Habitats Directive during the reporting period is expected.
status: valid
status modified: 2017-11-23
accepted date: 2017-11-23
in scheme: QaQc
error type: ERROR

Mandatory information missing.
type: Concept
notation: S030
definition: Population unit for the hunting bag or quantity taken in the wild should be provided.
status: valid
status modified: 2017-11-23
accepted date: 2017-11-23
in scheme: QaQc
error type: ERROR

Mandatory information missing.
type: Concept
notation: G004
definition: Information relating to the Habitats Directive and the Natura 2000 network of the Member State is expected.
status: valid
status modified: 2017-11-23
accepted date: 2017-11-23
in scheme: QaQc
error type: ERROR

Min/max value should be provided systematically for all seasons.
type: Concept
notation: S500
definition: Report '0' if no hunting bag orThere was a temporary ban.
status: valid
status modified: 2017-11-23
accepted date: 2017-11-23
in scheme: QaQc
error type: ERROR

Mandatory information missing.
type: Concept
notation: G005
definition: General information on the network of pSCIs, SCIs and SACs is expected.
status: valid
status modified: 2017-11-23
accepted date: 2017-11-23
in scheme: QaQc
error type: ERROR

Incoherent information.
type: Concept
notation: S501
definition: Only min/max or unknown value is expected for 3.3.b1 Statistics/quantity per hunting season or year over the reporting period - Season/year1.
status: valid
status modified: 2017-11-23
accepted date: 2017-11-23
in scheme: QaQc
error type: ERROR

Mandatory information missing.
type: Concept
notation: G006
definition: General information on monitoring is expected.
status: valid
status modified: 2017-11-23
accepted date: 2017-11-23
in scheme: QaQc
error type: ERROR

Mandatory information missing.
type: Concept
notation: S502
definition: Statistics/quantity per hunting season or year over the reporting period - Season/year1 should be provided (3.3.b1min, 3.3.b1max, 3.3.b1x).
status: valid
status modified: 2017-11-23
accepted date: 2017-11-23
in scheme: QaQc
error type: ERROR

Mandatory information missing.
type: Concept
notation: G007
definition: General information on species protection is expected.
status: valid
status modified: 2017-11-23
accepted date: 2017-11-23
in scheme: QaQc
error type: ERROR

Incorrect data format.
type: Concept
notation: S503
definition: Numeric field, only decimals greater or equal 0 are permitted.
status: valid
status modified: 2017-11-23
accepted date: 2017-11-23
in scheme: QaQc
error type: ERROR

Mandatory information missing.
type: Concept
notation: G008
definition: General information on the implementation of conservation measures within the Natura 2000 sites and their impact on conservation status expected.
status: valid
status modified: 2017-11-23
accepted date: 2017-11-23
in scheme: QaQc
error type: ERROR

Incorrect data format.
type: Concept
notation: S504
definition: Numeric field, only decimals greater or equal 0 are permitted.
status: valid
status modified: 2017-11-23
accepted date: 2017-11-23
in scheme: QaQc
error type: ERROR

Mandatory information missing.
type: Concept
notation: G009
definition: General information on transposition of the Directive is expected.
status: valid
status modified: 2017-11-23
accepted date: 2017-11-23
in scheme: QaQc
error type: ERROR

3.3b1max Statistics/quantity on season/year 1- max should be �?� min.
type: Concept
notation: S505
status: valid
status modified: 2017-11-23
accepted date: 2017-11-23
in scheme: QaQc
error type: ERROR

Incorrect data format.
type: Concept
notation: G010
definition: Numeric field, only integers greater than 0 are permitted.
status: valid
status modified: 2017-11-23
accepted date: 2017-11-23
in scheme: QaQc
error type: ERROR

Invalid code.
type: Concept
notation: S506
definition: Code should be 'Yes' or 'No'.
status: valid
status modified: 2017-11-23
accepted date: 2017-11-23
in scheme: QaQc
error type: ERROR

Incoherent information.
type: Concept
notation: G011
definition: The total number of all SACs cannot be higher than the total number of all sites (pSCIs, SCIs and SACs).
status: valid
status modified: 2017-11-23
accepted date: 2017-11-23
in scheme: QaQc
error type: ERROR

Incorrect data format.
type: Concept
notation: S507
definition: This field cannot be empty. Code should be 'Yes' or 'No'.
status: valid
status modified: 2017-11-23
accepted date: 2017-11-23
in scheme: QaQc
error type: ERROR

Incoherent information.
type: Concept
notation: G012
definition: The total number of marine sites (pSCIs, SCIs and SACs) cannot be higher than the total number of all sites (pSCIs, SCIs and SACs).
status: valid
status modified: 2017-11-23
accepted date: 2017-11-23
in scheme: QaQc
error type: ERROR

Min/max value should be provided systematically for all seasons.
type: Concept
notation: S508
definition: Report '0' if no hunting bag orThere was a temporary ban.
status: valid
status modified: 2017-11-23
accepted date: 2017-11-23
in scheme: QaQc
error type: ERROR

Mandatory information missing.
type: Concept
notation: G013
definition: The total number of all sites (pSCIs, SCIs, SACs) should be provided.
status: valid
status modified: 2017-11-23
accepted date: 2017-11-23
in scheme: QaQc
error type: ERROR

Incoherent information.
type: Concept
notation: S509
definition: Only min/max or unknown value is expected for 3.3.b2 Statistics/quantity per hunting season or year over the reporting period - Season/year2.
status: valid
status modified: 2017-11-23
accepted date: 2017-11-23
in scheme: QaQc
error type: ERROR

Incorrect data format.
type: Concept
notation: G014
definition: Numeric field, only decimals greater than 0 are permitted.
status: valid
status modified: 2017-11-23
accepted date: 2017-11-23
in scheme: QaQc
error type: ERROR

Mandatory information missing.
type: Concept
notation: S510
definition: Statistics/quantity per hunting season or year over the reporting period - Season/year2 should be provided (3.3.b2min, 3.3.b2max, 3.3.b2x).
status: valid
status modified: 2017-11-23
accepted date: 2017-11-23
in scheme: QaQc
error type: ERROR

Incoherent information.
type: Concept
notation: G015
definition: The surface area of all SACs cannot be higher than the surface area of all sites (pSCIs, SCIs and SACs).
status: valid
status modified: 2017-11-23
accepted date: 2017-11-23
in scheme: QaQc
error type: ERROR

Incorrect data format.
type: Concept
notation: S511
definition: Numeric field, only decimals greater or equal 0 are permitted.
status: valid
status modified: 2017-11-23
accepted date: 2017-11-23
in scheme: QaQc
error type: ERROR

Incoherent information.
type: Concept
notation: G016
definition: The surface area of terrestrial sites (pSCIs, SCIs and SACs) cannot be higher than the surface area of all sites (pSCIs, SCIs and SACs).
status: valid
status modified: 2017-11-23
accepted date: 2017-11-23
in scheme: QaQc
error type: ERROR

Incorrect data format.
type: Concept
notation: S512
definition: Numeric field, only decimals greater or equal 0 are permitted.
status: valid
status modified: 2017-11-23
accepted date: 2017-11-23
in scheme: QaQc
error type: ERROR

Incoherent information.
type: Concept
notation: G017
definition: The surface area of marine sites (pSCIs, SCIs and SACs) cannot be higher than the surface area of all sites (pSCIs, SCIs and SACs).
status: valid
status modified: 2017-11-23
accepted date: 2017-11-23
in scheme: QaQc
error type: ERROR

3.3b2max Statistics/quantity on season/year 2- max should be �?� min.
type: Concept
notation: S513
status: valid
status modified: 2017-11-23
accepted date: 2017-11-23
in scheme: QaQc
error type: ERROR

Incoherent information.
type: Concept
notation: G018
definition: The surface area of terrestrial sites (pSCIs, SCIs and SACs) plus the surface area of marine sites (pSCIs, SCIs and SACs) together should give the surface area of all sites (pSCIs, SCIs and SACs).
status: valid
status modified: 2017-11-23
accepted date: 2017-11-23
in scheme: QaQc
error type: ERROR

Invalid code.
type: Concept
notation: S514
definition: Code should be 'Yes' or 'No'.
status: valid
status modified: 2017-11-23
accepted date: 2017-11-23
in scheme: QaQc
error type: ERROR

Mandatory information missing.
type: Concept
notation: G019
definition: The surface area of all sites (pSCIs, SCIs, SACs) should be provided.
status: valid
status modified: 2017-11-23
accepted date: 2017-11-23
in scheme: QaQc
error type: ERROR

Incorrect data format.
type: Concept
notation: S515
definition: This field cannot be empty. Code should be 'Yes' or 'No'.
status: valid
status modified: 2017-11-23
accepted date: 2017-11-23
in scheme: QaQc
error type: ERROR

Incorrect data format.
type: Concept
notation: G020
definition: Numeric field, only integers greater than 0 are permitted.
status: valid
status modified: 2017-11-23
accepted date: 2017-11-23
in scheme: QaQc
error type: ERROR

Min/max value should be provided systematically for all seasons.
type: Concept
notation: S516
definition: Report '0' if no hunting bag orThere was a temporary ban.
status: valid
status modified: 2017-11-23
accepted date: 2017-11-23
in scheme: QaQc
error type: ERROR

Incoherent information.
type: Concept
notation: G021
definition: The total number of marine SACs cannot be higher than the total number of all SACs.
status: valid
status modified: 2017-11-23
accepted date: 2017-11-23
in scheme: QaQc
error type: ERROR

Incoherent information.
type: Concept
notation: S517
definition: Only min/max or unknown value is expected for 3.3.b3 Statistics/quantity per hunting season or year over the reporting period - Season/year3.
status: valid
status modified: 2017-11-23
accepted date: 2017-11-23
in scheme: QaQc
error type: ERROR

Mandatory information missing.
type: Concept
notation: G022
definition: The total number of all SACs should be provided.
status: valid
status modified: 2017-11-23
accepted date: 2017-11-23
in scheme: QaQc
error type: ERROR

Mandatory information missing.
type: Concept
notation: S518
definition: Statistics/quantity per hunting season or year over the reporting period - Season/year3 should be provided (3.3.b3min, 3.3.b3max, 3.3.b3x).
status: valid
status modified: 2017-11-23
accepted date: 2017-11-23
in scheme: QaQc
error type: ERROR

Incorrect data format.
type: Concept
notation: G023
definition: Numeric field, only decimals greater than 0 are permitted.
status: valid
status modified: 2017-11-23
accepted date: 2017-11-23
in scheme: QaQc
error type: ERROR

Incorrect data format.
type: Concept
notation: S519
definition: Numeric field, only decimals greater or equal 0 are permitted.
status: valid
status modified: 2017-11-23
accepted date: 2017-11-23
in scheme: QaQc
error type: ERROR

Incoherent information.
type: Concept
notation: G024
definition: The surface area of terrestrial SACs cannot be higher than the surface area of all SACs.
status: valid
status modified: 2017-11-23
accepted date: 2017-11-23
in scheme: QaQc
error type: ERROR

Incorrect data format.
type: Concept
notation: S520
definition: Numeric field, only decimals greater or equal 0 are permitted.
status: valid
status modified: 2017-11-23
accepted date: 2017-11-23
in scheme: QaQc
error type: ERROR

Incoherent information.
type: Concept
notation: G025
definition: The surface area of marine SACs cannot be higher than the surface area of all SACs.
status: valid
status modified: 2017-11-23
accepted date: 2017-11-23
in scheme: QaQc
error type: ERROR

3.3b3max Statistics/quantity on season/year 3- max should be �?� min.
type: Concept
notation: S521
status: valid
status modified: 2017-11-23
accepted date: 2017-11-23
in scheme: QaQc
error type: ERROR

Incoherent information.
type: Concept
notation: G026
definition: The surface area of terrestrial SACs plus the surface area of marine SACs together should give the surface area of all SACs.
status: valid
status modified: 2017-11-23
accepted date: 2017-11-23
in scheme: QaQc
error type: WARNING

Invalid code.
type: Concept
notation: S522
definition: Code should be 'Yes' or 'No'.
status: valid
status modified: 2017-11-23
accepted date: 2017-11-23
in scheme: QaQc
error type: ERROR

Mandatory information missing.
type: Concept
notation: G027
definition: The surface area of all SACs should be provided.
status: valid
status modified: 2017-11-23
accepted date: 2017-11-23
in scheme: QaQc
error type: ERROR

Incorrect data format.
type: Concept
notation: S523
definition: This field cannot be empty. Code should be 'Yes' or 'No'.
status: valid
status modified: 2017-11-23
accepted date: 2017-11-23
in scheme: QaQc
error type: ERROR

Incorrect data format.
type: Concept
notation: G028
definition: Numeric field, only decimals greater than 0 are permitted.
status: valid
status modified: 2017-11-23
accepted date: 2017-11-23
in scheme: QaQc
error type: ERROR

Min/max value should be provided systematically for all seasons.
type: Concept
notation: S524
definition: Report '0' if no hunting bag orThere was a temporary ban.
status: valid
status modified: 2017-11-23
accepted date: 2017-11-23
in scheme: QaQc
error type: ERROR

Incoherent information.
type: Concept
notation: G029
definition: The surface area of terrestrial SACs cannot be higher than the surface area of terrestrial sites (pSCIs, SCIs and SACs).
status: valid
status modified: 2017-11-23
accepted date: 2017-11-23
in scheme: QaQc
error type: ERROR

Incoherent information.
type: Concept
notation: S525
definition: Only min/max or unknown value is expected for 3.3.b4 Statistics/quantity per hunting season or year over the reporting period - Season/year4.
status: valid
status modified: 2017-11-23
accepted date: 2017-11-23
in scheme: QaQc
error type: ERROR

Mandatory information missing.
type: Concept
notation: G030
definition: The surface area of terrestrial sites (pSCIs, SCIs, SACs) should be provided.
status: valid
status modified: 2017-11-23
accepted date: 2017-11-23
in scheme: QaQc
error type: ERROR

Mandatory information missing.
type: Concept
notation: S526
definition: Statistics/quantity per hunting season or year over the reporting period - Season/year4 should be provided (3.3.b4min, 3.3.b4max, 3.3.b4x).
status: valid
status modified: 2017-11-23
accepted date: 2017-11-23
in scheme: QaQc
error type: ERROR

Incorrect data format.
type: Concept
notation: G031
definition: Numeric field, only decimals greater than 0 are permitted.
status: valid
status modified: 2017-11-23
accepted date: 2017-11-23
in scheme: QaQc
error type: ERROR

Incorrect data format.
type: Concept
notation: S527
definition: Numeric field, only decimals greater or equal 0 are permitted.
status: valid
status modified: 2017-11-23
accepted date: 2017-11-23
in scheme: QaQc
error type: ERROR

Mandatory information missing.
type: Concept
notation: G032
definition: The surface area of terrestrial SACs should be provided.
status: valid
status modified: 2017-11-23
accepted date: 2017-11-23
in scheme: QaQc
error type: ERROR

Incorrect data format.
type: Concept
notation: S528
definition: Numeric field, only decimals greater or equal 0 are permitted.
status: valid
status modified: 2017-11-23
accepted date: 2017-11-23
in scheme: QaQc
error type: ERROR

Incorrect data format.
type: Concept
notation: G033
definition: Numeric field, only integers greater than 0 are permitted.
status: valid
status modified: 2017-11-23
accepted date: 2017-11-23
in scheme: QaQc
error type: ERROR

3.3b4max Statistics/quantity on season/year 4- max should be �?� min.
type: Concept
notation: S529
status: valid
status modified: 2017-11-23
accepted date: 2017-11-23
in scheme: QaQc
error type: ERROR

Incoherent information.
type: Concept
notation: G034
definition: The total number of marine SACs cannot be higher than the total number of marine sites (pSCIs, SCIs and SACs).
status: valid
status modified: 2017-11-23
accepted date: 2017-11-23
in scheme: QaQc
error type: ERROR

Invalid code.
type: Concept
notation: S530
definition: Code should be 'Yes' or 'No'.
status: valid
status modified: 2017-11-23
accepted date: 2017-11-23
in scheme: QaQc
error type: ERROR

Mandatory information missing.
type: Concept
notation: G035
definition: The total number of marine sites (pSCIs, SCIs and SACs) should be provided.
status: valid
status modified: 2017-11-23
accepted date: 2017-11-23
in scheme: QaQc
error type: ERROR

Incorrect data format.
type: Concept
notation: S531
definition: This field cannot be empty. Code should be 'Yes' or 'No'.
status: valid
status modified: 2017-11-23
accepted date: 2017-11-23
in scheme: QaQc
error type: ERROR

Incorrect data format.
type: Concept
notation: G036
definition: Numeric field, only integers greater than 0 are permitted.
status: valid
status modified: 2017-11-23
accepted date: 2017-11-23
in scheme: QaQc
error type: ERROR

Min/max value should be provided systematically for all seasons.
type: Concept
notation: S532
definition: Report '0' if no hunting bag orThere was a temporary ban.
status: valid
status modified: 2017-11-23
accepted date: 2017-11-23
in scheme: QaQc
error type: ERROR

Incoherent information.
type: Concept
notation: G037
definition: The surface area of marine SACs cannot be higher than the surface area of marine sites (pSCIs, SCIs and SACs).
status: valid
status modified: 2017-11-23
accepted date: 2017-11-23
in scheme: QaQc
error type: ERROR

Incoherent information.
type: Concept
notation: S533
definition: Only min/max or unknown value is expected for 3.3.b5 Statistics/quantity per hunting season or year over the reporting period - Season/year5.
status: valid
status modified: 2017-11-23
accepted date: 2017-11-23
in scheme: QaQc
error type: ERROR

Mandatory information missing.
type: Concept
notation: G038
definition: The surface area of marine sites (pSCIs, SCIs and SACs) should be provided.
status: valid
status modified: 2017-11-23
accepted date: 2017-11-23
in scheme: QaQc
error type: ERROR

Mandatory information missing.
type: Concept
notation: S534
definition: Statistics/quantity per hunting season or year over the reporting period - Season/year5 should be provided (3.3.b5min, 3.3.b5max, 3.3.b5x).
status: valid
status modified: 2017-11-23
accepted date: 2017-11-23
in scheme: QaQc
error type: ERROR

Incorrect data format.
type: Concept
notation: G039
definition: Numeric field, only integers greater than 0 are permitted.
status: valid
status modified: 2017-11-23
accepted date: 2017-11-23
in scheme: QaQc
error type: ERROR

Incorrect data format.
type: Concept
notation: S535
definition: Numeric field, only decimals greater or equal 0 are permitted.
status: valid
status modified: 2017-11-23
accepted date: 2017-11-23
in scheme: QaQc
error type: ERROR

Mandatory information missing.
type: Concept
notation: G040
definition: The total number of marine SACs should be provided.
status: valid
status modified: 2017-11-23
accepted date: 2017-11-23
in scheme: QaQc
error type: ERROR

Incorrect data format.
type: Concept
notation: S536
definition: Numeric field, only decimals greater or equal 0 are permitted.
status: valid
status modified: 2017-11-23
accepted date: 2017-11-23
in scheme: QaQc
error type: ERROR

Incorrect data format.
type: Concept
notation: G041
definition: Numeric field, only integers greater than 0 are permitted.
status: valid
status modified: 2017-11-23
accepted date: 2017-11-23
in scheme: QaQc
error type: ERROR

3.3b5max Statistics/quantity on season/year 5- max should be �?� min.
type: Concept
notation: S537
status: valid
status modified: 2017-11-23
accepted date: 2017-11-23
in scheme: QaQc
error type: ERROR

Mandatory information missing.
type: Concept
notation: G042
definition: The surface area of marine SACs should be provided.
status: valid
status modified: 2017-11-23
accepted date: 2017-11-23
in scheme: QaQc
error type: ERROR

Invalid code.
type: Concept
notation: S538
definition: Code should be 'Yes' or 'No'.
status: valid
status modified: 2017-11-23
accepted date: 2017-11-23
in scheme: QaQc
error type: ERROR

Mandatory information missing.
type: Concept
notation: G043
definition: The date of the last database delivered during the reporting period (2013 - 2018) is expected.
status: valid
status modified: 2017-11-23
accepted date: 2017-11-23
in scheme: QaQc
error type: ERROR

Incorrect data format.
type: Concept
notation: S539
definition: This field cannot be empty. Code should be 'Yes' or 'No'.
status: valid
status modified: 2017-11-23
accepted date: 2017-11-23
in scheme: QaQc
error type: ERROR

Incorrect data format.
type: Concept
notation: G044
definition: Numeric field, only integers greater than 0 are permitted.
status: valid
status modified: 2017-11-23
accepted date: 2017-11-23
in scheme: QaQc
error type: ERROR

Min/max value should be provided systematically for all seasons.
type: Concept
notation: S540
definition: Report '0' if no hunting bag orThere was a temporary ban.
status: valid
status modified: 2017-11-23
accepted date: 2017-11-23
in scheme: QaQc
error type: ERROR

Mandatory information missing.
type: Concept
notation: G045
definition: The total number of SACs for which necessary conservation measures have been established should be provided.
status: valid
status modified: 2017-11-23
accepted date: 2017-11-23
in scheme: QaQc
error type: ERROR

Incoherent information.
type: Concept
notation: S541
definition: Only min/max or unknown value is expected for 3.3.b6 Statistics/quantity per hunting season or year over the reporting period - Season/year6.
status: valid
status modified: 2017-11-23
accepted date: 2017-11-23
in scheme: QaQc
error type: ERROR

Incorrect data format.
type: Concept
notation: G046
definition: Numeric field, only decimals greater than 0 are permitted.
status: valid
status modified: 2017-11-23
accepted date: 2017-11-23
in scheme: QaQc
error type: ERROR

Mandatory information missing.
type: Concept
notation: S542
definition: Statistics/quantity per hunting season or year over the reporting period - Season/year5 should be provided (3.3.b6min, 3.3.b6max, 3.3.b6x).
status: valid
status modified: 2017-11-23
accepted date: 2017-11-23
in scheme: QaQc
error type: ERROR

Incoherent information.
type: Concept
notation: G047
definition: The proportion of the network area for which necessary conservation measures have been established should be between 0 and 100 %.
status: valid
status modified: 2017-11-23
accepted date: 2017-11-23
in scheme: QaQc
error type: ERROR

Incorrect data format.
type: Concept
notation: S543
definition: Numeric field, only decimals greater or equal 0 are permitted.
status: valid
status modified: 2017-11-23
accepted date: 2017-11-23
in scheme: QaQc
error type: ERROR

Mandatory information missing.
type: Concept
notation: G048
definition: The proportion of the network area for which necessary conservation measures have been established should be provided.
status: valid
status modified: 2017-11-23
accepted date: 2017-11-23
in scheme: QaQc
error type: ERROR

Incorrect data format.
type: Concept
notation: S544
definition: Numeric field, only decimals greater or equal 0 are permitted.
status: valid
status modified: 2017-11-23
accepted date: 2017-11-23
in scheme: QaQc
error type: ERROR

Incorrect data format.
type: Concept
notation: G049
definition: Numeric field, only integers greater than 0 are permitted.
status: valid
status modified: 2017-11-23
accepted date: 2017-11-23
in scheme: QaQc
error type: ERROR

3.3b6max Statistics/quantity on season/year 6- max should be �?� min.
type: Concept
notation: S545
status: valid
status modified: 2017-11-23
accepted date: 2017-11-23
in scheme: QaQc
error type: ERROR

Mandatory information missing.
type: Concept
notation: G050
definition: The total number of SACs for which a comprehensive management plan or a similar instrument is in place should be provided.
status: valid
status modified: 2017-11-23
accepted date: 2017-11-23
in scheme: QaQc
error type: ERROR

Invalid code.
type: Concept
notation: S546
definition: Code should be 'Yes' or 'No'.
status: valid
status modified: 2017-11-23
accepted date: 2017-11-23
in scheme: QaQc
error type: ERROR

Incorrect data format.
type: Concept
notation: G051
definition: Numeric field, only decimals greater than 0 are permitted.
status: valid
status modified: 2017-11-23
accepted date: 2017-11-23
in scheme: QaQc
error type: ERROR

Incorrect data format.
type: Concept
notation: S547
definition: This field cannot be empty. Code should be 'Yes' or 'No'.
status: valid
status modified: 2017-11-23
accepted date: 2017-11-23
in scheme: QaQc
error type: ERROR

Incoherent information.
type: Concept
notation: G052
definition: The proportion of the network area for a comprehensive management plan or a similar instrument is in place should be between 0 and 100 %.
status: valid
status modified: 2017-11-23
accepted date: 2017-11-23
in scheme: QaQc
error type: ERROR

Invalid code.
type: Concept
notation: S058
definition: Please check the vocabulary methodsUsed.
status: valid
status modified: 2017-11-23
accepted date: 2017-11-23
in scheme: QaQc
error type: BLOCKER

Mandatory information missing.
type: Concept
notation: G053
definition: The proportion of the network area for which a comprehensive management plan or a similar instrument is in place should be provided.
status: valid
status modified: 2017-11-23
accepted date: 2017-11-23
in scheme: QaQc
error type: ERROR

Mandatory information missing.
type: Concept
notation: S059
definition: The method should be provided. In case the information to be reported in this section is not available use 'AbsentData - Insufficient or no data available'.
status: valid
status modified: 2017-11-23
accepted date: 2017-11-23
in scheme: QaQc
error type: ERROR

Incorrect data format.
type: Concept
notation: G054
definition: The site code should contain 9 characters (letters and numbers).
status: valid
status modified: 2017-11-23
accepted date: 2017-11-23
in scheme: QaQc
error type: WARNING

Invalid code.
type: Concept
notation: S060
definition: Please check the vocabulary bioGeoReg.
status: valid
status modified: 2017-11-23
accepted date: 2017-11-23
in scheme: QaQc
error type: BLOCKER

Incoherent information.
type: Concept
notation: G055
definition: The site name should be provided in addition to the sitecode.
status: valid
status modified: 2017-11-23
accepted date: 2017-11-23
in scheme: QaQc
error type: ERROR

Mandatory information missing.
type: Concept
notation: S061
definition: Information on Biological or marine region is expected for mandatory report.
status: valid
status modified: 2017-11-23
accepted date: 2017-11-23
in scheme: QaQc
error type: ERROR

Incoherent information.
type: Concept
notation: G056
definition: The title of project/plan should be provided.
status: valid
status modified: 2017-11-23
accepted date: 2017-11-23
in scheme: QaQc
error type: ERROR

Incorrect data format.
type: Concept
notation: S062
definition: Numeric field, only decimals greater or equal 0 is permitted.
status: valid
status modified: 2017-11-23
accepted date: 2017-11-23
in scheme: QaQc
error type: ERROR

Incoherent information.
type: Concept
notation: G057
definition: The year when Commission was informed about compensatory measures should be provided.
status: valid
status modified: 2017-11-23
accepted date: 2017-11-23
in scheme: QaQc
error type: ERROR

Mandatory information missing.
type: Concept
notation: S063
definition: Surface area should be provided.
status: valid
status modified: 2017-11-23
accepted date: 2017-11-23
in scheme: QaQc
error type: ERROR

Incoherent information.
type: Concept
notation: G058
definition: The year when project/plan was started to be implemented should be provided.
status: valid
status modified: 2017-11-23
accepted date: 2017-11-23
in scheme: QaQc
error type: ERROR

Incorrect data format.
type: Concept
notation: S064
definition: Format must be YYYY-YYYY.
status: valid
status modified: 2017-11-23
accepted date: 2017-11-23
in scheme: QaQc
error type: ERROR

Invalid code.
type: Concept
notation: G059
definition: Code should be 'Yes' or 'No'.
status: valid
status modified: 2017-11-23
accepted date: 2017-11-23
in scheme: QaQc
error type: BLOCKER

Incoherent information.
type: Concept
notation: S065
definition: Year1 should be lower or equal than year2.
status: valid
status modified: 2017-11-23
accepted date: 2017-11-23
in scheme: QaQc
error type: ERROR

Incoherent information.
type: Concept
notation: G060
definition: Indicate whether a Commission opinion was requested.
status: valid
status modified: 2017-11-23
accepted date: 2017-11-23
in scheme: QaQc
error type: ERROR

Mandatory information missing.
type: Concept
notation: S066
definition: Period should be provided.
status: valid
status modified: 2017-11-23
accepted date: 2017-11-23
in scheme: QaQc
error type: ERROR

Mandatory information missing.
type: Concept
notation: G061
definition: A general description of the main measures taken is expected.
status: valid
status modified: 2017-11-23
accepted date: 2017-11-23
in scheme: QaQc
error type: ERROR

Invalid code.
type: Concept
notation: S067
definition: Please check the vocabulary trends.
status: valid
status modified: 2017-11-23
accepted date: 2017-11-23
in scheme: QaQc
error type: BLOCKER

Invalid code.
type: Concept
notation: G062
definition: Please check the vocabulary HDspecies.
status: valid
status modified: 2017-11-23
accepted date: 2017-11-23
in scheme: QaQc
error type: BLOCKER

Mandatory information missing.
type: Concept
notation: S068
definition: Trend should be provided. In case the information to be reported in this section is not available use 'Unk - unknown'.
status: valid
status modified: 2017-11-23
accepted date: 2017-11-23
in scheme: QaQc
error type: ERROR

Incoherent information.
type: Concept
notation: G063
definition: This section is to report on the reintroduction of Annex IV species only.
status: valid
status modified: 2017-11-23
accepted date: 2017-11-23
in scheme: QaQc
error type: WARNING

Incorrect data format.
type: Concept
notation: S069
definition: Numeric field, only decimals greater or equal 0 are permitted.
status: valid
status modified: 2017-11-23
accepted date: 2017-11-23
in scheme: QaQc
error type: ERROR

Incoherent information.
type: Concept
notation: G064
definition: The combination species code/scientific name should exist in the look up table lu_hd_species.
status: valid
status modified: 2017-11-23
accepted date: 2017-11-23
in scheme: QaQc
error type: WARNING

Incorrect data format.
type: Concept
notation: S070
definition: Numeric field, only decimals greater or equal 0 are permitted.
status: valid
status modified: 2017-11-23
accepted date: 2017-11-23
in scheme: QaQc
error type: ERROR

Incoherent information.
type: Concept
notation: G065
definition: The scientific name should be provided.
status: valid
status modified: 2017-11-23
accepted date: 2017-11-23
in scheme: QaQc
error type: ERROR

5.4b Short-term trend Magnitude - max should be �?� min.
type: Concept
notation: S071
status: valid
status modified: 2017-11-23
accepted date: 2017-11-23
in scheme: QaQc
error type: ERROR

Incoherent information.
type: Concept
notation: G066
definition: The reintroduction period should be provided.
status: valid
status modified: 2017-11-23
accepted date: 2017-11-23
in scheme: QaQc
error type: ERROR

Invalid code.
type: Concept
notation: S072
definition: Please check the vocabulary methodsUsed.
status: valid
status modified: 2017-11-23
accepted date: 2017-11-23
in scheme: QaQc
error type: BLOCKER

Incoherent information.
type: Concept
notation: G067
definition: The name of the reintroduction location and number of individuals reintroduced should be provided.
status: valid
status modified: 2017-11-23
accepted date: 2017-11-23
in scheme: QaQc
error type: ERROR

Incoherent information.
type: Concept
notation: S073
definition: Inconsistent values provided in fields 5.3 Short-term trend Direction and 5.5 Short-term trend Method used. when the method is 'AbsentData - Insufficient or no data available',The trend cannot be defined. If you want to report a trend as stable, increasing or decreasing based on a method using limited data,Please select 'estimateExpert - Based mainly on expert opinion with very limited data' for the method used
status: valid
status modified: 2017-11-23
accepted date: 2017-11-23
in scheme: QaQc
error type: WARNING

Invalid code.
type: Concept
notation: G068
definition: Please check the vocabulary yesNoTooEearly.
status: valid
status modified: 2017-11-23
accepted date: 2017-11-23
in scheme: QaQc
error type: BLOCKER

Mandatory information missing.
type: Concept
notation: S074
definition: The method should be provided. In case the information to be reported in this section is not available use 'AbsentData - Insufficient or no data available'.
status: valid
status modified: 2017-11-23
accepted date: 2017-11-23
in scheme: QaQc
error type: ERROR

Incoherent information.
type: Concept
notation: G069
definition: The question on successful introduction should be answered.
status: valid
status modified: 2017-11-23
accepted date: 2017-11-23
in scheme: QaQc
error type: ERROR

Incorrect data format.
type: Concept
notation: S075
definition: Incorrect data format, it must be YYYY-YYYY.
status: valid
status modified: 2017-11-23
accepted date: 2017-11-23
in scheme: QaQc
error type: ERROR

Incoherent information.
type: Concept
notation: S076
definition: Year1 should be lower or equal than year2.
status: valid
status modified: 2017-11-23
accepted date: 2017-11-23
in scheme: QaQc
error type: ERROR

Invalid code.
type: Concept
notation: S077
definition: Please check the vocabulary trends.
status: valid
status modified: 2017-11-23
accepted date: 2017-11-23
in scheme: QaQc
error type: BLOCKER

Incorrect data format.
type: Concept
notation: S078
definition: Numeric field, only decimals greater or equal 0 are permitted.
status: valid
status modified: 2017-11-23
accepted date: 2017-11-23
in scheme: QaQc
error type: ERROR

Incorrect data format.
type: Concept
notation: S079
definition: Numeric field, only decimals greater or equal 0 are permitted.
status: valid
status modified: 2017-11-23
accepted date: 2017-11-23
in scheme: QaQc
error type: ERROR

5.8b Long-term trend Magnitude - max should be �?� min.
type: Concept
notation: S080
status: valid
status modified: 2017-11-23
accepted date: 2017-11-23
in scheme: QaQc
error type: ERROR

Invalid code.
type: Concept
notation: S081
definition: Please check the vocabulary methodsUsed.
status: valid
status modified: 2017-11-23
accepted date: 2017-11-23
in scheme: QaQc
error type: BLOCKER

Only one of 5.10a, b or c Favourable reference range should be filled in.
type: Concept
notation: S082
definition: If an operator is used,There is no need to insert a value. if the value is provided for range in km��, no operator should be used. Moreover,The use of 'x - unknown' is not compatible withThe use of value or operators.
status: valid
status modified: 2017-11-23
accepted date: 2017-11-23
in scheme: QaQc
error type: ERROR

Mandatory information missing.
type: Concept
notation: S083
definition: Information on Favourable reference range should be provided (5.10a, b or c). In case the information to be reported in this section is not available use 'x - unknown' in 5.10c, knowingThe use of operators should help to reduceThe use of 'unknown' to a minimum.
status: valid
status modified: 2017-11-23
accepted date: 2017-11-23
in scheme: QaQc
error type: ERROR

Incorrect data format.
type: Concept
notation: S084
definition: Numeric field, only decimals greater or equal 0 is permitted.
status: valid
status modified: 2017-11-23
accepted date: 2017-11-23
in scheme: QaQc
error type: ERROR

Incoherent information.
type: Concept
notation: S085
definition: The Favourable reference range is smaller than 5.1 Surface area. Check whether this is on purpose.
status: valid
status modified: 2017-11-23
accepted date: 2017-11-23
in scheme: QaQc
error type: WARNING

Invalid code.
type: Concept
notation: S086
definition: Please check the vocabulary favourableOperator.
status: valid
status modified: 2017-11-23
accepted date: 2017-11-23
in scheme: QaQc
error type: ERROR

Invalid code.
type: Concept
notation: S087
definition: Only 'x - unknown' is allowed in this section.
status: valid
status modified: 2017-11-23
accepted date: 2017-11-23
in scheme: QaQc
error type: BLOCKER

Invalid code.
type: Concept
notation: S088
definition: Please check the vocabulary reasonChange.
status: valid
status modified: 2017-11-23
accepted date: 2017-11-23
in scheme: QaQc
error type: BLOCKER

Incoherent information.
type: Concept
notation: S089
definition: Incoherent information in this section. If 'noChange' is selected,There is no need to explain the nature of change.
status: valid
status modified: 2017-11-23
accepted date: 2017-11-23
in scheme: QaQc
error type: ERROR

Incoherent information.
type: Concept
notation: S090
definition: Incoherent information in this section. Only one main reason is expected.
status: valid
status modified: 2017-11-23
accepted date: 2017-11-23
in scheme: QaQc
error type: ERROR

Mandatory information missing.
type: Concept
notation: S092
definition: Indicate if there is any change sinceThe previous reporting period (2007 - 2012) in the range surface area reported. Report 'noChange' if the answer to the question: 'Is there a change between reporting periods?' is 'No'. ProvideThe nature of that change (more than one option can be chosen) if the answer is 'Yes'.
status: valid
status modified: 2017-11-23
accepted date: 2017-11-23
in scheme: QaQc
error type: ERROR

Incorrect data format.
type: Concept
notation: S093
definition: Incorrect data format, it must be YYYY or YYYY-YYYY.
status: valid
status modified: 2017-11-23
accepted date: 2017-11-23
in scheme: QaQc
error type: ERROR

Incoherent information.
type: Concept
notation: S094
definition: Year1 should be lower or equal than year2.
status: valid
status modified: 2017-11-23
accepted date: 2017-11-23
in scheme: QaQc
error type: ERROR

Mandatory information missing.
type: Concept
notation: S095
definition: The year or period should be provided.
status: valid
status modified: 2017-11-23
accepted date: 2017-11-23
in scheme: QaQc
error type: ERROR

Invalid code.
type: Concept
notation: S096
definition: Please check the vocabulary populationUnits.
status: valid
status modified: 2017-11-23
accepted date: 2017-11-23
in scheme: QaQc
error type: BLOCKER

Incoherent information.
type: Concept
notation: S097
definition: The reported population unit differs withThe recommended unit in the checklist onThe reference portal.
status: valid
status modified: 2017-11-23
accepted date: 2017-11-23
in scheme: QaQc
error type: ERROR

Incoherent information.
type: Concept
notation: S031
definition: If a Member State wishes to report population size using a different unit this can be reported in field 6.4, but this must be in addition to the reporting unit specified in the checklist and not as an alternative.
status: valid
status modified: 2017-11-23
accepted date: 2017-11-23
in scheme: QaQc
error type: ERROR

Incoherent information.
type: Concept
notation: S098
definition: Population size unit (6.2a) cannot be empty when Population size (6.2b,c,d) is provided.
status: valid
status modified: 2017-11-23
accepted date: 2017-11-23
in scheme: QaQc
error type: ERROR

Mandatory information missing.
type: Concept
notation: S099
definition: Population size unit should be provided.
status: valid
status modified: 2017-11-23
accepted date: 2017-11-23
in scheme: QaQc
error type: ERROR

Incorrect data format.
type: Concept
notation: S100
definition: Numeric field, only decimals greater or equal 0 are permitted.
status: valid
status modified: 2017-11-23
accepted date: 2017-11-23
in scheme: QaQc
error type: ERROR

Incorrect data format.
type: Concept
notation: S101
definition: Numeric field, only decimals greater or equal 0 are permitted.
status: valid
status modified: 2017-11-23
accepted date: 2017-11-23
in scheme: QaQc
error type: ERROR

6.2c Population size - max should be �?� min.
type: Concept
notation: S102
status: valid
status modified: 2017-11-23
accepted date: 2017-11-23
in scheme: QaQc
error type: ERROR

Incorrect data format.
type: Concept
notation: S103
definition: Numeric field, only decimals greater or equal 0 are permitted.
status: valid
status modified: 2017-11-23
accepted date: 2017-11-23
in scheme: QaQc
error type: ERROR

Mandatory information missing.
type: Concept
notation: S104
definition: Population size should be provided as interval (6.2b, c) and/or single value (6.2d).
status: valid
status modified: 2017-11-23
accepted date: 2017-11-23
in scheme: QaQc
error type: ERROR

Invalid code.
type: Concept
notation: S105
definition: Please check the vocabulary typeEstimate.
status: valid
status modified: 2017-11-23
accepted date: 2017-11-23
in scheme: QaQc
error type: BLOCKER

Incoherent information.
type: Concept
notation: S106
definition: The value 'mean - multi-year mean' is allowed in this section.
status: valid
status modified: 2017-11-23
accepted date: 2017-11-23
in scheme: QaQc
error type: WARNING

Mandatory information missing.
type: Concept
notation: S107
definition: The type of estimate for population size should be provided.
status: valid
status modified: 2017-11-23
accepted date: 2017-11-23
in scheme: QaQc
error type: ERROR

Invalid code.
type: Concept
notation: S108
definition: Please check the vocabulary populationUnits.
status: valid
status modified: 2017-11-23
accepted date: 2017-11-23
in scheme: QaQc
error type: ERROR

Incoherent information.
type: Concept
notation: S032
definition: The reported additional population unit is similar to the recommended unit in the checklist onThe reference portal.The reported additional population unit should be converted to the reporting unit in field 6.2.
status: valid
status modified: 2017-11-23
accepted date: 2017-11-23
in scheme: QaQc
error type: WARNING

Incoherent information.
type: Concept
notation: S109
definition: Additional population size unit (6.4a) cannot be empty when Additional population size (6.4b,c,d) is provided.
status: valid
status modified: 2017-11-23
accepted date: 2017-11-23
in scheme: QaQc
error type: ERROR

Incorrect data format.
type: Concept
notation: S110
definition: Numeric field, only decimals greater or equal 0 are permitted.
status: valid
status modified: 2017-11-23
accepted date: 2017-11-23
in scheme: QaQc
error type: ERROR

Incorrect data format.
type: Concept
notation: S111
definition: Numeric field, only decimals greater or equal 0 are permitted.
status: valid
status modified: 2017-11-23
accepted date: 2017-11-23
in scheme: QaQc
error type: ERROR

6.4c Additional population size - max should be �?� min.
type: Concept
notation: S112
status: valid
status modified: 2017-11-23
accepted date: 2017-11-23
in scheme: QaQc
error type: ERROR

Invalid code.
type: Concept
notation: S113
definition: Please check the vocabulary typeEstimate.
status: valid
status modified: 2017-11-23
accepted date: 2017-11-23
in scheme: QaQc
error type: BLOCKER

Invalid code.
type: Concept
notation: S114
definition: Please check the vocabulary methodsUsed.
status: valid
status modified: 2017-11-23
accepted date: 2017-11-23
in scheme: QaQc
error type: BLOCKER

Incoherent information.
type: Concept
notation: S115
definition: 6.3 Type of estimate should be empty when Population size Method used is 'AbsentData - Insufficient or no data available'.
status: valid
status modified: 2017-11-23
accepted date: 2017-11-23
in scheme: QaQc
error type: WARNING

Mandatory information missing.
type: Concept
notation: S116
definition: The method should be provided. In case the information to be reported in this section is not available use 'AbsentData - Insufficient or no data available'.
status: valid
status modified: 2017-11-23
accepted date: 2017-11-23
in scheme: QaQc
error type: ERROR

Incorrect data format.
type: Concept
notation: S117
definition: Incorrect data format, it must be YYYY-YYYY.
status: valid
status modified: 2017-11-23
accepted date: 2017-11-23
in scheme: QaQc
error type: ERROR

Incoherent information.
type: Concept
notation: S118
definition: Year1 should be lower or equal than year2.
status: valid
status modified: 2017-11-23
accepted date: 2017-11-23
in scheme: QaQc
error type: ERROR

Mandatory information missing.
type: Concept
notation: S119
definition: The period should be provided.
status: valid
status modified: 2017-11-23
accepted date: 2017-11-23
in scheme: QaQc
error type: ERROR

Invalid code.
type: Concept
notation: S120
definition: Please check the vocabulary trends.
status: valid
status modified: 2017-11-23
accepted date: 2017-11-23
in scheme: QaQc
error type: BLOCKER

Mandatory information missing.
type: Concept
notation: S121
definition: Trend should be provided. In case the information to be reported in this section is not available use 'Unk - unknown'.
status: valid
status modified: 2017-11-23
accepted date: 2017-11-23
in scheme: QaQc
error type: ERROR

Incorrect data format.
type: Concept
notation: S122
definition: Numeric field, only decimals greater or equal 0 are permitted.
status: valid
status modified: 2017-11-23
accepted date: 2017-11-23
in scheme: QaQc
error type: ERROR

Incorrect data format.
type: Concept
notation: S123
definition: Numeric field, only decimals greater or equal 0 are permitted.
status: valid
status modified: 2017-11-23
accepted date: 2017-11-23
in scheme: QaQc
error type: ERROR

6.9b Short-term trend Magnitude - max should be �?� min.
type: Concept
notation: S124
status: valid
status modified: 2017-11-23
accepted date: 2017-11-23
in scheme: QaQc
error type: ERROR

Incorrect data format.
type: Concept
notation: S125
definition: Numeric field, only decimals greater or equal 0 are permitted.
status: valid
status modified: 2017-11-23
accepted date: 2017-11-23
in scheme: QaQc
error type: ERROR

Invalid code.
type: Concept
notation: S126
definition: Please check the vocabulary methodsUsed.
status: valid
status modified: 2017-11-23
accepted date: 2017-11-23
in scheme: QaQc
error type: BLOCKER

Incoherent information.
type: Concept
notation: S127
definition: Inconsistent values provided in fields 6.8 Short-term trend Direction and 6.10 Short-term trend Method used. when the method is assessed as 'AbsentData - Insufficient or no data available',The trend cannot be defined. If you want to report a trend as stable, increasing or decreasing based on a method using limited data,Please select 'estimateExpert - Based mainly on expert opinion with very limited data' for the method used
status: valid
status modified: 2017-11-23
accepted date: 2017-11-23
in scheme: QaQc
error type: WARNING

Mandatory information missing.
type: Concept
notation: S128
definition: The method should be provided. In case the information to be reported in this section is not available use 'AbsentData - Insufficient or no data available'.
status: valid
status modified: 2017-11-23
accepted date: 2017-11-23
in scheme: QaQc
error type: ERROR

Incorrect data format.
type: Concept
notation: S129
definition: Incorrect data format, it must be YYYY-YYYY.
status: valid
status modified: 2017-11-23
accepted date: 2017-11-23
in scheme: QaQc
error type: ERROR

Incoherent information.
type: Concept
notation: S130
definition: Year1 should be lower or equal than year2.
status: valid
status modified: 2017-11-23
accepted date: 2017-11-23
in scheme: QaQc
error type: ERROR

Invalid code.
type: Concept
notation: S131
definition: Please check the vocabulary trends.
status: valid
status modified: 2017-11-23
accepted date: 2017-11-23
in scheme: QaQc
error type: BLOCKER

Incorrect data format.
type: Concept
notation: S132
definition: Numeric field, only decimals greater or equal 0 are permitted.
status: valid
status modified: 2017-11-23
accepted date: 2017-11-23
in scheme: QaQc
error type: ERROR

Incorrect data format.
type: Concept
notation: S133
definition: Numeric field, only decimals greater or equal 0 are permitted.
status: valid
status modified: 2017-11-23
accepted date: 2017-11-23
in scheme: QaQc
error type: ERROR

6.13b Long-term trend Magnitude - max should be �?� min.
type: Concept
notation: S134
status: valid
status modified: 2017-11-23
accepted date: 2017-11-23
in scheme: QaQc
error type: ERROR

Incorrect data format.
type: Concept
notation: S135
definition: Numeric field, only decimals greater or equal 0 are permitted.
status: valid
status modified: 2017-11-23
accepted date: 2017-11-23
in scheme: QaQc
error type: ERROR

Invalid code.
type: Concept
notation: S136
definition: Please check the vocabulary methodsUsed.
status: valid
status modified: 2017-11-23
accepted date: 2017-11-23
in scheme: QaQc
error type: BLOCKER

Only one of 6.15a1, b or c Favourable reference population should be filled in.
type: Concept
notation: S137
definition: If an operator is used,There is no need to insert a value. if the value is provided for population size, no operator should be used. Moreover,The use of 'x - unknown' is not compatible withThe use of value or operators.
status: valid
status modified: 2017-11-23
accepted date: 2017-11-23
in scheme: QaQc
error type: ERROR

Mandatory information missing.
type: Concept
notation: S138
definition: Information on Favourable reference population should be provided (6.15a, b or c).
status: valid
status modified: 2017-11-23
accepted date: 2017-11-23
in scheme: QaQc
error type: ERROR

Incorrect data format.
type: Concept
notation: S139
definition: Numeric field, only decimals greater or equal 0 is permitted.
status: valid
status modified: 2017-11-23
accepted date: 2017-11-23
in scheme: QaQc
error type: ERROR

Incoherent information.
type: Concept
notation: S140
definition: The Favourable reference population size is smaller than 6.2The current population size. Check whether this is on purpose.
status: valid
status modified: 2017-11-23
accepted date: 2017-11-23
in scheme: QaQc
error type: WARNING

Incoherent information.
type: Concept
notation: S141
definition: The Favourable reference population size is smaller than 6.4The current additional population size. Check whether this is on purpose.
status: valid
status modified: 2017-11-23
accepted date: 2017-11-23
in scheme: QaQc
error type: WARNING

Invalid code.
type: Concept
notation: S142
definition: Please check the vocabulary populationUnits.
status: valid
status modified: 2017-11-23
accepted date: 2017-11-23
in scheme: QaQc
error type: ERROR

Incoherent information.
type: Concept
notation: S143
definition: The Favourable reference population size unit should correspond to the current recommended or additional population size (SpecReg.6.2a, SpecReg.6.4a).
status: valid
status modified: 2017-11-23
accepted date: 2017-11-23
in scheme: QaQc
error type: ERROR

Incoherent information.
type: Concept
notation: S548
definition: The Favourable reference population size unit (6.15a2) cannot be empty when the Favourable reference population size (6.15a1) is provided.
status: valid
status modified: 2017-11-23
accepted date: 2017-11-23
in scheme: QaQc
error type: ERROR

Invalid code.
type: Concept
notation: S144
definition: Please check the vocabulary favourableOperator.
status: valid
status modified: 2017-11-23
accepted date: 2017-11-23
in scheme: QaQc
error type: BLOCKER

Invalid code.
type: Concept
notation: S145
definition: Only 'x - unknown' is allowed in this section.
status: valid
status modified: 2017-11-23
accepted date: 2017-11-23
in scheme: QaQc
error type: BLOCKER

Invalid code.
type: Concept
notation: S146
definition: Please check the vocabulary reasonChange.
status: valid
status modified: 2017-11-23
accepted date: 2017-11-23
in scheme: QaQc
error type: BLOCKER

Incoherent information.
type: Concept
notation: S147
definition: Incoherent information in this section. If 'noChange' is selected,There is no need to explain the nature of change.
status: valid
status modified: 2017-11-23
accepted date: 2017-11-23
in scheme: QaQc
error type: ERROR

Incoherent information.
type: Concept
notation: S148
definition: Incoherent information in this section. Only one main reason is expected.
status: valid
status modified: 2017-11-23
accepted date: 2017-11-23
in scheme: QaQc
error type: ERROR

Mandatory information missing.
type: Concept
notation: S150
definition: Indicate if there is any change sinceThe previous reporting period (2007 - 2012) in the population size reported. Report 'noChange' if the answer to the question: 'Is there a change between reporting periods?' is 'No'. ProvideThe nature of that change (more than one option can be chosen) if the answer is 'Yes'.
status: valid
status modified: 2017-11-23
accepted date: 2017-11-23
in scheme: QaQc
error type: ERROR

Invalid code.
type: Concept
notation: S151
definition: Please check the vocabulary yesNoUnknown.
status: valid
status modified: 2017-11-23
accepted date: 2017-11-23
in scheme: QaQc
error type: BLOCKER

Mandatory information missing.
type: Concept
notation: S152
definition: Information onThe sufficiency and quality of occupied habitat area should be provided.
status: valid
status modified: 2017-11-23
accepted date: 2017-11-23
in scheme: QaQc
error type: ERROR

Invalid code.
type: Concept
notation: S153
definition: Please check the vocabulary yesNoUnknown.
status: valid
status modified: 2017-11-23
accepted date: 2017-11-23
in scheme: QaQc
error type: BLOCKER

Incoherent information.
type: Concept
notation: S154
definition: Incoherent information in this section. Information on unoccupied habitat area is only expected if the answer to the question: 'Are area and quality ofThe occupied habitat sufficient' is 'N - No'.
status: valid
status modified: 2017-11-23
accepted date: 2017-11-23
in scheme: QaQc
error type: ERROR

Mandatory information missing.
type: Concept
notation: S155
definition: Information related to unoccupied habitat area should be provided.
status: valid
status modified: 2017-11-23
accepted date: 2017-11-23
in scheme: QaQc
error type: ERROR

Invalid code.
type: Concept
notation: S156
definition: Please check the vocabulary methodsUsed.
status: valid
status modified: 2017-11-23
accepted date: 2017-11-23
in scheme: QaQc
error type: BLOCKER

Mandatory information missing.
type: Concept
notation: S157
definition: The method should be provided. In case the information to be reported in this section is not available use 'AbsentData - Insufficient or no data available'.
status: valid
status modified: 2017-11-23
accepted date: 2017-11-23
in scheme: QaQc
error type: ERROR

Incorrect data format.
type: Concept
notation: S158
definition: Incorrect data format, it must be YYYY-YYYY.
status: valid
status modified: 2017-11-23
accepted date: 2017-11-23
in scheme: QaQc
error type: ERROR

Incoherent information.
type: Concept
notation: S159
definition: Year1 should be lower or equal than year2.
status: valid
status modified: 2017-11-23
accepted date: 2017-11-23
in scheme: QaQc
error type: ERROR

Mandatory information missing.
type: Concept
notation: S160
definition: The period should be provided.
status: valid
status modified: 2017-11-23
accepted date: 2017-11-23
in scheme: QaQc
error type: ERROR

Invalid code.
type: Concept
notation: S161
definition: Please check the vocabulary trends.
status: valid
status modified: 2017-11-23
accepted date: 2017-11-23
in scheme: QaQc
error type: BLOCKER

Mandatory information missing.
type: Concept
notation: S162
definition: Trend should be provided. In case the information to be reported in this section is not available use 'Unk - unknown'.
status: valid
status modified: 2017-11-23
accepted date: 2017-11-23
in scheme: QaQc
error type: ERROR

Invalid code.
type: Concept
notation: S163
definition: Please check the vocabulary methodsUsed.
status: valid
status modified: 2017-11-23
accepted date: 2017-11-23
in scheme: QaQc
error type: BLOCKER

Incoherent information.
type: Concept
notation: S164
definition: Inconsistent values provided in fields 7.4 Short-term trend Direction and 7.5 Short-term trend Method used. when the method is assessed as 'AbsentData - Insufficient or no data available',The trend cannot be defined. If you want to report a trend as stable, increasing or decreasing based on a method using limited data,Please select 'estimateExpert - Based mainly on expert opinion with very limited data' for the method used
status: valid
status modified: 2017-11-23
accepted date: 2017-11-23
in scheme: QaQc
error type: WARNING

Mandatory information missing.
type: Concept
notation: S165
definition: The method should be provided. In case the information to be reported in this section is not available use 'AbsentData - Insufficient or no data available'.
status: valid
status modified: 2017-11-23
accepted date: 2017-11-23
in scheme: QaQc
error type: ERROR

Incorrect data format.
type: Concept
notation: S166
definition: Incorrect data format, it must be YYYY-YYYY.
status: valid
status modified: 2017-11-23
accepted date: 2017-11-23
in scheme: QaQc
error type: ERROR

Incoherent information.
type: Concept
notation: S167
definition: Year1 should be lower or equal than year2.
status: valid
status modified: 2017-11-23
accepted date: 2017-11-23
in scheme: QaQc
error type: ERROR

Invalid code.
type: Concept
notation: S168
definition: Please check the vocabulary trends.
status: valid
status modified: 2017-11-23
accepted date: 2017-11-23
in scheme: QaQc
error type: BLOCKER

Invalid code.
type: Concept
notation: S169
definition: Please check the vocabulary methodsUsed.
status: valid
status modified: 2017-11-23
accepted date: 2017-11-23
in scheme: QaQc
error type: BLOCKER

Invalid code.
type: Concept
notation: S170
definition: Please check the vocabulary threats.
status: valid
status modified: 2017-11-23
accepted date: 2017-11-23
in scheme: QaQc
error type: BLOCKER

More entries than permitted.
type: Concept
notation: S171
definition: More entries than permitted. Maximum of 10 pressures per biogeographical assessment.
status: valid
status modified: 2017-11-23
accepted date: 2017-11-23
in scheme: QaQc
error type: ERROR

More entries than permitted.
type: Concept
notation: S172
definition: More entries than permitted. Maximum of 10 threats per biogeographical assessment.
status: valid
status modified: 2017-11-23
accepted date: 2017-11-23
in scheme: QaQc
error type: ERROR

More entries than permitted.
type: Concept
notation: S173
definition: More entries than permitted. Maximum of 5 pressures with 'H - High importance' per biogeographical assessment.
status: valid
status modified: 2017-11-23
accepted date: 2017-11-23
in scheme: QaQc
error type: ERROR

More entries than permitted.
type: Concept
notation: S174
definition: More entries than permitted. Maximum of 5 threats with 'H - High importance' per biogeographical assessment.
status: valid
status modified: 2017-11-23
accepted date: 2017-11-23
in scheme: QaQc
error type: ERROR

Incoherent information.
type: Concept
notation: S175
definition: Incoherent information in this section. Code 'Xu - Unknown pressure' or 'Xxp - No pressures ' should be reported as a pressure, not as a threat.
status: valid
status modified: 2017-11-23
accepted date: 2017-11-23
in scheme: QaQc
error type: ERROR

Incoherent information.
type: Concept
notation: S176
definition: Incoherent information in this section. Code 'Xt - No information on threats' used but other threats listed.
status: valid
status modified: 2017-11-23
accepted date: 2017-11-23
in scheme: QaQc
error type: WARNING

Incoherent information.
type: Concept
notation: S177
definition: Incoherent information in this section. Code 'Xp - No information on pressures' used but other pressures listed.
status: valid
status modified: 2017-11-23
accepted date: 2017-11-23
in scheme: QaQc
error type: WARNING

Mandatory information missing.
type: Concept
notation: S178
definition: The list of pressures and/or threats should be provided. Report 'Xp - No information on pressures' and/or 'Xt - No information on threats' for missing information.
status: valid
status modified: 2017-11-23
accepted date: 2017-11-23
in scheme: QaQc
error type: ERROR

Mandatory information missing.
type: Concept
notation: S179
definition: The list of threats should be provided. Report 'Xt - No information on threats' for missing information.
status: valid
status modified: 2017-11-23
accepted date: 2017-11-23
in scheme: QaQc
error type: ERROR

Mandatory information missing.
type: Concept
notation: S180
definition: The list of pressures should be provided. Report 'Xp - No information on pressures' for missing information.
status: valid
status modified: 2017-11-23
accepted date: 2017-11-23
in scheme: QaQc
error type: ERROR

Invalid code.
type: Concept
notation: S181
definition: Please check the vocabulary ranking.
status: valid
status modified: 2017-11-23
accepted date: 2017-11-23
in scheme: QaQc
error type: BLOCKER

Incoherent information.
type: Concept
notation: S182
definition: Incoherent information in this section. Ranking is provided although no code indicated for pressure and/or threat.
status: valid
status modified: 2017-11-23
accepted date: 2017-11-23
in scheme: QaQc
error type: ERROR

Mandatory information missing.
type: Concept
notation: S183
definition: This field cannot be empty unlessThe reported code is 'Xp', 'Xt', 'Xu', 'Xxp' or 'Xxt'.
status: valid
status modified: 2017-11-23
accepted date: 2017-11-23
in scheme: QaQc
error type: ERROR

Invalid code.
type: Concept
notation: S184
definition: Code should be 'p' = pressure or 't' = threat.
status: valid
status modified: 2017-11-23
accepted date: 2017-11-23
in scheme: QaQc
error type: ERROR

Incoherent information.
type: Concept
notation: S185
definition: Incoherent information in this section. Type of pressure/threat is provided although no code indicated for pressure and/or threat.
status: valid
status modified: 2017-11-23
accepted date: 2017-11-23
in scheme: QaQc
error type: ERROR

Mandatory information missing.
type: Concept
notation: S186
definition: The type of pressure or threats should be systematically provided. Code should be 'p' = pressure or 't' = threat.
status: valid
status modified: 2017-11-23
accepted date: 2017-11-23
in scheme: QaQc
error type: ERROR

Invalid code.
type: Concept
notation: S187
definition: Code should be 'Yes' or 'No'
status: valid
status modified: 2017-11-23
accepted date: 2017-11-23
in scheme: QaQc
error type: BLOCKER

Mandatory information missing.
type: Concept
notation: S188
definition: Indicate whether measures are needed or not.
status: valid
status modified: 2017-11-23
accepted date: 2017-11-23
in scheme: QaQc
error type: ERROR

Incoherent information.
type: Concept
notation: S189
definition: Incoherent information in this section. Status of measures is not expected if no measures are needed.
status: valid
status modified: 2017-11-23
accepted date: 2017-11-23
in scheme: QaQc
error type: ERROR

Invalid code.
type: Concept
notation: S190
definition: Please check the vocabulary measuresIdentified.
status: valid
status modified: 2017-11-23
accepted date: 2017-11-23
in scheme: QaQc
error type: BLOCKER

Mandatory information missing.
type: Concept
notation: S191
definition: Status of measures should be provided if measures are needed.
status: valid
status modified: 2017-11-23
accepted date: 2017-11-23
in scheme: QaQc
error type: ERROR

Incoherent information.
type: Concept
notation: S192
definition: Incoherent information in this section.The main purpose of measures taken is not expected if no measures are identified and taken.
status: valid
status modified: 2017-11-23
accepted date: 2017-11-23
in scheme: QaQc
error type: WARNING

Invalid code.
type: Concept
notation: S193
definition: Please check the vocabulary measuresPurposeSpecies.
status: valid
status modified: 2017-11-23
accepted date: 2017-11-23
in scheme: QaQc
error type: BLOCKER

Incoherent information.
type: Concept
notation: S194
definition: Incoherent information in this section.The main purpose of measures taken is expected if measures are identified and taken.
status: valid
status modified: 2017-11-23
accepted date: 2017-11-23
in scheme: QaQc
error type: ERROR

Incoherent information.
type: Concept
notation: S195
definition: Incoherent information in this section. Location of measures is not expected if no measures are identified and taken.
status: valid
status modified: 2017-11-23
accepted date: 2017-11-23
in scheme: QaQc
error type: WARNING

Invalid code.
type: Concept
notation: S196
definition: Please check the vocabulary measuresLocation.
status: valid
status modified: 2017-11-23
accepted date: 2017-11-23
in scheme: QaQc
error type: BLOCKER

Incoherent information.
type: Concept
notation: S197
definition: Incoherent information in this section.The location ofThe measures is expected if measures are identified and taken
status: valid
status modified: 2017-11-23
accepted date: 2017-11-23
in scheme: QaQc
error type: ERROR

Incoherent information.
type: Concept
notation: S198
definition: Incoherent information in this section. Time frame of response to measures is not expected if no measures are needed.
status: valid
status modified: 2017-11-23
accepted date: 2017-11-23
in scheme: QaQc
error type: WARNING

Invalid code.
type: Concept
notation: S199
definition: Please check the vocabulary measuresResponse.
status: valid
status modified: 2017-11-23
accepted date: 2017-11-23
in scheme: QaQc
error type: BLOCKER

Mandatory information missing.
type: Concept
notation: S200
definition: The time frame ofThe response to measures should be provided if measures are needed.
status: valid
status modified: 2017-11-23
accepted date: 2017-11-23
in scheme: QaQc
error type: ERROR

Invalid code.
type: Concept
notation: S201
definition: Please check the vocabulary measures.
status: valid
status modified: 2017-11-23
accepted date: 2017-11-23
in scheme: QaQc
error type: BLOCKER

More entries than permitted.
type: Concept
notation: S203
definition: More entries than permitted. Maximum of 10 measures per biogeographical assessment.
status: valid
status modified: 2017-11-23
accepted date: 2017-11-23
in scheme: QaQc
error type: ERROR

Mandatory information missing.
type: Concept
notation: S204
definition: The list of measures should be provided if measures are needed.
status: valid
status modified: 2017-11-23
accepted date: 2017-11-23
in scheme: QaQc
error type: ERROR

Invalid code.
type: Concept
notation: S205
definition: Please check the vocabulary Prospects
status: valid
status modified: 2017-11-23
accepted date: 2017-11-23
in scheme: QaQc
error type: BLOCKER

Mandatory information missing.
type: Concept
notation: S206
definition: The future prospects of each ofThe three parameters should be provided. In case the information to be reported in this section is not available use 'unk - unknown'.
status: valid
status modified: 2017-11-23
accepted date: 2017-11-23
in scheme: QaQc
error type: ERROR

Invalid code.
type: Concept
notation: S207
definition: Please check the vocabulary Prospects
status: valid
status modified: 2017-11-23
accepted date: 2017-11-23
in scheme: QaQc
error type: BLOCKER

Mandatory information missing.
type: Concept
notation: S208
definition: The future prospects of each ofThe three parameters should be provided. In case the information to be reported in this section is not available use 'unk - unknown'.
status: valid
status modified: 2017-11-23
accepted date: 2017-11-23
in scheme: QaQc
error type: ERROR

Invalid code.
type: Concept
notation: S209
definition: Please check the vocabulary Prospects
status: valid
status modified: 2017-11-23
accepted date: 2017-11-23
in scheme: QaQc
error type: BLOCKER

Mandatory information missing.
type: Concept
notation: S210
definition: The future prospects of each ofThe three parameters should be provided. In case the information to be reported in this section is not available use 'unk - unknown'.
status: valid
status modified: 2017-11-23
accepted date: 2017-11-23
in scheme: QaQc
error type: ERROR

Invalid code.
type: Concept
notation: S211
definition: Please check the vocabulary assessments.
status: valid
status modified: 2017-11-23
accepted date: 2017-11-23
in scheme: QaQc
error type: BLOCKER

Incoherent information.
type: Concept
notation: S212
definition: Incoherent information in this section.The conclusion for Range should be 'U2 - Unfavourable - Bad' when range surface area is more than 10% below favourable reference range (reported value in 5.10b is '>> - Much more than').
status: valid
status modified: 2017-11-23
accepted date: 2017-11-23
in scheme: QaQc
error type: ERROR

Incoherent information.
type: Concept
notation: S213
definition: Incoherent information in this section.The conclusion for Range cannot be 'FV - Favourable' when the trend is decreasing (reported value in 5.3 is 'D - Decreasing').
status: valid
status modified: 2017-11-23
accepted date: 2017-11-23
in scheme: QaQc
error type: ERROR

Mandatory information missing.
type: Concept
notation: S214
definition: The conclusion for Range should be provided.
status: valid
status modified: 2017-11-23
accepted date: 2017-11-23
in scheme: QaQc
error type: ERROR

Invalid code.
type: Concept
notation: S215
definition: Please check the vocabulary assessments.
status: valid
status modified: 2017-11-23
accepted date: 2017-11-23
in scheme: QaQc
error type: BLOCKER

Ranking of pressure/threat
type: ConceptScheme
notation: ranking
is part of: Habitats directive Art. 17 reporting in year 2018
registration status: Public draft
user modified: roschsab
date modified: 2017-10-04 13:37:42.0
vocabulary type: Common
is numeric concept identifiers: false
is notations equal identifiers: false

High importance/impact
type: Concept
notation: H
status: valid
status modified: 2017-07-25
in scheme: Ranking of pressure/threat

Medium importance/impact
type: Concept
notation: M
status: valid
status modified: 2017-07-25
in scheme: Ranking of pressure/threat

Change and reasons for change in value for parameter and in conservation status and conservation status trend
type: ConceptScheme
notation: reasonChange
is part of: Habitats directive Art. 17 reporting in year 2018
registration status: Public draft
user modified: roschsab
date modified: 2017-10-04 13:35:27.0
vocabulary type: Common
is numeric concept identifiers: false
is notations equal identifiers: false

Genuine change
type: Concept
notation: genuine
status: valid
status modified: 2017-07-25
in scheme: Change and reasons for change in value for parameter and in conservation status and conservation status trend

Improved knowledge/more accurate data
type: Concept
notation: knowledge
status: valid
status modified: 2017-07-25
in scheme: Change and reasons for change in value for parameter and in conservation status and conservation status trend

Use of different method
type: Concept
notation: method
status: valid
status modified: 2017-07-25
in scheme: Change and reasons for change in value for parameter and in conservation status and conservation status trend

No change
type: Concept
notation: noChange
status: valid
status modified: 2017-07-25
in scheme: Change and reasons for change in value for parameter and in conservation status and conservation status trend

No information on the nature of change
type: Concept
notation: noInfo
status: valid
status modified: 2017-07-25
in scheme: Change and reasons for change in value for parameter and in conservation status and conservation status trend

Threats and pressures
type: ConceptScheme
notation: threats
is part of: Habitats directive Art. 17 reporting in year 2018
registration status: Public draft
user modified: roschsab
date modified: 2018-05-18 12:38:39.0
vocabulary type: Common
is numeric concept identifiers: false
is notations equal identifiers: false

Conversion into agricultural land (excluding drainage and burning)
type: Concept
notation: A01
definition: Conversion of natural and semi-natural non-agricultural habitats (e.g. semi-natural forests) and non-agricultural habitats of species targeted by the nature directives into agricultural land (e.g. pastures, meadows, arable fields). This pressure does not relate only to land use changes that occurred during the reporting period but it refers to instances where continuing the agricultural use of originally non-agricultural habitat prevent the latter from being restored (e.g. in case of land use conflicts between agriculture and nature conservation).
status: valid
status modified: 2018-05-18
accepted date: 2018-05-18
in scheme: Threats and pressures

Conversion from one type of agricultural land use to another (excluding drainage and burning)
type: Concept
notation: A02
definition: Conversion of agricultural habitats into other types of agricultural habitats. This pressure often refers to conversion of semi-natural agricultural habitats (e.g. meadows) into intensive production areas (e.g. sawn grasslands or arable fields) but it also includes more subtle changes, mostly of habitat conditions (e.g. change of crops or a move from spring-sown to autumn/winter-sown cereals causing denser/taller crop structure earlier in the nesting season or earlier harvesting) or other types of conversion (e.g. rice paddies into other types of culture). This pressure does not relate only to land use changes that occurred during the reporting period but it refers to instances where continuing the current agricultural use of a habitat prevent the latter from being restored (e.g. in cases of land use conflicts between agriculture and nature conservation).
status: valid
status modified: 2018-05-18
accepted date: 2018-05-18
in scheme: Threats and pressures

Conversion from mixed farming and agroforestry systems to specialised (e.g. single crop) production
type: Concept
notation: A03
definition: Large scale changes (affecting the habitat at landscape level or landscape functions like connectivity or nutrient cycling) of agricultural systems from traditional mixed or diversified farming and agroforestry into intensive specialised farming (e.g. single crop).
status: valid
status modified: 2018-05-18
accepted date: 2018-05-18
in scheme: Threats and pressures

Changes in terrain and surface of agricultural areas
type: Concept
notation: A04
definition: Changes in terrain and surface of agricultural areas due to, for example, restructuring of slopes, terracing, levelling, rock crushing or other changes of terrain to, for example, facilitate the use of machinery or manage runoff of rain water or to prepare new terrains for agricultural production.
status: valid
status modified: 2018-05-18
accepted date: 2018-05-18
in scheme: Threats and pressures

Removal of small landscape features for agricultural land parcel consolidation (hedges, stone walls, rushes, open ditches, springs, solitary trees, etc.)
type: Concept
notation: A05
definition: Removal of single landscape features or small scale parcel consolidation (e.g. removal of hedges between two existing arable fields, to facilitate use of farm machinery).
status: valid
status modified: 2018-05-18
accepted date: 2018-05-18
in scheme: Threats and pressures

Abandonment of grassland management (e.g. cessation of grazing or mowing)
type: Concept
notation: A06
definition: Abandonment of traditional agricultural practices in grasslands such as cessation of mowing or abandonment of traditional pastoral systems like itinerant grazing in mountain areas.
status: valid
status modified: 2018-05-18
accepted date: 2018-05-18
in scheme: Threats and pressures

Abandonment of management/use of other agricultural and agroforestry systems (all except grassland)
type: Concept
notation: A07
definition: Abandonment of traditional management systems or use of other agricultural systems (excluding grasslands), such as the abandonment of traditional farming, abandonment of mowing, grazing and other traditional uses of fens, mires, heathland or agroforestry habitats.
status: valid
status modified: 2018-05-18
accepted date: 2018-05-18
in scheme: Threats and pressures

Mowing or cutting of grasslands
type: Concept
notation: A08
definition: Inappropriate techniques or timing of mowing, for example mowing at inappropriate times, mowing with too high a frequency, using machinery or inadequate machinery for mowing of grasslands or leaving dead material after mowing on the ground (mulching).
status: valid
status modified: 2018-05-18
accepted date: 2018-05-18
in scheme: Threats and pressures

Intensive grazing or overgrazing by livestock
type: Concept
notation: A09
definition: Intensive grazing or overgrazing by livestock in agricultural and agroforestry habitats (e.g. pastures, meadows, pastured forests) where grazing causes damage to vegetation or soil (e.g. trampling, nitrogen input) or where livestock presents a disturbance or a competitor for species targeted by the nature directives. Includes intensive grazing in other habitats in agricultural landscapes (riparian areas, bogs, scrubs and forests) where grazing causes damage to vegetation or habitats.
status: valid
status modified: 2018-05-18
accepted date: 2018-05-18
in scheme: Threats and pressures

Extensive grazing or undergrazing by livestock
type: Concept
notation: A10
definition: Insufficient grazing or undergrazing that causes, for example, changes in species composition, or extensive grazing in inappropriate habitats like meadows or bogs.
status: valid
status modified: 2018-05-18
accepted date: 2018-05-18
in scheme: Threats and pressures

Burning for agriculture
type: Concept
notation: A11
definition: Burning as an agricultural practice, for example, to create a pasture, or burning agricultural waste like crop stubble.
status: valid
status modified: 2018-05-18
accepted date: 2018-05-18
in scheme: Threats and pressures

Suppression of fire for agriculture
type: Concept
notation: A12
definition: Suppression or lack of controlled burning used as a traditional management practice e.g. of heaths in wet and cold regions of Europe.
status: valid
status modified: 2018-05-18
accepted date: 2018-05-18
in scheme: Threats and pressures

Reseeding of grasslands and other semi-natural habitats
type: Concept
notation: A13
definition: Reseeding of grasslands and other semi-natural habitats.
status: valid
status modified: 2018-05-18
accepted date: 2018-05-18
in scheme: Threats and pressures

Livestock farming (without grazing)
type: Concept
notation: A14
definition: Other activities, except grazing, related to livestock farming, like animal breeding (e.g. causing point or diffuse pollution), livestock feeding or use of veterinary drugs (e.g. causing increased mortality of scavengers like vultures as a consequence of 'incidental poisoning' following the consumption of livestock carcasses treated with veterinary drugs). Includes abandonment of traditional processes related to livestock (e.g. closure of traditional livestock carcass dumps causing loss of food resources for vultures).
status: valid
status modified: 2018-05-18
accepted date: 2018-05-18
in scheme: Threats and pressures

Tillage practices (e.g. ploughing) in agriculture
type: Concept
notation: A15
definition: Inappropriate techniques or timing of tillage, for example, ploughing at inappropriate times, using inadequate machinery for ploughing or the inappropriate use of tillage (e.g. tillage in grasslands).
status: valid
status modified: 2018-05-18
accepted date: 2018-05-18
in scheme: Threats and pressures

Other soil management practices in agriculture
type: Concept
notation: A16
definition: Inappropriate use of soil management practices in agriculture or inappropriate techniques/timing of soil management other than tillage.
status: valid
status modified: 2018-05-18
accepted date: 2018-05-18
in scheme: Threats and pressures

Harvesting of crops and cutting of croplands
type: Concept
notation: A17
definition: Inappropriate techniques and timing of harvesting, for example, use of machinery for harvesting, use of inadequate machinery for harvesting (e.g. more efficient machinery may reduce the amount of unharvested/spilt grain available as food) or inappropriate harvesting periods (e.g. harvesting too early in season, harvesting during the night). Includes the cutting of vegetation along the edges of fields.
status: valid
status modified: 2018-05-18
accepted date: 2018-05-18
in scheme: Threats and pressures

Irrigation of agricultural land
type: Concept
notation: A18
definition: Input of water into semi-natural or extensive agricultural habitats (e.g. irrigation of olive orchards) possibly leading to changes in species composition or increased production. Includes the installation of irrigation infrastructure.
status: valid
status modified: 2018-05-18
accepted date: 2018-05-18
in scheme: Threats and pressures

Application of natural fertilisers on agricultural land
type: Concept
notation: A19
definition: Use, application, treatment and stocking of natural fertilisers (e.g. manure, slurry) for agricultural production.
status: valid
status modified: 2018-05-18
accepted date: 2018-05-18
in scheme: Threats and pressures

Application of synthetic (mineral) fertilisers on agricultural land
type: Concept
notation: A20
definition: Use, application, treatment and stocking of synthetic fertilisers for agricultural production.
status: valid
status modified: 2018-05-18
accepted date: 2018-05-18
in scheme: Threats and pressures

Use of plant protection chemicals in agriculture
type: Concept
notation: A21
definition: Use of plant protection chemicals in agriculture (e.g. pesticides, fungicides, growth retardants, hormones, seed coatings etc.).
status: valid
status modified: 2018-05-18
accepted date: 2018-05-18
in scheme: Threats and pressures

Use of physical plant protection in agriculture
type: Concept
notation: A22
definition: Use of physical plant protection in agriculture (e.g. weed picking or netting/cages for fruit ).
status: valid
status modified: 2018-05-18
accepted date: 2018-05-18
in scheme: Threats and pressures

Use of other pest control methods in agriculture (excluding tillage)
type: Concept
notation: A23
definition: Use of other pest control methods in agriculture (e.g. biocontrol)
status: valid
status modified: 2018-05-18
accepted date: 2018-05-18
in scheme: Threats and pressures

Waste management practices in agriculture
type: Concept
notation: A24
definition: Management of waste in agriculture (e.g. temporary holding of solutions like manure storage ponds/lagoons or deposition of waste).
status: valid
status modified: 2018-05-18
accepted date: 2018-05-18
in scheme: Threats and pressures

Agricultural activities generating point source pollution to surface or ground waters
type: Concept
notation: A25
definition: This pressure addresses point source water pollution resulting from activities which cannot be directly attributed to specific activities covered by other level 2 pressures (e.g. point pollution from an animal farm should be reported as A14 Livestock farming (without grazing)).
status: valid
status modified: 2018-05-18
accepted date: 2018-05-18
in scheme: Threats and pressures

Agricultural activities generating diffuse pollution to surface or ground waters
type: Concept
notation: A26
definition: This pressure addresses diffuse water pollution resulting from activities which cannot be directly attributed to specific activities covered by other level 2 pressures (e.g. diffuse pollution due to the application of fertilisers or plant protection chemicals should be reported under respective activities A20 Application of synthetic (mineral) fertilisers on agricultural land or A21 Use of plant protection chemicals in agriculture).
status: valid
status modified: 2018-05-18
accepted date: 2018-05-18
in scheme: Threats and pressures

Agricultural activities generating air pollution
type: Concept
notation: A27
definition: This pressure addresses air pollution resulting from agricultural activities and agricultural land use.
status: valid
status modified: 2018-05-18
accepted date: 2018-05-18
in scheme: Threats and pressures

Agricultural activities generating marine pollution
type: Concept
notation: A28
definition: This pressure addresses point or diffuse source marine pollution resulting from activities which cannot be directly attributed to specific activities covered by other level 2 pressures (e.g. diffuse pollution due to application of fertilisers or plant protection chemicals should be reported under respective activities A20 Application of synthetic (mineral) fertilisers on agricultural land or A21 Use of plant protection chemicals in agriculture).
status: valid
status modified: 2018-05-18
accepted date: 2018-05-18
in scheme: Threats and pressures

Agricultural activities generating soil pollution
type: Concept
notation: A29
definition: This pressure should be used to address the pollution resulting from activities which cannot be directly attributed to specific activities covered by other level 2 pressures (e.g. diffuse pollution due to application of fertilisers or plant protection chemicals should be reported under respective activities A20 Application of synthetic (mineral) fertilisers on agricultural land or A21 Use of plant protection chemicals in agriculture).
status: valid
status modified: 2018-05-18
accepted date: 2018-05-18
in scheme: Threats and pressures

Active abstractions from groundwater, surface water or mixed water for agriculture
type: Concept
notation: A30
definition: Abstraction of water for use in agriculture e.g. for irrigation or in large scale animal breeding.
status: valid
status modified: 2018-05-18
accepted date: 2018-05-18
in scheme: Threats and pressures

Drainage for use as agricultural land
type: Concept
notation: A31
definition: Activities like water abstraction, hydrological modifications, canalisation aimed at draining natural or semi-natural habitats for the use as agricultural land (e.g. drainage of wetlands for agriculture).
status: valid
status modified: 2018-05-18
accepted date: 2018-05-18
in scheme: Threats and pressures

Development and operation of dams for agriculture
type: Concept
notation: A32
definition: Development and operation of dams for agriculture (e.g. for irrigation).
status: valid
status modified: 2018-05-18
accepted date: 2018-05-18
in scheme: Threats and pressures

Modification of hydrological flow or physical alteration of water bodies for agriculture (excluding development and operation of dams)
type: Concept
notation: A33
definition: Activities modifying physical structure or hydrological functioning of water bodies triggered by agricultural production (e.g. altering of flooding regimes, altering regimes of rivers to keep sufficient water supply for irrigation, cleaning irrigation canals, canalisation of rivers and cutting of the oxbow lakes).
status: valid
status modified: 2018-05-18
accepted date: 2018-05-18
in scheme: Threats and pressures

Introduction and spread of new crops (including GMOs)
type: Concept
notation: A34
definition: Introduction and/or spread of new crops (e.g. crops producing pollen toxic for pollinators) and GMOs.
status: valid
status modified: 2018-05-18
accepted date: 2018-05-18
in scheme: Threats and pressures

Agricultural crops for renewable energy production
type: Concept
notation: A35
definition: Conversion of agricultural or non-agricultural habitats into areas of agricultural production of renewable energy stocks, and other pressures arising from the agricultural production of energy crops.
status: valid
status modified: 2018-05-18
accepted date: 2018-05-18
in scheme: Threats and pressures

Agriculture activities not referred to above
type: Concept
notation: A36
definition: Other agricultural activities not mentioned above.
status: valid
status modified: 2018-05-18
accepted date: 2018-05-18
in scheme: Threats and pressures

Conversion to forest from other land uses, or afforestation (excluding drainage)
type: Concept
notation: B01
definition: Increase in forest area, including planting of forests on grassland or heathland, or converting shrubs into forest. This pressure does not relate only to land use changes that occurred during the reporting period but it refers to instances where continuing the current forestry use of a natural/semi-natural habitat prevents the latter from being restored (e.g. in cases of land use conflicts between forestry and nature conservation for the restoration of some heathlands and peats, which were in the past afforested and are currently being managed and replanted as forests).
status: valid
status modified: 2018-05-18
accepted date: 2018-05-18
in scheme: Threats and pressures

Conversion to other types of forests including monocultures
type: Concept
notation: B02
definition: Conversion of forest habitats into another type of forest habitat, often conversion from extensive forests into production forests (e.g. conversion to monocultures) but also other types of conversion (e.g. conversion from coppice to high forest or changes of tree species composition). Includes deliberate changes. Passive abandonment of traditional forest management should be reported as B04. This pressure does not relate only to land use changes that occurred during the reporting period but it refers to instances where continuing the current forestry use of a natural/semi-natural habitat prevent the latter from being restored (e.g. in case of land use conflicts between forestry and nature conservation).
status: valid
status modified: 2018-05-18
accepted date: 2018-05-18
in scheme: Threats and pressures

Replanting with or introducing non-native or non-typical species (including new species and GMOs)
type: Concept
notation: B03
definition: Replanting with non-native (including new tree species and genetically modified organisms) or non-typical species (i.e. native species which do not naturally occur as a part of a specific forest type or within a specific region) after forest exploitation or planting non-native or non-typical species in existing forests.
status: valid
status modified: 2018-05-18
accepted date: 2018-05-18
in scheme: Threats and pressures

Abandonment of traditional forest management
type: Concept
notation: B04
definition: Abandonment of traditional management and maintenance of secondary forest habitats such as some oak and oak-hornbeam forests, chestnut forests or lichen-pine forests.
status: valid
status modified: 2018-05-18
accepted date: 2018-05-18
in scheme: Threats and pressures

Logging without replanting or natural regrowth
type: Concept
notation: B05
definition: Decline in forest area due to non-replanting or absence of natural regrowth after forest exploitation.
status: valid
status modified: 2018-05-18
accepted date: 2018-05-18
in scheme: Threats and pressures

Logging (excluding clear cutting) of individual trees
type: Concept
notation: B06
definition: Logging (of individual trees) causing damage to e.g. standing trees, forest undergrowth or soil and springs.
status: valid
status modified: 2018-05-18
accepted date: 2018-05-18
in scheme: Threats and pressures

Removal of dead and dying trees, including debris
type: Concept
notation: B07
definition: Removal of dead and dying trees (e.g. to prevent forestry pests) and removal of fallen wood (e.g. for firewood collection, fire prevention or enabling access by machinery).
status: valid
status modified: 2018-05-18
accepted date: 2018-05-18
in scheme: Threats and pressures

Removal of old trees (excluding dead or dying trees)
type: Concept
notation: B08
definition: Targeted removal of old trees (e.g. to preserve the forest structure or to improve regeneration). Includes logging of mature trees (trees with a high potential to become old) in forests with a diverse age structure.
status: valid
status modified: 2018-05-18
accepted date: 2018-05-18
in scheme: Threats and pressures

Clear-cutting, removal of all trees
type: Concept
notation: B09
definition: Forest clearance (small to large scale removal of all trees) causing damage to forest habitat or habitats of species targeted by the nature directives, to soil or springs or other physical features.
status: valid
status modified: 2018-05-18
accepted date: 2018-05-18
in scheme: Threats and pressures

Illegal logging
type: Concept
notation: B10
definition: Illegal logging e.g. organised illegal timber extraction.
status: valid
status modified: 2018-05-18
accepted date: 2018-05-18
in scheme: Threats and pressures

Cork extraction and forest exploitation excluding logging.
type: Concept
notation: B11
definition: Forest exploitation activities (e.g. cork extraction), excluding timber logging.
status: valid
status modified: 2018-05-18
accepted date: 2018-05-18
in scheme: Threats and pressures

Thinning of tree layer
type: Concept
notation: B12
definition: Removal of trees (including logging) of a certain tree layer(s) (upper or lower) in order to favour selected trees or to promote natural regeneration. Includes damage to soil, springs, forest habitats and undergrowth due to thinning.
status: valid
status modified: 2018-05-18
accepted date: 2018-05-18
in scheme: Threats and pressures

Burning for forestry
type: Concept
notation: B13
definition: Burning as a forestry practice (e.g. burning waste after exploitation).
status: valid
status modified: 2018-05-18
accepted date: 2018-05-18
in scheme: Threats and pressures

Suppression of fire for forestry
type: Concept
notation: B14
definition: Suppression of forest management practices using controlled burning and fire.
status: valid
status modified: 2018-05-18
accepted date: 2018-05-18
in scheme: Threats and pressures

Forest management reducing old growth forests.
type: Concept
notation: B15
definition: Shortening of logging rotations or other activities like thinning aimed at earlier logging.
status: valid
status modified: 2018-05-18
accepted date: 2018-05-18
in scheme: Threats and pressures

Wood transport
type: Concept
notation: B16
definition: Construction and maintenance of logging roads and tracks (closed to public circulation), wood transport within forest (damaging forest undergrowth, soil and springs) and poor management of wood transport (e.g. leaving the felled wood in piles in forests during summer or damage to soil).
status: valid
status modified: 2018-05-18
accepted date: 2018-05-18
in scheme: Threats and pressures

Tillage practices in forestry and other soil management practices in forestry
type: Concept
notation: B17
definition: Using tillage or other soil management practices in forestry (e.g. preparation of soil for forest replanting).
status: valid
status modified: 2018-05-18
accepted date: 2018-05-18
in scheme: Threats and pressures

Application of natural fertilisers
type: Concept
notation: B18
definition: Use, application, treatment and stocking of natural fertilisers (e.g. manure, slurry) in forestry.
status: valid
status modified: 2018-05-18
accepted date: 2018-05-18
in scheme: Threats and pressures

Application of synthetic fertilisers in forestry, including liming of forest soils
type: Concept
notation: B19
definition: Use, application, treatment and stocking of synthetic fertilisers in forestry.
status: valid
status modified: 2018-05-18
accepted date: 2018-05-18
in scheme: Threats and pressures

Use of plant protection chemicals in forestry
type: Concept
notation: B20
definition: Use of plant protection chemicals in forestry (e.g. pesticides, fungicides, pheromones or repulsives).
status: valid
status modified: 2018-05-18
accepted date: 2018-05-18
in scheme: Threats and pressures

Use of physical plant protection in forestry, excluding tree layer thinning
type: Concept
notation: B21
definition: Use of physical or mechanical plant protection in forestry (e.g. exclosure fencing, protective cages/sleeves around trees/saplings, cutting weeds, mulching).
status: valid
status modified: 2018-05-18
accepted date: 2018-05-18
in scheme: Threats and pressures

Use of other pest control methods in forestry
type: Concept
notation: B22
definition: Use of other pest control methods in forestry (e.g. biocontrol).
status: valid
status modified: 2018-05-18
accepted date: 2018-05-18
in scheme: Threats and pressures

Forestry activities generating pollution to surface or ground waters
type: Concept
notation: B23
definition: This pressure addresses diffuse water pollution resulting from activities which cannot be directly attributed to specific activities covered by other level 2 pressures (e.g. diffuse pollution due to application of fertilisers or plant protection chemicals should be reported under respective activities B19, Application of synthetic fertilisers in forestry, including liming of forest soils or B21 Use of physical plant protection in forestry, excluding tree layer thinning).
status: valid
status modified: 2018-05-18
accepted date: 2018-05-18
in scheme: Threats and pressures

Forestry activities generating air pollution
type: Concept
notation: B24
definition: This pressure addresses air pollution resulting from forestry activities.
status: valid
status modified: 2018-05-18
accepted date: 2018-05-18
in scheme: Threats and pressures

Forestry activities generating marine pollution
type: Concept
notation: B25
definition: This pressure addresses marine pollution resulting from activities which cannot be directly attributed to specific activities covered by other level 2 pressures (e.g. marine pollution due to the application of fertilisers or plant protection chemicals should be reported under respective activities B19 Application of synthetic fertilisers in forestry, including liming of forest soils or B21 Use of physical plant protection in forestry, excluding tree layer thinning).
status: valid
status modified: 2018-05-18
accepted date: 2018-05-18
in scheme: Threats and pressures

Forestry activities generating soil pollution
type: Concept
notation: B26
definition: This pressure addresses soil pollution resulting from activities which cannot be directly attributed to specific activities covered by other level 2 pressures (e.g. soil pollution due to application of fertilisers or plant protection chemicals should be reported under respective activities B19 Application of synthetic fertilisers in forestry, including liming of forest soils or B21 Use of physical plant protection in forestry, excluding tree layer thinning) .
status: valid
status modified: 2018-05-18
accepted date: 2018-05-18
in scheme: Threats and pressures

Modification of hydrological conditions, or physical alteration of water bodies and drainage for forestry (including dams)
type: Concept
notation: B27
definition: Activities modifying the physical structure or hydrological functioning of water bodies triggered by forestry production and exploitation, and activities aimed at drying out the land to facilitate forestry production or exploitation (e.g. altering of flooding regimes, canalisation of rivers, cutting of the oxbow lakes, building draining canals).
status: valid
status modified: 2018-05-18
accepted date: 2018-05-18
in scheme: Threats and pressures

Forests for renewable energy production
type: Concept
notation: B28
definition: Conversion of forest or non-forest habitats into short rotation coppices (e.g. coppices of willow, poplar or eucalyptus) or converting or maintaining existing forest as short rotation coppices/forests (e.g. chestnut forests) for biomass production and other pressures from forestry biomass production.
status: valid
status modified: 2018-05-18
accepted date: 2018-05-18
in scheme: Threats and pressures

Other forestry activities, excluding those relating to agro-forestry
type: Concept
notation: B29
definition: Other forestry activities not mentioned above (e.g. example pruning).
status: valid
status modified: 2018-05-18
accepted date: 2018-05-18
in scheme: Threats and pressures

Extraction of minerals (e.g. rock, metal ores, gravel, sand, shell)
type: Concept
notation: C01
definition: Extraction of rocks, gravel, sand, metal ores, loam, clay and shells from quarries, inland water bodies (lakes, river beds) and sea.
status: valid
status modified: 2018-05-18
accepted date: 2018-05-18
in scheme: Threats and pressures

Extraction of salt
type: Concept
notation: C02
definition: Extraction of salt from quarries and saltpans.
status: valid
status modified: 2018-05-18
accepted date: 2018-05-18
in scheme: Threats and pressures

Extraction of oil and gas, including infrastructure
type: Concept
notation: C03
definition: Exploration of, development of infrastructure for and extracting petroleum and other liquid hydrocarbons (e.g. deep sea natural gas drilling or hydraulic fracturing on land). Includes oil spills that occur at the drill site.
status: valid
status modified: 2018-05-18
accepted date: 2018-05-18
in scheme: Threats and pressures

Coal mining
type: Concept
notation: C04
definition: Coal mining including both open cast and underground mining.
status: valid
status modified: 2018-05-18
accepted date: 2018-05-18
in scheme: Threats and pressures

Peat extraction
type: Concept
notation: C05
definition: Extraction of peat (e.g. cutting of peat and mechanical removal of peat). Includes drainage associated with peat extraction.
status: valid
status modified: 2018-05-18
accepted date: 2018-05-18
in scheme: Threats and pressures

Dumping/depositing of inert materials from terrestrial extraction
type: Concept
notation: C06
definition: Dumping/depositing of inert materials from terrestrial extraction.
status: valid
status modified: 2018-05-18
accepted date: 2018-05-18
in scheme: Threats and pressures

Dumping/depositing of dredged materials from marine extraction
type: Concept
notation: C07
definition: Dumping/depositing of dredged materials from marine extraction.
status: valid
status modified: 2018-05-18
accepted date: 2018-05-18
in scheme: Threats and pressures

Abandonment or conversion of saltpans
type: Concept
notation: C08
definition: Abandonment or conversion of saltpans (e.g. for aquaculture or rice fields).
status: valid
status modified: 2018-05-18
accepted date: 2018-05-18
in scheme: Threats and pressures

Geotechnical surveying
type: Concept
notation: C09
definition: Geotechnical surveying for oil and gas exploration and exploration of mines (e.g. seismic marine surveys or surveys to evaluate potential for hydraulic fracturing).
status: valid
status modified: 2018-05-18
accepted date: 2018-05-18
in scheme: Threats and pressures

Extraction activities generating point source pollution to surface or ground waters
type: Concept
notation: C10
definition: This pressure should be used to address the point source pollution to surface and ground waters resulting from activities which cannot be directly attributed to specific activities covered by other level 2 pressures (e.g. point source pollution from coal mines or at oil and gas exploitation sites should be reported under the respective codes C04 Coal mining or C03 Extraction of oil and gas, including infrastructure).
status: valid
status modified: 2018-05-18
accepted date: 2018-05-18
in scheme: Threats and pressures

Extraction activities generating diffuse pollution to ground or surface waters
type: Concept
notation: C11
definition: This pressure should be used to address the diffuse pollution to surface and ground waters resulting from activities which cannot be directly attributed to specific activities covered by other level 2 pressures (e.g. diffuse pollution related to coal mining or oil and gas exploitation should be reported under the respective codes C04 Coal mining or C03 Extraction of oil and gas, including infrastructure).
status: valid
status modified: 2018-05-18
accepted date: 2018-05-18
in scheme: Threats and pressures

Extraction activities generating marine pollution
type: Concept
notation: C12
definition: This pressure should be used to address marine pollution resulting from activities which cannot be directly attributed to specific activities covered by other level 2 pressures (e.g. marine pollution related to oil and gas exploitation should be reported under C03 Extraction of oil and gas, including infrastructure).
status: valid
status modified: 2018-05-18
accepted date: 2018-05-18
in scheme: Threats and pressures

Extraction activities generating noise, light or other forms of pollution
type: Concept
notation: C13
definition: This pressure should be used to address the noise, light pollution or pollution by other forms of energy resulting from activities which cannot be directly attributed to specific activities covered by other level 2 pressures (e.g. sound wave pollution from marine seismic surveys should be reported as C09 Geotechnical surveying).
status: valid
status modified: 2018-05-18
accepted date: 2018-05-18
in scheme: Threats and pressures

Abstraction of surface and ground water for resource extraction
type: Concept
notation: C14
definition: Abstraction of water for processing the exploited materials.
status: valid
status modified: 2018-05-18
accepted date: 2018-05-18
in scheme: Threats and pressures

Mining and extraction activities not referred to above
type: Concept
notation: C15
definition: Other mining and extraction activities not mentioned above (e.g. closure of mines).
status: valid
status modified: 2018-05-18
accepted date: 2018-05-18
in scheme: Threats and pressures

Wind, wave and tidal power, including infrastructure
type: Concept
notation: D01
definition: Renewable energy (wind, wave and tidal power) generation including development and use of associated infrastructure (e.g. building wind turbines or tidal barrages, collision of birds with wind turbines, damage to coastal habitats or disturbance of marine mammals due to operation of tidal or wave barrages).
status: valid
status modified: 2018-05-18
accepted date: 2018-05-18
in scheme: Threats and pressures

Hydropower (dams, weirs, run-off-the-river), including infrastructure
type: Concept
notation: D02
definition: Hydropower generation including development and use of associated infrastructure (e.g. building dams or weirs, changes of hydrological functioning rivers or chemical and thermal properties of water due to operation of dams and weirs).
status: valid
status modified: 2018-05-18
accepted date: 2018-05-18
in scheme: Threats and pressures

Solar power, including infrastructure
type: Concept
notation: D03
definition: Renewable energy (solar power) generation including development and use of associated infrastructure (e.g. building solar farms).
status: valid
status modified: 2018-05-18
accepted date: 2018-05-18
in scheme: Threats and pressures

Geothermal power generation (including infrastructure)
type: Concept
notation: D04
definition: Renewable energy (geothermal power) generation including development and use of associated infrastructure (e.g. exploitation drills, geothermal wells, managing waste heat, managing pollution from geothermal waters, accidents).
status: valid
status modified: 2018-05-18
accepted date: 2018-05-18
in scheme: Threats and pressures

Development and operation of energy production plants (including bioenergy plants, fossil and nuclear energy plants)
type: Concept
notation: D05
definition: Development and operation of energy production plants (e.g. bioenergy plants, fossil and nuclear energy plants).
status: valid
status modified: 2018-05-18
accepted date: 2018-05-18
in scheme: Threats and pressures

Transmission of electricity and communications (cables)
type: Concept
notation: D06
definition: Construction, operation and maintenance of power lines and communication infrastructure (e.g. collisions or electrocution of wildlife with phone and power lines).
status: valid
status modified: 2018-05-18
accepted date: 2018-05-18
in scheme: Threats and pressures

Oil and gas pipelines
type: Concept
notation: D07
definition: Construction and operation of oil and gas pipelines in both the marine and terrestrial environment (e.g. negative impact of explosions, air pollution).
status: valid
status modified: 2018-05-18
accepted date: 2018-05-18
in scheme: Threats and pressures

Energy production and transmission activities generating pollution to surface or ground waters
type: Concept
notation: D08
definition: This pressure should be used to address the pollution to surface and ground waters resulting from activities which cannot be directly attributed to specific activities covered by other level 2 pressures (e.g. pollution from oil pipelines or from geothermal waters should be reported under D07 Oil and gas pipelines or D04 Geothermal power generation (including infrastructure)).
status: valid
status modified: 2018-05-18
accepted date: 2018-05-18
in scheme: Threats and pressures

Energy production and transmission activities generating air pollution
type: Concept
notation: D09
definition: This pressure should be used to address the air pollution resulting from activities which cannot be directly attributed to specific activities covered by other level 2 pressures (e.g. pollution from fossil energy plants should be reported as D05 Development and operation of energy production plants (including bioenergy plants, fossil and nuclear energy plants)).
status: valid
status modified: 2018-05-18
accepted date: 2018-05-18
in scheme: Threats and pressures

Energy production and transmission activities generating marine pollution
type: Concept
notation: D10
definition: This pressure should be used to address the marine pollution resulting from activities which cannot be directly attributed to specific activities covered by other level 2 pressures (e.g. pollution from oil pipelines or from geothermal waters should be reported under D07 Oil and gas pipelines or D04 Geothermal power generation (including infrastructure)).
status: valid
status modified: 2018-05-18
accepted date: 2018-05-18
in scheme: Threats and pressures

Energy production and transmission activities generating noise pollution
type: Concept
notation: D11
definition: This pressure should be used to address the noise pollution resulting from activities which cannot be directly attributed to specific activities covered by other level 2 pressures (e.g. noise pollution from wind, wave or tidal turbines should be reported under D01 Wind, wave and tidal power, including infrastructure)).
status: valid
status modified: 2018-05-18
accepted date: 2018-05-18
in scheme: Threats and pressures

Energy production and transmission activities generating light, heat or other forms pollution
type: Concept
notation: D12
definition: This pressure should be used to address the light, heat or other forms pollution resulting from activities which cannot be directly attributed to specific activities covered by other level 2 pressures (e.g. heat pollution from cooling waters should be reported under D05 Development and operation of energy production plants (including bioenergy plants, fossil and nuclear energy plants)).
status: valid
status modified: 2018-05-18
accepted date: 2018-05-18
in scheme: Threats and pressures

Abstraction of surface and ground water for energy production (excluding hydropower)
type: Concept
notation: D13
definition: Surface water abstraction for energy production (e.g. for cooling in electricity production).
status: valid
status modified: 2018-05-18
accepted date: 2018-05-18
in scheme: Threats and pressures

Energy production and transmission activities not referred to above
type: Concept
notation: D14
definition: Other energy production and transmission related activities not mentioned above.
status: valid
status modified: 2018-05-18
accepted date: 2018-05-18
in scheme: Threats and pressures

Roads, paths, railroads and related infrastructure (e.g. bridges, viaducts, tunnels)
type: Concept
notation: E01
definition: Construction and operation (e.g. collisions, traffic, noise, light, fencing associated with roads, use of salt for snow cleaning etc.) of road and related infrastructure and related pressures such as animal mortality, habitat fragmentation, improved access to sites via roads and paths.
status: valid
status modified: 2018-05-18
accepted date: 2018-05-18
in scheme: Threats and pressures

Shipping lanes and ferry lanes transport operations
type: Concept
notation: E02
definition: Operation and use of marine and inland water transport corridors, as well as pressures linked to transport activities on these freshwater and ocean waterways (e.g. disturbance from shipping at feeding/nesting areas, death or injury by collision, wakes from cargo ship traffic, oil spills from tankers, increased risk of colonisation of islands by invasive species). Includes the anchorage of ships and vessels (industrial, commercial).
status: valid
status modified: 2018-05-18
accepted date: 2018-05-18
in scheme: Threats and pressures

Shipping lanes, ferry lanes and anchorage infrastructure (e.g. canalisation, dredging)
type: Concept
notation: E03
definition: Maintenance and construction of marine and inland water shipping lanes, transport corridors or coastal infrastructure for anchorage of ships and vessels (industrial, commercial) including hydrological and morphological modifications for transport (e.g. canalisation, water deviation, barriers and locks, dredging and desilting of waterways for navigational purposes).
status: valid
status modified: 2018-05-18
accepted date: 2018-05-18
in scheme: Threats and pressures

Flight paths of planes, helicopter and other non-leisure aircrafts
type: Concept
notation: E04
definition: Transport activities on the flight paths of the aircraft including near airports (e.g. birds collisions with (commercial) aircraft at/near airports).
status: valid
status modified: 2018-05-18
accepted date: 2018-05-18
in scheme: Threats and pressures

Land, water and air transport activities generating pollution to surface or ground waters
type: Concept
notation: E05
definition: This pressure should be used to address the pollution to surface or ground waters resulting from activities which cannot be directly attributed to specific activities covered by other level 2 pressures (e.g. leaks and spills from commercial freshwater vessels should be reported under E02 Shipping lanes and ferry lanes transport operations).
status: valid
status modified: 2018-05-18
accepted date: 2018-05-18
in scheme: Threats and pressures

Land, water and air transport activities generating air pollution
type: Concept
notation: E06
definition: This pressure should be used to address air pollution resulting from activities which cannot be directly attributed to specific activities covered by other level 2 pressures (e.g. emissions from particular transportation methods like road transportation vehicles, aircrafts, container ships or ferries should be reported under respective codes E01 Roads, paths, railroads and related infrastructure (e.g. bridges, viaducts, tunnels), E02 Shipping lanes and ferry lanes transport operations or E04 Flight paths of planes, helicopter and other non-leisure aircrafts).
status: valid
status modified: 2018-05-18
accepted date: 2018-05-18
in scheme: Threats and pressures

Land, water and air transport activities generating marine pollution
type: Concept
notation: E07
definition: This pressure should be used to address marine pollution resulting from activities which cannot be directly attributed to specific activities covered by other level 2 pressures (e.g. oil spills from tankers or fuel oil leaks and discharges from ships and ferries should be reported under E02 Shipping lanes and ferry lanes transport operations).
status: valid
status modified: 2018-05-18
accepted date: 2018-05-18
in scheme: Threats and pressures

Land, water and air transport activities generating noise, light and other forms of pollution
type: Concept
notation: E08
definition: This pressure should be used to address noise, light and other forms of pollution resulting from activities which cannot be directly attributed to specific activities covered by other level 2 pressures (e.g. noise from shipping should be reported under E02 Shipping lanes and ferry lanes transport operations).
status: valid
status modified: 2018-05-18
accepted date: 2018-05-18
in scheme: Threats and pressures

Land, water and air transport activities not referred to above
type: Concept
notation: E09
definition: Other land, water and air transport activities not mentioned above.
status: valid
status modified: 2018-05-18
accepted date: 2018-05-18
in scheme: Threats and pressures

Conversion from other land uses to housing, settlement or recreational areas (excluding drainage and modification of coastline, estuary and coastal conditions)
type: Concept
notation: F01
definition: Conversion of natural and semi-natural habitats to housing, settlement or recreational areas. Includes development of dispersed housing. This pressure does not relate only to land use changes that occurred during the reporting period,it also refers to instances where continuing the current land use of a natural/semi-natural habitat prevent the latter from being restored.
status: valid
status modified: 2018-05-18
accepted date: 2018-05-18
in scheme: Threats and pressures

Construction or modification (e.g. of housing and settlements) in existing urban or recreational areas
type: Concept
notation: F02
definition: Construction in existing urban or recreational areas, reconstruction of existing buildings and structures, and the demolition of buildings and human structures. This pressure can include e.g. demolishment of structures important for nesting or sheltering of birds and bats, negative impact of isolation or other reconstruction works to nesting birds or bats. Includes deliberate closure of roofs (to prevent bats or birds).
status: valid
status modified: 2018-05-18
accepted date: 2018-05-18
in scheme: Threats and pressures

Conversion from other land uses to commercial / industrial areas (excluding drainage and modification of coastline, estuary and coastal conditions)
type: Concept
notation: F03
definition: Conversion of natural and semi-natural habitats to commercial or industrial areas (e.g. building the industrial parks or warehouse zones) or construction of solitary buildings not dedicated to housing and recreation (like solitary buildings for agricultural or forestry use). This pressure relates not only to land use changes that occurred during the reporting period but refers to instances where continuing the current land use of a natural/semi-natural habitat prevent the latter from being restored.
status: valid
status modified: 2018-05-18
accepted date: 2018-05-18
in scheme: Threats and pressures

Construction or modification of commercial / industrial infrastructure in existing commercial / industrial areas
type: Concept
notation: F04
definition: Construction in existing commercial or industrial areas, reconstruction of existing buildings and other industrial infrastructure and demolition of buildings and industrial structures. Includes reconstructions and demolishment of solitary buildings not dedicated for housing and recreation (like solitary buildings for agricultural or forestry use).
status: valid
status modified: 2018-05-18
accepted date: 2018-05-18
in scheme: Threats and pressures

Creation or development of sports, tourism and leisure infrastructure (outside the urban or recreational areas)
type: Concept
notation: F05
definition: Creation and development of sport and leisure structures outside the urban or recreational areas (e.g. building the ski lifts, cable cars, motocross circuits).
status: valid
status modified: 2018-05-18
accepted date: 2018-05-18
in scheme: Threats and pressures

Development and maintenance of beach areas for tourism and recreation incl. beach nourishment and beach cleaning
type: Concept
notation: F06
definition: Activities connected with development and maintenance of recreational coastal areas and beach resorts such as levelling of dunes morphology, beach cleaning (also with mechanical vehicles), beach nourishment, human trampling and overuse, construction of buildings connected to the seaside bathing establishments, marine/beach litter deposition.
status: valid
status modified: 2018-05-18
accepted date: 2018-05-18
in scheme: Threats and pressures

Sports, tourism and leisure activities
type: Concept
notation: F07
definition: Sport, tourism and leisure activities outside the urban and recreational zones (e.g. outdoor sports, leisure aircrafts, drones, human trampling, wildlife watching).
status: valid
status modified: 2018-05-18
accepted date: 2018-05-18
in scheme: Threats and pressures

F08
type: Concept
notation: F08
preferred label: Modification of coastline, estuary and coastal conditions for development, use and protection of residential, commercial, industrial and recreational infrastructure and areas (including sea defences or coastal protection works and infrastructures)
definition: Activities modifying coastline or estuary and coastal conditions triggered by urban development such as development and protection of residential, commercial, industrial and recreational infrastructure and areas. Includes activities like building sea defences and coastal protection infrastructure or maintenance of existing coastal structures (e.g. repairs to existing sea defences, harbour walls).
status: valid
status modified: 2018-05-18
accepted date: 2018-05-18
in scheme: Threats and pressures

Deposition and treatment of waste/garbage from household/recreational facilities
type: Concept
notation: F09
definition: Management, including deposition and treatment (e.g. dumps, landfills, incineration and other methods of physical or biological processing) of waste from urban and recreational areas (e.g. household waste, other urban waste like waste from hospitals or from urban green areas, food waste from recreational areas).
status: valid
status modified: 2018-05-18
accepted date: 2018-05-18
in scheme: Threats and pressures

Deposition and treatment of waste/garbage from commercial and industrial facilities.
type: Concept
notation: F10
definition: Management, including deposition and treatment (e.g. dumps, landfills, incineration recycling and other methods of physical or chemical processing) of waste from industrial production processes.
status: valid
status modified: 2018-05-18
accepted date: 2018-05-18
in scheme: Threats and pressures

Pollution to surface or ground water due to urban run-offs
type: Concept
notation: F11
definition: Pollution from rain and storm water running from urbanised areas carrying pollutants from roads and parking plots as well as fertilizers and pesticides used for urban vegetation.
status: valid
status modified: 2018-05-18
accepted date: 2018-05-18
in scheme: Threats and pressures

Discharge of urban waste water (excluding storm overflows and/or urban run-offs) generating pollution to surface or ground water
type: Concept
notation: F12
definition: Discharges of urban waste water (sewage) into surface and ground waters as well as discharges from non-manufacturing commercial areas which can largely be assimilated as urban waste water. Includes also activities related to household waste water treatment.
status: valid
status modified: 2018-05-18
accepted date: 2018-05-18
in scheme: Threats and pressures

Plants, contaminated or abandoned industrial sites generating pollution to surface or ground water
type: Concept
notation: F13
definition: Discharges of industrial waste water into surface and ground waters as well as diffuse pollution from contaminated or abandoned industrial sites. Includes also activities related to industrial waste water treatment.
status: valid
status modified: 2018-05-18
accepted date: 2018-05-18
in scheme: Threats and pressures

Other residential and recreational activities and structures generating point pollution to surface or ground waters
type: Concept
notation: F14
definition: This pressure should be used to address the point pollution to surface and ground waters originating from urban and recreational areas which cannot be directly attributed to specific activities covered by other level 2 pressures (e.g. if the source of the pollution is unknown or pollution is from several different sources).
status: valid
status modified: 2018-05-18
accepted date: 2018-05-18
in scheme: Threats and pressures

Other industrial and commercial activities and structures generating point pollution to surface or ground waters
type: Concept
notation: F15
definition: This pressure should be used to address the point pollution to surface and ground waters originating from industrial processes (i.e. from industrial production and processing) and structures which cannot be directly attributed to specific activities covered by other level 2 pressures (e.g. if the source of the pollution is unknown or pollution is from several different sources like from production sites together with solid waste treatment and disposal processes).
status: valid
status modified: 2018-05-18
accepted date: 2018-05-18
in scheme: Threats and pressures

Other residential and recreational activities and structures generating diffuse pollution to surface or ground waters
type: Concept
notation: F16
definition: This pressure should be used to address the diffuse pollution to surface and ground waters originating from urban and recreational areas which cannot be directly attributed to specific activities covered by other level 2 pressures (e.g. if the source of the pollution is unknown or pollution is from several different sources).
status: valid
status modified: 2018-05-18
accepted date: 2018-05-18
in scheme: Threats and pressures

Other industrial and commercial activities and structures generating diffuse pollution to surface or ground waters
type: Concept
notation: F17
definition: This pressure should be used to address the diffuse pollution to surface and ground waters originating from industrial processes (i.e. from industrial production and processing) and structures which cannot be directly attributed to specific activities covered by other level 2 pressures (e.g. if the source of the pollution is unknown or pollution is from several different sources like from production sites together with solid waste treatment and disposal processes).
status: valid
status modified: 2018-05-18
accepted date: 2018-05-18
in scheme: Threats and pressures

Residential and recreational activities and structures generating air pollution
type: Concept
notation: F18
definition: Different activities related to residential and recreational areas generating air pollution (e.g. heating).
status: valid
status modified: 2018-05-18
accepted date: 2018-05-18
in scheme: Threats and pressures

Industrial and commercial activities and structures generating air pollution
type: Concept
notation: F19
definition: Industrial activities (i.e. industrial production and processing) generating air pollution (e.g. industrial production).
status: valid
status modified: 2018-05-18
accepted date: 2018-05-18
in scheme: Threats and pressures

Residential or recreational activities and structures generating marine pollution (excl. marine macro- and micro-particular pollution)
type: Concept
notation: F20
definition: This pressure should be used to address the marine pollution originating from urban and recreational areas which cannot be directly attributed to specific activities covered by other level 2 pressures (e.g. if the source of the pollution is unknown or pollution is from several different sources).
status: valid
status modified: 2018-05-18
accepted date: 2018-05-18
in scheme: Threats and pressures

Industrial or commercial activities and structures generating marine pollution (excluding marine macro- and micro-particular pollution)
type: Concept
notation: F21
definition: This pressure should be used to address the marine pollution originating from industrial processes (i.e. from industrial production and processing) and structures which cannot be directly attributed to specific activities covered by other level 2 pressures (e.g. if the source of the pollution is unknown or pollution is from several different sources like from production sites together with solid waste treatment and disposal processes).
status: valid
status modified: 2018-05-18
accepted date: 2018-05-18
in scheme: Threats and pressures

Residential or recreational activities and structures generating marine macro- and micro- particulate pollution (e.g. plastic bags, Styrofoam)
type: Concept
notation: F22
definition: Different activities (e.g. urban waste disposal, use of products containing micro-particles) related to residential and recreational areas generating marine macro- and micro- particulate pollution (e.g. plastic bags, Styrofoam). Includes micro-residues in benthic habitats.
status: valid
status modified: 2018-05-18
accepted date: 2018-05-18
in scheme: Threats and pressures

Industrial or commercial activities and structures generating marine macro- and micro- particulate pollution (e.g. plastic bags, Styrofoam)
type: Concept
notation: F23
definition: Industrial processes (i.e. from industrial production and processing) , storage and transportation of industrial products generating marine macro- and micro- particulate pollution (e.g. plastic bags, Styrofoam). Includes micro-residues in benthic habitats.
status: valid
status modified: 2018-05-18
accepted date: 2018-05-18
in scheme: Threats and pressures

Residential or recreational activities and structures generating noise, light, heat or other forms of pollution
type: Concept
notation: F24
definition: Different activities and structures related to residential and recreational areas that generate noise, light, heat or other forms of pollution.
status: valid
status modified: 2018-05-18
accepted date: 2018-05-18
in scheme: Threats and pressures

Industrial or commercial activities and structures generating noise, light, heat or other forms of pollution
type: Concept
notation: F25
definition: Industrial processes (i.e. from industrial production and processing) and structures generating noise, light, heat or other forms of pollution.
status: valid
status modified: 2018-05-18
accepted date: 2018-05-18
in scheme: Threats and pressures

Drainage, land reclamation and conversion of wetlands, marshes, bogs, etc. to settlement or recreational areas
type: Concept
notation: F26
definition: Drainage, land reclamation and conversion of wetlands (e.g. marshes, bogs, fens, alluvial habitats) to prepare land for construction of human settlements or for use as recreational areas.
status: valid
status modified: 2018-05-18
accepted date: 2018-05-18
in scheme: Threats and pressures

Drainage, land reclamation or conversion of wetlands, marshes, bogs, etc. to industrial/commercial areas
type: Concept
notation: F27
definition: Drainage, land reclamation and conversion of wetlands (e.g. marshes, bogs, fens, alluvial habitats) to prepare land for construction of industrial/commercial areas.
status: valid
status modified: 2018-05-18
accepted date: 2018-05-18
in scheme: Threats and pressures

Modification of flooding regimes, flood protection for residential or recreational development
type: Concept
notation: F28
definition: Activities modifying physical structure and/or hydrological functioning of water bodies triggered by flood protection of urban and recreational zones (e.g. flood protection dams and reservoirs, river impoundments, canalisation, water deviation, removing bank vegetation).
status: valid
status modified: 2018-05-18
accepted date: 2018-05-18
in scheme: Threats and pressures

Construction or development of reservoirs and dams for residential or recreational development
type: Concept
notation: F29
definition: Construction, development, use and maintenance of reservoirs and dams for residential or recreational use (e.g. drinking water supply).
status: valid
status modified: 2018-05-18
accepted date: 2018-05-18
in scheme: Threats and pressures

Construction or development of reservoirs and dams for industrial or commercial development
type: Concept
notation: F30
definition: Construction, development, use and maintenance of reservoirs and dams for industrial or commercial development and use (e.g. for industrial cooling).
status: valid
status modified: 2018-05-18
accepted date: 2018-05-18
in scheme: Threats and pressures

Other modification of hydrological conditions for residential or recreational development
type: Concept
notation: F31
definition: This pressure should be used to address activities related to development and use of housing and recreational areas and structures modifying physical structure and/or hydrological functioning of water bodies which cannot be directly attributed to specific activities covered by other level 2 pressures.
status: valid
status modified: 2018-05-18
accepted date: 2018-05-18
in scheme: Threats and pressures

Other modification of hydrological conditions for industrial or commercial development
type: Concept
notation: F32
definition: This pressure should be used to address activities related to development and use of industrial areas structures modifying physical structure and/or hydrological functioning of water bodies which cannot be directly attributed to specific activities covered by other level 2 pressures.
status: valid
status modified: 2018-05-18
accepted date: 2018-05-18
in scheme: Threats and pressures

Abstraction of ground and surface waters (including marine) for public water supply and recreational use
type: Concept
notation: F33
definition: Abstraction from ground and surface waters for public water supply and recreational use (e.g. abstraction of fresh/marine water for swimming pools).
status: valid
status modified: 2018-05-18
accepted date: 2018-05-18
in scheme: Threats and pressures

Abstraction of ground and surface waters (including marine) for commercial/industrial use (excluding energy)
type: Concept
notation: F34
definition: Abstraction from ground and surface waters (including marine) for commercial/industrial use (e.g. for industrial cooling or industrial processing).
status: valid
status modified: 2018-05-18
accepted date: 2018-05-18
in scheme: Threats and pressures

Marine fish and shellfish harvesting (professional, recreational) causing reduction of species/prey populations and disturbance of species
type: Concept
notation: G01
definition: Professional and recreational marine fishing and shellfish harvesting causing increased mortality, reduction of species and/or prey populations and disturbance to species.
status: valid
status modified: 2018-05-18
accepted date: 2018-05-18
in scheme: Threats and pressures

Marine fish and shellfish processing
type: Concept
notation: G02
definition: Activities related to marine fish and shellfish processing like handling the catch, storing, pre-processing and processing, and waste treatment.
status: valid
status modified: 2018-05-18
accepted date: 2018-05-18
in scheme: Threats and pressures

Marine fish and shellfish harvesting (professional, recreational) activities causing physical loss and disturbance of seafloor habitats.
type: Concept
notation: G03
definition: Professional and recreational marine fishing and shellfish harvesting activities causing physical loss and disturbance of seafloor habitats (e.g. bottom trawling, benthic dredging).
status: valid
status modified: 2018-05-18
accepted date: 2018-05-18
in scheme: Threats and pressures

Marine plant harvesting
type: Concept
notation: G04
definition: Commercial and non-professional harvesting of wild marine macro- and micro-algae .
status: valid
status modified: 2018-05-18
accepted date: 2018-05-18
in scheme: Threats and pressures

Freshwater fish and shellfish harvesting (professional)
type: Concept
notation: G05
definition: Professional freshwater fishing and shellfish harvesting causing increased direct mortality, reduction of species and/or prey populations and disturbance to species.
status: valid
status modified: 2018-05-18
accepted date: 2018-05-18
in scheme: Threats and pressures

Freshwater fish and shellfish harvesting (recreational)
type: Concept
notation: G06
definition: Recreational freshwater fishing and shellfish harvesting causing increased direct mortality, reduction of species and/or prey populations and disturbance to species.
status: valid
status modified: 2018-05-18
accepted date: 2018-05-18
in scheme: Threats and pressures

Hunting
type: Concept
notation: G07
definition: Hunting causing increased direct mortality, reduction of species and/or prey populations and disturbance to species.
status: valid
status modified: 2018-05-18
accepted date: 2018-05-18
in scheme: Threats and pressures

Management of fishing stocks and game
type: Concept
notation: G08
definition: Activities related to management of fishing stocks and game such as stocking or restocking with native fish species (including illegal restocking), management of game population (e.g. control of certain other predators, such as corvids, by gamekeepers), management of game habitat (e.g. burning of heather for Lagopus lagopus), feeding of game, damages due to overabundant game.
status: valid
status modified: 2018-05-18
accepted date: 2018-05-18
in scheme: Threats and pressures

Harvesting or collecting of other wild plants and animals (excluding hunting and leisure fishing)
type: Concept
notation: G09
definition: Harvesting or collecting of other wild plants and animals (excluding fish, shellfish and game) for example, honey, fruit or wild mushroom collection, reed cutting/harvesting, orchid collection, butterfly collecting, pillaging of floristic stations.
status: valid
status modified: 2018-05-18
accepted date: 2018-05-18
in scheme: Threats and pressures

Illegal shooting/killing
type: Concept
notation: G10
definition: Illegal shooting, killing or collecting of animal species. This includes, for example, illegal killing of game species, illegal taking of fish, illegal collecting of strictly protected animal species. Also includes hunting, capture or killing using methods and forms referred to in the Article 8 of the Birds Directive (e.g. 'indiscriminate' forms of hunting for birds such as snares) or in Article 15 of the Habitats Directive; or the practice of hunting and fishing activities that do not conform to e.g. quotas or seasonal restrictions.
status: valid
status modified: 2018-05-18
accepted date: 2018-05-18
in scheme: Threats and pressures

Illegal harvesting, collecting and taking
type: Concept
notation: G11
definition: Illegal harvesting, collecting and taking of plant species (e.g. collecting strictly protected species or illegal taking of other plants species for which harvesting is regulated).
status: valid
status modified: 2018-05-18
accepted date: 2018-05-18
in scheme: Threats and pressures

Bycatch and incidental killing (due to fishing and hunting activities)
type: Concept
notation: G12
definition: Bycatch and incidental killing due to fishing and hunting activities (e.g. 'accidentally' shooting of a non-target species, because of similarities with a target species, capture/drowning on long-lines and in fishing nets, entanglement in discarded/lost fishing gear).
status: valid
status modified: 2018-05-18
accepted date: 2018-05-18
in scheme: Threats and pressures

Poisoning of animals (excluding lead poisoning)
type: Concept
notation: G13
definition: Deliberate poisoning of animals including the effect of secondary poisoning.
status: valid
status modified: 2018-05-18
accepted date: 2018-05-18
in scheme: Threats and pressures

Use of lead ammunition or fishing weights
type: Concept
notation: G14
definition: Poisoning related to the use of lead shots, lead bullet fragments or fishing weights.
status: valid
status modified: 2018-05-18
accepted date: 2018-05-18
in scheme: Threats and pressures

Modification of coastal conditions for marine aquaculture
type: Concept
notation: G15
definition: Activities modifying coastal conditions triggered by marine aquaculture (e.g. habitat loss and degradation in coastal areas due to development and installation of infrastructure). Includes changes like changes in sedimentation rates due to operation of facilities and use of equipment and tools (e.g. for harvesting).
status: valid
status modified: 2018-05-18
accepted date: 2018-05-18
in scheme: Threats and pressures

Marine aquaculture generating marine pollution
type: Concept
notation: G16
definition: Marine pollution from marine aquaculture (e.g. nutrient input from feeding, pollution due to use of veterinary products or fertilisers or increased concentrations of organic material). Includes pollution by litter.
status: valid
status modified: 2018-05-18
accepted date: 2018-05-18
in scheme: Threats and pressures

Introduction and spread of species (including GMOs) in marine aquaculture
type: Concept
notation: G17
definition: Introduction and/or spread of allochthonous species or allochthonous genotypes and of genetically modified organisms in marine aquaculture. It also includes changes in interspecific relations between native wild species induced by marine aquaculture (e.g. changes in sexual behaviour of autochthonous population due to aquaculture, increased food supply for piscivorous species).
status: valid
status modified: 2018-05-18
accepted date: 2018-05-18
in scheme: Threats and pressures

Abandonment of marine aquaculture
type: Concept
notation: G18
definition: Abandonment of marine aquaculture.
status: valid
status modified: 2018-05-18
accepted date: 2018-05-18
in scheme: Threats and pressures

Other impacts from marine aquaculture, including infrastructure
type: Concept
notation: G19
definition: Other impacts from marine aquaculture and development and use of marine aquaculture facilities and infrastructure (e.g. disturbance due to noise and light from construction or operation of aquaculture farms, disturbance from anti-predator devices).
status: valid
status modified: 2018-05-18
accepted date: 2018-05-18
in scheme: Threats and pressures

Abstraction of water, flow diversion, dams and other modifications of hydrological conditions for freshwater aquaculture
type: Concept
notation: G20
definition: Abstraction of water, flow deviation, development and operation of dams and reservoirs and other changes to the physical structure of water bodies or hydrological flow or triggered by freshwater aquaculture.
status: valid
status modified: 2018-05-18
accepted date: 2018-05-18
in scheme: Threats and pressures

Freshwater aquaculture generating point source pollution to surface or ground waters
type: Concept
notation: G21
definition: Chemical or biological point pollution to surface or ground waters from freshwater aquaculture (e.g. nutrient input from feeding, pollution due to use of veterinary products or increased concentrations of organic material).
status: valid
status modified: 2018-05-18
accepted date: 2018-05-18
in scheme: Threats and pressures

Freshwater aquaculture generating diffuse source pollution to surface or ground waters
type: Concept
notation: G22
definition: Chemical or biological diffuse pollution to surface or ground waters from freshwater aquaculture (e.g. nutrient input from feeding, pollution due to use of veterinary products or increased concentrations of organic material).
status: valid
status modified: 2018-05-18
accepted date: 2018-05-18
in scheme: Threats and pressures

Freshwater aquaculture generating marine pollution
type: Concept
notation: G23
definition: Chemical or biological marine pollution from freshwater aquaculture (e.g. nutrient input from feeding, pollution due to use of veterinary products or fertilisers or increased concentrations of organic material).
status: valid
status modified: 2018-05-18
accepted date: 2018-05-18
in scheme: Threats and pressures

Introduction and spread of species (including alien species and GMOs) in freshwater aquaculture
type: Concept
notation: G24
definition: Introduction and/or spread of allochthonous species or allochthonous genotypes and of genetically modified organisms in freshwater aquaculture. It also includes changes in interspecific relationships between native wild species introduced by aquaculture (e.g. an increase of piscivorous fishes due to aquaculture practices that would exert added pressure on endangered amphibians, increase in food supply for native fish populations).
status: valid
status modified: 2018-05-18
accepted date: 2018-05-18
in scheme: Threats and pressures

Abandonment of freshwater aquaculture
type: Concept
notation: G25
definition: Abandonment of freshwater aquaculture.
status: valid
status modified: 2018-05-18
accepted date: 2018-05-18
in scheme: Threats and pressures

Other impacts from freshwater aquaculture, including infrastructure
type: Concept
notation: G26
definition: Other impacts from freshwater aquaculture and development and use of freshwater aquaculture facilities and infrastructure (e.g. disturbance due to noise and light from construction or operation of aquaculture farms).
status: valid
status modified: 2018-05-18
accepted date: 2018-05-18
in scheme: Threats and pressures

Other activities related to extraction and cultivation of biological living resources not referred to above
type: Concept
notation: G27
definition: Other activities related to extraction and cultivation of biological living resources not referred to above.
status: valid
status modified: 2018-05-18
accepted date: 2018-05-18
in scheme: Threats and pressures

Military, paramilitary or police exercises and operations on land
type: Concept
notation: H01
definition: Military, paramilitary or police infrastructure, exercises and operations on land (excluding military bases in urbanised areas). Includes, for example, munitions testing, restricted access to military training areas, military manoeuvres).
status: valid
status modified: 2018-05-18
accepted date: 2018-05-18
in scheme: Threats and pressures

Military, paramilitary or police exercises and operations in the freshwater and marine environment
type: Concept
notation: H02
definition: Military, paramilitary or police infrastructure, exercises and operations in the freshwater and marine environment (e.g. collisions with vessels, disturbance by sonar from military vessels).
status: valid
status modified: 2018-05-18
accepted date: 2018-05-18
in scheme: Threats and pressures

Abandonment of terrestrial military or similar exercises (loss of open habitats)
type: Concept
notation: H03
definition: Abandonment of terrestrial military or similar exercises (e.g. natural successions on open habitats due to cessation of military activities).
status: valid
status modified: 2018-05-18
accepted date: 2018-05-18
in scheme: Threats and pressures

Vandalism or arson
type: Concept
notation: H04
definition: Vandalism or arson, including for example larger scale wildfires initiated by arson.
status: valid
status modified: 2018-05-18
accepted date: 2018-05-18
in scheme: Threats and pressures

Tree surgery, felling/removal of roadside trees and vegetation for public safety
type: Concept
notation: H05
definition: Tree surgery, felling or removal of roadside trees and vegetation on the grounds of public safety (including interventions classified as public safety issue).
status: valid
status modified: 2018-05-18
accepted date: 2018-05-18
in scheme: Threats and pressures

Closure or restricted access to site/habitat
type: Concept
notation: H06
definition: Closure or restricted access to sites, like fencing of open sites, closure of caves, natural galleries and other types of restricted access to a habitat or site related to protection of private property and human safety.
status: valid
status modified: 2018-05-18
accepted date: 2018-05-18
in scheme: Threats and pressures

Intrusive and destructive research and monitoring activities
type: Concept
notation: H07
definition: Applied (intrusive) destructive research. Includes for example collection of animals/plants for scientific purposes.
status: valid
status modified: 2018-05-18
accepted date: 2018-05-18
in scheme: Threats and pressures

Other human intrusions and disturbance not mentioned above
type: Concept
notation: H08
definition: Other human intrusions and disturbance not mentioned above (e.g. illegal dumping).
status: valid
status modified: 2018-05-18
accepted date: 2018-05-18
in scheme: Threats and pressures

Invasive alien species of Union concern
type: Concept
notation: I01
definition: Problems related to invasive alien species of Union concern (under Regulation (EU) No 1143/2014) (e.g. clogging of aquatic habitats by Eichhornia crassipes,predation of adults and chicks/eggs by Myocastor coypus, Nyctereutes procyonoides and Procyon lotor, browsing of understorey habitats by Muntiacus reevesi, competition for food with Procambarus clarkii,hybridisation with Oxyura jamaicensis).
status: valid
status modified: 2018-05-18
accepted date: 2018-05-18
in scheme: Threats and pressures

Other invasive alien species (other then species of Union concern)
type: Concept
notation: I02
definition: Problems related to other 'invasive' alien species (any species introduced in modern period that is established in the wild outside its natural range and whose introduction and/or spread represent a threat or a potential threat to habitats and species, regardless of the invasive population dynamics) other than invasive alien species of Union concern (under Regulation (EU) No 1143/2014), for which code I01 should be used) (e.g. predation of adults and chicks/eggs by Genetta genetta, Neovison vison, Rattus norvegicus and R. rattus, loss of (native) prey species owing to competition with Crassostrea gigas,decline in the quality of native vegetation owing to spread of invasive plant species (e.g. Amorpha fruticosa and Hedychium gardnerianum),overgrowing of alluvial and lowland humid habitats with invasive plants (e.g. Solidago gigantea, S. canadensis, Aster lanceolatus, A. novi-belgii, Fallopia japonica, F. sachaliensis and Impatiens glandulifera)).
status: valid
status modified: 2018-05-18
accepted date: 2018-05-18
in scheme: Threats and pressures

DO NOT USE Other alien species (not invasive)
type: Concept
notation: I03
definition: This code should not be used for new entries. It has been restored for technical reason.
status: valid
status modified: 2018-05-18
accepted date: 2018-05-18
in scheme: Threats and pressures

Problematic native species
type: Concept
notation: I04
definition: Harmful plants, animals, that are originally found within the ecosystem(s) in question, but have become out-of-balance directly or indirectly due to human activities. It includes, for example, problems with feral native animals (e.g. cats, dog); overabundant algae due to loss of native grazing fish; predation of adults, fledglings and chicks/eggs by Mus musculus, native Mustela spp., Sus scrofa, Vulpes vulpes and domestic/feral Felis catus; interbreeding with feral Columba livia. This pressure should be used if problems with native species cannot be associated with other more specific drivers/pressures (e.g. when problems with native species can be associated with multiple human activities or more precise activities are unknown).
status: valid
status modified: 2018-05-18
accepted date: 2018-05-18
in scheme: Threats and pressures

Plant and animal diseases, pathogens and pests
type: Concept
notation: I05
definition: Problems related to plant and animal diseases, pathogens and pests (including insect and nematode pests) like plague affecting rodents or diseases such as those caused by Clostridium botulinum (avian botulism) and Trichomonas gallinae (trichomoniasis).
status: valid
status modified: 2018-05-18
accepted date: 2018-05-18
in scheme: Threats and pressures

Mixed source pollution to surface and ground waters (limnic and terrestrial)
type: Concept
notation: J01
definition: Mixed source pollution to surface and ground waters. Pollution should only be reported under this category when the key driver of the pollution is unclear or where pollution is related to several causes. (e.g. river eutrophication can be related to several direct and indirect sources like sewage, agricultural and industrial discharges, diffuse pollution from agriculture, decreased retention of alluvial vegetation due to inadequate management). Where a key sectoral driver can be identified, pollution should be reported under the corresponding sectoral pollution category.
status: valid
status modified: 2018-05-18
accepted date: 2018-05-18
in scheme: Threats and pressures

Mixed source marine water pollution (marine and coastal)
type: Concept
notation: J02
definition: Mixed source marine water pollution (marine and coastal). Pollution should only be reported under this category when the key driver of the pollution is unclear or where pollution is related to several causes (e.g. marine pollution by hydrocarbons can be related to several sources, like industrial discharges, water and land based transport operation, pollution, transport and exploitation accidents). Where a key sectoral driver can be identified, pollution should be reported under the corresponding sectoral pollution category.
status: valid
status modified: 2018-05-18
accepted date: 2018-05-18
in scheme: Threats and pressures

Mixed source air pollution, air-borne pollutants
type: Concept
notation: J03
definition: Mixed source air pollution, air-borne pollutants. Pollution should only be reported under this category when the key driver of the pollution is unclear or where pollution is related to several causes (e.g. source of pollutants for acid rain is usually a mix of emissions from vehicles, power plants etc.). Where a key sectoral driver can be identified, pollution should be reported under the corresponding sectoral pollution category.
status: valid
status modified: 2018-05-18
accepted date: 2018-05-18
in scheme: Threats and pressures

Mixed source soil pollution and solid waste (excluding discharges)
type: Concept
notation: J04
definition: Mixed source soil pollution and solid waste (excluding discharges). Pollution should only be reported under this category when the key driver of the pollution is unclear or where pollution is related to several causes. Where a key sectoral driver can be identified, pollution should be reported under the corresponding sectoral pollution category.
status: valid
status modified: 2018-05-18
accepted date: 2018-05-18
in scheme: Threats and pressures

Mixed source excess energy
type: Concept
notation: J05
definition: Mixed source excess energy. Pollution should only be reported under this category when the key driver of the pollution is unclear or where pollution is related to several causes. Where a key sectoral driver can be identified, pollution should be reported under the corresponding sectoral pollution category.
status: valid
status modified: 2018-05-18
accepted date: 2018-05-18
in scheme: Threats and pressures

Abstraction from groundwater, surface water or mixed water
type: Concept
notation: K01
definition: Abstractions from groundwater, surface water or mixed water should only be reported under this category when the key driver of the change is unclear or where these changes are related to several causes. Where a key sectoral driver(s) can be identified, the pressure/threat should be reported under the corresponding sectoral category.
status: valid
status modified: 2018-05-18
accepted date: 2018-05-18
in scheme: Threats and pressures

Drainage
type: Concept
notation: K02
definition: Drainage including landfill, land reclamation and drying out should only be reported under this category when the key driver of the change is unclear or where these changes are related to several causes. Where a key sectoral driver(s) can be identified, the pressure/threat should be reported under the corresponding sectoral category.
status: valid
status modified: 2018-05-18
accepted date: 2018-05-18
in scheme: Threats and pressures

Development and operation of dams
type: Concept
notation: K03
definition: Development and operation of dams should only be reported under this category when the key driver of the change is unclear or where these changes are related to several causes. Where a key sectoral driver(s) can be identified, the pressure/threat should be reported under the corresponding sectoral category.
status: valid
status modified: 2018-05-18
accepted date: 2018-05-18
in scheme: Threats and pressures

Modification of hydrological flow
type: Concept
notation: K04
definition: Modification of hydrological flow should only be reported under this category when the key driver of the change is unclear or where these changes are related to several causes. Where a key sectoral driver can be identified, the pressure/threat should be reported under the corresponding sectoral category. Includes, for example, modification of flooding regimes or cutting of aquatic and bank vegetation to improve water flow.
status: valid
status modified: 2018-05-18
accepted date: 2018-05-18
in scheme: Threats and pressures

Physical alteration of water bodies
type: Concept
notation: K05
definition: Physical alteration of water bodies should only be reported under this category when the key driver of the change is unclear or where these changes are related to several causes. Where a key sectoral driver(s) can be identified, the pressure/threat should be reported under the corresponding sectoral category. Includes, for example, removal of sediments, canalisation and water deviation.
status: valid
status modified: 2018-05-18
accepted date: 2018-05-18
in scheme: Threats and pressures

Abiotic natural processes (e.g. erosion, silting up, drying out, submersion, salinization)
type: Concept
notation: L01
definition: Abiotic natural processes (e.g. natural erosion in areas with naturally low vegetation cover). Includes natural abiotic processes only. The abiotic processes resulting from human activities or the abandonment of human activities should be reported under the appropriate pressures, for example, silting up as a result of erosion due to wood transport should be coded as B16 Wood transport.
status: valid
status modified: 2018-05-18
accepted date: 2018-05-18
in scheme: Threats and pressures

Natural succession resulting in species composition change (other than by direct changes of agricultural or forestry practices)
type: Concept
notation: L02
definition: Changes in a species composition due to natural succession (e.g. primary succession related to natural siltation of lakes or succession after natural disturbances). Includes natural succession only. Spontaneous succession following the abandonment of farming practices is to be coded using appropriate codes under the category A - Agriculture. Spontaneous succession following the abandonment of traditional forest practices is to be coded using respective codes under the category F - Forestry.
status: valid
status modified: 2018-05-18
accepted date: 2018-05-18
in scheme: Threats and pressures

Accumulation of organic material
type: Concept
notation: L03
definition: Accumulation of organic material. Includes natural processes accumulation of organic material only (e.g. peat formation) .
status: valid
status modified: 2018-05-18
accepted date: 2018-05-18
in scheme: Threats and pressures

Natural processes of eutrophication or acidification
type: Concept
notation: L04
definition: Natural processes of eutrophication or acidification (e.g. natural eutrophication of lakes or natural eutrophication due to natural drying out of peatlands in areas with insufficient precipitation rate). Includes natural processes of acidification or eutrophication only. Eutrophication resulting directly or indirectly from human activities should be reported under the appropriate pressures, for example, eutrophication due to the anthropogenic input of nitrogen should be reported under A20 or eutrophication due to drainage of fens or peatlands should be reported under codes that capture drainage, for example A31.
status: valid
status modified: 2018-05-18
accepted date: 2018-05-18
in scheme: Threats and pressures

Reduced fecundity / genetic depression (e.g. inbreeding or endogamy)
type: Concept
notation: L05
definition: Reduced fecundity and/or genetic depression resulting from e.g. inbreeding or endogamy. This pressure should be used for genetic depression in naturally small and/or isolated populations but also in populations which declined and/or became isolated in the past (excluding recent past) due to anthropogenic pressures.
status: valid
status modified: 2018-05-18
accepted date: 2018-05-18
in scheme: Threats and pressures

Interspecific relations (competition, predation, parasitism, pathogens)
type: Concept
notation: L06
definition: Interspecific relations (competition, predation, parasitism, pathogens). Includes natural relations (not induced by human activities) like plant pest damages (e.g. infection of seeds, like mildew infection, rust infection etc.), animal pest damages (e.g. damage to the plants reproductive organs by invertebrates, parasites) or native plants hybridization with other plants. Changes in interspecific relationships resulting from human activities should be reported under respective pressures for example I04 or G08.
status: valid
status modified: 2018-05-18
accepted date: 2018-05-18
in scheme: Threats and pressures

Absence or reduction of interspecific faunal and floral relations (e.g. pollinators)
type: Concept
notation: L07
definition: Absence or reduction of interspecific relations (e.g. lack of pollinators or lack of prey). Includes absence or reduction of interspecific relations due to natural reasons (e.g. lack of prey due to spread of diseases).
status: valid
status modified: 2018-05-18
accepted date: 2018-05-18
in scheme: Threats and pressures

Volcanic activity
type: Concept
notation: M01
definition: Volcanic activity.
status: valid
status modified: 2018-05-18
accepted date: 2018-05-18
in scheme: Threats and pressures

Tidal waves, tsunamis
type: Concept
notation: M02
definition: Tidal waves, tsunamis. Includes geologically caused tidal waves/tsunamis.
status: valid
status modified: 2018-05-18
accepted date: 2018-05-18
in scheme: Threats and pressures

Earthquake
type: Concept
notation: M03
definition: Earthquakes.
status: valid
status modified: 2018-05-18
accepted date: 2018-05-18
in scheme: Threats and pressures

Avalanche (snow)
type: Concept
notation: M04
definition: Avalanche (snow). Includes avalanches which are not triggered by human activities, such as off piste skiing.
status: valid
status modified: 2018-05-18
accepted date: 2018-05-18
in scheme: Threats and pressures

Collapse of terrain, landslide
type: Concept
notation: M05
definition: Collapses of terrain, landslides.
status: valid
status modified: 2018-05-18
accepted date: 2018-05-18
in scheme: Threats and pressures

Underground collapses (natural processes)
type: Concept
notation: M06
definition: Underground collapses (natural processes).
status: valid
status modified: 2018-05-18
accepted date: 2018-05-18
in scheme: Threats and pressures

Storm, cyclone
type: Concept
notation: M07
definition: Storm, cyclone. Direct impact of storm or cyclone such as loss of clutches/broods of coastal-nesting species during storm surges, at-sea mortality ('wrecks') of seabirds during winter storms, damage to nests during high winds, direct impacts of heavy rain.
status: valid
status modified: 2018-05-18
accepted date: 2018-05-18
in scheme: Threats and pressures

Flooding (natural processes)
type: Concept
notation: M08
definition: Natural flooding causing e.g. loss of nests of species nesting on the ground or in emergent vegetation along rivers, in marshes and low-lying areas such as floodplains; reduced access to food resources in these areas during prolonged flooding.
status: valid
status modified: 2018-05-18
accepted date: 2018-05-18
in scheme: Threats and pressures

Fire (natural)
type: Concept
notation: M09
definition: Natural fires (e.g. natural forest fires).
status: valid
status modified: 2018-05-18
accepted date: 2018-05-18
in scheme: Threats and pressures

Other natural catastrophes
type: Concept
notation: M10
definition: Other natural catastrophes.
status: valid
status modified: 2018-05-18
accepted date: 2018-05-18
in scheme: Threats and pressures

Temperature changes (e.g. rise of temperature & extremes) due to climate change
type: Concept
notation: N01
definition: Periods in which temperatures exceed or go below the normal range of variation. Includes, for example, heat waves, cold spells, oceanic temperature changes, disappearance of glaciers/sea ice.
status: valid
status modified: 2018-05-18
accepted date: 2018-05-18
in scheme: Threats and pressures

Droughts and decreases in precipitation due to climate change
type: Concept
notation: N02
definition: Periods in which rainfall falls below the normal range of variation. Includes, for example, severe lack of rain, loss of surface water sources.
status: valid
status modified: 2018-05-18
accepted date: 2018-05-18
in scheme: Threats and pressures

Increases or changes in precipitation due to climate change
type: Concept
notation: N03
definition: Increased precipitation due to climate change. Also includes increased quantity and intensity of storms.
status: valid
status modified: 2018-05-18
accepted date: 2018-05-18
in scheme: Threats and pressures

Sea-level and wave exposure changes due to climate change
type: Concept
notation: N04
definition: Sea-level and wave exposure changes due to climate change.
status: valid
status modified: 2018-05-18
accepted date: 2018-05-18
in scheme: Threats and pressures

Change of habitat location, size, and / or quality due to climate change
type: Concept
notation: N05
definition: Change of habitat location, size, and / or quality due to climate change (e.g. changes in pH or ocean acidification).
status: valid
status modified: 2018-05-18
accepted date: 2018-05-18
in scheme: Threats and pressures

Desynchronisation of biological / ecological processes due to climate change
type: Concept
notation: N06
definition: Desynchronisation of biological / ecological processes due to climate change.
status: valid
status modified: 2018-05-18
accepted date: 2018-05-18
in scheme: Threats and pressures

Decline or extinction of related species (e.g. food source / prey, predator / parasite, symbiote, etc.) due to climate change
type: Concept
notation: N07
definition: Decline or extinction of related species (e.g. food source / prey, predator / parasite, symbiote, etc.) due to climate change.
status: valid
status modified: 2018-05-18
accepted date: 2018-05-18
in scheme: Threats and pressures

Change of species distribution (natural newcomers) due to climate change
type: Concept
notation: N08
definition: Change of species distribution (natural newcomers) due to climate change.
status: valid
status modified: 2018-05-18
accepted date: 2018-05-18
in scheme: Threats and pressures

Other climate related changes in abiotic conditions
type: Concept
notation: N09
definition: Other climate related changes in abiotic conditions e.g. water flow changes (limnic, tidal and oceanic) due to climate change.
status: valid
status modified: 2018-05-18
accepted date: 2018-05-18
in scheme: Threats and pressures

Unknown pressure
type: Concept
notation: Xu
definition: Pressure is acting, but not possible to clearly identify.
status: valid
status modified: 2018-05-18
accepted date: 2018-05-18
in scheme: Threats and pressures

No pressures
type: Concept
notation: Xxp
definition: There are no proven pressures.
status: valid
status modified: 2018-05-18
accepted date: 2018-05-18
in scheme: Threats and pressures

No threats
type: Concept
notation: Xxt
definition: There are no predicted threats.
status: valid
status modified: 2018-05-18
accepted date: 2018-05-18
in scheme: Threats and pressures

No information on pressures
type: Concept
notation: Xp
definition: No data on pressures.
status: valid
status modified: 2018-05-18
accepted date: 2018-05-18
in scheme: Threats and pressures

No information on threats
type: Concept
notation: Xt
definition: No data on threats.
status: valid
status modified: 2018-05-18
accepted date: 2018-05-18
in scheme: Threats and pressures

Threats and pressures from outside the EU territory
type: Concept
notation: Xe
definition: Threats and pressures from outside the EU territory (for the Article 17 reporting only).
status: valid
status modified: 2018-05-18
accepted date: 2018-05-18
in scheme: Threats and pressures

Threats and pressures from outside the Member State
type: Concept
notation: Xo
definition: Threats and pressures from outside the Member State (for the Article 17 reporting only).
status: valid
status modified: 2018-05-18
accepted date: 2018-05-18
in scheme: Threats and pressures

Trends
type: ConceptScheme
notation: trends
is part of: Habitats directive Art. 17 reporting in year 2018
registration status: Public draft
user modified: roschsab
date modified: 2017-09-13 13:14:08.0
vocabulary type: Common
is numeric concept identifiers: false
is notations equal identifiers: false

Decreasing
type: Concept
notation: D
status: valid
status modified: 2017-07-25
in scheme: Trends

Increasing
type: Concept
notation: I
status: valid
status modified: 2017-07-25
in scheme: Trends

Stable
type: Concept
notation: S
status: valid
status modified: 2017-07-25
in scheme: Trends

Uncertain
type: Concept
notation: U
status: valid
status modified: 2017-07-27
in scheme: Trends

Unknown
type: Concept
notation: Unk
status: valid
status modified: 2017-07-25
in scheme: Trends

Overall trend in conservation status
type: ConceptScheme
notation: trendsConclusion
is part of: Habitats directive Art. 17 reporting in year 2018
registration status: Public draft
user modified: roschsab
date modified: 2017-10-04 12:07:25.0
vocabulary type: Common
is numeric concept identifiers: false
is notations equal identifiers: false

Deteriorating
type: Concept
notation: D
status: valid
status modified: 2017-07-25
in scheme: Overall trend in conservation status

Improving
type: Concept
notation: I
status: valid
status modified: 2017-07-25
in scheme: Overall trend in conservation status

Stable
type: Concept
notation: S
status: valid
status modified: 2017-07-25
in scheme: Overall trend in conservation status

Unknown
type: Concept
notation: Unk
status: valid
status modified: 2017-07-25
in scheme: Overall trend in conservation status

Type of estimate for population size
type: ConceptScheme
notation: typeEstimate
is part of: Habitats directive Art. 17 reporting in year 2018
registration status: Public draft
user modified: roschsab
date modified: 2017-10-04 13:44:35.0
vocabulary type: Common
is numeric concept identifiers: false
is notations equal identifiers: false

Best estimate
type: Concept
notation: estimate
status: valid
status modified: 2017-07-25
in scheme: Type of estimate for population size

95% confidence interval
type: Concept
notation: interval
status: valid
status modified: 2017-07-25
in scheme: Type of estimate for population size

Multi-year mean
type: Concept
notation: mean
status: valid
status modified: 2017-07-25
in scheme: Type of estimate for population size

Minimum
type: Concept
notation: minimum
status: valid
status modified: 2017-07-25
in scheme: Type of estimate for population size

Reintroduction success
type: ConceptScheme
notation: yesNoTooEarly
is part of: Habitats directive Art. 17 reporting in year 2018
registration status: Public draft
user modified: roschsab
date modified: 2017-10-04 13:42:39.0
vocabulary type: Common
is numeric concept identifiers: false
is notations equal identifiers: false

No
type: Concept
notation: N
status: valid
status modified: 2017-07-25
in scheme: Reintroduction success

Too early to say
type: Concept
notation: Unk
status: valid
status modified: 2017-07-25
in scheme: Reintroduction success

Yes
type: Concept
notation: Y
status: valid
status modified: 2017-07-25
in scheme: Reintroduction success

Sufficiency of area and quality of occupied habitat
type: ConceptScheme
notation: yesNoUnknown
is part of: Habitats directive Art. 17 reporting in year 2018
registration status: Public draft
user modified: roschsab
date modified: 2017-10-04 13:44:11.0
vocabulary type: Common
is numeric concept identifiers: false
is notations equal identifiers: false

No
type: Concept
notation: N
status: valid
status modified: 2017-07-25
in scheme: Sufficiency of area and quality of occupied habitat

Unknown
type: Concept
notation: Unk
status: valid
status modified: 2017-07-25
in scheme: Sufficiency of area and quality of occupied habitat

Yes
type: Concept
notation: Y
status: valid
status modified: 2017-07-25
in scheme: Sufficiency of area and quality of occupied habitat