Birds directive Art. 12 reporting in year 2018
type: Collection
notation: art12_2018
has part: Bird species
has part: CDR QaQc Birds Directive Article 12 Reporting
has part: countries
has part: Assessment of the effectiveness of MPs for huntable species in non-Secure status (Articles 3 and 7, Management Plans)
has part: Assessment of the effectiveness of SAPs for globally threatened species (Art. 12, Species Action Plans)
has part: Keywintering species
has part: measures
has part: measuresIdentified
has part: measuresLocation
has part: measuresPurposeBirds
has part: measuresResponse
has part: methodsUsed
has part: populationUnits
has part: presenceBirds
has part: pressuresThreatsLocation
has part: ranking
has part: reasonChange
has part: Season in which data for Article 12 species were collected
has part: seasonRedList
has part: threats
has part: trends
has part: typeEstimate
has part: Type of international plan

Bird species
type: ConceptScheme
notation: BDspecies
is part of: Birds directive Art. 12 reporting in year 2018
registration status: Public draft
user modified: roschsab
date modified: 2018-07-03 11:58:01.0
vocabulary type: Common
is numeric concept identifiers: false
is notations equal identifiers: false

Gavia stellata
type: Concept
notation: A001
status: valid
status modified: 2018-07-03
accepted date: 2018-07-03
in scheme: Bird species

Gavia arctica
type: Concept
notation: A002
status: valid
status modified: 2018-07-03
accepted date: 2018-07-03
in scheme: Bird species

Gavia immer
type: Concept
notation: A003
status: valid
status modified: 2018-07-03
accepted date: 2018-07-03
in scheme: Bird species

Tachybaptus ruficollis
type: Concept
notation: A004
status: valid
status modified: 2018-07-03
accepted date: 2018-07-03
in scheme: Bird species

Podiceps cristatus
type: Concept
notation: A005
status: valid
status modified: 2018-07-03
accepted date: 2018-07-03
in scheme: Bird species

Podiceps grisegena
type: Concept
notation: A006
status: valid
status modified: 2018-07-03
accepted date: 2018-07-03
in scheme: Bird species

Podiceps auritus
type: Concept
notation: A007
status: valid
status modified: 2018-07-03
accepted date: 2018-07-03
in scheme: Bird species

Podiceps nigricollis
type: Concept
notation: A008
status: valid
status modified: 2018-07-03
accepted date: 2018-07-03
in scheme: Bird species

Fulmarus glacialis
type: Concept
notation: A009
status: valid
status modified: 2018-07-03
accepted date: 2018-07-03
in scheme: Bird species

Puffinus puffinus
type: Concept
notation: A013
status: valid
status modified: 2018-07-03
accepted date: 2018-07-03
in scheme: Bird species

Hydrobates pelagicus
type: Concept
notation: A014
status: valid
status modified: 2018-07-03
accepted date: 2018-07-03
in scheme: Bird species

Morus bassanus
type: Concept
notation: A016
status: valid
status modified: 2018-07-03
accepted date: 2018-07-03
in scheme: Bird species

Pelecanus onocrotalus
type: Concept
notation: A019
status: valid
status modified: 2018-07-03
accepted date: 2018-07-03
in scheme: Bird species

Pelecanus crispus
type: Concept
notation: A020
status: valid
status modified: 2018-07-03
accepted date: 2018-07-03
in scheme: Bird species

Botaurus stellaris
type: Concept
notation: A021
status: valid
status modified: 2018-07-03
accepted date: 2018-07-03
in scheme: Bird species

Ixobrychus minutus
type: Concept
notation: A022
status: valid
status modified: 2018-07-03
accepted date: 2018-07-03
in scheme: Bird species

Nycticorax nycticorax
type: Concept
notation: A023
status: valid
status modified: 2018-07-03
accepted date: 2018-07-03
in scheme: Bird species

Ardeola ralloides
type: Concept
notation: A024
status: valid
status modified: 2018-07-03
accepted date: 2018-07-03
in scheme: Bird species

Bubulcus ibis
type: Concept
notation: A025
status: valid
status modified: 2018-07-03
accepted date: 2018-07-03
in scheme: Bird species

Egretta garzetta
type: Concept
notation: A026
status: valid
status modified: 2018-07-03
accepted date: 2018-07-03
in scheme: Bird species

Ardea cinerea
type: Concept
notation: A028
status: valid
status modified: 2018-07-03
accepted date: 2018-07-03
in scheme: Bird species

Ardea purpurea
type: Concept
notation: A029
status: valid
status modified: 2018-07-03
accepted date: 2018-07-03
in scheme: Bird species

Ciconia nigra
type: Concept
notation: A030
status: valid
status modified: 2018-07-03
accepted date: 2018-07-03
in scheme: Bird species

Ciconia ciconia | W Europe & North-west Africa/Sub-Saharan Africa
type: Concept
notation: A031-A
status: valid
status modified: 2018-07-03
accepted date: 2018-07-03
in scheme: Bird species

Ciconia ciconia | Central & Eastern Europe/Sub-Saharan Africa
type: Concept
notation: A031-B
status: valid
status modified: 2018-07-03
accepted date: 2018-07-03
in scheme: Bird species

Plegadis falcinellus
type: Concept
notation: A032
status: valid
status modified: 2018-07-03
accepted date: 2018-07-03
in scheme: Bird species

Platalea leucorodia
type: Concept
notation: A034
status: valid
status modified: 2018-07-03
accepted date: 2018-07-03
in scheme: Bird species

Cygnus olor
type: Concept
notation: A036
status: valid
status modified: 2018-07-03
accepted date: 2018-07-03
in scheme: Bird species

Cygnus columbianus bewickii
type: Concept
notation: A037
status: valid
status modified: 2018-07-03
accepted date: 2018-07-03
in scheme: Bird species

Cygnus cygnus
type: Concept
notation: A038
status: valid
status modified: 2018-07-03
accepted date: 2018-07-03
in scheme: Bird species

Anser brachyrhynchus | Svalbard/North-west Europe
type: Concept
notation: A040-A
status: valid
status modified: 2018-07-03
accepted date: 2018-07-03
in scheme: Bird species

Anser brachyrhynchus | East Greenland & Iceland/UK
type: Concept
notation: A040-B
status: valid
status modified: 2018-07-03
accepted date: 2018-07-03
in scheme: Bird species

Anser erythropus
type: Concept
notation: A042
status: valid
status modified: 2018-07-03
accepted date: 2018-07-03
in scheme: Bird species

Anser anser
type: Concept
notation: A043
status: valid
status modified: 2018-07-03
accepted date: 2018-07-03
in scheme: Bird species

Anser anser | non-native populations
type: Concept
notation: A043-X
status: valid
status modified: 2018-07-03
accepted date: 2018-07-03
in scheme: Bird species

Branta canadensis
type: Concept
notation: A044-X
status: valid
status modified: 2018-07-03
accepted date: 2018-07-03
in scheme: Bird species

Branta leucopsis | East Greenland/Scotland & Ireland
type: Concept
notation: A045-A
status: valid
status modified: 2018-07-03
accepted date: 2018-07-03
in scheme: Bird species

Branta leucopsis | Svalbard/South-west Scotland
type: Concept
notation: A045-B
status: valid
status modified: 2018-07-03
accepted date: 2018-07-03
in scheme: Bird species

Branta leucopsis | Russia/Germany & Netherlands
type: Concept
notation: A045-C
status: valid
status modified: 2018-07-03
accepted date: 2018-07-03
in scheme: Bird species

Branta leucopsis | non-native populations
type: Concept
notation: A045-X
status: valid
status modified: 2018-07-03
accepted date: 2018-07-03
in scheme: Bird species

Tadorna tadorna
type: Concept
notation: A048
status: valid
status modified: 2018-07-03
accepted date: 2018-07-03
in scheme: Bird species

Anas crecca
type: Concept
notation: A052
status: valid
status modified: 2018-07-03
accepted date: 2018-07-03
in scheme: Bird species

Anas platyrhynchos
type: Concept
notation: A053
status: valid
status modified: 2018-07-03
accepted date: 2018-07-03
in scheme: Bird species

Anas acuta
type: Concept
notation: A054
status: valid
status modified: 2018-07-03
accepted date: 2018-07-03
in scheme: Bird species

Marmaronetta angustirostris
type: Concept
notation: A057
status: valid
status modified: 2018-07-03
accepted date: 2018-07-03
in scheme: Bird species

Netta rufina
type: Concept
notation: A058
status: valid
status modified: 2018-07-03
accepted date: 2018-07-03
in scheme: Bird species

Netta rufina | non-native populations
type: Concept
notation: A058-X
status: valid
status modified: 2018-07-03
accepted date: 2018-07-03
in scheme: Bird species

Aythya ferina
type: Concept
notation: A059
status: valid
status modified: 2018-07-03
accepted date: 2018-07-03
in scheme: Bird species

Aythya nyroca
type: Concept
notation: A060
status: valid
status modified: 2018-07-03
accepted date: 2018-07-03
in scheme: Bird species

Aythya fuligula
type: Concept
notation: A061
status: valid
status modified: 2018-07-03
accepted date: 2018-07-03
in scheme: Bird species

Aythya marila
type: Concept
notation: A062
status: valid
status modified: 2018-07-03
accepted date: 2018-07-03
in scheme: Bird species

Somateria mollissima
type: Concept
notation: A063
status: valid
status modified: 2018-07-03
accepted date: 2018-07-03
in scheme: Bird species

Clangula hyemalis
type: Concept
notation: A064
status: valid
status modified: 2018-07-03
accepted date: 2018-07-03
in scheme: Bird species

Melanitta fusca
type: Concept
notation: A066
status: valid
status modified: 2018-07-03
accepted date: 2018-07-03
in scheme: Bird species

Bucephala clangula
type: Concept
notation: A067
status: valid
status modified: 2018-07-03
accepted date: 2018-07-03
in scheme: Bird species

Mergus serrator
type: Concept
notation: A069
status: valid
status modified: 2018-07-03
accepted date: 2018-07-03
in scheme: Bird species

Mergus merganser
type: Concept
notation: A070
status: valid
status modified: 2018-07-03
accepted date: 2018-07-03
in scheme: Bird species

Oxyura leucocephala
type: Concept
notation: A071
status: valid
status modified: 2018-07-03
accepted date: 2018-07-03
in scheme: Bird species

Pernis apivorus
type: Concept
notation: A072
status: valid
status modified: 2018-07-03
accepted date: 2018-07-03
in scheme: Bird species

Milvus migrans
type: Concept
notation: A073
status: valid
status modified: 2018-07-03
accepted date: 2018-07-03
in scheme: Bird species

Milvus milvus
type: Concept
notation: A074
status: valid
status modified: 2018-07-03
accepted date: 2018-07-03
in scheme: Bird species

Haliaeetus albicilla
type: Concept
notation: A075
status: valid
status modified: 2018-07-03
accepted date: 2018-07-03
in scheme: Bird species

Gypaetus barbatus
type: Concept
notation: A076
status: valid
status modified: 2018-07-03
accepted date: 2018-07-03
in scheme: Bird species

Neophron percnopterus
type: Concept
notation: A077
status: valid
status modified: 2018-07-03
accepted date: 2018-07-03
in scheme: Bird species

Gyps fulvus
type: Concept
notation: A078
status: valid
status modified: 2018-07-03
accepted date: 2018-07-03
in scheme: Bird species

Aegypius monachus
type: Concept
notation: A079
status: valid
status modified: 2018-07-03
accepted date: 2018-07-03
in scheme: Bird species

Circaetus gallicus
type: Concept
notation: A080
status: valid
status modified: 2018-07-03
accepted date: 2018-07-03
in scheme: Bird species

Circus aeruginosus
type: Concept
notation: A081
status: valid
status modified: 2018-07-03
accepted date: 2018-07-03
in scheme: Bird species

Circus cyaneus
type: Concept
notation: A082
status: valid
status modified: 2018-07-03
accepted date: 2018-07-03
in scheme: Bird species

Circus macrourus
type: Concept
notation: A083
status: valid
status modified: 2018-07-03
accepted date: 2018-07-03
in scheme: Bird species

Circus pygargus
type: Concept
notation: A084
status: valid
status modified: 2018-07-03
accepted date: 2018-07-03
in scheme: Bird species

Buteo buteo
type: Concept
notation: A087
status: valid
status modified: 2018-07-03
accepted date: 2018-07-03
in scheme: Bird species

Buteo lagopus
type: Concept
notation: A088
status: valid
status modified: 2018-07-03
accepted date: 2018-07-03
in scheme: Bird species

Aquila chrysaetos
type: Concept
notation: A091
status: valid
status modified: 2018-07-03
accepted date: 2018-07-03
in scheme: Bird species

Hieraaetus pennatus
type: Concept
notation: A092
status: valid
status modified: 2018-07-03
accepted date: 2018-07-03
in scheme: Bird species

Pandion haliaetus
type: Concept
notation: A094
status: valid
status modified: 2018-07-03
accepted date: 2018-07-03
in scheme: Bird species

Falco naumanni
type: Concept
notation: A095
status: valid
status modified: 2018-07-03
accepted date: 2018-07-03
in scheme: Bird species

Falco tinnunculus
type: Concept
notation: A096
status: valid
status modified: 2018-07-03
accepted date: 2018-07-03
in scheme: Bird species

Falco vespertinus
type: Concept
notation: A097
status: valid
status modified: 2018-07-03
accepted date: 2018-07-03
in scheme: Bird species

Falco columbarius
type: Concept
notation: A098
status: valid
status modified: 2018-07-03
accepted date: 2018-07-03
in scheme: Bird species

Falco subbuteo
type: Concept
notation: A099
status: valid
status modified: 2018-07-03
accepted date: 2018-07-03
in scheme: Bird species

Falco eleonorae
type: Concept
notation: A100
status: valid
status modified: 2018-07-03
accepted date: 2018-07-03
in scheme: Bird species

Falco biarmicus
type: Concept
notation: A101
status: valid
status modified: 2018-07-03
accepted date: 2018-07-03
in scheme: Bird species

Falco rusticolus
type: Concept
notation: A102
status: valid
status modified: 2018-07-03
accepted date: 2018-07-03
in scheme: Bird species

Falco peregrinus | [including pelegrinoides]
type: Concept
notation: A103
status: valid
status modified: 2018-07-03
accepted date: 2018-07-03
in scheme: Bird species

Bonasa bonasia
type: Concept
notation: A104
status: valid
status modified: 2018-07-03
accepted date: 2018-07-03
in scheme: Bird species

Alectoris rufa
type: Concept
notation: A110
status: valid
status modified: 2018-07-03
accepted date: 2018-07-03
in scheme: Bird species

Alectoris rufa | non-native populations
type: Concept
notation: A110-X
status: valid
status modified: 2018-07-03
accepted date: 2018-07-03
in scheme: Bird species

Alectoris barbara
type: Concept
notation: A111
status: valid
status modified: 2018-07-03
accepted date: 2018-07-03
in scheme: Bird species

Coturnix coturnix
type: Concept
notation: A113
status: valid
status modified: 2018-07-03
accepted date: 2018-07-03
in scheme: Bird species

Phasianus colchicus
type: Concept
notation: A115
status: valid
status modified: 2018-07-03
accepted date: 2018-07-03
in scheme: Bird species

Phasianus colchicus | non-native populations
type: Concept
notation: A115-X
status: valid
status modified: 2018-07-03
accepted date: 2018-07-03
in scheme: Bird species

Rallus aquaticus
type: Concept
notation: A118
status: valid
status modified: 2018-07-03
accepted date: 2018-07-03
in scheme: Bird species

Porzana porzana
type: Concept
notation: A119
status: valid
status modified: 2018-07-03
accepted date: 2018-07-03
in scheme: Bird species

Crex crex
type: Concept
notation: A122
status: valid
status modified: 2018-07-03
accepted date: 2018-07-03
in scheme: Bird species

Gallinula chloropus
type: Concept
notation: A123
status: valid
status modified: 2018-07-03
accepted date: 2018-07-03
in scheme: Bird species

Fulica atra
type: Concept
notation: A125
status: valid
status modified: 2018-07-03
accepted date: 2018-07-03
in scheme: Bird species

Fulica cristata
type: Concept
notation: A126
status: valid
status modified: 2018-07-03
accepted date: 2018-07-03
in scheme: Bird species

Grus grus
type: Concept
notation: A127
status: valid
status modified: 2018-07-03
accepted date: 2018-07-03
in scheme: Bird species

Tetrax tetrax
type: Concept
notation: A128
status: valid
status modified: 2018-07-03
accepted date: 2018-07-03
in scheme: Bird species

Otis tarda
type: Concept
notation: A129
status: valid
status modified: 2018-07-03
accepted date: 2018-07-03
in scheme: Bird species

Haematopus ostralegus
type: Concept
notation: A130
status: valid
status modified: 2018-07-03
accepted date: 2018-07-03
in scheme: Bird species

Himantopus himantopus
type: Concept
notation: A131
status: valid
status modified: 2018-07-03
accepted date: 2018-07-03
in scheme: Bird species

Recurvirostra avosetta
type: Concept
notation: A132
status: valid
status modified: 2018-07-03
accepted date: 2018-07-03
in scheme: Bird species

Burhinus oedicnemus
type: Concept
notation: A133
status: valid
status modified: 2018-07-03
accepted date: 2018-07-03
in scheme: Bird species

Cursorius cursor
type: Concept
notation: A134
status: valid
status modified: 2018-07-03
accepted date: 2018-07-03
in scheme: Bird species

Glareola pratincola
type: Concept
notation: A135
status: valid
status modified: 2018-07-03
accepted date: 2018-07-03
in scheme: Bird species

Charadrius dubius
type: Concept
notation: A136
status: valid
status modified: 2018-07-03
accepted date: 2018-07-03
in scheme: Bird species

Charadrius hiaticula
type: Concept
notation: A137
status: valid
status modified: 2018-07-03
accepted date: 2018-07-03
in scheme: Bird species

Charadrius alexandrinus
type: Concept
notation: A138
status: valid
status modified: 2018-07-03
accepted date: 2018-07-03
in scheme: Bird species

Pluvialis apricaria
type: Concept
notation: A140
status: valid
status modified: 2018-07-03
accepted date: 2018-07-03
in scheme: Bird species

Pluvialis squatarola
type: Concept
notation: A141
status: valid
status modified: 2018-07-03
accepted date: 2018-07-03
in scheme: Bird species

Vanellus vanellus
type: Concept
notation: A142
status: valid
status modified: 2018-07-03
accepted date: 2018-07-03
in scheme: Bird species

Calidris canutus
type: Concept
notation: A143
status: valid
status modified: 2018-07-03
accepted date: 2018-07-03
in scheme: Bird species

Calidris alba
type: Concept
notation: A144
status: valid
status modified: 2018-07-03
accepted date: 2018-07-03
in scheme: Bird species

Calidris minuta
type: Concept
notation: A145
status: valid
status modified: 2018-07-03
accepted date: 2018-07-03
in scheme: Bird species

Calidris temminckii
type: Concept
notation: A146
status: valid
status modified: 2018-07-03
accepted date: 2018-07-03
in scheme: Bird species

Calidris ferruginea
type: Concept
notation: A147
status: valid
status modified: 2018-07-03
accepted date: 2018-07-03
in scheme: Bird species

Calidris maritima
type: Concept
notation: A148
status: valid
status modified: 2018-07-03
accepted date: 2018-07-03
in scheme: Bird species

Calidris alpina | all non-breeding populations
type: Concept
notation: A149
status: valid
status modified: 2018-07-03
accepted date: 2018-07-03
in scheme: Bird species

Lymnocryptes minimus
type: Concept
notation: A152
status: valid
status modified: 2018-07-03
accepted date: 2018-07-03
in scheme: Bird species

Gallinago gallinago
type: Concept
notation: A153
status: valid
status modified: 2018-07-03
accepted date: 2018-07-03
in scheme: Bird species

Gallinago media
type: Concept
notation: A154
status: valid
status modified: 2018-07-03
accepted date: 2018-07-03
in scheme: Bird species

Scolopax rusticola
type: Concept
notation: A155
status: valid
status modified: 2018-07-03
accepted date: 2018-07-03
in scheme: Bird species

Limosa limosa | all non-breeding populations
type: Concept
notation: A156
status: valid
status modified: 2018-07-03
accepted date: 2018-07-03
in scheme: Bird species

Limosa lapponica
type: Concept
notation: A157
status: valid
status modified: 2018-07-03
accepted date: 2018-07-03
in scheme: Bird species

Numenius phaeopus
type: Concept
notation: A158
status: valid
status modified: 2018-07-03
accepted date: 2018-07-03
in scheme: Bird species

Numenius tenuirostris
type: Concept
notation: A159
status: valid
status modified: 2018-07-03
accepted date: 2018-07-03
in scheme: Bird species

Tringa erythropus
type: Concept
notation: A161
status: valid
status modified: 2018-07-03
accepted date: 2018-07-03
in scheme: Bird species

Tringa totanus
type: Concept
notation: A162
status: valid
status modified: 2018-07-03
accepted date: 2018-07-03
in scheme: Bird species

Tringa stagnatilis
type: Concept
notation: A163
status: valid
status modified: 2018-07-03
accepted date: 2018-07-03
in scheme: Bird species

Tringa nebularia
type: Concept
notation: A164
status: valid
status modified: 2018-07-03
accepted date: 2018-07-03
in scheme: Bird species

Tringa ochropus
type: Concept
notation: A165
status: valid
status modified: 2018-07-03
accepted date: 2018-07-03
in scheme: Bird species

Tringa glareola
type: Concept
notation: A166
status: valid
status modified: 2018-07-03
accepted date: 2018-07-03
in scheme: Bird species

Xenus cinereus
type: Concept
notation: A167
status: valid
status modified: 2018-07-03
accepted date: 2018-07-03
in scheme: Bird species

Actitis hypoleucos
type: Concept
notation: A168
status: valid
status modified: 2018-07-03
accepted date: 2018-07-03
in scheme: Bird species

Arenaria interpres
type: Concept
notation: A169
status: valid
status modified: 2018-07-03
accepted date: 2018-07-03
in scheme: Bird species

Phalaropus lobatus
type: Concept
notation: A170
status: valid
status modified: 2018-07-03
accepted date: 2018-07-03
in scheme: Bird species

Stercorarius pomarinus
type: Concept
notation: A172
status: valid
status modified: 2018-07-03
accepted date: 2018-07-03
in scheme: Bird species

Stercorarius parasiticus
type: Concept
notation: A173
status: valid
status modified: 2018-07-03
accepted date: 2018-07-03
in scheme: Bird species

Stercorarius longicaudus
type: Concept
notation: A174
status: valid
status modified: 2018-07-03
accepted date: 2018-07-03
in scheme: Bird species

Catharacta skua
type: Concept
notation: A175
status: valid
status modified: 2018-07-03
accepted date: 2018-07-03
in scheme: Bird species

Larus melanocephalus
type: Concept
notation: A176
status: valid
status modified: 2018-07-03
accepted date: 2018-07-03
in scheme: Bird species

Larus ridibundus
type: Concept
notation: A179
status: valid
status modified: 2018-07-03
accepted date: 2018-07-03
in scheme: Bird species

Larus genei
type: Concept
notation: A180
status: valid
status modified: 2018-07-03
accepted date: 2018-07-03
in scheme: Bird species

Larus audouinii
type: Concept
notation: A181
status: valid
status modified: 2018-07-03
accepted date: 2018-07-03
in scheme: Bird species

Larus canus
type: Concept
notation: A182
status: valid
status modified: 2018-07-03
accepted date: 2018-07-03
in scheme: Bird species

Larus glaucoides
type: Concept
notation: A185
status: valid
status modified: 2018-07-03
accepted date: 2018-07-03
in scheme: Bird species

Larus hyperboreus
type: Concept
notation: A186
status: valid
status modified: 2018-07-03
accepted date: 2018-07-03
in scheme: Bird species

Larus marinus
type: Concept
notation: A187
status: valid
status modified: 2018-07-03
accepted date: 2018-07-03
in scheme: Bird species

Rissa tridactyla
type: Concept
notation: A188
status: valid
status modified: 2018-07-03
accepted date: 2018-07-03
in scheme: Bird species

Gelochelidon nilotica
type: Concept
notation: A189
status: valid
status modified: 2018-07-03
accepted date: 2018-07-03
in scheme: Bird species

Sterna dougallii
type: Concept
notation: A192
status: valid
status modified: 2018-07-03
accepted date: 2018-07-03
in scheme: Bird species

Sterna hirundo
type: Concept
notation: A193
status: valid
status modified: 2018-07-03
accepted date: 2018-07-03
in scheme: Bird species

Sterna paradisaea
type: Concept
notation: A194
status: valid
status modified: 2018-07-03
accepted date: 2018-07-03
in scheme: Bird species

Chlidonias niger
type: Concept
notation: A197
status: valid
status modified: 2018-07-03
accepted date: 2018-07-03
in scheme: Bird species

Chlidonias leucopterus
type: Concept
notation: A198
status: valid
status modified: 2018-07-03
accepted date: 2018-07-03
in scheme: Bird species

Alca torda
type: Concept
notation: A200
status: valid
status modified: 2018-07-03
accepted date: 2018-07-03
in scheme: Bird species

Cepphus grylle
type: Concept
notation: A202
status: valid
status modified: 2018-07-03
accepted date: 2018-07-03
in scheme: Bird species

Alle alle
type: Concept
notation: A203
status: valid
status modified: 2018-07-03
accepted date: 2018-07-03
in scheme: Bird species

Fratercula arctica
type: Concept
notation: A204
status: valid
status modified: 2018-07-03
accepted date: 2018-07-03
in scheme: Bird species

Pterocles alchata
type: Concept
notation: A205
status: valid
status modified: 2018-07-03
accepted date: 2018-07-03
in scheme: Bird species

Columba livia | wild populations
type: Concept
notation: A206
status: valid
status modified: 2018-07-03
accepted date: 2018-07-03
in scheme: Bird species

Columba livia | feral populations
type: Concept
notation: A206-X
status: valid
status modified: 2018-07-03
accepted date: 2018-07-03
in scheme: Bird species

Columba oenas
type: Concept
notation: A207
status: valid
status modified: 2018-07-03
accepted date: 2018-07-03
in scheme: Bird species

Streptopelia decaocto
type: Concept
notation: A209
status: valid
status modified: 2018-07-03
accepted date: 2018-07-03
in scheme: Bird species

Streptopelia turtur
type: Concept
notation: A210
status: valid
status modified: 2018-07-03
accepted date: 2018-07-03
in scheme: Bird species

Clamator glandarius
type: Concept
notation: A211
status: valid
status modified: 2018-07-03
accepted date: 2018-07-03
in scheme: Bird species

Cuculus canorus
type: Concept
notation: A212
status: valid
status modified: 2018-07-03
accepted date: 2018-07-03
in scheme: Bird species

Tyto alba
type: Concept
notation: A213
status: valid
status modified: 2018-07-03
accepted date: 2018-07-03
in scheme: Bird species

Otus scops
type: Concept
notation: A214
status: valid
status modified: 2018-07-03
accepted date: 2018-07-03
in scheme: Bird species

Bubo bubo
type: Concept
notation: A215
status: valid
status modified: 2018-07-03
accepted date: 2018-07-03
in scheme: Bird species

Bubo bubo | non-native populations
type: Concept
notation: A215-X
status: valid
status modified: 2018-07-03
accepted date: 2018-07-03
in scheme: Bird species

Glaucidium passerinum
type: Concept
notation: A217
status: valid
status modified: 2018-07-03
accepted date: 2018-07-03
in scheme: Bird species

Athene noctua
type: Concept
notation: A218
status: valid
status modified: 2018-07-03
accepted date: 2018-07-03
in scheme: Bird species

Athene noctua | non-native populations
type: Concept
notation: A218-X
status: valid
status modified: 2018-07-03
accepted date: 2018-07-03
in scheme: Bird species

Strix aluco
type: Concept
notation: A219
status: valid
status modified: 2018-07-03
accepted date: 2018-07-03
in scheme: Bird species

Strix uralensis
type: Concept
notation: A220
status: valid
status modified: 2018-07-03
accepted date: 2018-07-03
in scheme: Bird species

Asio otus
type: Concept
notation: A221
status: valid
status modified: 2018-07-03
accepted date: 2018-07-03
in scheme: Bird species

Asio flammeus
type: Concept
notation: A222
status: valid
status modified: 2018-07-03
accepted date: 2018-07-03
in scheme: Bird species

Aegolius funereus
type: Concept
notation: A223
status: valid
status modified: 2018-07-03
accepted date: 2018-07-03
in scheme: Bird species

Caprimulgus europaeus
type: Concept
notation: A224
status: valid
status modified: 2018-07-03
accepted date: 2018-07-03
in scheme: Bird species

Caprimulgus ruficollis
type: Concept
notation: A225
status: valid
status modified: 2018-07-03
accepted date: 2018-07-03
in scheme: Bird species

Apus apus
type: Concept
notation: A226
status: valid
status modified: 2018-07-03
accepted date: 2018-07-03
in scheme: Bird species

Apus pallidus
type: Concept
notation: A227
status: valid
status modified: 2018-07-03
accepted date: 2018-07-03
in scheme: Bird species

Tachymarptis melba
type: Concept
notation: A228
status: valid
status modified: 2018-07-03
accepted date: 2018-07-03
in scheme: Bird species

Alcedo atthis
type: Concept
notation: A229
status: valid
status modified: 2018-07-03
accepted date: 2018-07-03
in scheme: Bird species

Merops apiaster
type: Concept
notation: A230
status: valid
status modified: 2018-07-03
accepted date: 2018-07-03
in scheme: Bird species

Coracias garrulus
type: Concept
notation: A231
status: valid
status modified: 2018-07-03
accepted date: 2018-07-03
in scheme: Bird species

Upupa epops
type: Concept
notation: A232
status: valid
status modified: 2018-07-03
accepted date: 2018-07-03
in scheme: Bird species

Jynx torquilla
type: Concept
notation: A233
status: valid
status modified: 2018-07-03
accepted date: 2018-07-03
in scheme: Bird species

Picus canus
type: Concept
notation: A234
status: valid
status modified: 2018-07-03
accepted date: 2018-07-03
in scheme: Bird species

Dryocopus martius
type: Concept
notation: A236
status: valid
status modified: 2018-07-03
accepted date: 2018-07-03
in scheme: Bird species

Dendrocopos leucotos
type: Concept
notation: A239
status: valid
status modified: 2018-07-03
accepted date: 2018-07-03
in scheme: Bird species

Picoides tridactylus
type: Concept
notation: A241
status: valid
status modified: 2018-07-03
accepted date: 2018-07-03
in scheme: Bird species

Melanocorypha calandra
type: Concept
notation: A242
status: valid
status modified: 2018-07-03
accepted date: 2018-07-03
in scheme: Bird species

Calandrella brachydactyla
type: Concept
notation: A243
status: valid
status modified: 2018-07-03
accepted date: 2018-07-03
in scheme: Bird species

Galerida cristata
type: Concept
notation: A244
status: valid
status modified: 2018-07-03
accepted date: 2018-07-03
in scheme: Bird species

Galerida theklae
type: Concept
notation: A245
status: valid
status modified: 2018-07-03
accepted date: 2018-07-03
in scheme: Bird species

Lullula arborea
type: Concept
notation: A246
status: valid
status modified: 2018-07-03
accepted date: 2018-07-03
in scheme: Bird species

Alauda arvensis
type: Concept
notation: A247
status: valid
status modified: 2018-07-03
accepted date: 2018-07-03
in scheme: Bird species

Eremophila alpestris
type: Concept
notation: A248
status: valid
status modified: 2018-07-03
accepted date: 2018-07-03
in scheme: Bird species

Riparia riparia
type: Concept
notation: A249
status: valid
status modified: 2018-07-03
accepted date: 2018-07-03
in scheme: Bird species

Ptyonoprogne rupestris
type: Concept
notation: A250
status: valid
status modified: 2018-07-03
accepted date: 2018-07-03
in scheme: Bird species

Hirundo rustica
type: Concept
notation: A251
status: valid
status modified: 2018-07-03
accepted date: 2018-07-03
in scheme: Bird species

Anthus campestris
type: Concept
notation: A255
status: valid
status modified: 2018-07-03
accepted date: 2018-07-03
in scheme: Bird species

Anthus trivialis
type: Concept
notation: A256
status: valid
status modified: 2018-07-03
accepted date: 2018-07-03
in scheme: Bird species

Anthus pratensis
type: Concept
notation: A257
status: valid
status modified: 2018-07-03
accepted date: 2018-07-03
in scheme: Bird species

Anthus cervinus
type: Concept
notation: A258
status: valid
status modified: 2018-07-03
accepted date: 2018-07-03
in scheme: Bird species

Anthus spinoletta
type: Concept
notation: A259
status: valid
status modified: 2018-07-03
accepted date: 2018-07-03
in scheme: Bird species

Motacilla flava | [excluding tschutschensis]
type: Concept
notation: A260
status: valid
status modified: 2018-07-03
accepted date: 2018-07-03
in scheme: Bird species

Motacilla cinerea
type: Concept
notation: A261
status: valid
status modified: 2018-07-03
accepted date: 2018-07-03
in scheme: Bird species

Motacilla alba
type: Concept
notation: A262
status: valid
status modified: 2018-07-03
accepted date: 2018-07-03
in scheme: Bird species

Bombycilla garrulus
type: Concept
notation: A263
status: valid
status modified: 2018-07-03
accepted date: 2018-07-03
in scheme: Bird species

Cinclus cinclus
type: Concept
notation: A264
status: valid
status modified: 2018-07-03
accepted date: 2018-07-03
in scheme: Bird species

Prunella modularis
type: Concept
notation: A266
status: valid
status modified: 2018-07-03
accepted date: 2018-07-03
in scheme: Bird species

Prunella collaris
type: Concept
notation: A267
status: valid
status modified: 2018-07-03
accepted date: 2018-07-03
in scheme: Bird species

Cercotrichas galactotes
type: Concept
notation: A268
status: valid
status modified: 2018-07-03
accepted date: 2018-07-03
in scheme: Bird species

Erithacus rubecula
type: Concept
notation: A269
status: valid
status modified: 2018-07-03
accepted date: 2018-07-03
in scheme: Bird species

Luscinia luscinia
type: Concept
notation: A270
status: valid
status modified: 2018-07-03
accepted date: 2018-07-03
in scheme: Bird species

Luscinia megarhynchos
type: Concept
notation: A271
status: valid
status modified: 2018-07-03
accepted date: 2018-07-03
in scheme: Bird species

Phoenicurus ochruros
type: Concept
notation: A273
status: valid
status modified: 2018-07-03
accepted date: 2018-07-03
in scheme: Bird species

Phoenicurus phoenicurus
type: Concept
notation: A274
status: valid
status modified: 2018-07-03
accepted date: 2018-07-03
in scheme: Bird species

Saxicola rubetra
type: Concept
notation: A275
status: valid
status modified: 2018-07-03
accepted date: 2018-07-03
in scheme: Bird species

Saxicola torquatus
type: Concept
notation: A276
status: valid
status modified: 2018-07-03
accepted date: 2018-07-03
in scheme: Bird species

Oenanthe oenanthe | [excluding seebohmi]
type: Concept
notation: A277
status: valid
status modified: 2018-07-03
accepted date: 2018-07-03
in scheme: Bird species

Oenanthe hispanica
type: Concept
notation: A278
status: valid
status modified: 2018-07-03
accepted date: 2018-07-03
in scheme: Bird species

Oenanthe leucura
type: Concept
notation: A279
status: valid
status modified: 2018-07-03
accepted date: 2018-07-03
in scheme: Bird species

Monticola saxatilis
type: Concept
notation: A280
status: valid
status modified: 2018-07-03
accepted date: 2018-07-03
in scheme: Bird species

Monticola solitarius
type: Concept
notation: A281
status: valid
status modified: 2018-07-03
accepted date: 2018-07-03
in scheme: Bird species

Turdus torquatus
type: Concept
notation: A282
status: valid
status modified: 2018-07-03
accepted date: 2018-07-03
in scheme: Bird species

Turdus merula
type: Concept
notation: A283
status: valid
status modified: 2018-07-03
accepted date: 2018-07-03
in scheme: Bird species

Turdus pilaris
type: Concept
notation: A284
status: valid
status modified: 2018-07-03
accepted date: 2018-07-03
in scheme: Bird species

Turdus philomelos
type: Concept
notation: A285
status: valid
status modified: 2018-07-03
accepted date: 2018-07-03
in scheme: Bird species

Turdus iliacus
type: Concept
notation: A286
status: valid
status modified: 2018-07-03
accepted date: 2018-07-03
in scheme: Bird species

Turdus viscivorus
type: Concept
notation: A287
status: valid
status modified: 2018-07-03
accepted date: 2018-07-03
in scheme: Bird species

Cettia cetti
type: Concept
notation: A288
status: valid
status modified: 2018-07-03
accepted date: 2018-07-03
in scheme: Bird species

Cisticola juncidis
type: Concept
notation: A289
status: valid
status modified: 2018-07-03
accepted date: 2018-07-03
in scheme: Bird species

Locustella naevia
type: Concept
notation: A290
status: valid
status modified: 2018-07-03
accepted date: 2018-07-03
in scheme: Bird species

Locustella fluviatilis
type: Concept
notation: A291
status: valid
status modified: 2018-07-03
accepted date: 2018-07-03
in scheme: Bird species

Locustella luscinioides
type: Concept
notation: A292
status: valid
status modified: 2018-07-03
accepted date: 2018-07-03
in scheme: Bird species

Acrocephalus melanopogon
type: Concept
notation: A293
status: valid
status modified: 2018-07-03
accepted date: 2018-07-03
in scheme: Bird species

Acrocephalus paludicola
type: Concept
notation: A294
status: valid
status modified: 2018-07-03
accepted date: 2018-07-03
in scheme: Bird species

Acrocephalus schoenobaenus
type: Concept
notation: A295
status: valid
status modified: 2018-07-03
accepted date: 2018-07-03
in scheme: Bird species

Acrocephalus palustris
type: Concept
notation: A296
status: valid
status modified: 2018-07-03
accepted date: 2018-07-03
in scheme: Bird species

Acrocephalus scirpaceus
type: Concept
notation: A297
status: valid
status modified: 2018-07-03
accepted date: 2018-07-03
in scheme: Bird species

Acrocephalus arundinaceus
type: Concept
notation: A298
status: valid
status modified: 2018-07-03
accepted date: 2018-07-03
in scheme: Bird species

Hippolais icterina
type: Concept
notation: A299
status: valid
status modified: 2018-07-03
accepted date: 2018-07-03
in scheme: Bird species

Hippolais polyglotta
type: Concept
notation: A300
status: valid
status modified: 2018-07-03
accepted date: 2018-07-03
in scheme: Bird species

Sylvia undata
type: Concept
notation: A302
status: valid
status modified: 2018-07-03
accepted date: 2018-07-03
in scheme: Bird species

Sylvia conspicillata
type: Concept
notation: A303
status: valid
status modified: 2018-07-03
accepted date: 2018-07-03
in scheme: Bird species

Sylvia cantillans | [excluding subalpina]
type: Concept
notation: A304
status: valid
status modified: 2018-07-03
accepted date: 2018-07-03
in scheme: Bird species

Sylvia melanocephala
type: Concept
notation: A305
status: valid
status modified: 2018-07-03
accepted date: 2018-07-03
in scheme: Bird species

Sylvia nisoria
type: Concept
notation: A307
status: valid
status modified: 2018-07-03
accepted date: 2018-07-03
in scheme: Bird species

Sylvia communis
type: Concept
notation: A309
status: valid
status modified: 2018-07-03
accepted date: 2018-07-03
in scheme: Bird species

Sylvia borin
type: Concept
notation: A310
status: valid
status modified: 2018-07-03
accepted date: 2018-07-03
in scheme: Bird species

Sylvia atricapilla
type: Concept
notation: A311
status: valid
status modified: 2018-07-03
accepted date: 2018-07-03
in scheme: Bird species

Phylloscopus sibilatrix
type: Concept
notation: A314
status: valid
status modified: 2018-07-03
accepted date: 2018-07-03
in scheme: Bird species

Phylloscopus trochilus
type: Concept
notation: A316
status: valid
status modified: 2018-07-03
accepted date: 2018-07-03
in scheme: Bird species

Regulus regulus
type: Concept
notation: A317
status: valid
status modified: 2018-07-03
accepted date: 2018-07-03
in scheme: Bird species

Regulus ignicapilla
type: Concept
notation: A318
status: valid
status modified: 2018-07-03
accepted date: 2018-07-03
in scheme: Bird species

Muscicapa striata
type: Concept
notation: A319
status: valid
status modified: 2018-07-03
accepted date: 2018-07-03
in scheme: Bird species

Ficedula parva
type: Concept
notation: A320
status: valid
status modified: 2018-07-03
accepted date: 2018-07-03
in scheme: Bird species

Ficedula albicollis
type: Concept
notation: A321
status: valid
status modified: 2018-07-03
accepted date: 2018-07-03
in scheme: Bird species

Ficedula hypoleuca
type: Concept
notation: A322
status: valid
status modified: 2018-07-03
accepted date: 2018-07-03
in scheme: Bird species

Panurus biarmicus
type: Concept
notation: A323
status: valid
status modified: 2018-07-03
accepted date: 2018-07-03
in scheme: Bird species

Aegithalos caudatus
type: Concept
notation: A324
status: valid
status modified: 2018-07-03
accepted date: 2018-07-03
in scheme: Bird species

Parus major
type: Concept
notation: A330
status: valid
status modified: 2018-07-03
accepted date: 2018-07-03
in scheme: Bird species

Sitta whiteheadi
type: Concept
notation: A331
status: valid
status modified: 2018-07-03
accepted date: 2018-07-03
in scheme: Bird species

Sitta europaea
type: Concept
notation: A332
status: valid
status modified: 2018-07-03
accepted date: 2018-07-03
in scheme: Bird species

Tichodroma muraria
type: Concept
notation: A333
status: valid
status modified: 2018-07-03
accepted date: 2018-07-03
in scheme: Bird species

Certhia familiaris
type: Concept
notation: A334
status: valid
status modified: 2018-07-03
accepted date: 2018-07-03
in scheme: Bird species

Remiz pendulinus
type: Concept
notation: A336
status: valid
status modified: 2018-07-03
accepted date: 2018-07-03
in scheme: Bird species

Oriolus oriolus
type: Concept
notation: A337
status: valid
status modified: 2018-07-03
accepted date: 2018-07-03
in scheme: Bird species

Lanius collurio
type: Concept
notation: A338
status: valid
status modified: 2018-07-03
accepted date: 2018-07-03
in scheme: Bird species

Lanius minor
type: Concept
notation: A339
status: valid
status modified: 2018-07-03
accepted date: 2018-07-03
in scheme: Bird species

Lanius excubitor | [excluding meridionalis, but including koenigi]
type: Concept
notation: A340
status: valid
status modified: 2018-07-03
accepted date: 2018-07-03
in scheme: Bird species

Lanius senator
type: Concept
notation: A341
status: valid
status modified: 2018-07-03
accepted date: 2018-07-03
in scheme: Bird species

Garrulus glandarius
type: Concept
notation: A342
status: valid
status modified: 2018-07-03
accepted date: 2018-07-03
in scheme: Bird species

Pica pica
type: Concept
notation: A343
status: valid
status modified: 2018-07-03
accepted date: 2018-07-03
in scheme: Bird species

Nucifraga caryocatactes
type: Concept
notation: A344
status: valid
status modified: 2018-07-03
accepted date: 2018-07-03
in scheme: Bird species

Pyrrhocorax graculus
type: Concept
notation: A345
status: valid
status modified: 2018-07-03
accepted date: 2018-07-03
in scheme: Bird species

Pyrrhocorax pyrrhocorax
type: Concept
notation: A346
status: valid
status modified: 2018-07-03
accepted date: 2018-07-03
in scheme: Bird species

Corvus monedula
type: Concept
notation: A347
status: valid
status modified: 2018-07-03
accepted date: 2018-07-03
in scheme: Bird species

Corvus frugilegus
type: Concept
notation: A348
status: valid
status modified: 2018-07-03
accepted date: 2018-07-03
in scheme: Bird species

Corvus corone | [including cornix]
type: Concept
notation: A349
status: valid
status modified: 2018-07-03
accepted date: 2018-07-03
in scheme: Bird species

Corvus corax
type: Concept
notation: A350
status: valid
status modified: 2018-07-03
accepted date: 2018-07-03
in scheme: Bird species

Sturnus vulgaris
type: Concept
notation: A351
status: valid
status modified: 2018-07-03
accepted date: 2018-07-03
in scheme: Bird species

Sturnus unicolor
type: Concept
notation: A352
status: valid
status modified: 2018-07-03
accepted date: 2018-07-03
in scheme: Bird species

Passer hispaniolensis
type: Concept
notation: A355
status: valid
status modified: 2018-07-03
accepted date: 2018-07-03
in scheme: Bird species

Passer montanus
type: Concept
notation: A356
status: valid
status modified: 2018-07-03
accepted date: 2018-07-03
in scheme: Bird species

Petronia petronia
type: Concept
notation: A357
status: valid
status modified: 2018-07-03
accepted date: 2018-07-03
in scheme: Bird species

Montifringilla nivalis
type: Concept
notation: A358
status: valid
status modified: 2018-07-03
accepted date: 2018-07-03
in scheme: Bird species

Fringilla montifringilla
type: Concept
notation: A360
status: valid
status modified: 2018-07-03
accepted date: 2018-07-03
in scheme: Bird species

Serinus serinus
type: Concept
notation: A361
status: valid
status modified: 2018-07-03
accepted date: 2018-07-03
in scheme: Bird species

Chloris chloris
type: Concept
notation: A363
status: valid
status modified: 2018-07-03
accepted date: 2018-07-03
in scheme: Bird species

Chloris chloris | non-native populations
type: Concept
notation: A363-X
status: valid
status modified: 2018-07-03
accepted date: 2018-07-03
in scheme: Bird species

Carduelis carduelis
type: Concept
notation: A364
status: valid
status modified: 2018-07-03
accepted date: 2018-07-03
in scheme: Bird species

Carduelis carduelis | non-native populations
type: Concept
notation: A364-X
status: valid
status modified: 2018-07-03
accepted date: 2018-07-03
in scheme: Bird species

Loxia curvirostra
type: Concept
notation: A369
status: valid
status modified: 2018-07-03
accepted date: 2018-07-03
in scheme: Bird species

Loxia pytyopsittacus
type: Concept
notation: A370
status: valid
status modified: 2018-07-03
accepted date: 2018-07-03
in scheme: Bird species

Carpodacus erythrinus
type: Concept
notation: A371
status: valid
status modified: 2018-07-03
accepted date: 2018-07-03
in scheme: Bird species

Pyrrhula pyrrhula
type: Concept
notation: A372
status: valid
status modified: 2018-07-03
accepted date: 2018-07-03
in scheme: Bird species

Coccothraustes coccothraustes
type: Concept
notation: A373
status: valid
status modified: 2018-07-03
accepted date: 2018-07-03
in scheme: Bird species

Calcarius lapponicus
type: Concept
notation: A374
status: valid
status modified: 2018-07-03
accepted date: 2018-07-03
in scheme: Bird species

Plectrophenax nivalis
type: Concept
notation: A375
status: valid
status modified: 2018-07-03
accepted date: 2018-07-03
in scheme: Bird species

Emberiza citrinella
type: Concept
notation: A376
status: valid
status modified: 2018-07-03
accepted date: 2018-07-03
in scheme: Bird species

Emberiza cirlus
type: Concept
notation: A377
status: valid
status modified: 2018-07-03
accepted date: 2018-07-03
in scheme: Bird species

Emberiza cia
type: Concept
notation: A378
status: valid
status modified: 2018-07-03
accepted date: 2018-07-03
in scheme: Bird species

Emberiza hortulana
type: Concept
notation: A379
status: valid
status modified: 2018-07-03
accepted date: 2018-07-03
in scheme: Bird species

Emberiza pusilla
type: Concept
notation: A380
status: valid
status modified: 2018-07-03
accepted date: 2018-07-03
in scheme: Bird species

Emberiza schoeniclus
type: Concept
notation: A381
status: valid
status modified: 2018-07-03
accepted date: 2018-07-03
in scheme: Bird species

Emberiza melanocephala
type: Concept
notation: A382
status: valid
status modified: 2018-07-03
accepted date: 2018-07-03
in scheme: Bird species

Emberiza calandra
type: Concept
notation: A383
status: valid
status modified: 2018-07-03
accepted date: 2018-07-03
in scheme: Bird species

Pterodroma madeira
type: Concept
notation: A385
status: valid
status modified: 2018-07-03
accepted date: 2018-07-03
in scheme: Bird species

Bulweria bulwerii
type: Concept
notation: A387
status: valid
status modified: 2018-07-03
accepted date: 2018-07-03
in scheme: Bird species

Pelagodroma marina
type: Concept
notation: A389
status: valid
status modified: 2018-07-03
accepted date: 2018-07-03
in scheme: Bird species

Phalacrocorax carbo sinensis
type: Concept
notation: A391
status: valid
status modified: 2018-07-03
accepted date: 2018-07-03
in scheme: Bird species

Phalacrocorax aristotelis desmarestii
type: Concept
notation: A392
status: valid
status modified: 2018-07-03
accepted date: 2018-07-03
in scheme: Bird species

Anser albifrons albifrons
type: Concept
notation: A394
status: valid
status modified: 2018-07-03
accepted date: 2018-07-03
in scheme: Bird species

Anser albifrons flavirostris
type: Concept
notation: A395
status: valid
status modified: 2018-07-03
accepted date: 2018-07-03
in scheme: Bird species

Branta ruficollis
type: Concept
notation: A396
status: valid
status modified: 2018-07-03
accepted date: 2018-07-03
in scheme: Bird species

Tadorna ferruginea
type: Concept
notation: A397
status: valid
status modified: 2018-07-03
accepted date: 2018-07-03
in scheme: Bird species

Tadorna ferruginea | non-native populations
type: Concept
notation: A397-X
status: valid
status modified: 2018-07-03
accepted date: 2018-07-03
in scheme: Bird species

Elanus caeruleus
type: Concept
notation: A399
status: valid
status modified: 2018-07-03
accepted date: 2018-07-03
in scheme: Bird species

Accipiter gentilis arrigonii
type: Concept
notation: A400
status: valid
status modified: 2018-07-03
accepted date: 2018-07-03
in scheme: Bird species

Accipiter nisus granti
type: Concept
notation: A401
status: valid
status modified: 2018-07-03
accepted date: 2018-07-03
in scheme: Bird species

Accipiter brevipes
type: Concept
notation: A402
status: valid
status modified: 2018-07-03
accepted date: 2018-07-03
in scheme: Bird species

Buteo rufinus
type: Concept
notation: A403
status: valid
status modified: 2018-07-03
accepted date: 2018-07-03
in scheme: Bird species

Aquila heliaca
type: Concept
notation: A404
status: valid
status modified: 2018-07-03
accepted date: 2018-07-03
in scheme: Bird species

Aquila adalberti
type: Concept
notation: A405
status: valid
status modified: 2018-07-03
accepted date: 2018-07-03
in scheme: Bird species

Alectoris chukar
type: Concept
notation: A411
status: valid
status modified: 2018-07-03
accepted date: 2018-07-03
in scheme: Bird species

Alectoris chukar | non-native populations
type: Concept
notation: A411-X
status: valid
status modified: 2018-07-03
accepted date: 2018-07-03
in scheme: Bird species

Alectoris graeca whitakeri
type: Concept
notation: A413
status: valid
status modified: 2018-07-03
accepted date: 2018-07-03
in scheme: Bird species

Perdix perdix italica
type: Concept
notation: A414
status: valid
status modified: 2018-07-03
accepted date: 2018-07-03
in scheme: Bird species

Perdix perdix hispaniensis
type: Concept
notation: A415
status: valid
status modified: 2018-07-03
accepted date: 2018-07-03
in scheme: Bird species

Chlamydotis undulata
type: Concept
notation: A416
status: valid
status modified: 2018-07-03
accepted date: 2018-07-03
in scheme: Bird species

Uria aalge ibericus
type: Concept
notation: A419
status: valid
status modified: 2018-07-03
accepted date: 2018-07-03
in scheme: Bird species

Pterocles orientalis
type: Concept
notation: A420
status: valid
status modified: 2018-07-03
accepted date: 2018-07-03
in scheme: Bird species

Columba palumbus azorica
type: Concept
notation: A421
status: valid
status modified: 2018-07-03
accepted date: 2018-07-03
in scheme: Bird species

Columba bollii
type: Concept
notation: A422
status: valid
status modified: 2018-07-03
accepted date: 2018-07-03
in scheme: Bird species

Columba junoniae
type: Concept
notation: A423
status: valid
status modified: 2018-07-03
accepted date: 2018-07-03
in scheme: Bird species

Apus caffer
type: Concept
notation: A424
status: valid
status modified: 2018-07-03
accepted date: 2018-07-03
in scheme: Bird species

Apus unicolor
type: Concept
notation: A425
status: valid
status modified: 2018-07-03
accepted date: 2018-07-03
in scheme: Bird species

Dendrocopos major canariensis
type: Concept
notation: A427
status: valid
status modified: 2018-07-03
accepted date: 2018-07-03
in scheme: Bird species

Dendrocopos major thanneri
type: Concept
notation: A428
status: valid
status modified: 2018-07-03
accepted date: 2018-07-03
in scheme: Bird species

Dendrocopos syriacus
type: Concept
notation: A429
status: valid
status modified: 2018-07-03
accepted date: 2018-07-03
in scheme: Bird species

Chersophilus duponti
type: Concept
notation: A430
status: valid
status modified: 2018-07-03
accepted date: 2018-07-03
in scheme: Bird species

Anthus berthelotii
type: Concept
notation: A432
status: valid
status modified: 2018-07-03
accepted date: 2018-07-03
in scheme: Bird species

Lanius nubicus
type: Concept
notation: A433
status: valid
status modified: 2018-07-03
accepted date: 2018-07-03
in scheme: Bird species

Troglodytes troglodytes fridariensis
type: Concept
notation: A434
status: valid
status modified: 2018-07-03
accepted date: 2018-07-03
in scheme: Bird species

Oenanthe isabellina
type: Concept
notation: A435
status: valid
status modified: 2018-07-03
accepted date: 2018-07-03
in scheme: Bird species

Saxicola dacotiae
type: Concept
notation: A437
status: valid
status modified: 2018-07-03
accepted date: 2018-07-03
in scheme: Bird species

Hippolais olivetorum
type: Concept
notation: A439
status: valid
status modified: 2018-07-03
accepted date: 2018-07-03
in scheme: Bird species

Sylvia ruppeli
type: Concept
notation: A440
status: valid
status modified: 2018-07-03
accepted date: 2018-07-03
in scheme: Bird species

Ficedula semitorquata
type: Concept
notation: A442
status: valid
status modified: 2018-07-03
accepted date: 2018-07-03
in scheme: Bird species

Sitta krueperi
type: Concept
notation: A444
status: valid
status modified: 2018-07-03
accepted date: 2018-07-03
in scheme: Bird species

Sitta neumayer
type: Concept
notation: A445
status: valid
status modified: 2018-07-03
accepted date: 2018-07-03
in scheme: Bird species

Emberiza cineracea
type: Concept
notation: A446
status: valid
status modified: 2018-07-03
accepted date: 2018-07-03
in scheme: Bird species

Emberiza caesia
type: Concept
notation: A447
status: valid
status modified: 2018-07-03
accepted date: 2018-07-03
in scheme: Bird species

Fringilla coelebs ombriosa
type: Concept
notation: A448
status: valid
status modified: 2018-07-03
accepted date: 2018-07-03
in scheme: Bird species

Serinus canaria
type: Concept
notation: A450
status: valid
status modified: 2018-07-03
accepted date: 2018-07-03
in scheme: Bird species

Loxia scotica
type: Concept
notation: A451
status: valid
status modified: 2018-07-03
accepted date: 2018-07-03
in scheme: Bird species

Bucanetes githagineus
type: Concept
notation: A452
status: valid
status modified: 2018-07-03
accepted date: 2018-07-03
in scheme: Bird species

Pyrrhula murina
type: Concept
notation: A453
status: valid
status modified: 2018-07-03
accepted date: 2018-07-03
in scheme: Bird species

Columba trocaz
type: Concept
notation: A455
status: valid
status modified: 2018-07-03
accepted date: 2018-07-03
in scheme: Bird species

Surnia ulula
type: Concept
notation: A456
status: valid
status modified: 2018-07-03
accepted date: 2018-07-03
in scheme: Bird species

Strix nebulosa
type: Concept
notation: A457
status: valid
status modified: 2018-07-03
accepted date: 2018-07-03
in scheme: Bird species

Larus cachinnans
type: Concept
notation: A459
status: valid
status modified: 2018-07-03
accepted date: 2018-07-03
in scheme: Bird species

Meleagris gallopavo
type: Concept
notation: A460-X
status: valid
status modified: 2018-07-03
accepted date: 2018-07-03
in scheme: Bird species

Lagopus lagopus lagopus
type: Concept
notation: A461
status: valid
status modified: 2018-07-03
accepted date: 2018-07-03
in scheme: Bird species

Lagopus lagopus hibernica
type: Concept
notation: A463
status: valid
status modified: 2018-07-03
accepted date: 2018-07-03
in scheme: Bird species

Puffinus yelkouan
type: Concept
notation: A464
status: valid
status modified: 2018-07-03
accepted date: 2018-07-03
in scheme: Bird species

Calidris alpina schinzii | Britain & Ireland/SW Europe & NW Africa
type: Concept
notation: A466-A
status: valid
status modified: 2018-07-03
accepted date: 2018-07-03
in scheme: Bird species

Calidris alpina schinzii | Baltic/SW Europe & NW Africa
type: Concept
notation: A466-B
status: valid
status modified: 2018-07-03
accepted date: 2018-07-03
in scheme: Bird species

Oenanthe cypriaca
type: Concept
notation: A467
status: valid
status modified: 2018-07-03
accepted date: 2018-07-03
in scheme: Bird species

Sylvia melanothorax
type: Concept
notation: A468
status: valid
status modified: 2018-07-03
accepted date: 2018-07-03
in scheme: Bird species

Certhia brachydactyla dorotheae
type: Concept
notation: A469
status: valid
status modified: 2018-07-03
accepted date: 2018-07-03
in scheme: Bird species

Periparus ater cypriotes
type: Concept
notation: A471
status: valid
status modified: 2018-07-03
accepted date: 2018-07-03
in scheme: Bird species

Periparus ater all others
type: Concept
notation: A472
status: valid
status modified: 2018-07-03
accepted date: 2018-07-03
in scheme: Bird species

Acanthis flammea | [including cabaret and exilipes]
type: Concept
notation: A474
status: valid
status modified: 2018-07-03
accepted date: 2018-07-03
in scheme: Bird species

Alaudala rufescens
type: Concept
notation: A475
status: valid
status modified: 2018-07-03
accepted date: 2018-07-03
in scheme: Bird species

Linaria cannabina
type: Concept
notation: A476
status: valid
status modified: 2018-07-03
accepted date: 2018-07-03
in scheme: Bird species

Linaria flavirostris
type: Concept
notation: A477
status: valid
status modified: 2018-07-03
accepted date: 2018-07-03
in scheme: Bird species

Spinus spinus
type: Concept
notation: A478
status: valid
status modified: 2018-07-03
accepted date: 2018-07-03
in scheme: Bird species

Cecropis daurica
type: Concept
notation: A479
status: valid
status modified: 2018-07-03
accepted date: 2018-07-03
in scheme: Bird species

Cyanecula svecica
type: Concept
notation: A480
status: valid
status modified: 2018-07-03
accepted date: 2018-07-03
in scheme: Bird species

Cyanopica cooki
type: Concept
notation: A481
status: valid
status modified: 2018-07-03
accepted date: 2018-07-03
in scheme: Bird species

Cyanistes caeruleus s. str. | sensu stricto [excluding teneriffae]
type: Concept
notation: A483
status: valid
status modified: 2018-07-03
accepted date: 2018-07-03
in scheme: Bird species

Cyanistes teneriffae | [including degener, hedwigii, ombriosus, palmensis and ultramarinus]
type: Concept
notation: A484
status: valid
status modified: 2018-07-03
accepted date: 2018-07-03
in scheme: Bird species

Fringilla polatzeki
type: Concept
notation: A485
status: valid
status modified: 2018-07-03
accepted date: 2018-07-03
in scheme: Bird species

Fringilla teydea s. str. | sensu stricto [excluding polatzeki]
type: Concept
notation: A486
status: valid
status modified: 2018-07-03
accepted date: 2018-07-03
in scheme: Bird species

Iduna pallida s. str. | sensu stricto [excluding opaca]
type: Concept
notation: A487
status: valid
status modified: 2018-07-03
accepted date: 2018-07-03
in scheme: Bird species

Iduna opaca
type: Concept
notation: A488
status: valid
status modified: 2018-07-03
accepted date: 2018-07-03
in scheme: Bird species

Larus fuscus all others
type: Concept
notation: A489
status: valid
status modified: 2018-07-03
accepted date: 2018-07-03
in scheme: Bird species

Poecile cinctus
type: Concept
notation: A490
status: valid
status modified: 2018-07-03
accepted date: 2018-07-03
in scheme: Bird species

Poecile lugubris
type: Concept
notation: A491
status: valid
status modified: 2018-07-03
accepted date: 2018-07-03
in scheme: Bird species

Poecile montanus
type: Concept
notation: A492
status: valid
status modified: 2018-07-03
accepted date: 2018-07-03
in scheme: Bird species

Poecile palustris
type: Concept
notation: A493
status: valid
status modified: 2018-07-03
accepted date: 2018-07-03
in scheme: Bird species

Pastor roseus
type: Concept
notation: A494
status: valid
status modified: 2018-07-03
accepted date: 2018-07-03
in scheme: Bird species

Lanius meridionalis | [excluding koenigi]
type: Concept
notation: A496
status: valid
status modified: 2018-07-03
accepted date: 2018-07-03
in scheme: Bird species

Lophophanes cristatus
type: Concept
notation: A497
status: valid
status modified: 2018-07-03
accepted date: 2018-07-03
in scheme: Bird species

Phylloscopus orientalis
type: Concept
notation: A498
status: valid
status modified: 2018-07-03
accepted date: 2018-07-03
in scheme: Bird species

Phylloscopus bonelli s. str. | sensu stricto [excluding orientalis]
type: Concept
notation: A499
status: valid
status modified: 2018-07-03
accepted date: 2018-07-03
in scheme: Bird species

Sylvia sarda s. str. | sensu stricto [excluding balearica]
type: Concept
notation: A500
status: valid
status modified: 2018-07-03
accepted date: 2018-07-03
in scheme: Bird species

Gavia adamsii
type: Concept
notation: A502
status: valid
status modified: 2018-07-03
accepted date: 2018-07-03
in scheme: Bird species

Polysticta stelleri
type: Concept
notation: A506
status: valid
status modified: 2018-07-03
accepted date: 2018-07-03
in scheme: Bird species

Falco cherrug
type: Concept
notation: A511
status: valid
status modified: 2018-07-03
accepted date: 2018-07-03
in scheme: Bird species

Tetrao urogallus cantabricus
type: Concept
notation: A513
status: valid
status modified: 2018-07-03
accepted date: 2018-07-03
in scheme: Bird species

Anthropoides virgo
type: Concept
notation: A514
status: valid
status modified: 2018-07-03
accepted date: 2018-07-03
in scheme: Bird species

Glareola nordmanni
type: Concept
notation: A515
status: valid
status modified: 2018-07-03
accepted date: 2018-07-03
in scheme: Bird species

Charadrius leschenaultii
type: Concept
notation: A516
status: valid
status modified: 2018-07-03
accepted date: 2018-07-03
in scheme: Bird species

Oenanthe finschii
type: Concept
notation: A532
status: valid
status modified: 2018-07-03
accepted date: 2018-07-03
in scheme: Bird species

Oenanthe pleschanka
type: Concept
notation: A533
status: valid
status modified: 2018-07-03
accepted date: 2018-07-03
in scheme: Bird species

Tarsiger cyanurus
type: Concept
notation: A534
status: valid
status modified: 2018-07-03
accepted date: 2018-07-03
in scheme: Bird species

Emberiza aureola
type: Concept
notation: A540
status: valid
status modified: 2018-07-03
accepted date: 2018-07-03
in scheme: Bird species

Emberiza rustica
type: Concept
notation: A542
status: valid
status modified: 2018-07-03
accepted date: 2018-07-03
in scheme: Bird species

Loxia leucoptera
type: Concept
notation: A544
status: valid
status modified: 2018-07-03
accepted date: 2018-07-03
in scheme: Bird species

Pinicola enucleator
type: Concept
notation: A545
status: valid
status modified: 2018-07-03
accepted date: 2018-07-03
in scheme: Bird species

Perisoreus infaustus
type: Concept
notation: A548
status: valid
status modified: 2018-07-03
accepted date: 2018-07-03
in scheme: Bird species

Aix galericulata
type: Concept
notation: A553-X
status: valid
status modified: 2018-07-03
accepted date: 2018-07-03
in scheme: Bird species

Anser caerulescens
type: Concept
notation: A556-X
status: valid
status modified: 2018-07-03
accepted date: 2018-07-03
in scheme: Bird species

Chrysolophus pictus
type: Concept
notation: A557-X
status: valid
status modified: 2018-07-03
accepted date: 2018-07-03
in scheme: Bird species

Syrmaticus reevesii
type: Concept
notation: A558-X
status: valid
status modified: 2018-07-03
accepted date: 2018-07-03
in scheme: Bird species

Sylvia balearica
type: Concept
notation: A569
status: valid
status modified: 2018-07-03
accepted date: 2018-07-03
in scheme: Bird species

Sylvia hortensis s. str. | sensu stricto [excluding crassirostris]
type: Concept
notation: A570
status: valid
status modified: 2018-07-03
accepted date: 2018-07-03
in scheme: Bird species

Sylvia crassirostris
type: Concept
notation: A571
status: valid
status modified: 2018-07-03
accepted date: 2018-07-03
in scheme: Bird species

Phylloscopus collybita s. str. | sensu stricto [excluding canariensis, ibericus and tristis]
type: Concept
notation: A572
status: valid
status modified: 2018-07-03
accepted date: 2018-07-03
in scheme: Bird species

Phylloscopus trochiloides s. str. | sensu stricto [excluding nitidus and plumbeitarsus]
type: Concept
notation: A573
status: valid
status modified: 2018-07-03
accepted date: 2018-07-03
in scheme: Bird species

Sylvia curruca | [including minula]
type: Concept
notation: A574
status: valid
status modified: 2018-07-03
accepted date: 2018-07-03
in scheme: Bird species

Larus michahellis
type: Concept
notation: A604
status: valid
status modified: 2018-07-03
accepted date: 2018-07-03
in scheme: Bird species

Phylloscopus borealis
type: Concept
notation: A605
status: valid
status modified: 2018-07-03
accepted date: 2018-07-03
in scheme: Bird species

Motacilla citreola
type: Concept
notation: A608
status: valid
status modified: 2018-07-03
accepted date: 2018-07-03
in scheme: Bird species

Phylloscopus canariensis
type: Concept
notation: A613
status: valid
status modified: 2018-07-03
accepted date: 2018-07-03
in scheme: Bird species

Limosa limosa limosa | Western Europe/NW & West Africa
type: Concept
notation: A614-A
status: valid
status modified: 2018-07-03
accepted date: 2018-07-03
in scheme: Bird species

Limosa limosa limosa | Eastern Europe/Central & Eastern Africa
type: Concept
notation: A614-B
status: valid
status modified: 2018-07-03
accepted date: 2018-07-03
in scheme: Bird species

Limosa limosa islandica
type: Concept
notation: A616
status: valid
status modified: 2018-07-03
accepted date: 2018-07-03
in scheme: Bird species

Phylloscopus ibericus
type: Concept
notation: A618
status: valid
status modified: 2018-07-03
accepted date: 2018-07-03
in scheme: Bird species

Passer domesticus s. str. | sensu stricto [excluding italiae]
type: Concept
notation: A620
status: valid
status modified: 2018-07-03
accepted date: 2018-07-03
in scheme: Bird species

Passer domesticus s. str. | sensu stricto [excluding italiae], non-native populations
type: Concept
notation: A620-X
status: valid
status modified: 2018-07-03
accepted date: 2018-07-03
in scheme: Bird species

Passer italiae
type: Concept
notation: A621
status: valid
status modified: 2018-07-03
accepted date: 2018-07-03
in scheme: Bird species

Carduelis citrinella s. str. | sensu stricto [excluding corsicana]
type: Concept
notation: A623
status: valid
status modified: 2018-07-03
accepted date: 2018-07-03
in scheme: Bird species

Lagopus lagopus rossica
type: Concept
notation: A629
status: valid
status modified: 2018-07-03
accepted date: 2018-07-03
in scheme: Bird species

Certhia brachydactyla all others
type: Concept
notation: A637
status: valid
status modified: 2018-07-03
accepted date: 2018-07-03
in scheme: Bird species

Larus fuscus fuscus
type: Concept
notation: A640
status: valid
status modified: 2018-07-03
accepted date: 2018-07-03
in scheme: Bird species

Perdix perdix all others
type: Concept
notation: A644
status: valid
status modified: 2018-07-03
accepted date: 2018-07-03
in scheme: Bird species

Regulus madeirensis
type: Concept
notation: A652
status: valid
status modified: 2018-07-03
accepted date: 2018-07-03
in scheme: Bird species

Fringilla coelebs all others
type: Concept
notation: A657
status: valid
status modified: 2018-07-03
accepted date: 2018-07-03
in scheme: Bird species

Dendrocopos major all others
type: Concept
notation: A658
status: valid
status modified: 2018-07-03
accepted date: 2018-07-03
in scheme: Bird species

Tetrao urogallus all others
type: Concept
notation: A659
status: valid
status modified: 2018-07-03
accepted date: 2018-07-03
in scheme: Bird species

Tetrao urogallus aquitanicus
type: Concept
notation: A661
status: valid
status modified: 2018-07-03
accepted date: 2018-07-03
in scheme: Bird species

Phoenicopterus roseus
type: Concept
notation: A663
status: valid
status modified: 2018-07-03
accepted date: 2018-07-03
in scheme: Bird species

Anthus petrosus
type: Concept
notation: A666
status: valid
status modified: 2018-07-03
accepted date: 2018-07-03
in scheme: Bird species

Carduelis corsicana
type: Concept
notation: A669
status: valid
status modified: 2018-07-03
accepted date: 2018-07-03
in scheme: Bird species

Calidris alpina alpina
type: Concept
notation: A672
status: valid
status modified: 2018-07-03
accepted date: 2018-07-03
in scheme: Bird species

Branta bernicla hrota | Canada & Greenland/Ireland
type: Concept
notation: A674-A
status: valid
status modified: 2018-07-03
accepted date: 2018-07-03
in scheme: Bird species

Branta bernicla hrota | Svalbard/Denmark & UK
type: Concept
notation: A674-B
status: valid
status modified: 2018-07-03
accepted date: 2018-07-03
in scheme: Bird species

Branta bernicla bernicla
type: Concept
notation: A675
status: valid
status modified: 2018-07-03
accepted date: 2018-07-03
in scheme: Bird species

Troglodytes troglodytes all others
type: Concept
notation: A676
status: valid
status modified: 2018-07-03
accepted date: 2018-07-03
in scheme: Bird species

Apus affinis
type: Concept
notation: A677
status: valid
status modified: 2018-07-03
accepted date: 2018-07-03
in scheme: Bird species

Acrocephalus dumetorum
type: Concept
notation: A679
status: valid
status modified: 2018-07-03
accepted date: 2018-07-03
in scheme: Bird species

Acrocephalus agricola
type: Concept
notation: A680
status: valid
status modified: 2018-07-03
accepted date: 2018-07-03
in scheme: Bird species

Phalacrocorax carbo carbo
type: Concept
notation: A683
status: valid
status modified: 2018-07-03
accepted date: 2018-07-03
in scheme: Bird species

Phalacrocorax aristotelis aristotelis
type: Concept
notation: A684
status: valid
status modified: 2018-07-03
accepted date: 2018-07-03
in scheme: Bird species

Iduna caligata
type: Concept
notation: A686
status: valid
status modified: 2018-07-03
accepted date: 2018-07-03
in scheme: Bird species

Columba palumbus palumbus
type: Concept
notation: A687
status: valid
status modified: 2018-07-03
accepted date: 2018-07-03
in scheme: Bird species

Puffinus mauretanicus
type: Concept
notation: A693
status: valid
status modified: 2018-07-03
accepted date: 2018-07-03
in scheme: Bird species

Anser fabalis fabalis
type: Concept
notation: A701
status: valid
status modified: 2018-07-03
accepted date: 2018-07-03
in scheme: Bird species

Anser fabalis rossicus
type: Concept
notation: A702
status: valid
status modified: 2018-07-03
accepted date: 2018-07-03
in scheme: Bird species

Aquila fasciata
type: Concept
notation: A707
status: valid
status modified: 2018-07-03
accepted date: 2018-07-03
in scheme: Bird species

Lagopus lagopus scotica
type: Concept
notation: A711
status: valid
status modified: 2018-07-03
accepted date: 2018-07-03
in scheme: Bird species

Lagopus muta pyrenaica
type: Concept
notation: A712
status: valid
status modified: 2018-07-03
accepted date: 2018-07-03
in scheme: Bird species

Lagopus muta helvetica
type: Concept
notation: A713
status: valid
status modified: 2018-07-03
accepted date: 2018-07-03
in scheme: Bird species

Francolinus francolinus francolinus
type: Concept
notation: A716
status: valid
status modified: 2018-07-03
accepted date: 2018-07-03
in scheme: Bird species

Turnix sylvaticus
type: Concept
notation: A717
status: valid
status modified: 2018-07-03
accepted date: 2018-07-03
in scheme: Bird species

Porphyrio porphyrio porphyrio
type: Concept
notation: A722
status: valid
status modified: 2018-07-03
accepted date: 2018-07-03
in scheme: Bird species

Eudromias morinellus
type: Concept
notation: A727
status: valid
status modified: 2018-07-03
accepted date: 2018-07-03
in scheme: Bird species

Vanellus spinosus
type: Concept
notation: A728
status: valid
status modified: 2018-07-03
accepted date: 2018-07-03
in scheme: Bird species

Numenius arquata orientalis
type: Concept
notation: A730
status: valid
status modified: 2018-07-03
accepted date: 2018-07-03
in scheme: Bird species

Chlidonias hybrida
type: Concept
notation: A734
status: valid
status modified: 2018-07-03
accepted date: 2018-07-03
in scheme: Bird species

Bubo scandiacus
type: Concept
notation: A736
status: valid
status modified: 2018-07-03
accepted date: 2018-07-03
in scheme: Bird species

Delichon urbicum
type: Concept
notation: A738
status: valid
status modified: 2018-07-03
accepted date: 2018-07-03
in scheme: Bird species

Cygnus atratus
type: Concept
notation: A747-X
status: valid
status modified: 2018-07-03
accepted date: 2018-07-03
in scheme: Bird species

Alopochen aegyptiaca
type: Concept
notation: A748-X
status: valid
status modified: 2018-07-03
accepted date: 2018-07-03
in scheme: Bird species

Aix sponsa
type: Concept
notation: A749-X
status: valid
status modified: 2018-07-03
accepted date: 2018-07-03
in scheme: Bird species

Oxyura jamaicensis
type: Concept
notation: A750-X
status: valid
status modified: 2018-07-03
accepted date: 2018-07-03
in scheme: Bird species

Cairina moschata
type: Concept
notation: A751-X
status: valid
status modified: 2018-07-03
accepted date: 2018-07-03
in scheme: Bird species

Colinus virginianus
type: Concept
notation: A752-X
status: valid
status modified: 2018-07-03
accepted date: 2018-07-03
in scheme: Bird species

Francolinus francolinus asiae
type: Concept
notation: A753-X
status: valid
status modified: 2018-07-03
accepted date: 2018-07-03
in scheme: Bird species

Chrysolophus amherstiae
type: Concept
notation: A755-X
status: valid
status modified: 2018-07-03
accepted date: 2018-07-03
in scheme: Bird species

Pavo cristatus
type: Concept
notation: A756-X
status: valid
status modified: 2018-07-03
accepted date: 2018-07-03
in scheme: Bird species

Numida meleagris
type: Concept
notation: A757-X
status: valid
status modified: 2018-07-03
accepted date: 2018-07-03
in scheme: Bird species

Threskiornis aethiopicus
type: Concept
notation: A758-X
status: valid
status modified: 2018-07-03
accepted date: 2018-07-03
in scheme: Bird species

Porphyrio porphyrio poliocephalus
type: Concept
notation: A759-X
status: valid
status modified: 2018-07-03
accepted date: 2018-07-03
in scheme: Bird species

Psittacula krameri
type: Concept
notation: A760-X
status: valid
status modified: 2018-07-03
accepted date: 2018-07-03
in scheme: Bird species

Myiopsitta monachus
type: Concept
notation: A761-X
status: valid
status modified: 2018-07-03
accepted date: 2018-07-03
in scheme: Bird species

Leiothrix lutea
type: Concept
notation: A762-X
status: valid
status modified: 2018-07-03
accepted date: 2018-07-03
in scheme: Bird species

Paradoxornis webbianus
type: Concept
notation: A763-X
status: valid
status modified: 2018-07-03
accepted date: 2018-07-03
in scheme: Bird species

Amandava amandava
type: Concept
notation: A764-X
status: valid
status modified: 2018-07-03
accepted date: 2018-07-03
in scheme: Bird species

Acridotheres cristatellus
type: Concept
notation: A765-X
status: valid
status modified: 2018-07-03
accepted date: 2018-07-03
in scheme: Bird species

Mergellus albellus
type: Concept
notation: A767
status: valid
status modified: 2018-07-03
accepted date: 2018-07-03
in scheme: Bird species

Numenius arquata arquata
type: Concept
notation: A768
status: valid
status modified: 2018-07-03
accepted date: 2018-07-03
in scheme: Bird species

Ardea alba
type: Concept
notation: A773
status: valid
status modified: 2018-07-03
accepted date: 2018-07-03
in scheme: Bird species

Larus armenicus
type: Concept
notation: A798
status: valid
status modified: 2018-07-03
accepted date: 2018-07-03
in scheme: Bird species

Larus ichthyaetus
type: Concept
notation: A800
status: valid
status modified: 2018-07-03
accepted date: 2018-07-03
in scheme: Bird species

Anser canagicus
type: Concept
notation: A844-X
status: valid
status modified: 2018-07-03
accepted date: 2018-07-03
in scheme: Bird species

Anser indicus
type: Concept
notation: A845-X
status: valid
status modified: 2018-07-03
accepted date: 2018-07-03
in scheme: Bird species

Buteo jamaicensis
type: Concept
notation: A846-X
status: valid
status modified: 2018-07-03
accepted date: 2018-07-03
in scheme: Bird species

Parabuteo unicinctus
type: Concept
notation: A847-X
status: valid
status modified: 2018-07-03
accepted date: 2018-07-03
in scheme: Bird species

Agapornis roseicollis
type: Concept
notation: A848-X
status: valid
status modified: 2018-07-03
accepted date: 2018-07-03
in scheme: Bird species

Calonectris diomedea s. str. | sensu stricto [excluding borealis]
type: Concept
notation: A850
status: valid
status modified: 2018-07-03
accepted date: 2018-07-03
in scheme: Bird species

Calonectris borealis
type: Concept
notation: A851
status: valid
status modified: 2018-07-03
accepted date: 2018-07-03
in scheme: Bird species

Ardenna gravis
type: Concept
notation: A852
status: valid
status modified: 2018-07-03
accepted date: 2018-07-03
in scheme: Bird species

Ardenna grisea
type: Concept
notation: A853
status: valid
status modified: 2018-07-03
accepted date: 2018-07-03
in scheme: Bird species

Hydrobates leucorhous
type: Concept
notation: A854
status: valid
status modified: 2018-07-03
accepted date: 2018-07-03
in scheme: Bird species

Mareca penelope
type: Concept
notation: A855
status: valid
status modified: 2018-07-03
accepted date: 2018-07-03
in scheme: Bird species

Spatula querquedula
type: Concept
notation: A856
status: valid
status modified: 2018-07-03
accepted date: 2018-07-03
in scheme: Bird species

Spatula clypeata
type: Concept
notation: A857
status: valid
status modified: 2018-07-03
accepted date: 2018-07-03
in scheme: Bird species

Clanga pomarina
type: Concept
notation: A858
status: valid
status modified: 2018-07-03
accepted date: 2018-07-03
in scheme: Bird species

Clanga clanga
type: Concept
notation: A859
status: valid
status modified: 2018-07-03
accepted date: 2018-07-03
in scheme: Bird species

Calidris falcinellus
type: Concept
notation: A860
status: valid
status modified: 2018-07-03
accepted date: 2018-07-03
in scheme: Bird species

Calidris pugnax
type: Concept
notation: A861
status: valid
status modified: 2018-07-03
accepted date: 2018-07-03
in scheme: Bird species

Hydrocoloeus minutus
type: Concept
notation: A862
status: valid
status modified: 2018-07-03
accepted date: 2018-07-03
in scheme: Bird species

Thalasseus sandvicensis
type: Concept
notation: A863
status: valid
status modified: 2018-07-03
accepted date: 2018-07-03
in scheme: Bird species

Picus viridis s. str. | sensu stricto [excluding sharpei]
type: Concept
notation: A866
status: valid
status modified: 2018-07-03
accepted date: 2018-07-03
in scheme: Bird species

Picus sharpei
type: Concept
notation: A867
status: valid
status modified: 2018-07-03
accepted date: 2018-07-03
in scheme: Bird species

Leiopicus medius
type: Concept
notation: A868
status: valid
status modified: 2018-07-03
accepted date: 2018-07-03
in scheme: Bird species

Dryobates minor
type: Concept
notation: A869
status: valid
status modified: 2018-07-03
accepted date: 2018-07-03
in scheme: Bird species

Pterodroma deserta
type: Concept
notation: A872
status: valid
status modified: 2018-07-03
accepted date: 2018-07-03
in scheme: Bird species

Hydrobates castro
type: Concept
notation: A874
status: valid
status modified: 2018-07-03
accepted date: 2018-07-03
in scheme: Bird species

Microcarbo pygmaeus
type: Concept
notation: A875
status: valid
status modified: 2018-07-03
accepted date: 2018-07-03
in scheme: Bird species

Lyrurus tetrix tetrix
type: Concept
notation: A876
status: valid
status modified: 2018-07-03
accepted date: 2018-07-03
in scheme: Bird species

Lyrurus tetrix britannicus
type: Concept
notation: A877
status: valid
status modified: 2018-07-03
accepted date: 2018-07-03
in scheme: Bird species

Alectoris graeca all others
type: Concept
notation: A878
status: valid
status modified: 2018-07-03
accepted date: 2018-07-03
in scheme: Bird species

Puffinus lherminieri | [including baroli]
type: Concept
notation: A880
status: valid
status modified: 2018-07-03
accepted date: 2018-07-03
in scheme: Bird species

Onychoprion fuscatus
type: Concept
notation: A882
status: valid
status modified: 2018-07-03
accepted date: 2018-07-03
in scheme: Bird species

Thalasseus bengalensis
type: Concept
notation: A883
status: valid
status modified: 2018-07-03
accepted date: 2018-07-03
in scheme: Bird species

Hydrobates monteiroi
type: Concept
notation: A884
status: valid
status modified: 2018-07-03
accepted date: 2018-07-03
in scheme: Bird species

Sternula albifrons
type: Concept
notation: A885
status: valid
status modified: 2018-07-03
accepted date: 2018-07-03
in scheme: Bird species

Uria aalge all others
type: Concept
notation: A887
status: valid
status modified: 2018-07-03
accepted date: 2018-07-03
in scheme: Bird species

Mareca strepera
type: Concept
notation: A889
status: valid
status modified: 2018-07-03
accepted date: 2018-07-03
in scheme: Bird species

Larus argentatus argentatus
type: Concept
notation: A890
status: valid
status modified: 2018-07-03
accepted date: 2018-07-03
in scheme: Bird species

Lagopus muta all others
type: Concept
notation: A891
status: valid
status modified: 2018-07-03
accepted date: 2018-07-03
in scheme: Bird species

Zapornia parva
type: Concept
notation: A892
status: valid
status modified: 2018-07-03
accepted date: 2018-07-03
in scheme: Bird species

Zapornia pusilla
type: Concept
notation: A893
status: valid
status modified: 2018-07-03
accepted date: 2018-07-03
in scheme: Bird species

Hydroprogne caspia
type: Concept
notation: A894
status: valid
status modified: 2018-07-03
accepted date: 2018-07-03
in scheme: Bird species

Larus argentatus argenteus
type: Concept
notation: A895
status: valid
status modified: 2018-07-03
accepted date: 2018-07-03
in scheme: Bird species

Pternistis erckelii
type: Concept
notation: A896-X
status: valid
status modified: 2018-07-03
accepted date: 2018-07-03
in scheme: Bird species

Spilopelia senegalensis
type: Concept
notation: A897
status: valid
status modified: 2018-07-03
accepted date: 2018-07-03
in scheme: Bird species

Accipiter nisus all others
type: Concept
notation: A898
status: valid
status modified: 2018-07-03
accepted date: 2018-07-03
in scheme: Bird species

Accipiter gentilis all others
type: Concept
notation: A899
status: valid
status modified: 2018-07-03
accepted date: 2018-07-03
in scheme: Bird species

Melanitta nigra s. str. | sensu stricto [excluding americana]
type: Concept
notation: A900
status: valid
status modified: 2018-07-03
accepted date: 2018-07-03
in scheme: Bird species

Sylvia subalpina
type: Concept
notation: A907
status: valid
status modified: 2018-07-03
accepted date: 2018-07-03
in scheme: Bird species

CDR QaQc Birds Directive Article 12 Reporting
type: ConceptScheme
notation: cdrqaqc
is part of: Birds directive Art. 12 reporting in year 2018
registration status: Public draft
user modified: roschsab
date modified: 2019-05-14 10:18:24.0
vocabulary type: Common
is numeric concept identifiers: false
is notations equal identifiers: false

Invalid code.
type: Concept
notation: B001
definition: Please check the vocabulary countries.
status: valid
status modified: 2019-04-16
accepted date: 2019-04-16
in scheme: CDR QaQc Birds Directive Article 12 Reporting
error type: BLOCKER

Mandatory information missing.
type: Concept
notation: B002
definition: The country code should be provided.
status: valid
status modified: 2019-04-16
accepted date: 2019-04-16
in scheme: CDR QaQc Birds Directive Article 12 Reporting
error type: BLOCKER

Invalid code.
type: Concept
notation: B003
definition: Please check the vocabulary countries.
status: valid
status modified: 2019-04-16
accepted date: 2019-04-16
in scheme: CDR QaQc Birds Directive Article 12 Reporting
error type: BLOCKER

Mandatory information missing.
type: Concept
notation: B004
definition: The country code should be provided.
status: valid
status modified: 2019-04-16
accepted date: 2019-04-16
in scheme: CDR QaQc Birds Directive Article 12 Reporting
error type: BLOCKER

Invalid code.
type: Concept
notation: B005
definition: Please check the look up table lu_bird_species.
status: valid
status modified: 2019-04-16
accepted date: 2019-04-16
in scheme: CDR QaQc Birds Directive Article 12 Reporting
error type: BLOCKER

Mandatory information missing.
type: Concept
notation: B006
definition: The species code should be provided.
status: valid
status modified: 2019-04-16
accepted date: 2019-04-16
in scheme: CDR QaQc Birds Directive Article 12 Reporting
error type: BLOCKER

Incoherent information.
type: Concept
notation: B007
definition: The combination species code/EURING code should exist in the look up table lu_bird_species.
status: valid
status modified: 2019-04-16
accepted date: 2019-04-16
in scheme: CDR QaQc Birds Directive Article 12 Reporting
error type: WARNING

Incoherent information.
type: Concept
notation: B008
definition: The combination species code/scientific name should exist in the look up table lu_bird_species.
status: valid
status modified: 2019-04-16
accepted date: 2019-04-16
in scheme: CDR QaQc Birds Directive Article 12 Reporting
error type: WARNING

Incoherent information.
type: Concept
notation: B009
definition: The scientific name should be provided.
status: valid
status modified: 2019-04-16
accepted date: 2019-04-16
in scheme: CDR QaQc Birds Directive Article 12 Reporting
error type: ERROR

Incoherent information.
type: Concept
notation: B010
definition: The combination species code/ subspecific population should exist in the the look up table lu_bird_species.
status: valid
status modified: 2019-04-16
accepted date: 2019-04-16
in scheme: CDR QaQc Birds Directive Article 12 Reporting
error type: WARNING

Incoherent information.
type: Concept
notation: B011
definition: The combination species code/ subspecific population should exist in the look up table lu_bird_species.
status: valid
status modified: 2019-04-16
accepted date: 2019-04-16
in scheme: CDR QaQc Birds Directive Article 12 Reporting
error type: WARNING

Invalid code.
type: Concept
notation: B012
definition: Please check the vocabulary seasonArt12.
status: valid
status modified: 2019-04-16
accepted date: 2019-04-16
in scheme: CDR QaQc Birds Directive Article 12 Reporting
error type: BLOCKER

Mandatory information missing.
type: Concept
notation: B013
definition: Information on Season is expected for all reports.
status: valid
status modified: 2019-04-16
accepted date: 2019-04-16
in scheme: CDR QaQc Birds Directive Article 12 Reporting
error type: ERROR

Incorrect data format.
type: Concept
notation: B014
definition: Format must be YYYY or YYYY-YYYY.
status: valid
status modified: 2019-04-16
accepted date: 2019-04-16
in scheme: CDR QaQc Birds Directive Article 12 Reporting
error type: ERROR

Incoherent information.
type: Concept
notation: B015
definition: Year1 should be lower or equal than year2.
status: valid
status modified: 2019-04-16
accepted date: 2019-04-16
in scheme: CDR QaQc Birds Directive Article 12 Reporting
error type: ERROR

Mandatory information missing.
type: Concept
notation: B016
definition: The year or period should be provided.
status: valid
status modified: 2019-04-16
accepted date: 2019-04-16
in scheme: CDR QaQc Birds Directive Article 12 Reporting
error type: ERROR

Invalid code.
type: Concept
notation: B017
definition: Please check the vocabulary populationUnits.
status: valid
status modified: 2019-04-16
accepted date: 2019-04-16
in scheme: CDR QaQc Birds Directive Article 12 Reporting
error type: BLOCKER

Incoherent information.
type: Concept
notation: B018
definition: The reported population unit differs with the recommended unit in the checklist on the reference portal.
status: valid
status modified: 2019-04-16
accepted date: 2019-04-16
in scheme: CDR QaQc Birds Directive Article 12 Reporting
error type: ERROR

Incoherent information.
type: Concept
notation: B019
definition: The reported population unit differs with the recommended unit in the reported checklist.
status: valid
status modified: 2019-04-16
accepted date: 2019-04-16
in scheme: CDR QaQc Birds Directive Article 12 Reporting
error type: ERROR

Incoherent information.
type: Concept
notation: B020
definition: Population size unit (2.2a) cannot be empty when Population size (2.2b,c,d) is provided.
status: valid
status modified: 2019-04-16
accepted date: 2019-04-16
in scheme: CDR QaQc Birds Directive Article 12 Reporting
error type: ERROR

Mandatory information missing.
type: Concept
notation: B021
definition: Population size unit should be provided.
status: valid
status modified: 2019-04-16
accepted date: 2019-04-16
in scheme: CDR QaQc Birds Directive Article 12 Reporting
error type: ERROR

Incorrect data format.
type: Concept
notation: B022
definition: Numeric field, only integers greater or equal 0 are permitted.
status: valid
status modified: 2019-04-16
accepted date: 2019-04-16
in scheme: CDR QaQc Birds Directive Article 12 Reporting
error type: ERROR

Incorrect data format.
type: Concept
notation: B023
definition: Numeric field, only integers greater or equal 0 are permitted.
status: valid
status modified: 2019-04-16
accepted date: 2019-04-16
in scheme: CDR QaQc Birds Directive Article 12 Reporting
error type: ERROR

2.2c Population size - max should be greater or equal min.
type: Concept
notation: B024
status: valid
status modified: 2019-04-16
accepted date: 2019-04-16
in scheme: CDR QaQc Birds Directive Article 12 Reporting
error type: ERROR

Incorrect data format.
type: Concept
notation: B025
definition: Numeric field, only integers greater or equal 0 are permitted.
status: valid
status modified: 2019-04-16
accepted date: 2019-04-16
in scheme: CDR QaQc Birds Directive Article 12 Reporting
error type: ERROR

Mandatory information missing.
type: Concept
notation: B026
definition: Population size should be provided as interval (2.2b,c) and/or best single value (2.2d). When only a minimum (or maximum) estimate of population size is available (e.g. through expert opinion) this should be entered in the 'Best single value' field and NOT the '(b) Minimum' or '(c) Maximum' fields.
status: valid
status modified: 2019-04-16
accepted date: 2019-04-16
in scheme: CDR QaQc Birds Directive Article 12 Reporting
error type: ERROR

Invalid code.
type: Concept
notation: B027
definition: Please check the vocabulary typeEstimate.
status: valid
status modified: 2019-04-16
accepted date: 2019-04-16
in scheme: CDR QaQc Birds Directive Article 12 Reporting
error type: BLOCKER

Incoherent information.
type: Concept
notation: B028
definition: Type of estimate was provided although there is no entry for population size (2.2b,c,d). Check coherence between these two fields. If both interval (2.2b 'Minimum' and 2.2c 'Maximum') and a best single value (2.2d 'Best single value') are provided, field 2.3 'Type of estimate' should correspond to the more accurate estimate. This should be noted in 2.7 'Additional information'.
status: valid
status modified: 2019-04-16
accepted date: 2019-04-16
in scheme: CDR QaQc Birds Directive Article 12 Reporting
error type: WARNING

Mandatory information missing.
type: Concept
notation: B029
definition: The type of estimate for population size should be provided.
status: valid
status modified: 2019-04-16
accepted date: 2019-04-16
in scheme: CDR QaQc Birds Directive Article 12 Reporting
error type: ERROR

Invalid code.
type: Concept
notation: B030
definition: Please check the vocabulary methodsUsed.
status: valid
status modified: 2019-04-16
accepted date: 2019-04-16
in scheme: CDR QaQc Birds Directive Article 12 Reporting
error type: BLOCKER

Incoherent information.
type: Concept
notation: B031
definition: 2.3 Type of estimate should be empty when Population size Method used is 'AbsentData - Insufficient or no data available'. When the method is assessed as 'AbsentData - Insufficient or no data available', the type of estimate used for the population size cannot be defined. If you want to report an estimate based on a method using limited data, please select 'estimateExpert - Based mainly on expert opinion with very limited data' for the method used.
status: valid
status modified: 2019-04-16
accepted date: 2019-04-16
in scheme: CDR QaQc Birds Directive Article 12 Reporting
error type: WARNING

Mandatory information missing.
type: Concept
notation: B032
definition: The method should be provided. In case the information to be reported in this section is not available use 'AbsentData - Insufficient or no data available'.
status: valid
status modified: 2019-04-16
accepted date: 2019-04-16
in scheme: CDR QaQc Birds Directive Article 12 Reporting
error type: ERROR

Invalid code.
type: Concept
notation: B033
definition: Please check the vocabulary reasonChange.
status: valid
status modified: 2019-04-16
accepted date: 2019-04-16
in scheme: CDR QaQc Birds Directive Article 12 Reporting
error type: BLOCKER

Incoherent information.
type: Concept
notation: B034
definition: If 'noChange' is selected, there is no need to explain the nature of change.
status: valid
status modified: 2019-04-16
accepted date: 2019-04-16
in scheme: CDR QaQc Birds Directive Article 12 Reporting
error type: ERROR

Incoherent information.
type: Concept
notation: B035
definition: Only one main reason is expected and should be part of the reported reasons.
status: valid
status modified: 2019-04-16
accepted date: 2019-04-16
in scheme: CDR QaQc Birds Directive Article 12 Reporting
error type: ERROR

Mandatory information missing.
type: Concept
notation: B036
definition: Indicate if there is any change since the previous reporting period (2008 - 2012) in the population size reported. Report 'noChange' if the answer to the question: 'Is there a change between reporting periods?' is 'No'. Provide the nature of that change (more than one option can be chosen) if the answer is 'Yes'.
status: valid
status modified: 2019-04-16
accepted date: 2019-04-16
in scheme: CDR QaQc Birds Directive Article 12 Reporting
error type: ERROR

Incorrect data format.
type: Concept
notation: B037
definition: Format must be YYYY-YYYY.
status: valid
status modified: 2019-04-16
accepted date: 2019-04-16
in scheme: CDR QaQc Birds Directive Article 12 Reporting
error type: ERROR

Incoherent information.
type: Concept
notation: B038
definition: Year1 should be lower or equal than year2.
status: valid
status modified: 2019-04-16
accepted date: 2019-04-16
in scheme: CDR QaQc Birds Directive Article 12 Reporting
error type: ERROR

Mandatory information missing.
type: Concept
notation: B039
definition: The period should be provided.
status: valid
status modified: 2019-04-16
accepted date: 2019-04-16
in scheme: CDR QaQc Birds Directive Article 12 Reporting
error type: ERROR

Invalid code.
type: Concept
notation: B040
definition: Please check the vocabulary trends.
status: valid
status modified: 2019-04-16
accepted date: 2019-04-16
in scheme: CDR QaQc Birds Directive Article 12 Reporting
error type: BLOCKER

Mandatory information missing.
type: Concept
notation: B041
definition: Trend should be provided. In case the information to be reported in this section is not available use 'Unk - unknown'.
status: valid
status modified: 2019-04-16
accepted date: 2019-04-16
in scheme: CDR QaQc Birds Directive Article 12 Reporting
error type: ERROR

Incorrect data format.
type: Concept
notation: B042
definition: Numeric field, only decimals are permitted.
status: valid
status modified: 2019-04-16
accepted date: 2019-04-16
in scheme: CDR QaQc Birds Directive Article 12 Reporting
error type: ERROR

Incorrect data format.
type: Concept
notation: B043
definition: Numeric field, only decimals are permitted.
status: valid
status modified: 2019-04-16
accepted date: 2019-04-16
in scheme: CDR QaQc Birds Directive Article 12 Reporting
error type: ERROR

3.1.3b Short-term trend Magnitude - max should be greater or equal min.
type: Concept
notation: B044
status: valid
status modified: 2019-04-16
accepted date: 2019-04-16
in scheme: CDR QaQc Birds Directive Article 12 Reporting
error type: ERROR

Incorrect data format.
type: Concept
notation: B045
definition: Numeric field, only decimals are permitted.
status: valid
status modified: 2019-04-16
accepted date: 2019-04-16
in scheme: CDR QaQc Birds Directive Article 12 Reporting
error type: ERROR

Mandatory information missing.
type: Concept
notation: B046
definition: Short term trend magnitude should be provided as interval (3.1.3a, b) and/or single value (3.1.3c). When only a minimum (or maximum) value of magnitude is known (e.g. through expert opinion) this should be entered in the 'Best single value' field and NOT the '(a) Minimum' or '(b) Maximum' fields.
status: valid
status modified: 2019-04-16
accepted date: 2019-04-16
in scheme: CDR QaQc Birds Directive Article 12 Reporting
error type: ERROR

Invalid code.
type: Concept
notation: B047
definition: Please check the vocabulary methodsUsed.
status: valid
status modified: 2019-04-16
accepted date: 2019-04-16
in scheme: CDR QaQc Birds Directive Article 12 Reporting
error type: BLOCKER

Incoherent information.
type: Concept
notation: B048
definition: Inconsistent values provided in fields 3.1.2 Short-term trend Direction and 3.1.4 Short-term trend Method used. When the method is assessed as 'AbsentData - Insufficient or no data available', the trend cannot be defined. If you want to report a trend as stable, increasing or decreasing based on a method using limited data, please select'?estimateExpert - Based mainly on expert opinion with very limited data' for the method used.
status: valid
status modified: 2019-04-16
accepted date: 2019-04-16
in scheme: CDR QaQc Birds Directive Article 12 Reporting
error type: WARNING

Mandatory information missing.
type: Concept
notation: B049
definition: The method should be provided. In case the information to be reported in this section is not available use 'AbsentData - Insufficient or no data available'.
status: valid
status modified: 2019-04-16
accepted date: 2019-04-16
in scheme: CDR QaQc Birds Directive Article 12 Reporting
error type: ERROR

Incorrect data format.
type: Concept
notation: B050
definition: Format must be YYYY-YYYY.
status: valid
status modified: 2019-04-16
accepted date: 2019-04-16
in scheme: CDR QaQc Birds Directive Article 12 Reporting
error type: ERROR

Incoherent information.
type: Concept
notation: B051
definition: Year1 should be lower or equal than year2.
status: valid
status modified: 2019-04-16
accepted date: 2019-04-16
in scheme: CDR QaQc Birds Directive Article 12 Reporting
error type: ERROR

Mandatory information missing.
type: Concept
notation: B052
definition: The period should be provided.
status: valid
status modified: 2019-04-16
accepted date: 2019-04-16
in scheme: CDR QaQc Birds Directive Article 12 Reporting
error type: ERROR

Invalid code.
type: Concept
notation: B053
definition: Please check the vocabulary trends.
status: valid
status modified: 2019-04-16
accepted date: 2019-04-16
in scheme: CDR QaQc Birds Directive Article 12 Reporting
error type: BLOCKER

Mandatory information missing.
type: Concept
notation: B054
definition: Trend should be provided. In case the information to be reported in this section is not available use 'Unk - unknown'.
status: valid
status modified: 2019-04-16
accepted date: 2019-04-16
in scheme: CDR QaQc Birds Directive Article 12 Reporting
error type: ERROR

Incorrect data format.
type: Concept
notation: B055
definition: Numeric field, only decimals are permitted.
status: valid
status modified: 2019-04-16
accepted date: 2019-04-16
in scheme: CDR QaQc Birds Directive Article 12 Reporting
error type: ERROR

Incorrect data format.
type: Concept
notation: B056
definition: Numeric field, only decimals are permitted.
status: valid
status modified: 2019-04-16
accepted date: 2019-04-16
in scheme: CDR QaQc Birds Directive Article 12 Reporting
error type: ERROR

3.2.3b Long-term trend Magnitude - max should be greater or equal min.
type: Concept
notation: B057
status: valid
status modified: 2019-04-16
accepted date: 2019-04-16
in scheme: CDR QaQc Birds Directive Article 12 Reporting
error type: ERROR

Incorrect data format.
type: Concept
notation: B058
definition: Numeric field, only decimals are permitted.
status: valid
status modified: 2019-04-16
accepted date: 2019-04-16
in scheme: CDR QaQc Birds Directive Article 12 Reporting
error type: ERROR

Mandatory information missing.
type: Concept
notation: B059
definition: Long term trend magnitude should be provided as interval (3.2.3a, b) and/or single value (3.2.3c). When only a minimum (or maximum) value of magnitude is known (e.g. through expert opinion) this should be entered in the 'Best single value' field and NOT the '(a) Minimum' or '(b) Maximum' fields.
status: valid
status modified: 2019-04-16
accepted date: 2019-04-16
in scheme: CDR QaQc Birds Directive Article 12 Reporting
error type: ERROR

Invalid code.
type: Concept
notation: B060
definition: Please check the vocabulary methodsUsed.
status: valid
status modified: 2019-04-16
accepted date: 2019-04-16
in scheme: CDR QaQc Birds Directive Article 12 Reporting
error type: BLOCKER

Incoherent information.
type: Concept
notation: B061
definition: Inconsistent values provided in fields 3.2.2 Long-term trend Direction and 3.2.4 Long-term trend Method used. When the method is assessed as 'AbsentData - Insufficient or no data available', the trend cannot be defined. If you want to report a trend as stable, increasing or decreasing based on a method using limited data, please select'?estimateExpert - Based mainly on expert opinion with very limited data' for the method used.
status: valid
status modified: 2019-04-16
accepted date: 2019-04-16
in scheme: CDR QaQc Birds Directive Article 12 Reporting
error type: WARNING

Mandatory information missing.
type: Concept
notation: B062
definition: The method should be provided. In case the information to be reported in this section is not available use 'AbsentData - Insufficient or no data available'.
status: valid
status modified: 2019-04-16
accepted date: 2019-04-16
in scheme: CDR QaQc Birds Directive Article 12 Reporting
error type: ERROR

Invalid code.
type: Concept
notation: B063
definition: Code should be 'Yes' or 'No'.
status: valid
status modified: 2019-04-16
accepted date: 2019-04-16
in scheme: CDR QaQc Birds Directive Article 12 Reporting
error type: BLOCKER

Mandatory information missing.
type: Concept
notation: B064
definition: Indicate whether information on species distribution is sensitive.
status: valid
status modified: 2019-04-16
accepted date: 2019-04-16
in scheme: CDR QaQc Birds Directive Article 12 Reporting
error type: ERROR

Incorrect data format.
type: Concept
notation: B065
definition: Format must be YYYY or YYYY-YYYY.
status: valid
status modified: 2019-04-16
accepted date: 2019-04-16
in scheme: CDR QaQc Birds Directive Article 12 Reporting
error type: ERROR

Incoherent information.
type: Concept
notation: B066
definition: Year1 should be lower or equal than year2.
status: valid
status modified: 2019-04-16
accepted date: 2019-04-16
in scheme: CDR QaQc Birds Directive Article 12 Reporting
error type: ERROR

Mandatory information missing.
type: Concept
notation: B067
definition: Year or period should be provided.
status: valid
status modified: 2019-04-16
accepted date: 2019-04-16
in scheme: CDR QaQc Birds Directive Article 12 Reporting
error type: ERROR

Incorrect data format.
type: Concept
notation: B068
definition: Numeric field, only decimals greater or equal 0 is permitted.
status: valid
status modified: 2019-04-16
accepted date: 2019-04-16
in scheme: CDR QaQc Birds Directive Article 12 Reporting
error type: ERROR

Mandatory information missing.
type: Concept
notation: B069
definition: Breeding distribution surface area should be provided.
status: valid
status modified: 2019-04-16
accepted date: 2019-04-16
in scheme: CDR QaQc Birds Directive Article 12 Reporting
error type: ERROR

Invalid code.
type: Concept
notation: B070
definition: Please check the vocabulary methodsUsed.
status: valid
status modified: 2019-04-16
accepted date: 2019-04-16
in scheme: CDR QaQc Birds Directive Article 12 Reporting
error type: BLOCKER

Mandatory information missing.
type: Concept
notation: B071
definition: Method should be provided. In case the information to be reported in this section is not available use 'AbsentData - Insufficient or no data available'.
status: valid
status modified: 2019-04-16
accepted date: 2019-04-16
in scheme: CDR QaQc Birds Directive Article 12 Reporting
error type: ERROR

Incorrect data format.
type: Concept
notation: B072
definition: Format must be YYYY-YYYY.
status: valid
status modified: 2019-04-16
accepted date: 2019-04-16
in scheme: CDR QaQc Birds Directive Article 12 Reporting
error type: ERROR

Incoherent information.
type: Concept
notation: B073
definition: Year1 should be lower or equal than year2.
status: valid
status modified: 2019-04-16
accepted date: 2019-04-16
in scheme: CDR QaQc Birds Directive Article 12 Reporting
error type: ERROR

Mandatory information missing.
type: Concept
notation: B074
definition: The period should be provided.
status: valid
status modified: 2019-04-16
accepted date: 2019-04-16
in scheme: CDR QaQc Birds Directive Article 12 Reporting
error type: ERROR

Invalid code.
type: Concept
notation: B075
definition: Please check the vocabulary trends.
status: valid
status modified: 2019-04-16
accepted date: 2019-04-16
in scheme: CDR QaQc Birds Directive Article 12 Reporting
error type: BLOCKER

Mandatory information missing.
type: Concept
notation: B076
definition: Trend should be provided. In case the information to be reported in this section is not available use 'Unk - unknown'.
status: valid
status modified: 2019-04-16
accepted date: 2019-04-16
in scheme: CDR QaQc Birds Directive Article 12 Reporting
error type: ERROR

Incorrect data format.
type: Concept
notation: B077
definition: Numeric field, only decimals are permitted.
status: valid
status modified: 2019-04-16
accepted date: 2019-04-16
in scheme: CDR QaQc Birds Directive Article 12 Reporting
error type: ERROR

Incorrect data format.
type: Concept
notation: B078
definition: Numeric field, only decimals are permitted.
status: valid
status modified: 2019-04-16
accepted date: 2019-04-16
in scheme: CDR QaQc Birds Directive Article 12 Reporting
error type: ERROR

5.1.3b Short-term trend Magnitude - max should be greater or equal min.
type: Concept
notation: B079
status: valid
status modified: 2019-04-16
accepted date: 2019-04-16
in scheme: CDR QaQc Birds Directive Article 12 Reporting
error type: ERROR

Incorrect data format.
type: Concept
notation: B080
definition: Numeric field, only decimals are permitted.
status: valid
status modified: 2019-04-16
accepted date: 2019-04-16
in scheme: CDR QaQc Birds Directive Article 12 Reporting
error type: ERROR

Mandatory information missing.
type: Concept
notation: B081
definition: Short term trend magnitude should be provided as interval (5.1.3a, b) and/or single value (5.1.3c). When only a minimum (or maximum) value of magnitude is known (e.g. through expert opinion) this should be entered in the 'Best single value' field and NOT the '(a) Minimum' or '(b) Maximum' fields.
status: valid
status modified: 2019-04-16
accepted date: 2019-04-16
in scheme: CDR QaQc Birds Directive Article 12 Reporting
error type: ERROR

Invalid code.
type: Concept
notation: B082
definition: Please check the vocabulary methodsUsed.
status: valid
status modified: 2019-04-16
accepted date: 2019-04-16
in scheme: CDR QaQc Birds Directive Article 12 Reporting
error type: BLOCKER

Incoherent information.
type: Concept
notation: B083
definition: Inconsistent values provided in fields 5.1.2 Short-term trend Direction and 5.1.4 Short-term trend Method used. When the method is assessed as 'AbsentData - Insufficient or no data available', the trend cannot be defined. If you want to report a trend as stable, increasing or decreasing based on a method using limited data, please select'?estimateExpert - Based mainly on expert opinion with very limited data' for the method used.
status: valid
status modified: 2019-04-16
accepted date: 2019-04-16
in scheme: CDR QaQc Birds Directive Article 12 Reporting
error type: WARNING

Mandatory information missing.
type: Concept
notation: B084
definition: The method should be provided. In case the information to be reported in this section is not available use 'AbsentData - Insufficient or no data available'.
status: valid
status modified: 2019-04-16
accepted date: 2019-04-16
in scheme: CDR QaQc Birds Directive Article 12 Reporting
error type: ERROR

Incorrect data format.
type: Concept
notation: B085
definition: Format must be YYYY-YYYY.
status: valid
status modified: 2019-04-16
accepted date: 2019-04-16
in scheme: CDR QaQc Birds Directive Article 12 Reporting
error type: ERROR

Incoherent information.
type: Concept
notation: B086
definition: Year1 should be lower or equal than year2.
status: valid
status modified: 2019-04-16
accepted date: 2019-04-16
in scheme: CDR QaQc Birds Directive Article 12 Reporting
error type: ERROR

Mandatory information missing.
type: Concept
notation: B087
definition: The period should be provided.
status: valid
status modified: 2019-04-16
accepted date: 2019-04-16
in scheme: CDR QaQc Birds Directive Article 12 Reporting
error type: ERROR

Invalid code.
type: Concept
notation: B088
definition: Please check the vocabulary trends.
status: valid
status modified: 2019-04-16
accepted date: 2019-04-16
in scheme: CDR QaQc Birds Directive Article 12 Reporting
error type: BLOCKER

Mandatory information missing.
type: Concept
notation: B089
definition: Trend should be provided. In case the information to be reported in this section is not available use 'Unk - unknown'.
status: valid
status modified: 2019-04-16
accepted date: 2019-04-16
in scheme: CDR QaQc Birds Directive Article 12 Reporting
error type: ERROR

Incorrect data format.
type: Concept
notation: B090
definition: Numeric field, only decimals are permitted.
status: valid
status modified: 2019-04-16
accepted date: 2019-04-16
in scheme: CDR QaQc Birds Directive Article 12 Reporting
error type: ERROR

Incorrect data format.
type: Concept
notation: B091
definition: Numeric field, only decimals are permitted.
status: valid
status modified: 2019-04-16
accepted date: 2019-04-16
in scheme: CDR QaQc Birds Directive Article 12 Reporting
error type: ERROR

5.2.3b Long-term trend Magnitude - max should be greater or equal min.
type: Concept
notation: B092
status: valid
status modified: 2019-04-16
accepted date: 2019-04-16
in scheme: CDR QaQc Birds Directive Article 12 Reporting
error type: ERROR

Incorrect data format.
type: Concept
notation: B093
definition: Numeric field, only decimals are permitted.
status: valid
status modified: 2019-04-16
accepted date: 2019-04-16
in scheme: CDR QaQc Birds Directive Article 12 Reporting
error type: ERROR

Mandatory information missing.
type: Concept
notation: B094
definition: Long term trend magnitude should be provided as interval (5.2.3a, b) and/or single value (5.2.3c). When only a minimum (or maximum) value of magnitude is known (e.g. through expert opinion) this should be entered in the 'Best single value' field and NOT the '(a) Minimum' or '(b) Maximum' fields.
status: valid
status modified: 2019-04-16
accepted date: 2019-04-16
in scheme: CDR QaQc Birds Directive Article 12 Reporting
error type: ERROR

Invalid code.
type: Concept
notation: B095
definition: Please check the vocabulary methodsUsed.
status: valid
status modified: 2019-04-16
accepted date: 2019-04-16
in scheme: CDR QaQc Birds Directive Article 12 Reporting
error type: BLOCKER

Incoherent information.
type: Concept
notation: B096
definition: Inconsistent values provided in fields 5.2.2 Long-term trend Direction and 5.2.4 Long-term trend Method used. When the method is assessed as 'AbsentData - Insufficient or no data available', the trend cannot be defined. If you want to report a trend as stable, increasing or decreasing based on a method using limited data, please select'?estimateExpert - Based mainly on expert opinion with very limited data' for the method used.
status: valid
status modified: 2019-04-16
accepted date: 2019-04-16
in scheme: CDR QaQc Birds Directive Article 12 Reporting
error type: WARNING

Mandatory information missing.
type: Concept
notation: B097
definition: The method should be provided. In case the information to be reported in this section is not available use 'AbsentData - Insufficient or no data available'.
status: valid
status modified: 2019-04-16
accepted date: 2019-04-16
in scheme: CDR QaQc Birds Directive Article 12 Reporting
error type: ERROR

Invalid code.
type: Concept
notation: B098
definition: Please check the vocabulary typeOfPlan .
status: valid
status modified: 2019-04-16
accepted date: 2019-04-16
in scheme: CDR QaQc Birds Directive Article 12 Reporting
error type: BLOCKER

Incoherent information.
type: Concept
notation: B099
definition: The reported type of international plan differs with the one specified in the look up table linkage_species_plans.
status: valid
status modified: 2019-04-16
accepted date: 2019-04-16
in scheme: CDR QaQc Birds Directive Article 12 Reporting
error type: ERROR

Mandatory information missing.
type: Concept
notation: B100
definition: Information on Type of international plan is expected for all reports. In case there is no international plan ue 'NA - No plan'.
status: valid
status modified: 2019-04-16
accepted date: 2019-04-16
in scheme: CDR QaQc Birds Directive Article 12 Reporting
error type: ERROR

Invalid code.
type: Concept
notation: B101
definition: Code should be 'Yes' or 'No'.
status: valid
status modified: 2019-04-16
accepted date: 2019-04-16
in scheme: CDR QaQc Birds Directive Article 12 Reporting
error type: BLOCKER

Mandatory information missing.
type: Concept
notation: B102
definition: Indicate whether a national plan linked to the international one has been adopted.
status: valid
status modified: 2019-04-16
accepted date: 2019-04-16
in scheme: CDR QaQc Birds Directive Article 12 Reporting
error type: ERROR

Incoherent information.
type: Concept
notation: B103
definition: Description of measures or initiatives is not expected if a national plan linked to the international one has been adopted (6.2 is 'Yes').
status: valid
status modified: 2019-04-16
accepted date: 2019-04-16
in scheme: CDR QaQc Birds Directive Article 12 Reporting
error type: ERROR

Incoherent information.
type: Concept
notation: B104
definition: Description of measures or initiatives is expected if a national plan linked to the international one has not been adopted (6.2 is 'No').
status: valid
status modified: 2019-04-16
accepted date: 2019-04-16
in scheme: CDR QaQc Birds Directive Article 12 Reporting
error type: ERROR

Invalid code.
type: Concept
notation: B105
definition: Please check the vocabulary effectivenessSAPs.
status: valid
status modified: 2019-04-16
accepted date: 2019-04-16
in scheme: CDR QaQc Birds Directive Article 12 Reporting
error type: BLOCKER

Invalid code.
type: Concept
notation: B106
definition: Please check the vocabulary effectivenessMPs.
status: valid
status modified: 2019-04-16
accepted date: 2019-04-16
in scheme: CDR QaQc Birds Directive Article 12 Reporting
error type: BLOCKER

Invalid code.
type: Concept
notation: B107
definition: Please check the vocabulary threats.
status: valid
status modified: 2019-04-16
accepted date: 2019-04-16
in scheme: CDR QaQc Birds Directive Article 12 Reporting
error type: BLOCKER

More entries than permitted.
type: Concept
notation: B108
definition: More entries than permitted. Maximum of 10 pressures per report.
status: valid
status modified: 2019-04-16
accepted date: 2019-04-16
in scheme: CDR QaQc Birds Directive Article 12 Reporting
error type: ERROR

More entries than permitted.
type: Concept
notation: B109
definition: More entries than permitted. Maximum of 10 threats per report.
status: valid
status modified: 2019-04-16
accepted date: 2019-04-16
in scheme: CDR QaQc Birds Directive Article 12 Reporting
error type: ERROR

More entries than permitted.
type: Concept
notation: B110
definition: More entries than permitted. Maximum of 5 pressures with 'H - High importance' per report.
status: valid
status modified: 2019-04-16
accepted date: 2019-04-16
in scheme: CDR QaQc Birds Directive Article 12 Reporting
error type: ERROR

More entries than permitted.
type: Concept
notation: B111
definition: More entries than permitted. Maximum of 5 threats with 'H - High importance' per report.
status: valid
status modified: 2019-04-16
accepted date: 2019-04-16
in scheme: CDR QaQc Birds Directive Article 12 Reporting
error type: ERROR

Incoherent information.
type: Concept
notation: B112
definition: Code 'Xu - Unknown pressure', 'Xp - No information on pressures ' or 'Xxp - No pressures ' should be reported as a pressure, not as a threat.
status: valid
status modified: 2019-04-16
accepted date: 2019-04-16
in scheme: CDR QaQc Birds Directive Article 12 Reporting
error type: ERROR

Incoherent information.
type: Concept
notation: B113
definition: Code 'Xt - No information on threats' or 'Xxt - No threats ' should be reported as a threat, not as a pressure.
status: valid
status modified: 2019-04-16
accepted date: 2019-04-16
in scheme: CDR QaQc Birds Directive Article 12 Reporting
error type: ERROR

Incoherent information.
type: Concept
notation: B114
definition: Code 'Xt - No information on threats' used but other threats listed.
status: valid
status modified: 2019-04-16
accepted date: 2019-04-16
in scheme: CDR QaQc Birds Directive Article 12 Reporting
error type: WARNING

Incoherent information.
type: Concept
notation: B115
definition: Code 'Xp - No information on pressures' used but other pressures listed.
status: valid
status modified: 2019-04-16
accepted date: 2019-04-16
in scheme: CDR QaQc Birds Directive Article 12 Reporting
error type: WARNING

Mandatory information missing.
type: Concept
notation: B116
definition: The list of pressures and/or threats should be provided. Report 'Xp - No information on pressures' and/or 'Xt - No information on threats' for missing information.
status: valid
status modified: 2019-04-16
accepted date: 2019-04-16
in scheme: CDR QaQc Birds Directive Article 12 Reporting
error type: ERROR

Mandatory information missing.
type: Concept
notation: B117
definition: The list of threats should be provided. Report 'Xt - No information on threats' for missing information.
status: valid
status modified: 2019-04-16
accepted date: 2019-04-16
in scheme: CDR QaQc Birds Directive Article 12 Reporting
error type: ERROR

Mandatory information missing.
type: Concept
notation: B118
definition: The list of pressures should be provided. Report 'Xp - No information on pressures' for missing information.
status: valid
status modified: 2019-04-16
accepted date: 2019-04-16
in scheme: CDR QaQc Birds Directive Article 12 Reporting
error type: ERROR

Invalid code.
type: Concept
notation: B119
definition: Please check the vocabulary ranking.
status: valid
status modified: 2019-04-16
accepted date: 2019-04-16
in scheme: CDR QaQc Birds Directive Article 12 Reporting
error type: BLOCKER

Incoherent information.
type: Concept
notation: B120
definition: Ranking is provided although no code indicated for pressure and/or threat.
status: valid
status modified: 2019-04-16
accepted date: 2019-04-16
in scheme: CDR QaQc Birds Directive Article 12 Reporting
error type: ERROR

Mandatory information missing.
type: Concept
notation: B121
definition: This field cannot be empty unless the reported code is 'Xp', 'Xt', 'Xu', 'Xxp' or 'Xxt'.
status: valid
status modified: 2019-04-16
accepted date: 2019-04-16
in scheme: CDR QaQc Birds Directive Article 12 Reporting
error type: ERROR

Invalid code.
type: Concept
notation: B122
definition: Please check the vocabulary pressuresThreatsLocation .
status: valid
status modified: 2019-04-16
accepted date: 2019-04-16
in scheme: CDR QaQc Birds Directive Article 12 Reporting
error type: BLOCKER

Incoherent information.
type: Concept
notation: B123
definition: Location is provided although no code indicated for pressure and/or threat.
status: valid
status modified: 2019-04-16
accepted date: 2019-04-16
in scheme: CDR QaQc Birds Directive Article 12 Reporting
error type: ERROR

Mandatory information missing.
type: Concept
notation: B124
definition: This field cannot be empty unless the reported code is 'Xp', 'Xt', 'Xu', 'Xxp' or 'Xxt'. Report 'unk - unknown' if needed.
status: valid
status modified: 2019-04-16
accepted date: 2019-04-16
in scheme: CDR QaQc Birds Directive Article 12 Reporting
error type: ERROR

Invalid code.
type: Concept
notation: B125
definition: Code should be 'p' = pressure or 't' = threat.
status: valid
status modified: 2019-04-16
accepted date: 2019-04-16
in scheme: CDR QaQc Birds Directive Article 12 Reporting
error type: ERROR

Incoherent information.
type: Concept
notation: B126
definition: Type of pressure/threat is provided although no code indicated for pressure and/or threat.
status: valid
status modified: 2019-04-16
accepted date: 2019-04-16
in scheme: CDR QaQc Birds Directive Article 12 Reporting
error type: ERROR

Mandatory information missing.
type: Concept
notation: B127
definition: The type of pressure or threats should be systematically provided. Code should be 'p' = pressure or 't' = threat.
status: valid
status modified: 2019-04-16
accepted date: 2019-04-16
in scheme: CDR QaQc Birds Directive Article 12 Reporting
error type: ERROR

Invalid code.
type: Concept
notation: B128
definition: Code should be 'Yes' or 'No'.
status: valid
status modified: 2019-04-16
accepted date: 2019-04-16
in scheme: CDR QaQc Birds Directive Article 12 Reporting
error type: BLOCKER

Mandatory information missing.
type: Concept
notation: B129
definition: Indicate whether measures are needed or not.
status: valid
status modified: 2019-04-16
accepted date: 2019-04-16
in scheme: CDR QaQc Birds Directive Article 12 Reporting
error type: ERROR

Incoherent information.
type: Concept
notation: B130
definition: Status of measures is not expected if no measures are needed.
status: valid
status modified: 2019-04-16
accepted date: 2019-04-16
in scheme: CDR QaQc Birds Directive Article 12 Reporting
error type: ERROR

Invalid code.
type: Concept
notation: B131
definition: Please check the vocabulary measuresIdentified.
status: valid
status modified: 2019-04-16
accepted date: 2019-04-16
in scheme: CDR QaQc Birds Directive Article 12 Reporting
error type: BLOCKER

Mandatory information missing.
type: Concept
notation: B132
definition: Status of measures should be provided if measures are needed.
status: valid
status modified: 2019-04-16
accepted date: 2019-04-16
in scheme: CDR QaQc Birds Directive Article 12 Reporting
error type: ERROR

Incoherent information.
type: Concept
notation: B133
definition: The main purpose of measures taken is not expected if no measures are identified and taken.
status: valid
status modified: 2019-04-16
accepted date: 2019-04-16
in scheme: CDR QaQc Birds Directive Article 12 Reporting
error type: WARNING

Invalid code.
type: Concept
notation: B134
definition: Please check the vocabulary measuresPurposeBirds.
status: valid
status modified: 2019-04-16
accepted date: 2019-04-16
in scheme: CDR QaQc Birds Directive Article 12 Reporting
error type: BLOCKER

Incoherent information.
type: Concept
notation: B135
definition: The main purpose of measures taken is expected if measures are identified and taken.
status: valid
status modified: 2019-04-16
accepted date: 2019-04-16
in scheme: CDR QaQc Birds Directive Article 12 Reporting
error type: ERROR

Incoherent information.
type: Concept
notation: B136
definition: Location of measures is not expected if no measures identified and taken.
status: valid
status modified: 2019-04-16
accepted date: 2019-04-16
in scheme: CDR QaQc Birds Directive Article 12 Reporting
error type: WARNING

Invalid code.
type: Concept
notation: B137
definition: Please check the vocabulary measuresLocation.
status: valid
status modified: 2019-04-16
accepted date: 2019-04-16
in scheme: CDR QaQc Birds Directive Article 12 Reporting
error type: BLOCKER

Incoherent information.
type: Concept
notation: B138
definition: The location of the measures is expected if measures are identified and taken.
status: valid
status modified: 2019-04-16
accepted date: 2019-04-16
in scheme: CDR QaQc Birds Directive Article 12 Reporting
error type: ERROR

Incoherent information.
type: Concept
notation: B139
definition: Time frame of response to measures is not expected if no measures are identified and taken.
status: valid
status modified: 2019-04-16
accepted date: 2019-04-16
in scheme: CDR QaQc Birds Directive Article 12 Reporting
error type: WARNING

Invalid code.
type: Concept
notation: B140
definition: Please check the vocabulary measuresResponse.
status: valid
status modified: 2019-04-16
accepted date: 2019-04-16
in scheme: CDR QaQc Birds Directive Article 12 Reporting
error type: BLOCKER

Mandatory information missing.
type: Concept
notation: B141
definition: The time frame of the response to measures should be provided if measures are identified and taken.
status: valid
status modified: 2019-04-16
accepted date: 2019-04-16
in scheme: CDR QaQc Birds Directive Article 12 Reporting
error type: ERROR

Invalid code.
type: Concept
notation: B142
definition: Please check the vocabulary measures.
status: valid
status modified: 2019-04-16
accepted date: 2019-04-16
in scheme: CDR QaQc Birds Directive Article 12 Reporting
error type: BLOCKER

More entries than permitted.
type: Concept
notation: B143
definition: More entries than permitted. Maximum of 10 measures per biogeographical assessment.
status: valid
status modified: 2019-04-16
accepted date: 2019-04-16
in scheme: CDR QaQc Birds Directive Article 12 Reporting
error type: ERROR

Mandatory information missing.
type: Concept
notation: B144
definition: The list of measures should be provided if measures are identified and taken.
status: valid
status modified: 2019-04-16
accepted date: 2019-04-16
in scheme: CDR QaQc Birds Directive Article 12 Reporting
error type: ERROR

Invalid code.
type: Concept
notation: B145
definition: Please check the vocabulary populationUnits.
status: valid
status modified: 2019-04-16
accepted date: 2019-04-16
in scheme: CDR QaQc Birds Directive Article 12 Reporting
error type: BLOCKER

Incoherent information.
type: Concept
notation: B146
definition: The reported population size unit within Natura 2000 network differs with the reporting unit used in 2.2.
status: valid
status modified: 2019-04-16
accepted date: 2019-04-16
in scheme: CDR QaQc Birds Directive Article 12 Reporting
error type: ERROR

Incoherent information.
type: Concept
notation: B147
definition: Population size unit within Natura 2000 network (9.1a) cannot be empty when Population size within within Natura 2000 network (9.1b,c,d) is provided.
status: valid
status modified: 2019-04-16
accepted date: 2019-04-16
in scheme: CDR QaQc Birds Directive Article 12 Reporting
error type: ERROR

Mandatory information missing.
type: Concept
notation: B148
definition: Population size unit within Natura 2000 network should be provided.
status: valid
status modified: 2019-04-16
accepted date: 2019-04-16
in scheme: CDR QaQc Birds Directive Article 12 Reporting
error type: ERROR

Incorrect data format.
type: Concept
notation: B149
definition: Numeric field, only integers greater or equal 0 are permitted.
status: valid
status modified: 2019-04-16
accepted date: 2019-04-16
in scheme: CDR QaQc Birds Directive Article 12 Reporting
error type: ERROR

Incorrect data format.
type: Concept
notation: B150
definition: Numeric field, only integers greater or equal 0 are permitted.
status: valid
status modified: 2019-04-16
accepted date: 2019-04-16
in scheme: CDR QaQc Birds Directive Article 12 Reporting
error type: ERROR

9.1c Population size within Natura 2000 network - max should be greater or equal min.
type: Concept
notation: B151
status: valid
status modified: 2019-04-16
accepted date: 2019-04-16
in scheme: CDR QaQc Birds Directive Article 12 Reporting
error type: ERROR

Incorrect data format.
type: Concept
notation: B152
definition: Numeric field, only integers greater or equal 0 are permitted.
status: valid
status modified: 2019-04-16
accepted date: 2019-04-16
in scheme: CDR QaQc Birds Directive Article 12 Reporting
error type: ERROR

Mandatory information missing.
type: Concept
notation: B153
definition: Population size within Natura 2000 network should be provided as interval (9.1b, c) and/or best single value (9.1d) for annex I species and non-annex I species triggering SPA classification. When only a minimum (or maximum) estimation of population size is available (e.g. through expert opinion) this should be entered in the 'Best single value' field and NOT the '(b) Minimum' or '(c) Maximum' fields.
status: valid
status modified: 2019-04-16
accepted date: 2019-04-16
in scheme: CDR QaQc Birds Directive Article 12 Reporting
error type: ERROR

Invalid code.
type: Concept
notation: B154
definition: Please check the vocabulary typeEstimate.
status: valid
status modified: 2019-04-16
accepted date: 2019-04-16
in scheme: CDR QaQc Birds Directive Article 12 Reporting
error type: BLOCKER

Incoherent information.
type: Concept
notation: B155
definition: Incoherent information provided. Type of estimate was provided although there is no entry for population size within Natura 2000 network (9.1b,c,d). Check coherence between these two fields. If both interval (9.1b 'Minimum' and 9.1c 'Maximum') and a best single value (9.1d 'Best single value') are provided, field 9.2 'Type of estimate' should correspond to the more accurate estimate. This should be noted in 9.6 'Additional information'.
status: valid
status modified: 2019-04-16
accepted date: 2019-04-16
in scheme: CDR QaQc Birds Directive Article 12 Reporting
error type: WARNING

Mandatory information missing.
type: Concept
notation: B156
definition: The type of estimate for the population size within Natura 2000 network should be provided.
status: valid
status modified: 2019-04-16
accepted date: 2019-04-16
in scheme: CDR QaQc Birds Directive Article 12 Reporting
error type: ERROR

Invalid code.
type: Concept
notation: B157
definition: Please check the vocabulary methodsUsed.
status: valid
status modified: 2019-04-16
accepted date: 2019-04-16
in scheme: CDR QaQc Birds Directive Article 12 Reporting
error type: BLOCKER

Incoherent information.
type: Concept
notation: B158
definition: 9.2 Type of estimate should be empty when Population size inside the network Method used is 'AbsentData - Insufficient or no data available'. When the method is assessed as 'AbsentData - Insufficient or no data available', the type of estimate used for the population size cannot be defined. If you want to report an estimate based on a method using limited data, please select 'estimateExpert - Based mainly on expert opinion with very limited data' for the method used.
status: valid
status modified: 2019-04-16
accepted date: 2019-04-16
in scheme: CDR QaQc Birds Directive Article 12 Reporting
error type: WARNING

Mandatory information missing.
type: Concept
notation: B159
definition: The method should be provided. In case the information to be reported in this section is not available use 'AbsentData - Insufficient or no data available'.
status: valid
status modified: 2019-04-16
accepted date: 2019-04-16
in scheme: CDR QaQc Birds Directive Article 12 Reporting
error type: ERROR

Invalid code.
type: Concept
notation: B160
definition: Please check the vocabulary trends.
status: valid
status modified: 2019-04-16
accepted date: 2019-04-16
in scheme: CDR QaQc Birds Directive Article 12 Reporting
error type: BLOCKER

Mandatory information missing.
type: Concept
notation: B161
definition: The Trend should be provided. In case the information to be reported in this section is not available use 'Unk - unknown'.
status: valid
status modified: 2019-04-16
accepted date: 2019-04-16
in scheme: CDR QaQc Birds Directive Article 12 Reporting
error type: ERROR

Invalid code.
type: Concept
notation: B162
definition: Please check the vocabulary methodsUsed.
status: valid
status modified: 2019-04-16
accepted date: 2019-04-16
in scheme: CDR QaQc Birds Directive Article 12 Reporting
error type: BLOCKER

Incoherent information.
type: Concept
notation: B163
definition: Inconsistent values provided in fields 9.4 Short-term trend Direction and 9.5 Short-term trend Method used. When the method is assessed as 'AbsentData - Insufficient or no data available', the trend cannot be defined. If you want to report a trend as stable, increasing or decreasing based on a method using limited data, please select'?estimateExpert - Based mainly on expert opinion with very limited data' for the method used.
status: valid
status modified: 2019-04-16
accepted date: 2019-04-16
in scheme: CDR QaQc Birds Directive Article 12 Reporting
error type: WARNING

Mandatory information missing.
type: Concept
notation: B164
definition: The method should be provided. In case the information to be reported in this section is not available use 'AbsentData - Insufficient or no data available'.
status: valid
status modified: 2019-04-16
accepted date: 2019-04-16
in scheme: CDR QaQc Birds Directive Article 12 Reporting
error type: ERROR

Invalid code.
type: Concept
notation: B165
definition: Code should be 'Yes' or 'No'.
status: valid
status modified: 2019-04-16
accepted date: 2019-04-16
in scheme: CDR QaQc Birds Directive Article 12 Reporting
error type: BLOCKER

Incoherent information.
type: Concept
notation: B166
definition: This section is to report on Annex II species only.
status: valid
status modified: 2019-04-16
accepted date: 2019-04-16
in scheme: CDR QaQc Birds Directive Article 12 Reporting
error type: ERROR

Mandatory information missing.
type: Concept
notation: B167
definition: Indicate whether this Annex II species is nationally hunted. Report 'No' if the answer to the question: 'Is the species nationally hunted' is 'No'.
status: valid
status modified: 2019-04-16
accepted date: 2019-04-16
in scheme: CDR QaQc Birds Directive Article 12 Reporting
error type: ERROR

Invalid code.
type: Concept
notation: B168
definition: Please check the vocabulary populationUnits.
status: valid
status modified: 2019-04-16
accepted date: 2019-04-16
in scheme: CDR QaQc Birds Directive Article 12 Reporting
error type: ERROR

Incoherent information.
type: Concept
notation: B169
definition: The reported unit for hunting bag differs with the recommended unit 'i - number of individuals' defined in the reporting format.
status: valid
status modified: 2019-04-16
accepted date: 2019-04-16
in scheme: CDR QaQc Birds Directive Article 12 Reporting
error type: ERROR

Mandatory information missing.
type: Concept
notation: B170
definition: Population unit for hunting bag should be provided.
status: valid
status modified: 2019-04-16
accepted date: 2019-04-16
in scheme: CDR QaQc Birds Directive Article 12 Reporting
error type: ERROR

Min/max value should be provided systematically for all seasons.
type: Concept
notation: B171
definition: Min/max value should be provided systematically for all seasons. Report '0' if no hunting bag or there was a temporary ban.
status: valid
status modified: 2019-04-16
accepted date: 2019-04-16
in scheme: CDR QaQc Birds Directive Article 12 Reporting
error type: ERROR

Incoherent information.
type: Concept
notation: B172
definition: Only min/max or unknown value is expected for 10.2b1 Statistics/quantity per hunting season or year over the reporting period 'Season/year1'.
status: valid
status modified: 2019-04-16
accepted date: 2019-04-16
in scheme: CDR QaQc Birds Directive Article 12 Reporting
error type: ERROR

Mandatory information missing.
type: Concept
notation: B173
definition: Statistics/quantity per hunting season or year over the reporting period 'Season/year1' should be provided (10.2b1min, 10.2b1max, 10.2b1x).
status: valid
status modified: 2019-04-16
accepted date: 2019-04-16
in scheme: CDR QaQc Birds Directive Article 12 Reporting
error type: ERROR

Incorrect data format.
type: Concept
notation: B174
definition: Numeric field, only decimals greater or equal 0 are permitted.
status: valid
status modified: 2019-04-16
accepted date: 2019-04-16
in scheme: CDR QaQc Birds Directive Article 12 Reporting
error type: ERROR

Incorrect data format.
type: Concept
notation: B175
definition: Numeric field, only decimals greater or equal 0 are permitted.
status: valid
status modified: 2019-04-16
accepted date: 2019-04-16
in scheme: CDR QaQc Birds Directive Article 12 Reporting
error type: ERROR

10.2b1max Statistics/quantity on season/year 1- max should be greater or equal min.
type: Concept
notation: B176
status: valid
status modified: 2019-04-16
accepted date: 2019-04-16
in scheme: CDR QaQc Birds Directive Article 12 Reporting
error type: ERROR

Invalid code.
type: Concept
notation: B177
definition: Code should be 'Yes' or 'No'.
status: valid
status modified: 2019-04-16
accepted date: 2019-04-16
in scheme: CDR QaQc Birds Directive Article 12 Reporting
error type: ERROR

Incorrect data format.
type: Concept
notation: B178
definition: This field cannot be empty. Code should be 'Yes' or 'No'.
status: valid
status modified: 2019-04-16
accepted date: 2019-04-16
in scheme: CDR QaQc Birds Directive Article 12 Reporting
error type: ERROR

Min/max value should be provided systematically for all seasons.
type: Concept
notation: B179
definition: Min/max value should be provided systematically for all seasons. Report '0' if no hunting bag or there was a temporary ban.
status: valid
status modified: 2019-04-16
accepted date: 2019-04-16
in scheme: CDR QaQc Birds Directive Article 12 Reporting
error type: ERROR

Incoherent information.
type: Concept
notation: B180
definition: Only min/max or unknown value is expected for 10.2b2 Statistics/quantity per hunting season or year over the reporting period 'Season/year2'.
status: valid
status modified: 2019-04-16
accepted date: 2019-04-16
in scheme: CDR QaQc Birds Directive Article 12 Reporting
error type: ERROR

Mandatory information missing.
type: Concept
notation: B181
definition: Statistics/quantity per hunting season or year over the reporting period 'Season/year2' should be provided (10.2b2min, 10.2b2max, 10.2b2x).
status: valid
status modified: 2019-04-16
accepted date: 2019-04-16
in scheme: CDR QaQc Birds Directive Article 12 Reporting
error type: ERROR

Incorrect data format.
type: Concept
notation: B182
definition: Numeric field, only decimals greater or equal 0 are permitted.
status: valid
status modified: 2019-04-16
accepted date: 2019-04-16
in scheme: CDR QaQc Birds Directive Article 12 Reporting
error type: ERROR

Incorrect data format.
type: Concept
notation: B183
definition: Numeric field, only decimals greater or equal 0 are permitted.
status: valid
status modified: 2019-04-16
accepted date: 2019-04-16
in scheme: CDR QaQc Birds Directive Article 12 Reporting
error type: ERROR

10.2b2max Statistics/quantity on season/year 2- max should be greater or equal min.
type: Concept
notation: B184
status: valid
status modified: 2019-04-16
accepted date: 2019-04-16
in scheme: CDR QaQc Birds Directive Article 12 Reporting
error type: ERROR

Invalid code.
type: Concept
notation: B185
definition: Code should be 'Yes' or 'No'.
status: valid
status modified: 2019-04-16
accepted date: 2019-04-16
in scheme: CDR QaQc Birds Directive Article 12 Reporting
error type: ERROR

Incorrect data format.
type: Concept
notation: B186
definition: This field cannot be empty. Code should be 'Yes' or 'No'.
status: valid
status modified: 2019-04-16
accepted date: 2019-04-16
in scheme: CDR QaQc Birds Directive Article 12 Reporting
error type: ERROR

Min/max value should be provided systematically for all seasons.
type: Concept
notation: B187
definition: Min/max value should be provided systematically for all seasons. Report '0' if no hunting bag or there was a temporary ban.
status: valid
status modified: 2019-04-16
accepted date: 2019-04-16
in scheme: CDR QaQc Birds Directive Article 12 Reporting
error type: ERROR

Incoherent information.
type: Concept
notation: B188
definition: Only min/max or unknown value is expected for 10.2b3 Statistics/quantity per hunting season or year over the reporting period 'Season/year3'.
status: valid
status modified: 2019-04-16
accepted date: 2019-04-16
in scheme: CDR QaQc Birds Directive Article 12 Reporting
error type: ERROR

Mandatory information missing.
type: Concept
notation: B189
definition: Statistics/quantity per hunting season or year over the reporting period 'Season/year3' should be provided (10.2b3min, 10.2b3max, 10.2b3x).
status: valid
status modified: 2019-04-16
accepted date: 2019-04-16
in scheme: CDR QaQc Birds Directive Article 12 Reporting
error type: ERROR

Incorrect data format.
type: Concept
notation: B190
definition: Numeric field, only decimals greater or equal 0 are permitted.
status: valid
status modified: 2019-04-16
accepted date: 2019-04-16
in scheme: CDR QaQc Birds Directive Article 12 Reporting
error type: ERROR

Incorrect data format.
type: Concept
notation: B191
definition: Numeric field, only decimals greater or equal 0 are permitted.
status: valid
status modified: 2019-04-16
accepted date: 2019-04-16
in scheme: CDR QaQc Birds Directive Article 12 Reporting
error type: ERROR

10.2b3max Statistics/quantity on season/year 3 - max should be greater or equal min.
type: Concept
notation: B192
status: valid
status modified: 2019-04-16
accepted date: 2019-04-16
in scheme: CDR QaQc Birds Directive Article 12 Reporting
error type: ERROR

Invalid code.
type: Concept
notation: B193
definition: Code should be 'Yes' or 'No'.
status: valid
status modified: 2019-04-16
accepted date: 2019-04-16
in scheme: CDR QaQc Birds Directive Article 12 Reporting
error type: ERROR

Incorrect data format.
type: Concept
notation: B194
definition: This field cannot be empty. Code should be 'Yes' or 'No'.
status: valid
status modified: 2019-04-16
accepted date: 2019-04-16
in scheme: CDR QaQc Birds Directive Article 12 Reporting
error type: ERROR

Min/max value should be provided systematically for all seasons.
type: Concept
notation: B195
definition: Min/max value should be provided systematically for all seasons. Report '0' if no hunting bag or there was a temporary ban.
status: valid
status modified: 2019-04-16
accepted date: 2019-04-16
in scheme: CDR QaQc Birds Directive Article 12 Reporting
error type: ERROR

Incoherent information.
type: Concept
notation: B196
definition: Only min/max or unknown value is expected for 10.2b4 Statistics/quantity per hunting season or year over the reporting period 'Season/year4'.
status: valid
status modified: 2019-04-16
accepted date: 2019-04-16
in scheme: CDR QaQc Birds Directive Article 12 Reporting
error type: ERROR

Mandatory information missing.
type: Concept
notation: B197
definition: M Statistics/quantity per hunting season or year over the reporting period 'Season/year4' should be provided (10.2b4min, 10.2b4max, 10.2b4x).
status: valid
status modified: 2019-04-16
accepted date: 2019-04-16
in scheme: CDR QaQc Birds Directive Article 12 Reporting
error type: ERROR

Incorrect data format.
type: Concept
notation: B198
definition: Numeric field, only decimals greater or equal 0 are permitted.
status: valid
status modified: 2019-04-16
accepted date: 2019-04-16
in scheme: CDR QaQc Birds Directive Article 12 Reporting
error type: ERROR

Incorrect data format.
type: Concept
notation: B199
definition: Numeric field, only decimals greater or equal 0 are permitted.
status: valid
status modified: 2019-04-16
accepted date: 2019-04-16
in scheme: CDR QaQc Birds Directive Article 12 Reporting
error type: ERROR

10.2b4max Statistics/quantity on season/year 4 - max should be greater or equal min.
type: Concept
notation: B200
status: valid
status modified: 2019-04-16
accepted date: 2019-04-16
in scheme: CDR QaQc Birds Directive Article 12 Reporting
error type: ERROR

Invalid code.
type: Concept
notation: B201
definition: Code should be 'Yes' or 'No'.
status: valid
status modified: 2019-04-16
accepted date: 2019-04-16
in scheme: CDR QaQc Birds Directive Article 12 Reporting
error type: ERROR

Incorrect data format.
type: Concept
notation: B202
definition: This field cannot be empty. Code should be 'Yes' or 'No'.
status: valid
status modified: 2019-04-16
accepted date: 2019-04-16
in scheme: CDR QaQc Birds Directive Article 12 Reporting
error type: ERROR

Min/max value should be provided systematically for all seasons.
type: Concept
notation: B203
definition: Min/max value should be provided systematically for all seasons. Report '0' if no hunting bag or there was a temporary ban.
status: valid
status modified: 2019-04-16
accepted date: 2019-04-16
in scheme: CDR QaQc Birds Directive Article 12 Reporting
error type: ERROR

Incoherent information.
type: Concept
notation: B204
definition: Only min/max or unknown value is expected for 10.2b5 Statistics/quantity per hunting season or year over the reporting period 'Season/year5'.
status: valid
status modified: 2019-04-16
accepted date: 2019-04-16
in scheme: CDR QaQc Birds Directive Article 12 Reporting
error type: ERROR

Mandatory information missing.
type: Concept
notation: B205
definition: Statistics/quantity per hunting season or year over the reporting period 'Season/year5' should be provided (10.2b5min, 10.2b5max, 10.2b5x).
status: valid
status modified: 2019-04-16
accepted date: 2019-04-16
in scheme: CDR QaQc Birds Directive Article 12 Reporting
error type: ERROR

Incorrect data format.
type: Concept
notation: B206
definition: Numeric field, only decimals greater or equal 0 are permitted.
status: valid
status modified: 2019-04-16
accepted date: 2019-04-16
in scheme: CDR QaQc Birds Directive Article 12 Reporting
error type: ERROR

Incorrect data format.
type: Concept
notation: B207
definition: Numeric field, only decimals greater or equal 0 are permitted.
status: valid
status modified: 2019-04-16
accepted date: 2019-04-16
in scheme: CDR QaQc Birds Directive Article 12 Reporting
error type: ERROR

10.2b5max Statistics/quantity on season/year 5 - max should be greater or equal min.
type: Concept
notation: B208
status: valid
status modified: 2019-04-16
accepted date: 2019-04-16
in scheme: CDR QaQc Birds Directive Article 12 Reporting
error type: ERROR

Invalid code.
type: Concept
notation: B209
definition: Code should be 'Yes' or 'No'.
status: valid
status modified: 2019-04-16
accepted date: 2019-04-16
in scheme: CDR QaQc Birds Directive Article 12 Reporting
error type: ERROR

Incorrect data format.
type: Concept
notation: B210
definition: This field cannot be empty. Code should be 'Yes' or 'No'.
status: valid
status modified: 2019-04-16
accepted date: 2019-04-16
in scheme: CDR QaQc Birds Directive Article 12 Reporting
error type: ERROR

Min/max value should be provided systematically for all seasons.
type: Concept
notation: B211
definition: Min/max value should be provided systematically for all seasons. Report '0' if no hunting bag or there was a temporary ban.
status: valid
status modified: 2019-04-16
accepted date: 2019-04-16
in scheme: CDR QaQc Birds Directive Article 12 Reporting
error type: ERROR

Incoherent information.
type: Concept
notation: B212
definition: Only min/max or unknown value is expected for 10.2b6 Statistics/quantity per hunting season or year over the reporting period 'Season/year6'.
status: valid
status modified: 2019-04-16
accepted date: 2019-04-16
in scheme: CDR QaQc Birds Directive Article 12 Reporting
error type: ERROR

Mandatory information missing.
type: Concept
notation: B213
definition: Statistics/quantity per hunting season or year over the reporting period 'Season/year6' should be provided (10.2b6min, 10.2b6max, 10.2b6x).
status: valid
status modified: 2019-04-16
accepted date: 2019-04-16
in scheme: CDR QaQc Birds Directive Article 12 Reporting
error type: ERROR

Incorrect data format.
type: Concept
notation: B214
definition: Numeric field, only decimals greater or equal 0 are permitted.
status: valid
status modified: 2019-04-16
accepted date: 2019-04-16
in scheme: CDR QaQc Birds Directive Article 12 Reporting
error type: ERROR

Incorrect data format.
type: Concept
notation: B215
definition: Numeric field, only decimals greater or equal 0 are permitted.
status: valid
status modified: 2019-04-16
accepted date: 2019-04-16
in scheme: CDR QaQc Birds Directive Article 12 Reporting
error type: ERROR

10.2b6max Statistics/quantity on season/year 6 - max should be greater or equal min.
type: Concept
notation: B216
status: valid
status modified: 2019-04-16
accepted date: 2019-04-16
in scheme: CDR QaQc Birds Directive Article 12 Reporting
error type: ERROR

Invalid code.
type: Concept
notation: B217
definition: Code should be 'Yes' or 'No'.
status: valid
status modified: 2019-04-16
accepted date: 2019-04-16
in scheme: CDR QaQc Birds Directive Article 12 Reporting
error type: ERROR

Incorrect data format.
type: Concept
notation: B218
definition: This field cannot be empty. Code should be 'Yes' or 'No'.
status: valid
status modified: 2019-04-16
accepted date: 2019-04-16
in scheme: CDR QaQc Birds Directive Article 12 Reporting
error type: ERROR

Invalid code.
type: Concept
notation: B219
definition: Please check the vocabulary methodsUsed.
status: valid
status modified: 2019-04-16
accepted date: 2019-04-16
in scheme: CDR QaQc Birds Directive Article 12 Reporting
error type: BLOCKER

Mandatory information missing.
type: Concept
notation: B220
definition: The method should be provided. In case the information to be reported in this section is not available use 'AbsentData - Insufficient or no data available'.
status: valid
status modified: 2019-04-16
accepted date: 2019-04-16
in scheme: CDR QaQc Birds Directive Article 12 Reporting
error type: ERROR

Incoherent information.
type: Concept
notation: B221
definition: This section is to report on the species' national status in relation to objectives outlined in the SAPs/BMSs.
status: valid
status modified: 2019-04-16
accepted date: 2019-04-16
in scheme: CDR QaQc Birds Directive Article 12 Reporting
error type: ERROR

Mandatory information missing.
type: Concept
notation: B222
definition: Information on the species' national status in relation to objectives outlined in the SAPs/BMSs should be provided.
status: valid
status modified: 2019-04-16
accepted date: 2019-04-16
in scheme: CDR QaQc Birds Directive Article 12 Reporting
error type: ERROR

Incoherent information.
type: Concept
notation: B223
definition: This section is to report on the status of huntable species in non-Secure status, in relation to objectives outlined in the MPs.
status: valid
status modified: 2019-04-16
accepted date: 2019-04-16
in scheme: CDR QaQc Birds Directive Article 12 Reporting
error type: ERROR

Mandatory information missing.
type: Concept
notation: B224
definition: Information on the status of huntable species in non-Secure status, in relation to objectives outlined in the MPs should be provided.
status: valid
status modified: 2019-04-16
accepted date: 2019-04-16
in scheme: CDR QaQc Birds Directive Article 12 Reporting
error type: ERROR

Mandatory information missing.
type: Concept
notation: B225
definition: Source of information is expected.
status: valid
status modified: 2019-04-16
accepted date: 2019-04-16
in scheme: CDR QaQc Birds Directive Article 12 Reporting
error type: ERROR

Mandatory information missing.
type: Concept
notation: B226
definition: Source of information is expected.
status: valid
status modified: 2019-04-16
accepted date: 2019-04-16
in scheme: CDR QaQc Birds Directive Article 12 Reporting
error type: ERROR

Mandatory information missing.
type: Concept
notation: B227
definition: Source of information is expected.
status: valid
status modified: 2019-04-16
accepted date: 2019-04-16
in scheme: CDR QaQc Birds Directive Article 12 Reporting
error type: ERROR

Mandatory information missing.
type: Concept
notation: B228
definition: Source of information is expected.
status: valid
status modified: 2019-04-16
accepted date: 2019-04-16
in scheme: CDR QaQc Birds Directive Article 12 Reporting
error type: ERROR

Mandatory information missing.
type: Concept
notation: B229
definition: Source of information is expected.
status: valid
status modified: 2019-04-16
accepted date: 2019-04-16
in scheme: CDR QaQc Birds Directive Article 12 Reporting
error type: ERROR

Mandatory information missing.
type: Concept
notation: B230
definition: Source of information is expected.
status: valid
status modified: 2019-04-16
accepted date: 2019-04-16
in scheme: CDR QaQc Birds Directive Article 12 Reporting
error type: ERROR

Mandatory information missing.
type: Concept
notation: B231
definition: Source of information is expected.
status: valid
status modified: 2019-04-16
accepted date: 2019-04-16
in scheme: CDR QaQc Birds Directive Article 12 Reporting
error type: ERROR

Invalid code.
type: Concept
notation: B232
definition: Code should be 'Yes' or 'No'.
status: valid
status modified: 2019-04-16
accepted date: 2019-04-16
in scheme: CDR QaQc Birds Directive Article 12 Reporting
error type: BLOCKER

Mandatory information missing.
type: Concept
notation: B233
definition: Indicate whether information related to international plans is provided for the other season.
status: valid
status modified: 2019-04-16
accepted date: 2019-04-16
in scheme: CDR QaQc Birds Directive Article 12 Reporting
error type: ERROR

Invalid code.
type: Concept
notation: B234
definition: Code should be 'Yes' or 'No'.
status: valid
status modified: 2019-04-16
accepted date: 2019-04-16
in scheme: CDR QaQc Birds Directive Article 12 Reporting
error type: BLOCKER

Mandatory information missing.
type: Concept
notation: B235
definition: Indicate whether information related to Annex II species is provided for the other season.
status: valid
status modified: 2019-04-16
accepted date: 2019-04-16
in scheme: CDR QaQc Birds Directive Article 12 Reporting
error type: ERROR

Incoherent information.
type: Concept
notation: B236
definition: The best single value (2.2d) should not be less than the minimum (2.2b) or higher than the maximum (2.2c).
status: valid
status modified: 2019-04-16
accepted date: 2019-04-16
in scheme: CDR QaQc Birds Directive Article 12 Reporting
error type: WARNING

Incoherent information.
type: Concept
notation: B237
definition: The best single value (9.1d) should not be less than the minimum (9.1b) or higher than the maximum (9.1c).
status: valid
status modified: 2019-04-16
accepted date: 2019-04-16
in scheme: CDR QaQc Birds Directive Article 12 Reporting
error type: WARNING

Incoherent information.
type: Concept
notation: B238
definition: The trend direction is reported as 'D - decreasing'. At least one of the min, max or best single value should be negative.
status: valid
status modified: 2019-04-16
accepted date: 2019-04-16
in scheme: CDR QaQc Birds Directive Article 12 Reporting
error type: ERROR

Incoherent information.
type: Concept
notation: B239
definition: The trend direction is reported as 'D - decreasing'. At least one of the min, max or best single value should be negative.
status: valid
status modified: 2019-04-16
accepted date: 2019-04-16
in scheme: CDR QaQc Birds Directive Article 12 Reporting
error type: ERROR

Incoherent information.
type: Concept
notation: B240
definition: The trend direction is reported as 'D - decreasing'. At least one of the min, max or best single value should be negative.
status: valid
status modified: 2019-04-16
accepted date: 2019-04-16
in scheme: CDR QaQc Birds Directive Article 12 Reporting
error type: ERROR

Incoherent information.
type: Concept
notation: B241
definition: The trend direction is reported as 'D - decreasing'. At least one of the min, max or best single value should be negative.
status: valid
status modified: 2019-04-16
accepted date: 2019-04-16
in scheme: CDR QaQc Birds Directive Article 12 Reporting
error type: ERROR

Invalid code.
type: Concept
notation: GB001
definition: Please check the vocabulary countries.
status: valid
status modified: 2019-04-16
accepted date: 2019-04-16
in scheme: CDR QaQc Birds Directive Article 12 Reporting
error type: BLOCKER

Mandatory information missing.
type: Concept
notation: GB002
definition: The country code should be provided.
status: valid
status modified: 2019-04-16
accepted date: 2019-04-16
in scheme: CDR QaQc Birds Directive Article 12 Reporting
error type: BLOCKER

Invalid code.
type: Concept
notation: GB003
definition: Please check the vocabulary countries.
status: valid
status modified: 2019-04-16
accepted date: 2019-04-16
in scheme: CDR QaQc Birds Directive Article 12 Reporting
error type: BLOCKER

Mandatory information missing.
type: Concept
notation: GB004
definition: The country code should be provided.
status: valid
status modified: 2019-04-16
accepted date: 2019-04-16
in scheme: CDR QaQc Birds Directive Article 12 Reporting
error type: BLOCKER

Mandatory information missing.
type: Concept
notation: GB005
definition: Information on main achievements under the Birds Directive during the reporting period is expected.
status: valid
status modified: 2019-04-16
accepted date: 2019-04-16
in scheme: CDR QaQc Birds Directive Article 12 Reporting
error type: ERROR

Mandatory information missing.
type: Concept
notation: GB006
definition: Information related to the Birds Directive is expected.
status: valid
status modified: 2019-04-16
accepted date: 2019-04-16
in scheme: CDR QaQc Birds Directive Article 12 Reporting
error type: ERROR

Mandatory information missing.
type: Concept
notation: GB007
definition: General information on the network of SPAs is expected.
status: valid
status modified: 2019-04-16
accepted date: 2019-04-16
in scheme: CDR QaQc Birds Directive Article 12 Reporting
error type: ERROR

Mandatory information missing.
type: Concept
notation: GB008
definition: General information on monitoring is expected.
status: valid
status modified: 2019-04-16
accepted date: 2019-04-16
in scheme: CDR QaQc Birds Directive Article 12 Reporting
error type: ERROR

Mandatory information missing.
type: Concept
notation: GB009
definition: General information on species protection is expected.
status: valid
status modified: 2019-04-16
accepted date: 2019-04-16
in scheme: CDR QaQc Birds Directive Article 12 Reporting
error type: ERROR

Mandatory information missing.
type: Concept
notation: GB010
definition: General information on transposition of the Directive is expected.
status: valid
status modified: 2019-04-16
accepted date: 2019-04-16
in scheme: CDR QaQc Birds Directive Article 12 Reporting
error type: ERROR

Incorrect data format.
type: Concept
notation: GB011
definition: Numeric field, only integers greater or equal 0 are permitted.
status: valid
status modified: 2019-04-16
accepted date: 2019-04-16
in scheme: CDR QaQc Birds Directive Article 12 Reporting
error type: ERROR

Incoherent information.
type: Concept
notation: GB012
definition: The number of marine SPAs cannot be higher than the total number of SPAs.
status: valid
status modified: 2019-04-16
accepted date: 2019-04-16
in scheme: CDR QaQc Birds Directive Article 12 Reporting
error type: ERROR

Mandatory information missing.
type: Concept
notation: GB013
definition: The total number of SPAs should be provided.
status: valid
status modified: 2019-04-16
accepted date: 2019-04-16
in scheme: CDR QaQc Birds Directive Article 12 Reporting
error type: ERROR

Incorrect data format.
type: Concept
notation: GB014
definition: Numeric field, only decimals greater or equal 0 are permitted.
status: valid
status modified: 2019-04-16
accepted date: 2019-04-16
in scheme: CDR QaQc Birds Directive Article 12 Reporting
error type: ERROR

Incoherent information.
type: Concept
notation: GB015
definition: The surface area of terrestrial SPAs cannot be higher than the surface area of all SPAs.
status: valid
status modified: 2019-04-16
accepted date: 2019-04-16
in scheme: CDR QaQc Birds Directive Article 12 Reporting
error type: ERROR

Incoherent information.
type: Concept
notation: GB016
definition: The surface area of marine SPAs cannot be higher than the surface area of all SPAs.
status: valid
status modified: 2019-04-16
accepted date: 2019-04-16
in scheme: CDR QaQc Birds Directive Article 12 Reporting
error type: ERROR

Incoherent information.
type: Concept
notation: GB017
definition: The surface area of terrestrial SPAs plus the surface area of marine SPAs together should give the surface area of all SPAs.
status: valid
status modified: 2019-04-16
accepted date: 2019-04-16
in scheme: CDR QaQc Birds Directive Article 12 Reporting
error type: ERROR

Mandatory information missing.
type: Concept
notation: GB018
definition: The surface area of all SPAs should be provided.
status: valid
status modified: 2019-04-16
accepted date: 2019-04-16
in scheme: CDR QaQc Birds Directive Article 12 Reporting
error type: ERROR

Incorrect data format.
type: Concept
notation: GB019
definition: Numeric field, only decimals greater or equal 0 are permitted.
status: valid
status modified: 2019-04-16
accepted date: 2019-04-16
in scheme: CDR QaQc Birds Directive Article 12 Reporting
error type: ERROR

Mandatory information missing.
type: Concept
notation: GB020
definition: The surface area of terrestrial SPAs should be provided.
status: valid
status modified: 2019-04-16
accepted date: 2019-04-16
in scheme: CDR QaQc Birds Directive Article 12 Reporting
error type: ERROR

Incorrect data format.
type: Concept
notation: GB021
definition: Numeric field, only integers greater or equal 0 are permitted.
status: valid
status modified: 2019-04-16
accepted date: 2019-04-16
in scheme: CDR QaQc Birds Directive Article 12 Reporting
error type: ERROR

Mandatory information missing.
type: Concept
notation: GB022
definition: The total number of marine SPAs should be provided.
status: valid
status modified: 2019-04-16
accepted date: 2019-04-16
in scheme: CDR QaQc Birds Directive Article 12 Reporting
error type: ERROR

Incorrect data format.
type: Concept
notation: GB023
definition: Numeric field, only decimals greater or equal 0 are permitted.
status: valid
status modified: 2019-04-16
accepted date: 2019-04-16
in scheme: CDR QaQc Birds Directive Article 12 Reporting
error type: ERROR

Mandatory information missing.
type: Concept
notation: GB024
definition: The surface area of marine SPAs should be provided.
status: valid
status modified: 2019-04-16
accepted date: 2019-04-16
in scheme: CDR QaQc Birds Directive Article 12 Reporting
error type: ERROR

Mandatory information missing.
type: Concept
notation: GB025
definition: The date of the last database delivered during the reporting period (2013 - 2018) is expected. Supply this information in the [DD]-MM-YYYY format.
status: valid
status modified: 2019-04-16
accepted date: 2019-04-16
in scheme: CDR QaQc Birds Directive Article 12 Reporting
error type: ERROR

Incorrect data format.
type: Concept
notation: GB026
definition: Numeric field, only integers greater or equal 0 are permitted.
status: valid
status modified: 2019-04-16
accepted date: 2019-04-16
in scheme: CDR QaQc Birds Directive Article 12 Reporting
error type: ERROR

Mandatory information missing.
type: Concept
notation: GB027
definition: The total number of SPAs for which necessary conservation measures have been established should be provided.
status: valid
status modified: 2019-04-16
accepted date: 2019-04-16
in scheme: CDR QaQc Birds Directive Article 12 Reporting
error type: ERROR

Incorrect data format.
type: Concept
notation: GB028
definition: Numeric field, only decimals greater or equal 0 are permitted.
status: valid
status modified: 2019-04-16
accepted date: 2019-04-16
in scheme: CDR QaQc Birds Directive Article 12 Reporting
error type: ERROR

Incoherent information.
type: Concept
notation: GB029
definition: The proportion of the network area for which necessary conservation measures have been established should be between 0 and 100 %.
status: valid
status modified: 2019-04-16
accepted date: 2019-04-16
in scheme: CDR QaQc Birds Directive Article 12 Reporting
error type: ERROR

Mandatory information missing.
type: Concept
notation: GB030
definition: The proportion of the network area for which necessary conservation measures have been established should be provided.
status: valid
status modified: 2019-04-16
accepted date: 2019-04-16
in scheme: CDR QaQc Birds Directive Article 12 Reporting
error type: ERROR

Incorrect data format.
type: Concept
notation: GB031
definition: Numeric field, only integers greater or equal 0 are permitted.
status: valid
status modified: 2019-04-16
accepted date: 2019-04-16
in scheme: CDR QaQc Birds Directive Article 12 Reporting
error type: ERROR

Mandatory information missing.
type: Concept
notation: GB032
definition: The total number of SPAs for which a comprehensive management plan or a similar instrument is in place should be provided.
status: valid
status modified: 2019-04-16
accepted date: 2019-04-16
in scheme: CDR QaQc Birds Directive Article 12 Reporting
error type: ERROR

Incorrect data format.
type: Concept
notation: GB033
definition: Numeric field, only decimals greater or equal 0 are permitted.
status: valid
status modified: 2019-04-16
accepted date: 2019-04-16
in scheme: CDR QaQc Birds Directive Article 12 Reporting
error type: ERROR

Incoherent information.
type: Concept
notation: GB034
definition: The proportion of the network area for which a comprehensive management plan or a similar instrument is in place should be between 0 and 100 %.
status: valid
status modified: 2019-04-16
accepted date: 2019-04-16
in scheme: CDR QaQc Birds Directive Article 12 Reporting
error type: ERROR

Mandatory information missing.
type: Concept
notation: GB035
definition: The proportion of the network area for which a comprehensive management plan or a similar instrument is in place should be provided.
status: valid
status modified: 2019-04-16
accepted date: 2019-04-16
in scheme: CDR QaQc Birds Directive Article 12 Reporting
error type: ERROR

Incorrect data format.
type: Concept
notation: GB036
definition: The site code should contain 9 characters (letters and numbers).
status: valid
status modified: 2019-04-16
accepted date: 2019-04-16
in scheme: CDR QaQc Birds Directive Article 12 Reporting
error type: WARNING

Incoherent information.
type: Concept
notation: GB037
definition: The site name should be provided in addition to the sitecode.
status: valid
status modified: 2019-04-16
accepted date: 2019-04-16
in scheme: CDR QaQc Birds Directive Article 12 Reporting
error type: ERROR

Incoherent information.
type: Concept
notation: GB038
definition: The title of project/plan should be provided.
status: valid
status modified: 2019-04-16
accepted date: 2019-04-16
in scheme: CDR QaQc Birds Directive Article 12 Reporting
error type: ERROR

Incoherent information.
type: Concept
notation: GB039
definition: The year when Commission was informed about compensatory measures should be provided.
status: valid
status modified: 2019-04-16
accepted date: 2019-04-16
in scheme: CDR QaQc Birds Directive Article 12 Reporting
error type: ERROR

Incoherent information.
type: Concept
notation: GB040
definition: The year when project/plan was started to be implemented should be provided.
status: valid
status modified: 2019-04-16
accepted date: 2019-04-16
in scheme: CDR QaQc Birds Directive Article 12 Reporting
error type: ERROR

Incoherent information.
type: Concept
notation: GB041
definition: The year of publication should be provided.
status: valid
status modified: 2019-04-16
accepted date: 2019-04-16
in scheme: CDR QaQc Birds Directive Article 12 Reporting
error type: ERROR

Incoherent information.
type: Concept
notation: GB042
definition: Web-link and/or bibliographic reference should be provided.
status: valid
status modified: 2019-04-16
accepted date: 2019-04-16
in scheme: CDR QaQc Birds Directive Article 12 Reporting
error type: ERROR

Incoherent information.
type: Concept
notation: GB043
definition: The year of publication should be provided.
status: valid
status modified: 2019-04-16
accepted date: 2019-04-16
in scheme: CDR QaQc Birds Directive Article 12 Reporting
error type: ERROR

Incoherent information.
type: Concept
notation: GB044
definition: Web-link and/or bibliographic reference should be provided.
status: valid
status modified: 2019-04-16
accepted date: 2019-04-16
in scheme: CDR QaQc Birds Directive Article 12 Reporting
error type: ERROR

Incoherent information.
type: Concept
notation: GB045
definition: The year of publication should be provided.
status: valid
status modified: 2019-04-16
accepted date: 2019-04-16
in scheme: CDR QaQc Birds Directive Article 12 Reporting
error type: ERROR

Incoherent information.
type: Concept
notation: GB046
definition: Web-link and/or bibliographic reference should be provided.
status: valid
status modified: 2019-04-16
accepted date: 2019-04-16
in scheme: CDR QaQc Birds Directive Article 12 Reporting
error type: ERROR

Incoherent information.
type: Concept
notation: GB047
definition: The year of publication should be provided.
status: valid
status modified: 2019-04-16
accepted date: 2019-04-16
in scheme: CDR QaQc Birds Directive Article 12 Reporting
error type: ERROR

Incoherent information.
type: Concept
notation: GB048
definition: Web-link and/or bibliographic reference should be provided.
status: valid
status modified: 2019-04-16
accepted date: 2019-04-16
in scheme: CDR QaQc Birds Directive Article 12 Reporting
error type: ERROR

Incoherent information.
type: Concept
notation: GB049
definition: Main contents of legal decision for introduction should be provided.
status: valid
status modified: 2019-04-16
accepted date: 2019-04-16
in scheme: CDR QaQc Birds Directive Article 12 Reporting
error type: ERROR

Incoherent information.
type: Concept
notation: GB050
definition: The date of consultation with the Commission should be provided.
status: valid
status modified: 2019-04-16
accepted date: 2019-04-16
in scheme: CDR QaQc Birds Directive Article 12 Reporting
error type: ERROR

Code for Member States and for sub-national regions
type: ConceptScheme
notation: countries
is part of: Birds directive Art. 12 reporting in year 2018
registration status: Public draft
user modified: roschsab
date modified: 2019-03-04 07:56:22.0
vocabulary type: Common
is numeric concept identifiers: false
is notations equal identifiers: false

Austria
type: Concept
notation: AT
status: valid
status modified: 2017-07-27
accepted date: 2017-07-27
in scheme: Code for Member States and for sub-national regions

Belgium
type: Concept
notation: BE
status: valid
status modified: 2017-07-27
accepted date: 2017-07-27
in scheme: Code for Member States and for sub-national regions

Bulgaria
type: Concept
notation: BG
status: valid
status modified: 2017-07-27
accepted date: 2017-07-27
in scheme: Code for Member States and for sub-national regions

Cyprus
type: Concept
notation: CY
status: valid
status modified: 2017-07-27
accepted date: 2017-07-27
in scheme: Code for Member States and for sub-national regions

Czechia
type: Concept
notation: CZ
status: valid
status modified: 2017-07-27
accepted date: 2017-07-27
in scheme: Code for Member States and for sub-national regions

Germany
type: Concept
notation: DE
status: valid
status modified: 2017-07-27
accepted date: 2017-07-27
in scheme: Code for Member States and for sub-national regions

Denmark
type: Concept
notation: DK
status: valid
status modified: 2017-07-27
accepted date: 2017-07-27
in scheme: Code for Member States and for sub-national regions

Estonia
type: Concept
notation: EE
status: valid
status modified: 2017-07-27
accepted date: 2017-07-27
in scheme: Code for Member States and for sub-national regions

Spain
type: Concept
notation: ES
status: valid
status modified: 2017-07-27
accepted date: 2017-07-27
in scheme: Code for Member States and for sub-national regions

Spain: Canary Islands
type: Concept
notation: ESIC
status: valid
status modified: 2017-10-12
in scheme: Code for Member States and for sub-national regions

Finland
type: Concept
notation: FI
status: valid
status modified: 2017-07-27
accepted date: 2017-07-27
in scheme: Code for Member States and for sub-national regions

France
type: Concept
notation: FR
status: valid
status modified: 2017-07-27
accepted date: 2017-07-27
in scheme: Code for Member States and for sub-national regions

United Kingdom: Gibraltar
type: Concept
notation: GIB
status: valid
status modified: 2017-10-12
in scheme: Code for Member States and for sub-national regions

Greece
type: Concept
notation: GR
status: valid
status modified: 2017-07-27
accepted date: 2017-07-27
in scheme: Code for Member States and for sub-national regions

Croatia
type: Concept
notation: HR
status: valid
status modified: 2017-07-27
accepted date: 2017-07-27
in scheme: Code for Member States and for sub-national regions

Hungary
type: Concept
notation: HU
status: valid
status modified: 2017-07-27
accepted date: 2017-07-27
in scheme: Code for Member States and for sub-national regions

Ireland
type: Concept
notation: IE
status: valid
status modified: 2017-07-27
accepted date: 2017-07-27
in scheme: Code for Member States and for sub-national regions

Italy
type: Concept
notation: IT
status: valid
status modified: 2017-07-27
accepted date: 2017-07-27
in scheme: Code for Member States and for sub-national regions

Lithuania
type: Concept
notation: LT
status: valid
status modified: 2017-07-27
accepted date: 2017-07-27
in scheme: Code for Member States and for sub-national regions

Luxembourg
type: Concept
notation: LU
status: valid
status modified: 2017-07-27
accepted date: 2017-07-27
in scheme: Code for Member States and for sub-national regions

Latvia
type: Concept
notation: LV
status: valid
status modified: 2017-07-27
accepted date: 2017-07-27
in scheme: Code for Member States and for sub-national regions

Malta
type: Concept
notation: MT
status: valid
status modified: 2017-07-27
accepted date: 2017-07-27
in scheme: Code for Member States and for sub-national regions

Netherlands
type: Concept
notation: NL
status: valid
status modified: 2017-07-27
accepted date: 2017-07-27
in scheme: Code for Member States and for sub-national regions

Poland
type: Concept
notation: PL
status: valid
status modified: 2017-07-27
accepted date: 2017-07-27
in scheme: Code for Member States and for sub-national regions

Portugal
type: Concept
notation: PT
status: valid
status modified: 2017-07-27
accepted date: 2017-07-27
in scheme: Code for Member States and for sub-national regions

Portugal: Azores
type: Concept
notation: PTAC
status: valid
status modified: 2017-10-12
in scheme: Code for Member States and for sub-national regions

Portugal: Madeira
type: Concept
notation: PTMA
status: valid
status modified: 2017-10-12
in scheme: Code for Member States and for sub-national regions

Romania
type: Concept
notation: RO
status: valid
status modified: 2017-07-27
accepted date: 2017-07-27
in scheme: Code for Member States and for sub-national regions

Sweden
type: Concept
notation: SE
status: valid
status modified: 2017-07-27
accepted date: 2017-07-27
in scheme: Code for Member States and for sub-national regions

Slovenia
type: Concept
notation: SI
status: valid
status modified: 2017-07-27
accepted date: 2017-07-27
in scheme: Code for Member States and for sub-national regions

Slovakia
type: Concept
notation: SK
status: valid
status modified: 2017-07-27
accepted date: 2017-07-27
in scheme: Code for Member States and for sub-national regions

United Kingdom
type: Concept
notation: UK
status: valid
status modified: 2017-07-27
accepted date: 2017-07-27
in scheme: Code for Member States and for sub-national regions

Assessment of the effectiveness of MPs for huntable species in non-Secure status (Articles 3 and 7, Management Plans)
type: ConceptScheme
notation: effectivenessMPs
is part of: Birds directive Art. 12 reporting in year 2018
registration status: Public draft
user modified: roschsab
date modified: 2017-10-16 20:28:25.0
vocabulary type: Common
is numeric concept identifiers: false
is notations equal identifiers: false

further deteriorating
type: Concept
notation: deteriorating
status: valid
status modified: 2017-10-12
in scheme: Assessment of the effectiveness of MPs for huntable species in non-Secure status (Articles 3 and 7, Management Plans)

improving
type: Concept
notation: improving
status: valid
status modified: 2017-10-12
in scheme: Assessment of the effectiveness of MPs for huntable species in non-Secure status (Articles 3 and 7, Management Plans)

unchanged
type: Concept
notation: unchanged
status: valid
status modified: 2017-10-12
in scheme: Assessment of the effectiveness of MPs for huntable species in non-Secure status (Articles 3 and 7, Management Plans)

Assessment of the effectiveness of SAPs for globally threatened species (Art. 12, Species Action Plans)
type: ConceptScheme
notation: effectivenessSAPs
is part of: Birds directive Art. 12 reporting in year 2018
registration status: Public draft
user modified: roschsab
date modified: 2017-10-16 20:29:30.0
vocabulary type: Common
is numeric concept identifiers: false
is notations equal identifiers: false

further deteriorating away from the plan’s aim/objective(s)
type: Concept
notation: deteriorating
status: valid
status modified: 2017-10-12
in scheme: Assessment of the effectiveness of SAPs for globally threatened species (Art. 12, Species Action Plans)

moving towards the plan's aim/objective(s)
type: Concept
notation: towards
status: valid
status modified: 2017-10-12
in scheme: Assessment of the effectiveness of SAPs for globally threatened species (Art. 12, Species Action Plans)

unchanged
type: Concept
notation: unchanged
status: valid
status modified: 2017-10-12
in scheme: Assessment of the effectiveness of SAPs for globally threatened species (Art. 12, Species Action Plans)

Keywintering species
type: ConceptScheme
notation: keywinteringSpecies
is part of: Birds directive Art. 12 reporting in year 2018
registration status: Public draft
user modified: roschsab
date modified: 2017-12-19 12:03:29.0
vocabulary type: Common
is numeric concept identifiers: false
is notations equal identifiers: false

Gavia stellata
type: Concept
notation: A001
status: valid
status modified: 2017-12-19
accepted date: 2017-12-19
in scheme: Keywintering species

Gavia arctica
type: Concept
notation: A002
status: valid
status modified: 2017-12-19
accepted date: 2017-12-19
in scheme: Keywintering species

Gavia immer
type: Concept
notation: A003
status: valid
status modified: 2017-12-19
accepted date: 2017-12-19
in scheme: Keywintering species

Tachybaptus ruficollis
type: Concept
notation: A004
status: valid
status modified: 2017-12-19
accepted date: 2017-12-19
in scheme: Keywintering species

Podiceps cristatus
type: Concept
notation: A005
status: valid
status modified: 2017-12-19
accepted date: 2017-12-19
in scheme: Keywintering species

Podiceps auritus
type: Concept
notation: A007
status: valid
status modified: 2017-12-19
accepted date: 2017-12-19
in scheme: Keywintering species

Podiceps nigricollis
type: Concept
notation: A008
status: valid
status modified: 2017-12-19
accepted date: 2017-12-19
in scheme: Keywintering species

Pelecanus crispus
type: Concept
notation: A020
status: valid
status modified: 2017-12-19
accepted date: 2017-12-19
in scheme: Keywintering species

Egretta garzetta
type: Concept
notation: A026
status: valid
status modified: 2017-12-19
accepted date: 2017-12-19
in scheme: Keywintering species

Platalea leucorodia
type: Concept
notation: A034
status: valid
status modified: 2017-12-19
accepted date: 2017-12-19
in scheme: Keywintering species

Cygnus olor
type: Concept
notation: A036
status: valid
status modified: 2017-12-19
accepted date: 2017-12-19
in scheme: Keywintering species

Cygnus columbianus bewickii
type: Concept
notation: A037
status: valid
status modified: 2017-12-19
accepted date: 2017-12-19
in scheme: Keywintering species

Cygnus cygnus
type: Concept
notation: A038
status: valid
status modified: 2017-12-19
accepted date: 2017-12-19
in scheme: Keywintering species

Anser brachyrhynchus | Svalbard/North-west Europe
type: Concept
notation: A040-A
status: valid
status modified: 2017-12-19
accepted date: 2017-12-19
in scheme: Keywintering species

Anser brachyrhynchus | East Greenland & Iceland/UK
type: Concept
notation: A040-B
status: valid
status modified: 2017-12-19
accepted date: 2017-12-19
in scheme: Keywintering species

Anser erythropus
type: Concept
notation: A042
status: valid
status modified: 2017-12-19
accepted date: 2017-12-19
in scheme: Keywintering species

Anser anser
type: Concept
notation: A043
status: valid
status modified: 2017-12-19
accepted date: 2017-12-19
in scheme: Keywintering species

Branta leucopsis | East Greenland/Scotland & Ireland
type: Concept
notation: A045-A
status: valid
status modified: 2017-12-19
accepted date: 2017-12-19
in scheme: Keywintering species

Branta leucopsis | Svalbard/South-west Scotland
type: Concept
notation: A045-B
status: valid
status modified: 2017-12-19
accepted date: 2017-12-19
in scheme: Keywintering species

Branta leucopsis | Russia/Germany & Netherlands
type: Concept
notation: A045-C
status: valid
status modified: 2017-12-19
accepted date: 2017-12-19
in scheme: Keywintering species

Tadorna tadorna
type: Concept
notation: A048
status: valid
status modified: 2017-12-19
accepted date: 2017-12-19
in scheme: Keywintering species

Anas crecca
type: Concept
notation: A052
status: valid
status modified: 2017-12-19
accepted date: 2017-12-19
in scheme: Keywintering species

Anas platyrhynchos
type: Concept
notation: A053
status: valid
status modified: 2017-12-19
accepted date: 2017-12-19
in scheme: Keywintering species

Anas acuta
type: Concept
notation: A054
status: valid
status modified: 2017-12-19
accepted date: 2017-12-19
in scheme: Keywintering species

Marmaronetta angustirostris
type: Concept
notation: A057
status: valid
status modified: 2017-12-19
accepted date: 2017-12-19
in scheme: Keywintering species

Netta rufina
type: Concept
notation: A058
status: valid
status modified: 2017-12-19
accepted date: 2017-12-19
in scheme: Keywintering species

Aythya ferina
type: Concept
notation: A059
status: valid
status modified: 2017-12-19
accepted date: 2017-12-19
in scheme: Keywintering species

Aythya fuligula
type: Concept
notation: A061
status: valid
status modified: 2017-12-19
accepted date: 2017-12-19
in scheme: Keywintering species

Aythya marila
type: Concept
notation: A062
status: valid
status modified: 2017-12-19
accepted date: 2017-12-19
in scheme: Keywintering species

Somateria mollissima
type: Concept
notation: A063
status: valid
status modified: 2017-12-19
accepted date: 2017-12-19
in scheme: Keywintering species

Clangula hyemalis
type: Concept
notation: A064
status: valid
status modified: 2017-12-19
accepted date: 2017-12-19
in scheme: Keywintering species

Melanitta fusca
type: Concept
notation: A066
status: valid
status modified: 2017-12-19
accepted date: 2017-12-19
in scheme: Keywintering species

Bucephala clangula
type: Concept
notation: A067
status: valid
status modified: 2017-12-19
accepted date: 2017-12-19
in scheme: Keywintering species

Mergus serrator
type: Concept
notation: A069
status: valid
status modified: 2017-12-19
accepted date: 2017-12-19
in scheme: Keywintering species

Mergus merganser
type: Concept
notation: A070
status: valid
status modified: 2017-12-19
accepted date: 2017-12-19
in scheme: Keywintering species

Oxyura leucocephala
type: Concept
notation: A071
status: valid
status modified: 2017-12-19
accepted date: 2017-12-19
in scheme: Keywintering species

Fulica atra
type: Concept
notation: A125
status: valid
status modified: 2017-12-19
accepted date: 2017-12-19
in scheme: Keywintering species

Fulica cristata
type: Concept
notation: A126
status: valid
status modified: 2017-12-19
accepted date: 2017-12-19
in scheme: Keywintering species

Grus grus
type: Concept
notation: A127
status: valid
status modified: 2017-12-19
accepted date: 2017-12-19
in scheme: Keywintering species

Haematopus ostralegus
type: Concept
notation: A130
status: valid
status modified: 2017-12-19
accepted date: 2017-12-19
in scheme: Keywintering species

Recurvirostra avosetta
type: Concept
notation: A132
status: valid
status modified: 2017-12-19
accepted date: 2017-12-19
in scheme: Keywintering species

Charadrius hiaticula
type: Concept
notation: A137
status: valid
status modified: 2017-12-19
accepted date: 2017-12-19
in scheme: Keywintering species

Charadrius alexandrinus
type: Concept
notation: A138
status: valid
status modified: 2017-12-19
accepted date: 2017-12-19
in scheme: Keywintering species

Pluvialis apricaria
type: Concept
notation: A140
status: valid
status modified: 2017-12-19
accepted date: 2017-12-19
in scheme: Keywintering species

Pluvialis squatarola
type: Concept
notation: A141
status: valid
status modified: 2017-12-19
accepted date: 2017-12-19
in scheme: Keywintering species

Vanellus vanellus
type: Concept
notation: A142
status: valid
status modified: 2017-12-19
accepted date: 2017-12-19
in scheme: Keywintering species

Calidris canutus
type: Concept
notation: A143
status: valid
status modified: 2017-12-19
accepted date: 2017-12-19
in scheme: Keywintering species

Calidris alba
type: Concept
notation: A144
status: valid
status modified: 2017-12-19
accepted date: 2017-12-19
in scheme: Keywintering species

Calidris minuta
type: Concept
notation: A145
status: valid
status modified: 2017-12-19
accepted date: 2017-12-19
in scheme: Keywintering species

Calidris ferruginea
type: Concept
notation: A147
status: valid
status modified: 2017-12-19
accepted date: 2017-12-19
in scheme: Keywintering species

Calidris maritima
type: Concept
notation: A148
status: valid
status modified: 2017-12-19
accepted date: 2017-12-19
in scheme: Keywintering species

Calidris alpina | all non-breeding populations
type: Concept
notation: A149
status: valid
status modified: 2017-12-19
accepted date: 2017-12-19
in scheme: Keywintering species

Limosa limosa | all non-breeding populations
type: Concept
notation: A156
status: valid
status modified: 2017-12-19
accepted date: 2017-12-19
in scheme: Keywintering species

Limosa lapponica
type: Concept
notation: A157
status: valid
status modified: 2017-12-19
accepted date: 2017-12-19
in scheme: Keywintering species

Numenius tenuirostris
type: Concept
notation: A159
status: valid
status modified: 2017-12-19
accepted date: 2017-12-19
in scheme: Keywintering species

Tringa totanus
type: Concept
notation: A162
status: valid
status modified: 2017-12-19
accepted date: 2017-12-19
in scheme: Keywintering species

Arenaria interpres
type: Concept
notation: A169
status: valid
status modified: 2017-12-19
accepted date: 2017-12-19
in scheme: Keywintering species

Larus glaucoides
type: Concept
notation: A185
status: valid
status modified: 2017-12-19
accepted date: 2017-12-19
in scheme: Keywintering species

Larus hyperboreus
type: Concept
notation: A186
status: valid
status modified: 2017-12-19
accepted date: 2017-12-19
in scheme: Keywintering species

Alle alle
type: Concept
notation: A203
status: valid
status modified: 2017-12-19
accepted date: 2017-12-19
in scheme: Keywintering species

Phalacrocorax carbo sinensis
type: Concept
notation: A391
status: valid
status modified: 2017-12-19
accepted date: 2017-12-19
in scheme: Keywintering species

Anser albifrons albifrons
type: Concept
notation: A394
status: valid
status modified: 2017-12-19
accepted date: 2017-12-19
in scheme: Keywintering species

Anser albifrons flavirostris
type: Concept
notation: A395
status: valid
status modified: 2017-12-19
accepted date: 2017-12-19
in scheme: Keywintering species

Branta ruficollis
type: Concept
notation: A396
status: valid
status modified: 2017-12-19
accepted date: 2017-12-19
in scheme: Keywintering species

Polysticta stelleri
type: Concept
notation: A506
status: valid
status modified: 2017-12-19
accepted date: 2017-12-19
in scheme: Keywintering species

Charadrius leschenaultii
type: Concept
notation: A516
status: valid
status modified: 2017-12-19
accepted date: 2017-12-19
in scheme: Keywintering species

Oenanthe finschii
type: Concept
notation: A532
status: valid
status modified: 2017-12-19
accepted date: 2017-12-19
in scheme: Keywintering species

Phoenicopterus roseus
type: Concept
notation: A663
status: valid
status modified: 2017-12-19
accepted date: 2017-12-19
in scheme: Keywintering species

Branta bernicla hrota | Canada & Greenland/Ireland
type: Concept
notation: A674-A
status: valid
status modified: 2017-12-19
accepted date: 2017-12-19
in scheme: Keywintering species

Branta bernicla hrota | Svalbard/Denmark & UK
type: Concept
notation: A674-B
status: valid
status modified: 2017-12-19
accepted date: 2017-12-19
in scheme: Keywintering species

Branta bernicla bernicla
type: Concept
notation: A675
status: valid
status modified: 2017-12-19
accepted date: 2017-12-19
in scheme: Keywintering species

Phalacrocorax carbo carbo
type: Concept
notation: A683
status: valid
status modified: 2017-12-19
accepted date: 2017-12-19
in scheme: Keywintering species

Anser fabalis fabalis
type: Concept
notation: A701
status: valid
status modified: 2017-12-19
accepted date: 2017-12-19
in scheme: Keywintering species

Anser fabalis rossicus
type: Concept
notation: A702
status: valid
status modified: 2017-12-19
accepted date: 2017-12-19
in scheme: Keywintering species

Vanellus spinosus
type: Concept
notation: A728
status: valid
status modified: 2017-12-19
accepted date: 2017-12-19
in scheme: Keywintering species

Numenius arquata orientalis
type: Concept
notation: A730
status: valid
status modified: 2017-12-19
accepted date: 2017-12-19
in scheme: Keywintering species

Mergellus albellus
type: Concept
notation: A767
status: valid
status modified: 2017-12-19
accepted date: 2017-12-19
in scheme: Keywintering species

Numenius arquata arquata
type: Concept
notation: A768
status: valid
status modified: 2017-12-19
accepted date: 2017-12-19
in scheme: Keywintering species

Ardea alba
type: Concept
notation: A773
status: valid
status modified: 2017-12-19
accepted date: 2017-12-19
in scheme: Keywintering species

Larus armenicus
type: Concept
notation: A798
status: valid
status modified: 2017-12-19
accepted date: 2017-12-19
in scheme: Keywintering species

Mareca penelope
type: Concept
notation: A855
status: valid
status modified: 2017-12-19
accepted date: 2017-12-19
in scheme: Keywintering species

Spatula clypeata
type: Concept
notation: A857
status: valid
status modified: 2017-12-19
accepted date: 2017-12-19
in scheme: Keywintering species

Clanga clanga
type: Concept
notation: A859
status: valid
status modified: 2017-12-19
accepted date: 2017-12-19
in scheme: Keywintering species

Microcarbo pygmaeus
type: Concept
notation: A875
status: valid
status modified: 2017-12-19
accepted date: 2017-12-19
in scheme: Keywintering species

Mareca strepera
type: Concept
notation: A889
status: valid
status modified: 2017-12-19
accepted date: 2017-12-19
in scheme: Keywintering species

Melanitta nigra s. str. | sensu stricto [excluding americana]
type: Concept
notation: A900
status: valid
status modified: 2017-12-19
accepted date: 2017-12-19
in scheme: Keywintering species

Conservation measures
type: ConceptScheme
notation: measures
is part of: Birds directive Art. 12 reporting in year 2018
registration status: Public draft
user modified: roschsab
date modified: 2018-05-14 15:57:34.0
vocabulary type: Common
is numeric concept identifiers: false
is notations equal identifiers: false

Prevent conversion of natural and semi-natural habitats, and habitats of species into agricultural land
type: Concept
notation: CA01
definition: Preventing the conversion of natural and semi-natural habitats, and habitats of species targeted by the nature directives, into agricultural land for production (arable or pasture) or into more intensively farmed land. Includes, for example, the conversion of grasslands or wetlands into arable land.
status: valid
status modified: 2018-05-14
accepted date: 2018-05-14
in scheme: Conservation measures

Restore small landscape features on agricultural land
type: Concept
notation: CA02
definition: The restoration of small landscape features present on agricultural land that are important to wild fauna and flora for migration, dispersal, genetic exchange or as breeding/feeding habitats. Such features can be hedges, stone walls, ponds, small woods, ecotone zones, edges around fields, ditches, natural pathways.
status: valid
status modified: 2018-05-14
accepted date: 2018-05-14
in scheme: Conservation measures

Maintain existing extensive agricultural practices and agricultural landscape features
type: Concept
notation: CA03
definition: Maintaining extensive agricultural management practices such as extensive grazing/mowing or traditional burning, and protecting small landscape features or elements (e.g. ecotone zones, hedges, stone walls, ponds small woods, edges around fields, ditches, ground paths). This also includes 'wildlife-friendly' management of hedges.
status: valid
status modified: 2018-05-14
accepted date: 2018-05-14
in scheme: Conservation measures

Reinstate appropriate agricultural practices to address abandonment, including mowing, grazing, burning or equivalent measures
type: Concept
notation: CA04
definition: Reinstating agricultural practices to stop or slow down natural succession caused by the abandonment of agricultural land and/or insufficient land use. These practices can be of an agricultural nature, such as the re-introduction of grazing, or a substitute of those (e.g. use machinery to keep open habitats). This can also include conservation grazing (i.e. ecological management using agricultural practices such as grazing by domestic animals � goats, sheep, cattle, horses � without a farming purpose).
status: valid
status modified: 2018-05-14
accepted date: 2018-05-14
in scheme: Conservation measures

Adapt mowing, grazing and other equivalent agricultural activities
type: Concept
notation: CA05
definition: Adapting the frequency, methods used and/or the timing of mowing/cutting of grasslands or of grazing by livestock in order to maintain/restore habitats or to avoid damage to species (e.g. nesting birds). This also includes the adaption and management of other equivalent activities (e.g. burning). Includes, for example, converting from intensively managed grassland to more extensive or reducing trampling by livestock.
status: valid
status modified: 2018-05-14
accepted date: 2018-05-14
in scheme: Conservation measures

Stop mowing, grazing and other equivalent agricultural activities
type: Concept
notation: CA06
definition: Stopping (or avoiding) the mowing or cutting of grasslands or grazing by livestock in order to restore habitats or to avoid damage to species (e.g. nesting birds); stopping (or avoiding) other equivalent activities.
status: valid
status modified: 2018-05-14
accepted date: 2018-05-14
in scheme: Conservation measures

Recreate Annex I agricultural habitats
type: Concept
notation: CA07
definition: Land previously used for either agriculture (e.g. arable land), forestry (e.g. popular plantation) or another use being (re)created/restored as an Annex I agricultural habitat type. Includes, for example, the recreation of an Annex I grassland from a forest plantation. This is a process that could take a long time to fully restore the habitats structure and functions.
status: valid
status modified: 2018-05-14
accepted date: 2018-05-14
in scheme: Conservation measures

Adapt soil management practices in agriculture
type: Concept
notation: CA08
definition: Adaptating soil management practices (including tillage) to minimize or prevent loss of soil and its biodiversity.
status: valid
status modified: 2018-05-14
accepted date: 2018-05-14
in scheme: Conservation measures

Manage the use of natural fertilisers and chemicals in agricultural (plant and animal) production
type: Concept
notation: CA09
definition: Managing (reducing or eliminating) the use of: - fertilisers (e.g. mineral, manure, sludge) - pesticides, fungicides, seed coatings, herbicides, growth retardants, hormones and other chemicals used in plant production - rodenticides and other pest control products -wormers and other veterinary products used in animal production (e.g. diclofenac and/or other similar veterinary products). Alos includes developing and maintaining the conservation headlands or field margins.
status: valid
status modified: 2018-05-14
accepted date: 2018-05-14
in scheme: Conservation measures

Reduce/eliminate point pollution to surface or ground waters from agricultural activities
type: Concept
notation: CA10
definition: Reducing or eliminating point source pollution from agricultural activities to surface and ground waters (e.g. due to large scale animal breeding or storage of farmyard waste and/or checmical products).
status: valid
status modified: 2018-05-14
accepted date: 2018-05-14
in scheme: Conservation measures

Reduce diffuse pollution to surface or ground waters from agricultural activities
type: Concept
notation: CA11
definition: Reducing diffuse pollution to surface and ground waters due to agricultural activities. This can also include developing and maintaining riparian buffer strips along water courses as a (spatially restricted) way of reducing 'diffuse' pollution to surface waters.
status: valid
status modified: 2018-05-14
accepted date: 2018-05-14
in scheme: Conservation measures

Reduce/eliminate air pollution from agricultural activities
type: Concept
notation: CA12
definition: Reducing or eliminating air pollution due to agricultural activities.
status: valid
status modified: 2018-05-14
accepted date: 2018-05-14
in scheme: Conservation measures

Reduce/eliminate marine pollution from agricultural activities
type: Concept
notation: CA13
definition: Reducing or eliminating marine pollution due to agricultural activities.
status: valid
status modified: 2018-05-14
accepted date: 2018-05-14
in scheme: Conservation measures

Reduce/eliminate soil pollution from agricultural activities
type: Concept
notation: CA14
definition: Reducing or eliminating soil pollution due to agricultural activities.
status: valid
status modified: 2018-05-14
accepted date: 2018-05-14
in scheme: Conservation measures

Manage drainage and irrigation operations and infrastructures in agriculture
type: Concept
notation: CA15
definition: Managing drainage and irrigation operations and infrastructures (such as surface and groundwater abstraction, construction and operation of dams or altering of hydrological flow of rivers) as well as managing or restoring the hydrological regime of drained agricultural areas (e.g. restoration of hydrological regimes of drained peatlands, hydrologically altered wetlands and freshwater habitats in agricultural areas). The management of drainage and irrigation can include the possible cessation of these activities. This measure also includes restoring other freshwater habitats or wetlands impacted by changes of hydrological functioning through activities such as building dams or surface water abstraction for agriculture.
status: valid
status modified: 2018-05-14
accepted date: 2018-05-14
in scheme: Conservation measures

Other measures related to agricultural practices
type: Concept
notation: CA16
definition: Other measures related to agricultural practices or agriculture-related habitats not covered by the other CA measures e.g. adapting the methods and/or timing of harvesting to avoid disturbance of nesting birds.
status: valid
status modified: 2018-05-14
accepted date: 2018-05-14
in scheme: Conservation measures

Prevent conversion of (semi-) natural habitats into forests and of (semi-)natural forests into intensive forest plantation
type: Concept
notation: CB01
definition: Preventing the conversion of natural and semi-natural habitats, as well as habitats of species targeted by the nature directives, into forest (e.g. afforestation), preventing the conversion of natural and semi-natural forests into intensive forest plantations or monocultures.
status: valid
status modified: 2018-05-14
accepted date: 2018-05-14
in scheme: Conservation measures

Maintain existing traditional forest management and exploitation practices
type: Concept
notation: CB02
definition: Maintaining existing (traditional or extensive) forest management and exploitation practices to preserve habitats or habitats for species or to avoid species disturbance. This includes maintaining traditional or extensive management, for example, to secure or develop old tree stocks, the old-growth and natural decay stages of forests (that are clearly beyond regular harvesting age), coppices, pollarding or secondary forest habitats (such as oak-hornbeam forest on potential beech habitats); this also includes maintaining the measures to favour the opening of closed woodlands, to preserve or restore habitat continuity, to manage species composition, or to retain habitat tree groups. Includes also keeping aside wilderness areas. .
status: valid
status modified: 2018-05-14
accepted date: 2018-05-14
in scheme: Conservation measures

Reinstate forest management and exploitation practices
type: Concept
notation: CB03
definition: Reinstating (traditional or extensive) forest management and exploitation practices to preserve or to restore habitats or habitats for species targeted by the nature directives impacted by abandonment of traditional forestry use.
status: valid
status modified: 2018-05-14
accepted date: 2018-05-14
in scheme: Conservation measures

Adapt/manage reforestation and forest regeneration
type: Concept
notation: CB04
definition: Adaptating or managing reforestation to restore habitats and habitats of species including for example the conversion of clear-fell plantations to long-term native woodland or the adaptation of reforestation techniques such as using natural regeneration or fire.
status: valid
status modified: 2018-05-14
accepted date: 2018-05-14
in scheme: Conservation measures

Adapt/change forest management and exploitation practices
type: Concept
notation: CB05
definition: Adapting or changing forest management and exploitation practices to preserve or to restore habitats/habitats of species targeted by the nature directives or to avoid species disturbance. This can involve adapting and changing management practices in order to secure or develop old stocks of trees, to maintain coppices, to retain dead and dying trees and stumps, to favour opening of closed woodlands, to preserve or restore habitat continuity, to manage species composition, to prevent forest wildfires; but also adapting the time and duration of forestry activities to avoid disturbance of species. However this excludes the management of drainage and irrigation, which are included under CB14.
status: valid
status modified: 2018-05-14
accepted date: 2018-05-14
in scheme: Conservation measures

Stop forest management and exploitation practices
type: Concept
notation: CB06
definition: Stopping (or avoiding) forest management and exploitation practices to preserve or to restore habitats or habitats for species targeted by the nature directives, or to avoid species disturbance. Includes the application of non-intervention management.
status: valid
status modified: 2018-05-14
accepted date: 2018-05-14
in scheme: Conservation measures

Combat illegal logging
type: Concept
notation: CB07
definition: Taking measures to stop and prevent illegal logging and pressures from this illegal activity.
status: valid
status modified: 2018-05-14
accepted date: 2018-05-14
in scheme: Conservation measures

Restoration of Annex I forest habitats
type: Concept
notation: CB08
definition: Land previously used for agriculture (e.g. arable land), for industrial forestry plantations (e.g. poplar or eucalyptus plantations), or other land cover being restored or (re)created as an Annex I forest habitat type. This could be, for example, recreating an Annex I alluvial forest from farmland. It could take decades to fully restore the habitats structure and functions and it can includes active restoration (seed sowing or planting new vegetation) or passive allowing natural succession.
status: valid
status modified: 2018-05-14
accepted date: 2018-05-14
in scheme: Conservation measures

Manage the use of chemicals for fertilisation, liming and pest control in forestry
type: Concept
notation: CB09
definition: Managing(reducing or eliminating) of the use of: -pesticides, herbicides and pest control products - fertilisers (mineral, manure, sludge) - liming.
status: valid
status modified: 2018-05-14
accepted date: 2018-05-14
in scheme: Conservation measures

Reduce diffuse pollution to surface or ground waters from forestry activities
type: Concept
notation: CB10
definition: Reducing diffuse pollution to surface and ground waters due to forestry activities.
status: valid
status modified: 2018-05-14
accepted date: 2018-05-14
in scheme: Conservation measures

Reduce air pollution from forestry activities
type: Concept
notation: CB11
definition: Reducing air pollution due to forestry activities.
status: valid
status modified: 2018-05-14
accepted date: 2018-05-14
in scheme: Conservation measures

Reduce marine pollution from forestry activities
type: Concept
notation: CB12
definition: Reducing marine pollution due to forestry activities.
status: valid
status modified: 2018-05-14
accepted date: 2018-05-14
in scheme: Conservation measures

Reduce soil pollution from forestry activities
type: Concept
notation: CB13
definition: Reducing soil pollution due to forestry activities.
status: valid
status modified: 2018-05-14
accepted date: 2018-05-14
in scheme: Conservation measures

Manage drainage and irrigation operations and infrastructures
type: Concept
notation: CB14
definition: Managing drainage and irrigation operations and infrastructure (including surface and groundwater abstraction, construction and operation of dams and altering of hydrological flow of rivers) as well as managing or restoring the hydrological regime of drained forest areas. The management of drainage and irrigation can include the possible cessation of these activities. This measure also includes restoring freshwater habitats impacted by changes of hydrological functioning due to drainage for forestry.
status: valid
status modified: 2018-05-14
accepted date: 2018-05-14
in scheme: Conservation measures

Other measures related to forestry practices
type: Concept
notation: CB15
definition: Other measures related to forestry practices or forest habitats not covered by the other CB measures.
status: valid
status modified: 2018-05-14
accepted date: 2018-05-14
in scheme: Conservation measures

Adapt/manage extraction of non-energy resources
type: Concept
notation: CC01
definition: Adapting and managing (including stopping and avoiding) the extraction of minerals and non-energy resources (e.g. sand, gravel, loam, clay and peat extraction for plant compost or other horticultural purposes) as well as adapting and managing the extaction of salt. Alos includes reducing the impact from geotechnical surveying and other preparatory work for extraction.
status: valid
status modified: 2018-05-14
accepted date: 2018-05-14
in scheme: Conservation measures

Adapt/manage exploitation of energy resources
type: Concept
notation: CC02
definition: Adapting and managing (including stopping and avoiding) the exploitation of energy resources (coal mining, incl. open-cast mining, peat extraction, oil and gas exploration and drilling). Alos includes reducing the impact from geotechnical surveying and other preparatory works for extraction.
status: valid
status modified: 2018-05-14
accepted date: 2018-05-14
in scheme: Conservation measures

Adapt/manage renewable energy installation, facilities and operation
type: Concept
notation: CC03
definition: Adapting and managing (including stopping and avoiding) installation and operation of renewable energy infrastructure (excluding hydropower). This also includes measures to mitigate impact of wind farms such as avoiding building turbines at sensitive sites (e.g. migration bottlenecks), turning off turbines under certain conditions and/or particularly problematic times of year (e.g. peak migration).
status: valid
status modified: 2018-05-14
accepted date: 2018-05-14
in scheme: Conservation measures

Reduce impact of hydropower operation and infrastructure
type: Concept
notation: CC04
definition: Reducing/minimizing the impact of hydropower infrastructures (such as dams, weirs, reservoirs) and their operation (e.g. hydropeaking) on freshwater habitats and species. This can include building and managing fish passages or regulating water flows. Alos includes restoring freshwater habitats impacted by changes of hydrological functioning like building dams for energy production.
status: valid
status modified: 2018-05-14
accepted date: 2018-05-14
in scheme: Conservation measures

Adapt/manage fossil energy installation, facilities and operation
type: Concept
notation: CC05
definition: Adapting and managing the installation of and operation of fossil energy infrastructure excluding oil and gas pipelines(CC06).
status: valid
status modified: 2018-05-14
accepted date: 2018-05-14
in scheme: Conservation measures

Reduce impact of service corridors and networks
type: Concept
notation: CC06
definition: Reducing the impact of service corridors and networks (electricity, telecommunications, oil and gas pipelines) on habitats and species targeted by the nature directives. This includes for example modifying power lines to prevent bird electrocution or developing green/blue infrastructure to improve connectivity.
status: valid
status modified: 2018-05-14
accepted date: 2018-05-14
in scheme: Conservation measures

Habitat restoration/creation from resources, exploitation areas or areas damaged due to installation of renewable energy infrastructure
type: Concept
notation: CC07
definition: Land previously used or prepared for mineral extraction (e.g. gravel extraction, quarry), energy resources extraction (e.g. coal or peat) or damaged due to depositing of extraction material or due to construction and operation of renewable energy infrastructure being restored as Annex I habitat type and/or habitat of a species targeted by the nature directives. This includes both active or passive restoration allowing for natural succession. Exlcudes restoration of agricultural and forest habitats which should be reported under CA07 or CB08 respectively and restoration of habitats damaged due to construction and operation of hydropower infrastructure, which should be reported under CC04.
status: valid
status modified: 2018-05-14
accepted date: 2018-05-14
in scheme: Conservation measures

Manage/reduce/eliminate point pollution to surface or ground waters from resource exploitation and energy production
type: Concept
notation: CC08
definition: Managing, reducing or eliminating point source pollution to surface or ground waters caused by the extraction and exploitation of minerals and energy resources (e.g. from mine waters), and energy production.
status: valid
status modified: 2018-05-14
accepted date: 2018-05-14
in scheme: Conservation measures

Manage/reduce/eliminate diffuse pollution to surface or ground waters from resource exploitation and energy production
type: Concept
notation: CC09
definition: Managing, reducing or eliminating diffuse pollution to surface and ground waters caused by the extraction and exploitation of minerals and energy resources (e.g. due to mining activities), and energy production .
status: valid
status modified: 2018-05-14
accepted date: 2018-05-14
in scheme: Conservation measures

Manage/reduce/eliminate air pollution from resource exploitation and energy production
type: Concept
notation: CC10
definition: Managing, reducing or eliminating air pollution related to resource exploitation and energy production such as the combustion of fossil or bioenergy fuels.
status: valid
status modified: 2018-05-14
accepted date: 2018-05-14
in scheme: Conservation measures

Manage/reduce/eliminate marine pollution from resource exploitation and energy production
type: Concept
notation: CC11
definition: Managing, reducing or eliminating marine pollution related to resource exploitation and energy production.
status: valid
status modified: 2018-05-14
accepted date: 2018-05-14
in scheme: Conservation measures

Reduce/eliminate noise, light, thermal and other forms of pollution related to resource exploitation and energy production
type: Concept
notation: CC12
definition: Reducing or eliminating noise and light pollution, electromagnetic pollution, thermal heating of water bodies or localised heating of the sea related to resource exploitation and energy production. Includes also the reduction/elimination of noise pollution from sonar and geological surveys at sea.
status: valid
status modified: 2018-05-14
accepted date: 2018-05-14
in scheme: Conservation measures

Manage water abstraction for resource extraction and energy production
type: Concept
notation: CC13
definition: Managing surface and ground water abstraction for extraction/exploitation of resources and energy production (excluding management of drainage and water abstraction activities related to extraction and exploitation (e.g. peat drainage - CC02 or abstraction of mine waters - CC01).
status: valid
status modified: 2018-05-14
accepted date: 2018-05-14
in scheme: Conservation measures

Other measures related to extraction and energy exploitation activities
type: Concept
notation: CC14
definition: Other measures related to the extraction and energy exploitation activities.
status: valid
status modified: 2018-05-14
accepted date: 2018-05-14
in scheme: Conservation measures

Reduce impact of transport operation and infrastructure
type: Concept
notation: CE01
definition: Reducing the impact of transport infrastructures (roads, railroads, bridges, viaducts, tunnels, shipping lanes and canals, locks, ports, airfields) and transport operations on habitats and species targeted by the nature directives. This include,s for example, building and managing passages for animals, developing green/blue infrastructure, managing marine and fluvial traffic and infrastructure to, for example, reduce erosion of banks and deterring (e.g. by letting grass grow long or employing active 'scaring' tactics) birds from using airfield/airports. Also includes any measures to reduce noise and light pollution. Regulating traffic or construction of traffic infrastructure in order to reduce chemical/particulate pollution should be reported under code CE03.
status: valid
status modified: 2018-05-14
accepted date: 2018-05-14
in scheme: Conservation measures

Manage/reduce/eliminate pollution to surface or ground water from transport
type: Concept
notation: CE02
definition: Managing, reducing or eliminating point or diffuse pollution to surface and ground waters due to land, water, and air-based transport (e.g. cars, boats, airplanes).
status: valid
status modified: 2018-05-14
accepted date: 2018-05-14
in scheme: Conservation measures

Manage/reduce/eliminate air pollution from transport
type: Concept
notation: CE03
definition: Managing, reducing or eliminating air pollution due to land, water or air-based transport (e.g. cars, boats, airplanes).
status: valid
status modified: 2018-05-14
accepted date: 2018-05-14
in scheme: Conservation measures

Manage/reduce/eliminate marine pollution from transport
type: Concept
notation: CE04
definition: Managing, reducing or eliminating marine pollution due to transport activities and infrastructure.
status: valid
status modified: 2018-05-14
accepted date: 2018-05-14
in scheme: Conservation measures

Manage/reduce/eliminate noise, light and other forms of pollution from transport
type: Concept
notation: CE05
definition: Managing, reducing or eliminating noise, light and other forms of pollution related to land, waterand air-based transport (e.g. cars, boats, airplanes).
status: valid
status modified: 2018-05-14
accepted date: 2018-05-14
in scheme: Conservation measures

Habitat restoration of areas impacted by transport
type: Concept
notation: CE06
definition: Restore habitats damaged by transport e.g. restoring freshwater habitats impacted by changes in hydrological functioning like canalisation, or coastal habitats destroyed as a result of the dredging of ship lanes.
status: valid
status modified: 2018-05-14
accepted date: 2018-05-14
in scheme: Conservation measures

Other measures related to transport
type: Concept
notation: CE07
definition: Other measures related to transport
status: valid
status modified: 2018-05-14
accepted date: 2018-05-14
in scheme: Conservation measures

Manage conversion of land for construction and development of infrastructure
type: Concept
notation: CF01
definition: Managing (i.e. preventing, minimizing effects of) conversion of land to the construction and development of residential, commercial, industrial and recreational areas and infrastructures.
status: valid
status modified: 2018-05-14
accepted date: 2018-05-14
in scheme: Conservation measures

Habitat restoration of areas impacted by residential, commercial, industrial and recreational infrastructure, operations and activities
type: Concept
notation: CF02
definition: Restoring habitats in areas negatively impacted by residential, commercial, industrial and recreational infrastructure, including the operation of these infrastructures. Includes, for example, the restoration of dune habitats impacted by the protection of urban and recreational zones. This excludes the restoration of agricultural and forest habitats which should be reported under CA07 or CB08 respectively.
status: valid
status modified: 2018-05-14
accepted date: 2018-05-14
in scheme: Conservation measures

Reduce impact of outdoor sports, leisure and recreational activities
type: Concept
notation: CF03
definition: Reducing the impact of outdoor sports, leisure and recreational activities (e.g. camping, skiing, mountaineering, boating, wildlife watching - bird and whale watching) on terrestrial, freshwater and marine habitats and species, and managing these activities. Also includes restoration of habitats impacted by outdoor sports, leisure and recreational activities.
status: valid
status modified: 2018-05-14
accepted date: 2018-05-14
in scheme: Conservation measures

Reduce/eliminate point source pollution to surface or ground waters from industrial, commercial, residential and recreational areas and activities
type: Concept
notation: CF04
definition: Reducing or eliminating point source pollution to surface and ground waters from industrial, commercial, residential and recreational areas and activities. This includes reducing/eliminating discharges from industrial and urban waste water treatment plants, or reducing/eliminating point source pollution from contaminated or abandoned industrial sites or from household waste dumps.
status: valid
status modified: 2018-05-14
accepted date: 2018-05-14
in scheme: Conservation measures

Reduce/eliminate diffuse pollution to surface or ground waters from industrial, commercial, residential and recreational areas and activities
type: Concept
notation: CF05
definition: Reducing or eliminating diffuse pollution to surface and ground waters from industrial, commercial, residential and recreational areas and activities (e.g. reducing/eliminating diffuse pollution due to sewage not connected to the sewage network or diffuse source pollution from contaminated or abandoned industrial sites or leakages from waste disposal sites).
status: valid
status modified: 2018-05-14
accepted date: 2018-05-14
in scheme: Conservation measures

Reduce/eliminate air pollution from industrial, commercial, residential and recreational areas and activities
type: Concept
notation: CF06
definition: Reducing or eliminating chemical and micro-particulate point and diffuse pollution to air from industrial, commercial, residential and recreational areas and activities.
status: valid
status modified: 2018-05-14
accepted date: 2018-05-14
in scheme: Conservation measures

Reduce/eliminate marine pollution from industrial, commercial, residential and recreational areas and activities
type: Concept
notation: CF07
definition: Reducing or eliminating chemical point and diffuse source pollution to marine waters from industrial, commercial, residential and recreational areas and activities.
status: valid
status modified: 2018-05-14
accepted date: 2018-05-14
in scheme: Conservation measures

Reduce/eliminate marine contamination with litter
type: Concept
notation: CF08
definition: Reducing or eliminating the input and subsequent contamination of marine ecosystems with litter from all possible sources, including from the fishing industry.
status: valid
status modified: 2018-05-14
accepted date: 2018-05-14
in scheme: Conservation measures

Reduce/eliminate noise, light, heat or other forms pollution from industrial, commercial, residential and recreational areas and activities
type: Concept
notation: CF09
definition: Reducing or eliminating noise, light, heat, electromagnetic or other types of pollution from industrial, commercial, residential and recreational areas and activities. Excludes measure to reduce noise and light pollution from sport and leisure activities (CF03).
status: valid
status modified: 2018-05-14
accepted date: 2018-05-14
in scheme: Conservation measures

Manage changes in hydrological and coastal systems and regimes for construction and development
type: Concept
notation: CF10
definition: Managing acitvities causing changes in hydrological conditions and coastal systesm (e.g. drainage, land reclamation, conversion of wetlands, modification of flooding regimes, flood protection infrastructure and operations, building of dams and reservoirs, coastal protection and sea defence) associated with residential, commercial, industrial and recreational areas and activities. This includes restoring freshwater habitats and wetlands impacted by changes of hydrological functioning like building dams or canalisation for flood protection.
status: valid
status modified: 2018-05-14
accepted date: 2018-05-14
in scheme: Conservation measures

Manage water abstraction for public supply and for industrial and commercial use
type: Concept
notation: CF11
definition: Managing the abstraction of ground and surface water for industrial and commercial use, as well as for public water supply (including, for example, drinking water, water for urban watering of parks and gardens and irrigation of golf courses). This includes also restoring freshwater habitats impacted by changes of hydrological functioning like building dams for surface water abstraction.
status: valid
status modified: 2018-05-14
accepted date: 2018-05-14
in scheme: Conservation measures

Other measures related to residential, commercial, industrial and recreational infrastructures, operations and activities
type: Concept
notation: CF12
definition: Other measures related to residential, commercial, industrial and recreational infrastructures, operations and activities. Includes, for example, measures to regulate/adapt the reconstruction and renovation of buildings (important for nesting and sheltering of bats and birds) for example, by regulating timing of those interventions. Includes reducing the use of pesticides and fertilisers on lawns, hedges and fences.
status: valid
status modified: 2018-05-14
accepted date: 2018-05-14
in scheme: Conservation measures

Management of professional/commercial fishing (including shellfish and seaweed harvesting)
type: Concept
notation: CG01
definition: Managing of e.g. quantities, methods, periods, areas, and species for professional fishing; and shellfish and seaweed harvesting in marine, coastal and inland waters. This can include enforcement and control of e.g. fishing quotas and other regulations or stopping/avoiding fishing. Managing methods and periods for fishing to reduce bycatch and/or incidental killing should be included under CG05. Also includes the restoration of habitats damaged due to commercial fishing.
status: valid
status modified: 2018-05-14
accepted date: 2018-05-14
in scheme: Conservation measures

Management of hunting, recreational fishing and recreational or commercial harvesting or collection of plants
type: Concept
notation: CG02
definition: Managing methods, periods, areas, quotas and species for hunting, recreational angling, recreational shellfish harvesting and recreational or commercial harvesting of plants (including fruits) and mushrooms. This can include stopping or avoiding hunting, recreational fishing, harvesting or collecting. Also includes the restoration of habitats damaged due to exploitation of species, for example, human trampling due to harvesting of shellfish or collection of plants, habitats damaged by game.
status: valid
status modified: 2018-05-14
accepted date: 2018-05-14
in scheme: Conservation measures

Reducing the impact of (re-) stocking for fishing and hunting, of artificial feeding and predator control
type: Concept
notation: CG03
definition: Reducing the impact of (re-) stocking fish and game species, of artificial game feeding, of the culling of possible predators or competitors of game species (illegal persecution of predators such as raptor persecution should be reported under CG04) and reducing the impact of other similar activities related to management of game and fishing stocks.
status: valid
status modified: 2018-05-14
accepted date: 2018-05-14
in scheme: Conservation measures

Control/eradication of illegal killing, fishing and harvesting
type: Concept
notation: CG04
definition: Controlling, though enforcement, the illegal killing, fishing and harvesting of fish, shellfish or plant species, including the use of illegal methods or the taking protected species.
status: valid
status modified: 2018-05-14
accepted date: 2018-05-14
in scheme: Conservation measures

Reduce bycatch and incidental killing of non-target species
type: Concept
notation: CG05
definition: Introducing or adapting practices to reduce bycatch or incidental killing from commercial and recreational use and exploitation of species (e.g. by adapting methods or periods for fishing).
status: valid
status modified: 2018-05-14
accepted date: 2018-05-14
in scheme: Conservation measures

Reduce impact of lead poisoning
type: Concept
notation: CG06
definition: Reducing impact of lead ammunition or fishing weights.
status: valid
status modified: 2018-05-14
accepted date: 2018-05-14
in scheme: Conservation measures

Manage changes in coastal conditions for marine aquaculture
type: Concept
notation: CG07
definition: Managing changes to coastal conditions due to the installation, maintenance and operation of marine/coastal aquaculture facilities for fish, shellfish, plants or algae. This can include, for example, regulating or minimising the effect of dredging. This also includes restoring coastal habitats and wetlands impacted by changes of coastal conditions due to marine aquaculture.
status: valid
status modified: 2018-05-14
accepted date: 2018-05-14
in scheme: Conservation measures

Reduce/eliminate marine pollution from marine aquaculture
type: Concept
notation: CG08
definition: Reducing or eliminating pollution to marine waters from marine/coastal aquaculture (fish, shellfish, plants, algae).
status: valid
status modified: 2018-05-14
accepted date: 2018-05-14
in scheme: Conservation measures

Other measures to reduce impacts from marine aquaculture infrastructures and operation
type: Concept
notation: CG09
definition: Other measures to reduce the impact from marine/coastal aquaculture such as impacts from the introduction of new species. Includes maintaining existing extensive aquaculture.
status: valid
status modified: 2018-05-14
accepted date: 2018-05-14
in scheme: Conservation measures

Manage water abstraction and modifications of hydrological conditions for freshwater aquaculture
type: Concept
notation: CG10
definition: Managing water abstraction and modification of hydrological conditions (e.g. weirs, canals, small dams, water deviation) due to to installation, maintenance and operation of freshwater aquaculture of fish, plants and algae.
status: valid
status modified: 2018-05-14
accepted date: 2018-05-14
in scheme: Conservation measures

Reduce/eliminate point source pollution to surface waters from freshwater aquaculture
type: Concept
notation: CG11
definition: Reducing or eliminating point source pollution to surface waters from freshwater aquaculture (e.g. due to feeding, use of antibiotics or fertilisation).
status: valid
status modified: 2018-05-14
accepted date: 2018-05-14
in scheme: Conservation measures

Reduce/eliminate diffuse pollution to surface waters from freshwater aquaculture
type: Concept
notation: CG12
definition: Reducing or eliminating diffuse pollution to surface waters from freshwater aquaculture (e.g. due to feeding, use of antibiotics or fertilisation).
status: valid
status modified: 2018-05-14
accepted date: 2018-05-14
in scheme: Conservation measures

Reduce/eliminate marine pollution from freshwater aquaculture
type: Concept
notation: CG13
definition: Reducing or eliminating pollution to marine waters from freshwater aquaculture (e.g. due to feeding, use of antibiotics or fertilisation).
status: valid
status modified: 2018-05-14
accepted date: 2018-05-14
in scheme: Conservation measures

Other measures to reduce impacts of freshwater aquaculture infrastructures and operation
type: Concept
notation: CG14
definition: Other measures to reduce impact from freshwater aquaculture such as the impacts from the introduction of new species. Includes maintaining existing extensive aquaculture.
status: valid
status modified: 2018-05-14
accepted date: 2018-05-14
in scheme: Conservation measures

Other measures related to exploitation of species
type: Concept
notation: CG15
definition: Other measures related to the exploitation of species (e.g. deliberate, non-lethal disturbance/deterrence of 'pest' species such as Phalacrocorax spp., to reduce conflicts with aquaculture).
status: valid
status modified: 2018-05-14
accepted date: 2018-05-14
in scheme: Conservation measures

Reduce impact of military installations and activities
type: Concept
notation: CH01
definition: Reducing the impact of military sites, infrastructures, exercises and operations.
status: valid
status modified: 2018-05-14
accepted date: 2018-05-14
in scheme: Conservation measures

Adapt/maintain military activities
type: Concept
notation: CH02
definition: Adapting or maintaining military activities for nature protection objectives; use of military activity to maintain or restore habitats (e.g. use disturbance from military exercises to maintain open habitats).
status: valid
status modified: 2018-05-14
accepted date: 2018-05-14
in scheme: Conservation measures

Reduce impact of other specific human actions
type: Concept
notation: CH03
definition: Reducing the impact from specific human actions not included in other categories. (e.g. from property fences and walls, closure of caves and gallery entrances, felling roadside trees or from civil unrest and vandalism).
status: valid
status modified: 2018-05-14
accepted date: 2018-05-14
in scheme: Conservation measures

Early detection and rapid eradication of invasive alien species of Union concern
type: Concept
notation: CI01
definition: Establishing and operating the system of early detection and rapid eradication of invasive alien species of Union concern (under Regulation (EU) No 1143/2014). This also includes measures to prevent, or reduce the likelihood of the establishment and entry of invasive alien species.
status: valid
status modified: 2018-05-14
accepted date: 2018-05-14
in scheme: Conservation measures

Management, control or eradication of established invasive alien species of Union concern
type: Concept
notation: CI02
definition: Managing, controlling or eradicating established invasive alien species of Union concern (under Regulation (EU) No 1143/2014) (e.g. culling of Ruddy duck - Oxyura jamaicensis).
status: valid
status modified: 2018-05-14
accepted date: 2018-05-14
in scheme: Conservation measures

Management, control or eradication of other invasive alien species
type: Concept
notation: CI03
definition: Managing, controlling the spread of other 'invasive' alien species ( i.e. any species introduced in modern period that is established in the wild outside its natural range and whose introduction and/or spread represents a threat or a potential threat to habitats and species, regardless of the invasive population dynamics (e.g. controlling Acacia spp.)) or eradicating established populations of other alien species.
status: valid
status modified: 2018-05-14
accepted date: 2018-05-14
in scheme: Conservation measures

DO NOT USE Management, control or eradication of other alien species
type: Concept
notation: CI04
definition: This code should not be used for new entries. It has been restored for technical reasons.
status: valid
status modified: 2018-05-14
accepted date: 2018-05-14
in scheme: Conservation measures

Management of problematic native species
type: Concept
notation: CI05
definition: Managing native plants and animals that have become out-of-balance directly or indirectly due to human activities and, in certain regions, may be causing damage to particular habitats (e.g. deer jeopardising forest restoration) or threatening population of target species (e.g. gulls predating on eggs and chicks of a threatened bird). This also includes managing impacts of feral populations.
status: valid
status modified: 2018-05-14
accepted date: 2018-05-14
in scheme: Conservation measures

Other measures related to problematic species
type: Concept
notation: CI06
definition: Other measures related to problematic species.
status: valid
status modified: 2018-05-14
accepted date: 2018-05-14
in scheme: Conservation measures

Controlling and eradicating plant and animal diseases, pathogens and pests
type: Concept
notation: CI07
definition: Controlling and eradicating plant and animal diseases, pathogens and pests (including insect and nematode pests).
status: valid
status modified: 2018-05-14
accepted date: 2018-05-14
in scheme: Conservation measures

Reduce impact of mixed source pollution
type: Concept
notation: CJ01
definition: Reducing the impact of pollution in situations where no specific driver can be identified.
status: valid
status modified: 2018-05-14
accepted date: 2018-05-14
in scheme: Conservation measures

Reduce impact of multi-purpose hydrological changes
type: Concept
notation: CJ02
definition: Reducing the impact of landfilling, removal of sediments, canalisation, water deviation, flooding regime modification and other modifications of hydrological functioning or physical chracteristics of water bodies, which cannot be easily associated with one of the categories above.
status: valid
status modified: 2018-05-14
accepted date: 2018-05-14
in scheme: Conservation measures

Restore habitats impacted by multi-purpose hydrological changes
type: Concept
notation: CJ03
definition: Restoring freshwater, wetlands and coastal habitats impacted by multi-purpose hydrological modifications. This excludes restoration of agricultural and forest habitats which should be reported under CA10 or CB10 respectively.
status: valid
status modified: 2018-05-14
accepted date: 2018-05-14
in scheme: Conservation measures

Other measures related to mixed source pollution and multi-purpose human-induced changes in hydraulic conditions
type: Concept
notation: CJ04
definition: Other measures related to mixed source pollution and multi-purpose human-induced changes in hydraulic conditions.
status: valid
status modified: 2018-05-14
accepted date: 2018-05-14
in scheme: Conservation measures

Management of habitats (others than agriculture and forest) to slow, stop or reverse natural processes
type: Concept
notation: CL01
definition: Managing habitats (biotic and abiotic factors), excluding agriculture and forest-related habitats, to slow down, stop or reverse natural processes. This can include abiotic natural processes (e.g. erosion, silting up, drying out, salinization, eutrophication or acidification), natural succession of vegetation (in open early succsession stage habitats), natural accumulation of organic material, which is not a result of human activitiy, or lack of human activities. For example, if measures adress drying out which is a result of a human induced modification of hydrological conditions, it should not be reported under this category. Includes, for example, managing and restoring natural open (early-succession stage) habitats impacted by natural processes (e.g. maintaining heathland to prevent them from being overgrown by trees by grazing, conservation burning).
status: valid
status modified: 2018-05-14
accepted date: 2018-05-14
in scheme: Conservation measures

Minimise/prevent impacts of geological and natural catastrophes
type: Concept
notation: CL02
definition: Minimising (and when possible preventing) the impacts of geological events (e.g. volcanic activity) and extreme natural events (e.g. tidal waves, storms, landslides, flooding, wild fires) on habitats and species.
status: valid
status modified: 2018-05-14
accepted date: 2018-05-14
in scheme: Conservation measures

Restore habitats following geological and natural catastrophes
type: Concept
notation: CL03
definition: Restoring habitats and species after the occurrence of geological events (e.g. volcanic activity) and extreme natural events (e.g. tidal waves, storms, landslides, flooding, wild fires).
status: valid
status modified: 2018-05-14
accepted date: 2018-05-14
in scheme: Conservation measures

Other measures related to natural processes
type: Concept
notation: CL04
definition: Other measures related to natural processes e.g. control of natural competitors, predators or diseases of species targeted by the nature directives.
status: valid
status modified: 2018-05-14
accepted date: 2018-05-14
in scheme: Conservation measures

Adopt climate change mitigation measures
type: Concept
notation: CN01
definition: Adoption and implementation of general climate change mitigation measures. These are generally taken in a broader scale and not specifically for alleviating pressure on habitats and species. Therefore,this 'conservation measure' should only be noted when the main pressure is climate change and mitigation measures are being implemented.
status: valid
status modified: 2018-05-14
accepted date: 2018-05-14
in scheme: Conservation measures

Implement climate change adaptation measures
type: Concept
notation: CN02
definition: Implementation of specific climate change adaptation measures to address specific pressures on habitats and species (e.g. managing an interconnected network of habitats / protected areas, to facilitate the adaptive dispersal of key species in the context of shifts in suitable 'climate envelopes').
status: valid
status modified: 2018-05-14
accepted date: 2018-05-14
in scheme: Conservation measures

Support conservation measures in another EU Member State
type: Concept
notation: CX01
definition: Supporting the implementation of conservation measures in other EU Member States, for example, through financing or capacity building.
status: valid
status modified: 2018-05-14
accepted date: 2018-05-14
in scheme: Conservation measures

Support conservation measures in countries outside the EU
type: Concept
notation: CX02
definition: Supporting the implementation of measures in countries outside the EU (e.g. financing, capacity building).
status: valid
status modified: 2018-05-14
accepted date: 2018-05-14
in scheme: Conservation measures

Reinforce populations of species from the directives
type: Concept
notation: CS01
definition: Reinforcing populations of species targeted by the nature directives, including population enhancement through restocking, strengthening of extant populations by seeding, relocation and transfer from captivity or through cultivation. Excludes restoring habitats for species (see e.g. CS03).
status: valid
status modified: 2018-05-14
accepted date: 2018-05-14
in scheme: Conservation measures

Reintroduce species from the directives
type: Concept
notation: CS02
definition: Reintroduction of species targeted by the nature directives to former sites from other populations or ex-situ conservation through specific reintroduction programmes. Excludes restoring habitats for species (see e.g. CS03).
status: valid
status modified: 2018-05-14
accepted date: 2018-05-14
in scheme: Conservation measures

Improvement of habitat of species from the directives
type: Concept
notation: CS03
definition: Improvement of conditions for the species from the directives through specific measures that cannot be readily achieved by other pressure specific measures or pressure specific measures can not be identified. This includes, for example, the creation of ponds for amphibians, boosting reproductive success by installing nest boxes and platforms (as a substitue measure for lack of natural nesting cavities due to innapropriate forest management practices) or supplementary feeding (possibly carried out to mitigate a particular threat, such as 'natural' carcasses containing diclofenac, but also often carried out at as a broader measure to compensate for cumulative human pressures on natural habitats and food resources).
status: valid
status modified: 2018-05-14
accepted date: 2018-05-14
in scheme: Conservation measures

Manage other native species
type: Concept
notation: CS04
definition: Managing native plants and animals important for the restoration of habitats (e.g. managing keystone species of habitats) or for the survival of certain species (e.g. managing prey and their habitat, like wild rabbits as prey for Iberian lynx and Spanish Imperial Eagle Aquila adalberti). Includes reintroduction of crucial host species or other positively interacting species (like pollinators).
status: valid
status modified: 2018-05-14
accepted date: 2018-05-14
in scheme: Conservation measures

Status of measures
type: ConceptScheme
notation: measuresIdentified
is part of: Birds directive Art. 12 reporting in year 2018
registration status: Public draft
user modified: roschsab
date modified: 2017-10-12 13:57:03.0
vocabulary type: Common
is numeric concept identifiers: false
is notations equal identifiers: false

Measures identified, but none yet taken
type: Concept
notation: ident
status: valid
status modified: 2017-07-25
in scheme: Status of measures

Measures needed but cannot be identified
type: Concept
notation: notIdent
status: valid
status modified: 2017-07-25
in scheme: Status of measures

Measures identified and taken
type: Concept
notation: taken
status: valid
status modified: 2017-07-25
in scheme: Status of measures

Locations of the measures
type: ConceptScheme
notation: measuresLocation
is part of: Birds directive Art. 12 reporting in year 2018
registration status: Public draft
user modified: roschsab
date modified: 2017-10-12 13:55:51.0
vocabulary type: Common
is numeric concept identifiers: false
is notations equal identifiers: false

Only inside Natura 2000
type: Concept
notation: in
status: valid
status modified: 2017-07-25
in scheme: Locations of the measures

Both inside and outside Natura 2000
type: Concept
notation: inOut
status: valid
status modified: 2017-07-25
in scheme: Locations of the measures

Only outside Natura 2000
type: Concept
notation: out
status: valid
status modified: 2017-07-25
in scheme: Locations of the measures

Purpose of measures taken for birds
type: ConceptScheme
notation: measuresPurposeBirds
is part of: Birds directive Art. 12 reporting in year 2018
registration status: Public draft
user modified: roschsab
date modified: 2017-11-06 08:12:40.0
vocabulary type: Common
is numeric concept identifiers: false
is notations equal identifiers: false

Expand the current distribution of the species
type: Concept
notation: expand
status: valid
status modified: 2017-07-25
in scheme: Purpose of measures taken for birds

Increase the population size and/or improve population dynamics (improve reproduction success, reduce mortality, improve age/sex structure)
type: Concept
notation: increase
status: valid
status modified: 2017-07-25
in scheme: Purpose of measures taken for birds

Maintain the current distribution, population and/or habitat for the species
type: Concept
notation: maintain
status: valid
status modified: 2017-07-25
in scheme: Purpose of measures taken for birds

Restore the habitat of the species
type: Concept
notation: restore
status: valid
status modified: 2017-07-25
in scheme: Purpose of measures taken for birds

Response to the measures
type: ConceptScheme
notation: measuresResponse
is part of: Birds directive Art. 12 reporting in year 2018
registration status: Public draft
user modified: roschsab
date modified: 2017-10-12 14:00:56.0
vocabulary type: Common
is numeric concept identifiers: false
is notations equal identifiers: false

Long-term results (after 2030)
type: Concept
notation: lonTerm
status: valid
status modified: 2017-07-25
in scheme: Response to the measures

Medium-term results (within the next two reporting periods, 2019-2030)
type: Concept
notation: medTerm
status: valid
status modified: 2017-07-25
in scheme: Response to the measures

Short-term results (within the current reporting period, 2013-2018)
type: Concept
notation: srtTerm
status: valid
status modified: 2017-07-25
in scheme: Response to the measures

Methods used
type: ConceptScheme
notation: methodsUsed
is part of: Birds directive Art. 12 reporting in year 2018
registration status: Public draft
user modified: roschsab
date modified: 2017-10-13 07:13:29.0
vocabulary type: Common
is numeric concept identifiers: false
is notations equal identifiers: false

Insufficient or no data available
type: Concept
notation: absentData
status: valid
status modified: 2017-07-25
in scheme: Methods used

Complete survey or a statistically robust estimate
type: Concept
notation: completeSurvey
status: valid
status modified: 2017-07-25
in scheme: Methods used

Based mainly on expert opinion with very limited data
type: Concept
notation: estimateExpert
status: valid
status modified: 2017-07-25
in scheme: Methods used

Based mainly on extrapolation from a limited amount of data
type: Concept
notation: estimatePartial
status: valid
status modified: 2017-07-25
in scheme: Methods used

Valid population units for additional population size
type: ConceptScheme
notation: populationUnits
is part of: Birds directive Art. 12 reporting in year 2018
registration status: Public draft
user modified: roschsab
date modified: 2017-10-12 14:15:08.0
vocabulary type: Common
is numeric concept identifiers: false
is notations equal identifiers: false

number of breeding females
type: Concept
notation: bfemales
status: valid
status modified: 2017-08-01
accepted date: 2017-08-01
in scheme: Valid population units for additional population size

number of calling males
type: Concept
notation: cmales
status: valid
status modified: 2017-08-01
accepted date: 2017-08-01
in scheme: Valid population units for additional population size

number of individuals
type: Concept
notation: i
status: valid
status modified: 2017-08-01
accepted date: 2017-08-01
in scheme: Valid population units for additional population size

number of males
type: Concept
notation: males
status: valid
status modified: 2017-08-01
accepted date: 2017-08-01
in scheme: Valid population units for additional population size

number of pairs
type: Concept
notation: p
status: valid
status modified: 2017-08-01
accepted date: 2017-08-01
in scheme: Valid population units for additional population size

Presence (birds)
type: ConceptScheme
notation: presenceBirds
is part of: Birds directive Art. 12 reporting in year 2018
registration status: Public draft
user modified: roschsab
date modified: 2018-06-01 13:51:40.0
vocabulary type: Common
is numeric concept identifiers: false
is notations equal identifiers: false

The species has colonised the Member State during the short-term trend period of the reporting round (2007-2018)
type: Concept
notation: ARR
status: valid
status modified: 2017-07-27
accepted date: 2017-07-27
in scheme: Presence (birds)

Not present - delete from the check-list
type: Concept
notation: DEL
status: valid
status modified: 2017-11-30
in scheme: Presence (birds)

Extinct after 1980
type: Concept
notation: EXBA
status: valid
status modified: 2017-07-27
accepted date: 2017-07-27
in scheme: Presence (birds)

The species is present and occurs regularly in the Member State in the season in question
type: Concept
notation: PRE
status: valid
status modified: 2017-07-27
accepted date: 2017-07-27
in scheme: Presence (birds)

Optional report
type: Concept
notation: OPT
status: valid
status modified: 2018-06-01
in scheme: Presence (birds)

Location where the pressure/threat is primarily operating
type: ConceptScheme
notation: pressuresThreatsLocation
is part of: Birds directive Art. 12 reporting in year 2018
registration status: Public draft
user modified: roschsab
date modified: 2017-10-13 07:42:35.0
vocabulary type: Common
is numeric concept identifiers: false
is notations equal identifiers: false

unknown
type: Concept
notation: Unk
status: valid
status modified: 2017-10-12
in scheme: Location where the pressure/threat is primarily operating

elsewhere in the EU
type: Concept
notation: elseEU
status: valid
status modified: 2017-10-12
in scheme: Location where the pressure/threat is primarily operating

inside the Member State
type: Concept
notation: inMS
status: valid
status modified: 2017-10-12
in scheme: Location where the pressure/threat is primarily operating

both inside and outside EU
type: Concept
notation: inOutEU
status: valid
status modified: 2017-10-12
in scheme: Location where the pressure/threat is primarily operating

outside EU
type: Concept
notation: outEU
status: valid
status modified: 2017-10-12
in scheme: Location where the pressure/threat is primarily operating

Ranking of pressure/threat
type: ConceptScheme
notation: ranking
is part of: Birds directive Art. 12 reporting in year 2018
registration status: Public draft
user modified: roschsab
date modified: 2017-10-12 15:17:37.0
vocabulary type: Common
is numeric concept identifiers: false
is notations equal identifiers: false

High importance/impact
type: Concept
notation: H
status: valid
status modified: 2017-07-25
in scheme: Ranking of pressure/threat

Medium importance/impact
type: Concept
notation: M
status: valid
status modified: 2017-07-25
in scheme: Ranking of pressure/threat

(Change and reasons for change in value for parameter and in conservation status and conservation status trend)
type: ConceptScheme
notation: reasonChange
is part of: Birds directive Art. 12 reporting in year 2018
registration status: Public draft
user modified: roschsab
date modified: 2017-10-13 07:44:45.0
vocabulary type: Common
is numeric concept identifiers: false
is notations equal identifiers: false

Genuine change
type: Concept
notation: genuine
status: valid
status modified: 2017-10-12
in scheme: (Change and reasons for change in value for parameter and in conservation status and conservation status trend)

Improved knowledge/more accurate data
type: Concept
notation: knowledge
status: valid
status modified: 2017-10-12
in scheme: (Change and reasons for change in value for parameter and in conservation status and conservation status trend)

Use of different method
type: Concept
notation: method
status: valid
status modified: 2017-10-12
in scheme: (Change and reasons for change in value for parameter and in conservation status and conservation status trend)

No change
type: Concept
notation: noChange
status: valid
status modified: 2017-10-12
in scheme: (Change and reasons for change in value for parameter and in conservation status and conservation status trend)

No information on the nature of change
type: Concept
notation: noInfo
status: valid
status modified: 2017-10-12
in scheme: (Change and reasons for change in value for parameter and in conservation status and conservation status trend)

Season in which data for Article 12 species were collected
type: ConceptScheme
notation: seasonArt12
is part of: Birds directive Art. 12 reporting in year 2018
registration status: Public draft
user modified: roschsab
date modified: 2017-10-13 07:44:18.0
vocabulary type: Common
is numeric concept identifiers: false
is notations equal identifiers: false
label: Season in which data for Red List species were collected
notation: seasonRedList
date modified: 2017-10-13 07:46:07.0

Breeding
type: Concept
notation: B
status: valid
status modified: 2017-10-12
in scheme: Season in which data for Article 12 species were collected

Passage
type: Concept
notation: P
status: valid
status modified: 2017-10-12
in scheme: Season in which data for Article 12 species were collected

Winter
type: Concept
notation: W
status: valid
status modified: 2017-10-12
in scheme: Season in which data for Article 12 species were collected

Threats and pressures
type: ConceptScheme
notation: threats
is part of: Birds directive Art. 12 reporting in year 2018
registration status: Public draft
user modified: roschsab
date modified: 2018-05-18 12:38:04.0
vocabulary type: Common
is numeric concept identifiers: false
is notations equal identifiers: false

Conversion into agricultural land (excluding drainage and burning)
type: Concept
notation: A01
definition: Conversion of natural and semi-natural non-agricultural habitats (e.g. semi-natural forests) and non-agricultural habitats of species targeted by the nature directives into agricultural land (e.g. pastures, meadows, arable fields). This pressure does not relate only to land use changes that occurred during the reporting period but it refers to instances where continuing the agricultural use of originally non-agricultural habitat prevent the latter from being restored (e.g. in case of land use conflicts between agriculture and nature conservation).
status: valid
status modified: 2018-05-18
accepted date: 2018-05-18
in scheme: Threats and pressures

Conversion from one type of agricultural land use to another (excluding drainage and burning)
type: Concept
notation: A02
definition: Conversion of agricultural habitats into other types of agricultural habitats. This pressure often refers to conversion of semi-natural agricultural habitats (e.g. meadows) into intensive production areas (e.g. sawn grasslands or arable fields) but it also includes more subtle changes, mostly of habitat conditions (e.g. change of crops or a move from spring-sown to autumn/winter-sown cereals causing denser/taller crop structure earlier in the nesting season or earlier harvesting) or other types of conversion (e.g. rice paddies into other types of culture). This pressure does not relate only to land use changes that occurred during the reporting period but it refers to instances where continuing the current agricultural use of a habitat prevent the latter from being restored (e.g. in cases of land use conflicts between agriculture and nature conservation).
status: valid
status modified: 2018-05-18
accepted date: 2018-05-18
in scheme: Threats and pressures

Conversion from mixed farming and agroforestry systems to specialised (e.g. single crop) production
type: Concept
notation: A03
definition: Large scale changes (affecting the habitat at landscape level or landscape functions like connectivity or nutrient cycling) of agricultural systems from traditional mixed or diversified farming and agroforestry into intensive specialised farming (e.g. single crop).
status: valid
status modified: 2018-05-18
accepted date: 2018-05-18
in scheme: Threats and pressures

Changes in terrain and surface of agricultural areas
type: Concept
notation: A04
definition: Changes in terrain and surface of agricultural areas due to, for example, restructuring of slopes, terracing, levelling, rock crushing or other changes of terrain to, for example, facilitate the use of machinery or manage runoff of rain water or to prepare new terrains for agricultural production.
status: valid
status modified: 2018-05-18
accepted date: 2018-05-18
in scheme: Threats and pressures

Removal of small landscape features for agricultural land parcel consolidation (hedges, stone walls, rushes, open ditches, springs, solitary trees, etc.)
type: Concept
notation: A05
definition: Removal of single landscape features or small scale parcel consolidation (e.g. removal of hedges between two existing arable fields, to facilitate use of farm machinery).
status: valid
status modified: 2018-05-18
accepted date: 2018-05-18
in scheme: Threats and pressures

Abandonment of grassland management (e.g. cessation of grazing or mowing)
type: Concept
notation: A06
definition: Abandonment of traditional agricultural practices in grasslands such as cessation of mowing or abandonment of traditional pastoral systems like itinerant grazing in mountain areas.
status: valid
status modified: 2018-05-18
accepted date: 2018-05-18
in scheme: Threats and pressures

Abandonment of management/use of other agricultural and agroforestry systems (all except grassland)
type: Concept
notation: A07
definition: Abandonment of traditional management systems or use of other agricultural systems (excluding grasslands), such as the abandonment of traditional farming, abandonment of mowing, grazing and other traditional uses of fens, mires, heathland or agroforestry habitats.
status: valid
status modified: 2018-05-18
accepted date: 2018-05-18
in scheme: Threats and pressures

Mowing or cutting of grasslands
type: Concept
notation: A08
definition: Inappropriate techniques or timing of mowing, for example mowing at inappropriate times, mowing with too high a frequency, using machinery or inadequate machinery for mowing of grasslands or leaving dead material after mowing on the ground (mulching).
status: valid
status modified: 2018-05-18
accepted date: 2018-05-18
in scheme: Threats and pressures

Intensive grazing or overgrazing by livestock
type: Concept
notation: A09
definition: Intensive grazing or overgrazing by livestock in agricultural and agroforestry habitats (e.g. pastures, meadows, pastured forests) where grazing causes damage to vegetation or soil (e.g. trampling, nitrogen input) or where livestock presents a disturbance or a competitor for species targeted by the nature directives. Includes intensive grazing in other habitats in agricultural landscapes (riparian areas, bogs, scrubs and forests) where grazing causes damage to vegetation or habitats.
status: valid
status modified: 2018-05-18
accepted date: 2018-05-18
in scheme: Threats and pressures

Extensive grazing or undergrazing by livestock
type: Concept
notation: A10
definition: Insufficient grazing or undergrazing that causes, for example, changes in species composition, or extensive grazing in inappropriate habitats like meadows or bogs.
status: valid
status modified: 2018-05-18
accepted date: 2018-05-18
in scheme: Threats and pressures

Burning for agriculture
type: Concept
notation: A11
definition: Burning as an agricultural practice, for example, to create a pasture, or burning agricultural waste like crop stubble.
status: valid
status modified: 2018-05-18
accepted date: 2018-05-18
in scheme: Threats and pressures

Suppression of fire for agriculture
type: Concept
notation: A12
definition: Suppression or lack of controlled burning used as a traditional management practice e.g. of heaths in wet and cold regions of Europe.
status: valid
status modified: 2018-05-18
accepted date: 2018-05-18
in scheme: Threats and pressures

Reseeding of grasslands and other semi-natural habitats
type: Concept
notation: A13
definition: Reseeding of grasslands and other semi-natural habitats.
status: valid
status modified: 2018-05-18
accepted date: 2018-05-18
in scheme: Threats and pressures

Livestock farming (without grazing)
type: Concept
notation: A14
definition: Other activities, except grazing, related to livestock farming, like animal breeding (e.g. causing point or diffuse pollution), livestock feeding or use of veterinary drugs (e.g. causing increased mortality of scavengers like vultures as a consequence of 'incidental poisoning' following the consumption of livestock carcasses treated with veterinary drugs). Includes abandonment of traditional processes related to livestock (e.g. closure of traditional livestock carcass dumps causing loss of food resources for vultures).
status: valid
status modified: 2018-05-18
accepted date: 2018-05-18
in scheme: Threats and pressures

Tillage practices (e.g. ploughing) in agriculture
type: Concept
notation: A15
definition: Inappropriate techniques or timing of tillage, for example, ploughing at inappropriate times, using inadequate machinery for ploughing or the inappropriate use of tillage (e.g. tillage in grasslands).
status: valid
status modified: 2018-05-18
accepted date: 2018-05-18
in scheme: Threats and pressures

Other soil management practices in agriculture
type: Concept
notation: A16
definition: Inappropriate use of soil management practices in agriculture or inappropriate techniques/timing of soil management other than tillage.
status: valid
status modified: 2018-05-18
accepted date: 2018-05-18
in scheme: Threats and pressures

Harvesting of crops and cutting of croplands
type: Concept
notation: A17
definition: Inappropriate techniques and timing of harvesting, for example, use of machinery for harvesting, use of inadequate machinery for harvesting (e.g. more efficient machinery may reduce the amount of unharvested/spilt grain available as food) or inappropriate harvesting periods (e.g. harvesting too early in season, harvesting during the night). Includes the cutting of vegetation along the edges of fields.
status: valid
status modified: 2018-05-18
accepted date: 2018-05-18
in scheme: Threats and pressures

Irrigation of agricultural land
type: Concept
notation: A18
definition: Input of water into semi-natural or extensive agricultural habitats (e.g. irrigation of olive orchards) possibly leading to changes in species composition or increased production. Includes the installation of irrigation infrastructure.
status: valid
status modified: 2018-05-18
accepted date: 2018-05-18
in scheme: Threats and pressures

Application of natural fertilisers on agricultural land
type: Concept
notation: A19
definition: Use, application, treatment and stocking of natural fertilisers (e.g. manure, slurry) for agricultural production.
status: valid
status modified: 2018-05-18
accepted date: 2018-05-18
in scheme: Threats and pressures

Application of synthetic (mineral) fertilisers on agricultural land
type: Concept
notation: A20
definition: Use, application, treatment and stocking of synthetic fertilisers for agricultural production.
status: valid
status modified: 2018-05-18
accepted date: 2018-05-18
in scheme: Threats and pressures

Use of plant protection chemicals in agriculture
type: Concept
notation: A21
definition: Use of plant protection chemicals in agriculture (e.g. pesticides, fungicides, growth retardants, hormones, seed coatings etc.).
status: valid
status modified: 2018-05-18
accepted date: 2018-05-18
in scheme: Threats and pressures

Use of physical plant protection in agriculture
type: Concept
notation: A22
definition: Use of physical plant protection in agriculture (e.g. weed picking or netting/cages for fruit ).
status: valid
status modified: 2018-05-18
accepted date: 2018-05-18
in scheme: Threats and pressures

Use of other pest control methods in agriculture (excluding tillage)
type: Concept
notation: A23
definition: Use of other pest control methods in agriculture (e.g. biocontrol)
status: valid
status modified: 2018-05-18
accepted date: 2018-05-18
in scheme: Threats and pressures

Waste management practices in agriculture
type: Concept
notation: A24
definition: Management of waste in agriculture (e.g. temporary holding of solutions like manure storage ponds/lagoons or deposition of waste).
status: valid
status modified: 2018-05-18
accepted date: 2018-05-18
in scheme: Threats and pressures

Agricultural activities generating point source pollution to surface or ground waters
type: Concept
notation: A25
definition: This pressure addresses point source water pollution resulting from activities which cannot be directly attributed to specific activities covered by other level 2 pressures (e.g. point pollution from an animal farm should be reported as A14 Livestock farming (without grazing)).
status: valid
status modified: 2018-05-18
accepted date: 2018-05-18
in scheme: Threats and pressures

Agricultural activities generating diffuse pollution to surface or ground waters
type: Concept
notation: A26
definition: This pressure addresses diffuse water pollution resulting from activities which cannot be directly attributed to specific activities covered by other level 2 pressures (e.g. diffuse pollution due to the application of fertilisers or plant protection chemicals should be reported under respective activities A20 Application of synthetic (mineral) fertilisers on agricultural land or A21 Use of plant protection chemicals in agriculture).
status: valid
status modified: 2018-05-18
accepted date: 2018-05-18
in scheme: Threats and pressures

Agricultural activities generating air pollution
type: Concept
notation: A27
definition: This pressure addresses air pollution resulting from agricultural activities and agricultural land use.
status: valid
status modified: 2018-05-18
accepted date: 2018-05-18
in scheme: Threats and pressures

Agricultural activities generating marine pollution
type: Concept
notation: A28
definition: This pressure addresses point or diffuse source marine pollution resulting from activities which cannot be directly attributed to specific activities covered by other level 2 pressures (e.g. diffuse pollution due to application of fertilisers or plant protection chemicals should be reported under respective activities A20 Application of synthetic (mineral) fertilisers on agricultural land or A21 Use of plant protection chemicals in agriculture).
status: valid
status modified: 2018-05-18
accepted date: 2018-05-18
in scheme: Threats and pressures

Agricultural activities generating soil pollution
type: Concept
notation: A29
definition: This pressure should be used to address the pollution resulting from activities which cannot be directly attributed to specific activities covered by other level 2 pressures (e.g. diffuse pollution due to application of fertilisers or plant protection chemicals should be reported under respective activities A20 Application of synthetic (mineral) fertilisers on agricultural land or A21 Use of plant protection chemicals in agriculture).
status: valid
status modified: 2018-05-18
accepted date: 2018-05-18
in scheme: Threats and pressures

Active abstractions from groundwater, surface water or mixed water for agriculture
type: Concept
notation: A30
definition: Abstraction of water for use in agriculture e.g. for irrigation or in large scale animal breeding.
status: valid
status modified: 2018-05-18
accepted date: 2018-05-18
in scheme: Threats and pressures

Drainage for use as agricultural land
type: Concept
notation: A31
definition: Activities like water abstraction, hydrological modifications, canalisation aimed at draining natural or semi-natural habitats for the use as agricultural land (e.g. drainage of wetlands for agriculture).
status: valid
status modified: 2018-05-18
accepted date: 2018-05-18
in scheme: Threats and pressures

Development and operation of dams for agriculture
type: Concept
notation: A32
definition: Development and operation of dams for agriculture (e.g. for irrigation).
status: valid
status modified: 2018-05-18
accepted date: 2018-05-18
in scheme: Threats and pressures

Modification of hydrological flow or physical alteration of water bodies for agriculture (excluding development and operation of dams)
type: Concept
notation: A33
definition: Activities modifying physical structure or hydrological functioning of water bodies triggered by agricultural production (e.g. altering of flooding regimes, altering regimes of rivers to keep sufficient water supply for irrigation, cleaning irrigation canals, canalisation of rivers and cutting of the oxbow lakes).
status: valid
status modified: 2018-05-18
accepted date: 2018-05-18
in scheme: Threats and pressures

Introduction and spread of new crops (including GMOs)
type: Concept
notation: A34
definition: Introduction and/or spread of new crops (e.g. crops producing pollen toxic for pollinators) and GMOs.
status: valid
status modified: 2018-05-18
accepted date: 2018-05-18
in scheme: Threats and pressures

Agricultural crops for renewable energy production
type: Concept
notation: A35
definition: Conversion of agricultural or non-agricultural habitats into areas of agricultural production of renewable energy stocks, and other pressures arising from the agricultural production of energy crops.
status: valid
status modified: 2018-05-18
accepted date: 2018-05-18
in scheme: Threats and pressures

Agriculture activities not referred to above
type: Concept
notation: A36
definition: Other agricultural activities not mentioned above.
status: valid
status modified: 2018-05-18
accepted date: 2018-05-18
in scheme: Threats and pressures

Conversion to forest from other land uses, or afforestation (excluding drainage)
type: Concept
notation: B01
definition: Increase in forest area, including planting of forests on grassland or heathland, or converting shrubs into forest. This pressure does not relate only to land use changes that occurred during the reporting period but it refers to instances where continuing the current forestry use of a natural/semi-natural habitat prevents the latter from being restored (e.g. in cases of land use conflicts between forestry and nature conservation for the restoration of some heathlands and peats, which were in the past afforested and are currently being managed and replanted as forests).
status: valid
status modified: 2018-05-18
accepted date: 2018-05-18
in scheme: Threats and pressures

Conversion to other types of forests including monocultures
type: Concept
notation: B02
definition: Conversion of forest habitats into another type of forest habitat, often conversion from extensive forests into production forests (e.g. conversion to monocultures) but also other types of conversion (e.g. conversion from coppice to high forest or changes of tree species composition). Includes deliberate changes. Passive abandonment of traditional forest management should be reported as B04. This pressure does not relate only to land use changes that occurred during the reporting period but it refers to instances where continuing the current forestry use of a natural/semi-natural habitat prevent the latter from being restored (e.g. in case of land use conflicts between forestry and nature conservation).
status: valid
status modified: 2018-05-18
accepted date: 2018-05-18
in scheme: Threats and pressures

Replanting with or introducing non-native or non-typical species (including new species and GMOs)
type: Concept
notation: B03
definition: Replanting with non-native (including new tree species and genetically modified organisms) or non-typical species (i.e. native species which do not naturally occur as a part of a specific forest type or within a specific region) after forest exploitation or planting non-native or non-typical species in existing forests.
status: valid
status modified: 2018-05-18
accepted date: 2018-05-18
in scheme: Threats and pressures

Abandonment of traditional forest management
type: Concept
notation: B04
definition: Abandonment of traditional management and maintenance of secondary forest habitats such as some oak and oak-hornbeam forests, chestnut forests or lichen-pine forests.
status: valid
status modified: 2018-05-18
accepted date: 2018-05-18
in scheme: Threats and pressures

Logging without replanting or natural regrowth
type: Concept
notation: B05
definition: Decline in forest area due to non-replanting or absence of natural regrowth after forest exploitation.
status: valid
status modified: 2018-05-18
accepted date: 2018-05-18
in scheme: Threats and pressures

Logging (excluding clear cutting) of individual trees
type: Concept
notation: B06
definition: Logging (of individual trees) causing damage to e.g. standing trees, forest undergrowth or soil and springs.
status: valid
status modified: 2018-05-18
accepted date: 2018-05-18
in scheme: Threats and pressures

Removal of dead and dying trees, including debris
type: Concept
notation: B07
definition: Removal of dead and dying trees (e.g. to prevent forestry pests) and removal of fallen wood (e.g. for firewood collection, fire prevention or enabling access by machinery).
status: valid
status modified: 2018-05-18
accepted date: 2018-05-18
in scheme: Threats and pressures

Removal of old trees (excluding dead or dying trees)
type: Concept
notation: B08
definition: Targeted removal of old trees (e.g. to preserve the forest structure or to improve regeneration). Includes logging of mature trees (trees with a high potential to become old) in forests with a diverse age structure.
status: valid
status modified: 2018-05-18
accepted date: 2018-05-18
in scheme: Threats and pressures

Clear-cutting, removal of all trees
type: Concept
notation: B09
definition: Forest clearance (small to large scale removal of all trees) causing damage to forest habitat or habitats of species targeted by the nature directives, to soil or springs or other physical features.
status: valid
status modified: 2018-05-18
accepted date: 2018-05-18
in scheme: Threats and pressures

Illegal logging
type: Concept
notation: B10
definition: Illegal logging e.g. organised illegal timber extraction.
status: valid
status modified: 2018-05-18
accepted date: 2018-05-18
in scheme: Threats and pressures

Cork extraction and forest exploitation excluding logging.
type: Concept
notation: B11
definition: Forest exploitation activities (e.g. cork extraction), excluding timber logging.
status: valid
status modified: 2018-05-18
accepted date: 2018-05-18
in scheme: Threats and pressures

Thinning of tree layer
type: Concept
notation: B12
definition: Removal of trees (including logging) of a certain tree layer(s) (upper or lower) in order to favour selected trees or to promote natural regeneration. Includes damage to soil, springs, forest habitats and undergrowth due to thinning.
status: valid
status modified: 2018-05-18
accepted date: 2018-05-18
in scheme: Threats and pressures

Burning for forestry
type: Concept
notation: B13
definition: Burning as a forestry practice (e.g. burning waste after exploitation).
status: valid
status modified: 2018-05-18
accepted date: 2018-05-18
in scheme: Threats and pressures

Suppression of fire for forestry
type: Concept
notation: B14
definition: Suppression of forest management practices using controlled burning and fire.
status: valid
status modified: 2018-05-18
accepted date: 2018-05-18
in scheme: Threats and pressures

Forest management reducing old growth forests.
type: Concept
notation: B15
definition: Shortening of logging rotations or other activities like thinning aimed at earlier logging.
status: valid
status modified: 2018-05-18
accepted date: 2018-05-18
in scheme: Threats and pressures

Wood transport
type: Concept
notation: B16
definition: Construction and maintenance of logging roads and tracks (closed to public circulation), wood transport within forest (damaging forest undergrowth, soil and springs) and poor management of wood transport (e.g. leaving the felled wood in piles in forests during summer or damage to soil).
status: valid
status modified: 2018-05-18
accepted date: 2018-05-18
in scheme: Threats and pressures

Tillage practices in forestry and other soil management practices in forestry
type: Concept
notation: B17
definition: Using tillage or other soil management practices in forestry (e.g. preparation of soil for forest replanting).
status: valid
status modified: 2018-05-18
accepted date: 2018-05-18
in scheme: Threats and pressures

Application of natural fertilisers
type: Concept
notation: B18
definition: Use, application, treatment and stocking of natural fertilisers (e.g. manure, slurry) in forestry.
status: valid
status modified: 2018-05-18
accepted date: 2018-05-18
in scheme: Threats and pressures

Application of synthetic fertilisers in forestry, including liming of forest soils
type: Concept
notation: B19
definition: Use, application, treatment and stocking of synthetic fertilisers in forestry.
status: valid
status modified: 2018-05-18
accepted date: 2018-05-18
in scheme: Threats and pressures

Use of plant protection chemicals in forestry
type: Concept
notation: B20
definition: Use of plant protection chemicals in forestry (e.g. pesticides, fungicides, pheromones or repulsives).
status: valid
status modified: 2018-05-18
accepted date: 2018-05-18
in scheme: Threats and pressures

Use of physical plant protection in forestry, excluding tree layer thinning
type: Concept
notation: B21
definition: Use of physical or mechanical plant protection in forestry (e.g. exclosure fencing, protective cages/sleeves around trees/saplings, cutting weeds, mulching).
status: valid
status modified: 2018-05-18
accepted date: 2018-05-18
in scheme: Threats and pressures

Use of other pest control methods in forestry
type: Concept
notation: B22
definition: Use of other pest control methods in forestry (e.g. biocontrol).
status: valid
status modified: 2018-05-18
accepted date: 2018-05-18
in scheme: Threats and pressures

Forestry activities generating pollution to surface or ground waters
type: Concept
notation: B23
definition: This pressure addresses diffuse water pollution resulting from activities which cannot be directly attributed to specific activities covered by other level 2 pressures (e.g. diffuse pollution due to application of fertilisers or plant protection chemicals should be reported under respective activities B19, Application of synthetic fertilisers in forestry, including liming of forest soils or B21 Use of physical plant protection in forestry, excluding tree layer thinning).
status: valid
status modified: 2018-05-18
accepted date: 2018-05-18
in scheme: Threats and pressures

Forestry activities generating air pollution
type: Concept
notation: B24
definition: This pressure addresses air pollution resulting from forestry activities.
status: valid
status modified: 2018-05-18
accepted date: 2018-05-18
in scheme: Threats and pressures

Forestry activities generating marine pollution
type: Concept
notation: B25
definition: This pressure addresses marine pollution resulting from activities which cannot be directly attributed to specific activities covered by other level 2 pressures (e.g. marine pollution due to the application of fertilisers or plant protection chemicals should be reported under respective activities B19 Application of synthetic fertilisers in forestry, including liming of forest soils or B21 Use of physical plant protection in forestry, excluding tree layer thinning).
status: valid
status modified: 2018-05-18
accepted date: 2018-05-18
in scheme: Threats and pressures

Forestry activities generating soil pollution
type: Concept
notation: B26
definition: This pressure addresses soil pollution resulting from activities which cannot be directly attributed to specific activities covered by other level 2 pressures (e.g. soil pollution due to application of fertilisers or plant protection chemicals should be reported under respective activities B19 Application of synthetic fertilisers in forestry, including liming of forest soils or B21 Use of physical plant protection in forestry, excluding tree layer thinning) .
status: valid
status modified: 2018-05-18
accepted date: 2018-05-18
in scheme: Threats and pressures

Modification of hydrological conditions, or physical alteration of water bodies and drainage for forestry (including dams)
type: Concept
notation: B27
definition: Activities modifying the physical structure or hydrological functioning of water bodies triggered by forestry production and exploitation, and activities aimed at drying out the land to facilitate forestry production or exploitation (e.g. altering of flooding regimes, canalisation of rivers, cutting of the oxbow lakes, building draining canals).
status: valid
status modified: 2018-05-18
accepted date: 2018-05-18
in scheme: Threats and pressures

Forests for renewable energy production
type: Concept
notation: B28
definition: Conversion of forest or non-forest habitats into short rotation coppices (e.g. coppices of willow, poplar or eucalyptus) or converting or maintaining existing forest as short rotation coppices/forests (e.g. chestnut forests) for biomass production and other pressures from forestry biomass production.
status: valid
status modified: 2018-05-18
accepted date: 2018-05-18
in scheme: Threats and pressures

Other forestry activities, excluding those relating to agro-forestry
type: Concept
notation: B29
definition: Other forestry activities not mentioned above (e.g. example pruning).
status: valid
status modified: 2018-05-18
accepted date: 2018-05-18
in scheme: Threats and pressures

Extraction of minerals (e.g. rock, metal ores, gravel, sand, shell)
type: Concept
notation: C01
definition: Extraction of rocks, gravel, sand, metal ores, loam, clay and shells from quarries, inland water bodies (lakes, river beds) and sea.
status: valid
status modified: 2018-05-18
accepted date: 2018-05-18
in scheme: Threats and pressures

Extraction of salt
type: Concept
notation: C02
definition: Extraction of salt from quarries and saltpans.
status: valid
status modified: 2018-05-18
accepted date: 2018-05-18
in scheme: Threats and pressures

Extraction of oil and gas, including infrastructure
type: Concept
notation: C03
definition: Exploration of, development of infrastructure for and extracting petroleum and other liquid hydrocarbons (e.g. deep sea natural gas drilling or hydraulic fracturing on land). Includes oil spills that occur at the drill site.
status: valid
status modified: 2018-05-18
accepted date: 2018-05-18
in scheme: Threats and pressures

Coal mining
type: Concept
notation: C04
definition: Coal mining including both open cast and underground mining.
status: valid
status modified: 2018-05-18
accepted date: 2018-05-18
in scheme: Threats and pressures

Peat extraction
type: Concept
notation: C05
definition: Extraction of peat (e.g. cutting of peat and mechanical removal of peat). Includes drainage associated with peat extraction.
status: valid
status modified: 2018-05-18
accepted date: 2018-05-18
in scheme: Threats and pressures

Dumping/depositing of inert materials from terrestrial extraction
type: Concept
notation: C06
definition: Dumping/depositing of inert materials from terrestrial extraction.
status: valid
status modified: 2018-05-18
accepted date: 2018-05-18
in scheme: Threats and pressures

Dumping/depositing of dredged materials from marine extraction
type: Concept
notation: C07
definition: Dumping/depositing of dredged materials from marine extraction.
status: valid
status modified: 2018-05-18
accepted date: 2018-05-18
in scheme: Threats and pressures

Abandonment or conversion of saltpans
type: Concept
notation: C08
definition: Abandonment or conversion of saltpans (e.g. for aquaculture or rice fields).
status: valid
status modified: 2018-05-18
accepted date: 2018-05-18
in scheme: Threats and pressures

Geotechnical surveying
type: Concept
notation: C09
definition: Geotechnical surveying for oil and gas exploration and exploration of mines (e.g. seismic marine surveys or surveys to evaluate potential for hydraulic fracturing).
status: valid
status modified: 2018-05-18
accepted date: 2018-05-18
in scheme: Threats and pressures

Extraction activities generating point source pollution to surface or ground waters
type: Concept
notation: C10
definition: This pressure should be used to address the point source pollution to surface and ground waters resulting from activities which cannot be directly attributed to specific activities covered by other level 2 pressures (e.g. point source pollution from coal mines or at oil and gas exploitation sites should be reported under the respective codes C04 Coal mining or C03 Extraction of oil and gas, including infrastructure).
status: valid
status modified: 2018-05-18
accepted date: 2018-05-18
in scheme: Threats and pressures

Extraction activities generating diffuse pollution to ground or surface waters
type: Concept
notation: C11
definition: This pressure should be used to address the diffuse pollution to surface and ground waters resulting from activities which cannot be directly attributed to specific activities covered by other level 2 pressures (e.g. diffuse pollution related to coal mining or oil and gas exploitation should be reported under the respective codes C04 Coal mining or C03 Extraction of oil and gas, including infrastructure).
status: valid
status modified: 2018-05-18
accepted date: 2018-05-18
in scheme: Threats and pressures

Extraction activities generating marine pollution
type: Concept
notation: C12
definition: This pressure should be used to address marine pollution resulting from activities which cannot be directly attributed to specific activities covered by other level 2 pressures (e.g. marine pollution related to oil and gas exploitation should be reported under C03 Extraction of oil and gas, including infrastructure).
status: valid
status modified: 2018-05-18
accepted date: 2018-05-18
in scheme: Threats and pressures

Extraction activities generating noise, light or other forms of pollution
type: Concept
notation: C13
definition: This pressure should be used to address the noise, light pollution or pollution by other forms of energy resulting from activities which cannot be directly attributed to specific activities covered by other level 2 pressures (e.g. sound wave pollution from marine seismic surveys should be reported as C09 Geotechnical surveying).
status: valid
status modified: 2018-05-18
accepted date: 2018-05-18
in scheme: Threats and pressures

Abstraction of surface and ground water for resource extraction
type: Concept
notation: C14
definition: Abstraction of water for processing the exploited materials.
status: valid
status modified: 2018-05-18
accepted date: 2018-05-18
in scheme: Threats and pressures

Mining and extraction activities not referred to above
type: Concept
notation: C15
definition: Other mining and extraction activities not mentioned above (e.g. closure of mines).
status: valid
status modified: 2018-05-18
accepted date: 2018-05-18
in scheme: Threats and pressures

Wind, wave and tidal power, including infrastructure
type: Concept
notation: D01
definition: Renewable energy (wind, wave and tidal power) generation including development and use of associated infrastructure (e.g. building wind turbines or tidal barrages, collision of birds with wind turbines, damage to coastal habitats or disturbance of marine mammals due to operation of tidal or wave barrages).
status: valid
status modified: 2018-05-18
accepted date: 2018-05-18
in scheme: Threats and pressures

Hydropower (dams, weirs, run-off-the-river), including infrastructure
type: Concept
notation: D02
definition: Hydropower generation including development and use of associated infrastructure (e.g. building dams or weirs, changes of hydrological functioning rivers or chemical and thermal properties of water due to operation of dams and weirs).
status: valid
status modified: 2018-05-18
accepted date: 2018-05-18
in scheme: Threats and pressures

Solar power, including infrastructure
type: Concept
notation: D03
definition: Renewable energy (solar power) generation including development and use of associated infrastructure (e.g. building solar farms).
status: valid
status modified: 2018-05-18
accepted date: 2018-05-18
in scheme: Threats and pressures

Geothermal power generation (including infrastructure)
type: Concept
notation: D04
definition: Renewable energy (geothermal power) generation including development and use of associated infrastructure (e.g. exploitation drills, geothermal wells, managing waste heat, managing pollution from geothermal waters, accidents).
status: valid
status modified: 2018-05-18
accepted date: 2018-05-18
in scheme: Threats and pressures

Development and operation of energy production plants (including bioenergy plants, fossil and nuclear energy plants)
type: Concept
notation: D05
definition: Development and operation of energy production plants (e.g. bioenergy plants, fossil and nuclear energy plants).
status: valid
status modified: 2018-05-18
accepted date: 2018-05-18
in scheme: Threats and pressures

Transmission of electricity and communications (cables)
type: Concept
notation: D06
definition: Construction, operation and maintenance of power lines and communication infrastructure (e.g. collisions or electrocution of wildlife with phone and power lines).
status: valid
status modified: 2018-05-18
accepted date: 2018-05-18
in scheme: Threats and pressures

Oil and gas pipelines
type: Concept
notation: D07
definition: Construction and operation of oil and gas pipelines in both the marine and terrestrial environment (e.g. negative impact of explosions, air pollution).
status: valid
status modified: 2018-05-18
accepted date: 2018-05-18
in scheme: Threats and pressures

Energy production and transmission activities generating pollution to surface or ground waters
type: Concept
notation: D08
definition: This pressure should be used to address the pollution to surface and ground waters resulting from activities which cannot be directly attributed to specific activities covered by other level 2 pressures (e.g. pollution from oil pipelines or from geothermal waters should be reported under D07 Oil and gas pipelines or D04 Geothermal power generation (including infrastructure)).
status: valid
status modified: 2018-05-18
accepted date: 2018-05-18
in scheme: Threats and pressures

Energy production and transmission activities generating air pollution
type: Concept
notation: D09
definition: This pressure should be used to address the air pollution resulting from activities which cannot be directly attributed to specific activities covered by other level 2 pressures (e.g. pollution from fossil energy plants should be reported as D05 Development and operation of energy production plants (including bioenergy plants, fossil and nuclear energy plants)).
status: valid
status modified: 2018-05-18
accepted date: 2018-05-18
in scheme: Threats and pressures

Energy production and transmission activities generating marine pollution
type: Concept
notation: D10
definition: This pressure should be used to address the marine pollution resulting from activities which cannot be directly attributed to specific activities covered by other level 2 pressures (e.g. pollution from oil pipelines or from geothermal waters should be reported under D07 Oil and gas pipelines or D04 Geothermal power generation (including infrastructure)).
status: valid
status modified: 2018-05-18
accepted date: 2018-05-18
in scheme: Threats and pressures

Energy production and transmission activities generating noise pollution
type: Concept
notation: D11
definition: This pressure should be used to address the noise pollution resulting from activities which cannot be directly attributed to specific activities covered by other level 2 pressures (e.g. noise pollution from wind, wave or tidal turbines should be reported under D01 Wind, wave and tidal power, including infrastructure)).
status: valid
status modified: 2018-05-18
accepted date: 2018-05-18
in scheme: Threats and pressures

Energy production and transmission activities generating light, heat or other forms pollution
type: Concept
notation: D12
definition: This pressure should be used to address the light, heat or other forms pollution resulting from activities which cannot be directly attributed to specific activities covered by other level 2 pressures (e.g. heat pollution from cooling waters should be reported under D05 Development and operation of energy production plants (including bioenergy plants, fossil and nuclear energy plants)).
status: valid
status modified: 2018-05-18
accepted date: 2018-05-18
in scheme: Threats and pressures

Abstraction of surface and ground water for energy production (excluding hydropower)
type: Concept
notation: D13
definition: Surface water abstraction for energy production (e.g. for cooling in electricity production).
status: valid
status modified: 2018-05-18
accepted date: 2018-05-18
in scheme: Threats and pressures

Energy production and transmission activities not referred to above
type: Concept
notation: D14
definition: Other energy production and transmission related activities not mentioned above.
status: valid
status modified: 2018-05-18
accepted date: 2018-05-18
in scheme: Threats and pressures

Roads, paths, railroads and related infrastructure (e.g. bridges, viaducts, tunnels)
type: Concept
notation: E01
definition: Construction and operation (e.g. collisions, traffic, noise, light, fencing associated with roads, use of salt for snow cleaning etc.) of road and related infrastructure and related pressures such as animal mortality, habitat fragmentation, improved access to sites via roads and paths.
status: valid
status modified: 2018-05-18
accepted date: 2018-05-18
in scheme: Threats and pressures

Shipping lanes and ferry lanes transport operations
type: Concept
notation: E02
definition: Operation and use of marine and inland water transport corridors, as well as pressures linked to transport activities on these freshwater and ocean waterways (e.g. disturbance from shipping at feeding/nesting areas, death or injury by collision, wakes from cargo ship traffic, oil spills from tankers, increased risk of colonisation of islands by invasive species). Includes the anchorage of ships and vessels (industrial, commercial).
status: valid
status modified: 2018-05-18
accepted date: 2018-05-18
in scheme: Threats and pressures

Shipping lanes, ferry lanes and anchorage infrastructure (e.g. canalisation, dredging)
type: Concept
notation: E03
definition: Maintenance and construction of marine and inland water shipping lanes, transport corridors or coastal infrastructure for anchorage of ships and vessels (industrial, commercial) including hydrological and morphological modifications for transport (e.g. canalisation, water deviation, barriers and locks, dredging and desilting of waterways for navigational purposes).
status: valid
status modified: 2018-05-18
accepted date: 2018-05-18
in scheme: Threats and pressures

Flight paths of planes, helicopter and other non-leisure aircrafts
type: Concept
notation: E04
definition: Transport activities on the flight paths of the aircraft including near airports (e.g. birds collisions with (commercial) aircraft at/near airports).
status: valid
status modified: 2018-05-18
accepted date: 2018-05-18
in scheme: Threats and pressures

Land, water and air transport activities generating pollution to surface or ground waters
type: Concept
notation: E05
definition: This pressure should be used to address the pollution to surface or ground waters resulting from activities which cannot be directly attributed to specific activities covered by other level 2 pressures (e.g. leaks and spills from commercial freshwater vessels should be reported under E02 Shipping lanes and ferry lanes transport operations).
status: valid
status modified: 2018-05-18
accepted date: 2018-05-18
in scheme: Threats and pressures

Land, water and air transport activities generating air pollution
type: Concept
notation: E06
definition: This pressure should be used to address air pollution resulting from activities which cannot be directly attributed to specific activities covered by other level 2 pressures (e.g. emissions from particular transportation methods like road transportation vehicles, aircrafts, container ships or ferries should be reported under respective codes E01 Roads, paths, railroads and related infrastructure (e.g. bridges, viaducts, tunnels), E02 Shipping lanes and ferry lanes transport operations or E04 Flight paths of planes, helicopter and other non-leisure aircrafts).
status: valid
status modified: 2018-05-18
accepted date: 2018-05-18
in scheme: Threats and pressures

Land, water and air transport activities generating marine pollution
type: Concept
notation: E07
definition: This pressure should be used to address marine pollution resulting from activities which cannot be directly attributed to specific activities covered by other level 2 pressures (e.g. oil spills from tankers or fuel oil leaks and discharges from ships and ferries should be reported under E02 Shipping lanes and ferry lanes transport operations).
status: valid
status modified: 2018-05-18
accepted date: 2018-05-18
in scheme: Threats and pressures

Land, water and air transport activities generating noise, light and other forms of pollution
type: Concept
notation: E08
definition: This pressure should be used to address noise, light and other forms of pollution resulting from activities which cannot be directly attributed to specific activities covered by other level 2 pressures (e.g. noise from shipping should be reported under E02 Shipping lanes and ferry lanes transport operations).
status: valid
status modified: 2018-05-18
accepted date: 2018-05-18
in scheme: Threats and pressures

Land, water and air transport activities not referred to above
type: Concept
notation: E09
definition: Other land, water and air transport activities not mentioned above.
status: valid
status modified: 2018-05-18
accepted date: 2018-05-18
in scheme: Threats and pressures

Conversion from other land uses to housing, settlement or recreational areas (excluding drainage and modification of coastline, estuary and coastal conditions)
type: Concept
notation: F01
definition: Conversion of natural and semi-natural habitats to housing, settlement or recreational areas. Includes development of dispersed housing. This pressure does not relate only to land use changes that occurred during the reporting period,it also refers to instances where continuing the current land use of a natural/semi-natural habitat prevent the latter from being restored.
status: valid
status modified: 2018-05-18
accepted date: 2018-05-18
in scheme: Threats and pressures

Construction or modification (e.g. of housing and settlements) in existing urban or recreational areas
type: Concept
notation: F02
definition: Construction in existing urban or recreational areas, reconstruction of existing buildings and structures, and the demolition of buildings and human structures. This pressure can include e.g. demolishment of structures important for nesting or sheltering of birds and bats, negative impact of isolation or other reconstruction works to nesting birds or bats. Includes deliberate closure of roofs (to prevent bats or birds).
status: valid
status modified: 2018-05-18
accepted date: 2018-05-18
in scheme: Threats and pressures

Conversion from other land uses to commercial / industrial areas (excluding drainage and modification of coastline, estuary and coastal conditions)
type: Concept
notation: F03
definition: Conversion of natural and semi-natural habitats to commercial or industrial areas (e.g. building the industrial parks or warehouse zones) or construction of solitary buildings not dedicated to housing and recreation (like solitary buildings for agricultural or forestry use). This pressure relates not only to land use changes that occurred during the reporting period but refers to instances where continuing the current land use of a natural/semi-natural habitat prevent the latter from being restored.
status: valid
status modified: 2018-05-18
accepted date: 2018-05-18
in scheme: Threats and pressures

Construction or modification of commercial / industrial infrastructure in existing commercial / industrial areas
type: Concept
notation: F04
definition: Construction in existing commercial or industrial areas, reconstruction of existing buildings and other industrial infrastructure and demolition of buildings and industrial structures. Includes reconstructions and demolishment of solitary buildings not dedicated for housing and recreation (like solitary buildings for agricultural or forestry use).
status: valid
status modified: 2018-05-18
accepted date: 2018-05-18
in scheme: Threats and pressures

Creation or development of sports, tourism and leisure infrastructure (outside the urban or recreational areas)
type: Concept
notation: F05
definition: Creation and development of sport and leisure structures outside the urban or recreational areas (e.g. building the ski lifts, cable cars, motocross circuits).
status: valid
status modified: 2018-05-18
accepted date: 2018-05-18
in scheme: Threats and pressures

Development and maintenance of beach areas for tourism and recreation incl. beach nourishment and beach cleaning
type: Concept
notation: F06
definition: Activities connected with development and maintenance of recreational coastal areas and beach resorts such as levelling of dunes morphology, beach cleaning (also with mechanical vehicles), beach nourishment, human trampling and overuse, construction of buildings connected to the seaside bathing establishments, marine/beach litter deposition.
status: valid
status modified: 2018-05-18
accepted date: 2018-05-18
in scheme: Threats and pressures

Sports, tourism and leisure activities
type: Concept
notation: F07
definition: Sport, tourism and leisure activities outside the urban and recreational zones (e.g. outdoor sports, leisure aircrafts, drones, human trampling, wildlife watching).
status: valid
status modified: 2018-05-18
accepted date: 2018-05-18
in scheme: Threats and pressures

F08
type: Concept
notation: F08
preferred label: Modification of coastline, estuary and coastal conditions for development, use and protection of residential, commercial, industrial and recreational infrastructure and areas (including sea defences or coastal protection works and infrastructures)
definition: Activities modifying coastline or estuary and coastal conditions triggered by urban development such as development and protection of residential, commercial, industrial and recreational infrastructure and areas. Includes activities like building sea defences and coastal protection infrastructure or maintenance of existing coastal structures (e.g. repairs to existing sea defences, harbour walls).
status: valid
status modified: 2018-05-18
accepted date: 2018-05-18
in scheme: Threats and pressures

Deposition and treatment of waste/garbage from household/recreational facilities
type: Concept
notation: F09
definition: Management, including deposition and treatment (e.g. dumps, landfills, incineration and other methods of physical or biological processing) of waste from urban and recreational areas (e.g. household waste, other urban waste like waste from hospitals or from urban green areas, food waste from recreational areas).
status: valid
status modified: 2018-05-18
accepted date: 2018-05-18
in scheme: Threats and pressures

Deposition and treatment of waste/garbage from commercial and industrial facilities.
type: Concept
notation: F10
definition: Management, including deposition and treatment (e.g. dumps, landfills, incineration recycling and other methods of physical or chemical processing) of waste from industrial production processes.
status: valid
status modified: 2018-05-18
accepted date: 2018-05-18
in scheme: Threats and pressures

Pollution to surface or ground water due to urban run-offs
type: Concept
notation: F11
definition: Pollution from rain and storm water running from urbanised areas carrying pollutants from roads and parking plots as well as fertilizers and pesticides used for urban vegetation.
status: valid
status modified: 2018-05-18
accepted date: 2018-05-18
in scheme: Threats and pressures

Discharge of urban waste water (excluding storm overflows and/or urban run-offs) generating pollution to surface or ground water
type: Concept
notation: F12
definition: Discharges of urban waste water (sewage) into surface and ground waters as well as discharges from non-manufacturing commercial areas which can largely be assimilated as urban waste water. Includes also activities related to household waste water treatment.
status: valid
status modified: 2018-05-18
accepted date: 2018-05-18
in scheme: Threats and pressures

Plants, contaminated or abandoned industrial sites generating pollution to surface or ground water
type: Concept
notation: F13
definition: Discharges of industrial waste water into surface and ground waters as well as diffuse pollution from contaminated or abandoned industrial sites. Includes also activities related to industrial waste water treatment.
status: valid
status modified: 2018-05-18
accepted date: 2018-05-18
in scheme: Threats and pressures

Other residential and recreational activities and structures generating point pollution to surface or ground waters
type: Concept
notation: F14
definition: This pressure should be used to address the point pollution to surface and ground waters originating from urban and recreational areas which cannot be directly attributed to specific activities covered by other level 2 pressures (e.g. if the source of the pollution is unknown or pollution is from several different sources).
status: valid
status modified: 2018-05-18
accepted date: 2018-05-18
in scheme: Threats and pressures

Other industrial and commercial activities and structures generating point pollution to surface or ground waters
type: Concept
notation: F15
definition: This pressure should be used to address the point pollution to surface and ground waters originating from industrial processes (i.e. from industrial production and processing) and structures which cannot be directly attributed to specific activities covered by other level 2 pressures (e.g. if the source of the pollution is unknown or pollution is from several different sources like from production sites together with solid waste treatment and disposal processes).
status: valid
status modified: 2018-05-18
accepted date: 2018-05-18
in scheme: Threats and pressures

Other residential and recreational activities and structures generating diffuse pollution to surface or ground waters
type: Concept
notation: F16
definition: This pressure should be used to address the diffuse pollution to surface and ground waters originating from urban and recreational areas which cannot be directly attributed to specific activities covered by other level 2 pressures (e.g. if the source of the pollution is unknown or pollution is from several different sources).
status: valid
status modified: 2018-05-18
accepted date: 2018-05-18
in scheme: Threats and pressures

Other industrial and commercial activities and structures generating diffuse pollution to surface or ground waters
type: Concept
notation: F17
definition: This pressure should be used to address the diffuse pollution to surface and ground waters originating from industrial processes (i.e. from industrial production and processing) and structures which cannot be directly attributed to specific activities covered by other level 2 pressures (e.g. if the source of the pollution is unknown or pollution is from several different sources like from production sites together with solid waste treatment and disposal processes).
status: valid
status modified: 2018-05-18
accepted date: 2018-05-18
in scheme: Threats and pressures

Residential and recreational activities and structures generating air pollution
type: Concept
notation: F18
definition: Different activities related to residential and recreational areas generating air pollution (e.g. heating).
status: valid
status modified: 2018-05-18
accepted date: 2018-05-18
in scheme: Threats and pressures

Industrial and commercial activities and structures generating air pollution
type: Concept
notation: F19
definition: Industrial activities (i.e. industrial production and processing) generating air pollution (e.g. industrial production).
status: valid
status modified: 2018-05-18
accepted date: 2018-05-18
in scheme: Threats and pressures

Residential or recreational activities and structures generating marine pollution (excl. marine macro- and micro-particular pollution)
type: Concept
notation: F20
definition: This pressure should be used to address the marine pollution originating from urban and recreational areas which cannot be directly attributed to specific activities covered by other level 2 pressures (e.g. if the source of the pollution is unknown or pollution is from several different sources).
status: valid
status modified: 2018-05-18
accepted date: 2018-05-18
in scheme: Threats and pressures

Industrial or commercial activities and structures generating marine pollution (excluding marine macro- and micro-particular pollution)
type: Concept
notation: F21
definition: This pressure should be used to address the marine pollution originating from industrial processes (i.e. from industrial production and processing) and structures which cannot be directly attributed to specific activities covered by other level 2 pressures (e.g. if the source of the pollution is unknown or pollution is from several different sources like from production sites together with solid waste treatment and disposal processes).
status: valid
status modified: 2018-05-18
accepted date: 2018-05-18
in scheme: Threats and pressures

Residential or recreational activities and structures generating marine macro- and micro- particulate pollution (e.g. plastic bags, Styrofoam)
type: Concept
notation: F22
definition: Different activities (e.g. urban waste disposal, use of products containing micro-particles) related to residential and recreational areas generating marine macro- and micro- particulate pollution (e.g. plastic bags, Styrofoam). Includes micro-residues in benthic habitats.
status: valid
status modified: 2018-05-18
accepted date: 2018-05-18
in scheme: Threats and pressures

Industrial or commercial activities and structures generating marine macro- and micro- particulate pollution (e.g. plastic bags, Styrofoam)
type: Concept
notation: F23
definition: Industrial processes (i.e. from industrial production and processing) , storage and transportation of industrial products generating marine macro- and micro- particulate pollution (e.g. plastic bags, Styrofoam). Includes micro-residues in benthic habitats.
status: valid
status modified: 2018-05-18
accepted date: 2018-05-18
in scheme: Threats and pressures

Residential or recreational activities and structures generating noise, light, heat or other forms of pollution
type: Concept
notation: F24
definition: Different activities and structures related to residential and recreational areas that generate noise, light, heat or other forms of pollution.
status: valid
status modified: 2018-05-18
accepted date: 2018-05-18
in scheme: Threats and pressures

Industrial or commercial activities and structures generating noise, light, heat or other forms of pollution
type: Concept
notation: F25
definition: Industrial processes (i.e. from industrial production and processing) and structures generating noise, light, heat or other forms of pollution.
status: valid
status modified: 2018-05-18
accepted date: 2018-05-18
in scheme: Threats and pressures

Drainage, land reclamation and conversion of wetlands, marshes, bogs, etc. to settlement or recreational areas
type: Concept
notation: F26
definition: Drainage, land reclamation and conversion of wetlands (e.g. marshes, bogs, fens, alluvial habitats) to prepare land for construction of human settlements or for use as recreational areas.
status: valid
status modified: 2018-05-18
accepted date: 2018-05-18
in scheme: Threats and pressures

Drainage, land reclamation or conversion of wetlands, marshes, bogs, etc. to industrial/commercial areas
type: Concept
notation: F27
definition: Drainage, land reclamation and conversion of wetlands (e.g. marshes, bogs, fens, alluvial habitats) to prepare land for construction of industrial/commercial areas.
status: valid
status modified: 2018-05-18
accepted date: 2018-05-18
in scheme: Threats and pressures

Modification of flooding regimes, flood protection for residential or recreational development
type: Concept
notation: F28
definition: Activities modifying physical structure and/or hydrological functioning of water bodies triggered by flood protection of urban and recreational zones (e.g. flood protection dams and reservoirs, river impoundments, canalisation, water deviation, removing bank vegetation).
status: valid
status modified: 2018-05-18
accepted date: 2018-05-18
in scheme: Threats and pressures

Construction or development of reservoirs and dams for residential or recreational development
type: Concept
notation: F29
definition: Construction, development, use and maintenance of reservoirs and dams for residential or recreational use (e.g. drinking water supply).
status: valid
status modified: 2018-05-18
accepted date: 2018-05-18
in scheme: Threats and pressures

Construction or development of reservoirs and dams for industrial or commercial development
type: Concept
notation: F30
definition: Construction, development, use and maintenance of reservoirs and dams for industrial or commercial development and use (e.g. for industrial cooling).
status: valid
status modified: 2018-05-18
accepted date: 2018-05-18
in scheme: Threats and pressures

Other modification of hydrological conditions for residential or recreational development
type: Concept
notation: F31
definition: This pressure should be used to address activities related to development and use of housing and recreational areas and structures modifying physical structure and/or hydrological functioning of water bodies which cannot be directly attributed to specific activities covered by other level 2 pressures.
status: valid
status modified: 2018-05-18
accepted date: 2018-05-18
in scheme: Threats and pressures

Other modification of hydrological conditions for industrial or commercial development
type: Concept
notation: F32
definition: This pressure should be used to address activities related to development and use of industrial areas structures modifying physical structure and/or hydrological functioning of water bodies which cannot be directly attributed to specific activities covered by other level 2 pressures.
status: valid
status modified: 2018-05-18
accepted date: 2018-05-18
in scheme: Threats and pressures

Abstraction of ground and surface waters (including marine) for public water supply and recreational use
type: Concept
notation: F33
definition: Abstraction from ground and surface waters for public water supply and recreational use (e.g. abstraction of fresh/marine water for swimming pools).
status: valid
status modified: 2018-05-18
accepted date: 2018-05-18
in scheme: Threats and pressures

Abstraction of ground and surface waters (including marine) for commercial/industrial use (excluding energy)
type: Concept
notation: F34
definition: Abstraction from ground and surface waters (including marine) for commercial/industrial use (e.g. for industrial cooling or industrial processing).
status: valid
status modified: 2018-05-18
accepted date: 2018-05-18
in scheme: Threats and pressures

Marine fish and shellfish harvesting (professional, recreational) causing reduction of species/prey populations and disturbance of species
type: Concept
notation: G01
definition: Professional and recreational marine fishing and shellfish harvesting causing increased mortality, reduction of species and/or prey populations and disturbance to species.
status: valid
status modified: 2018-05-18
accepted date: 2018-05-18
in scheme: Threats and pressures

Marine fish and shellfish processing
type: Concept
notation: G02
definition: Activities related to marine fish and shellfish processing like handling the catch, storing, pre-processing and processing, and waste treatment.
status: valid
status modified: 2018-05-18
accepted date: 2018-05-18
in scheme: Threats and pressures

Marine fish and shellfish harvesting (professional, recreational) activities causing physical loss and disturbance of seafloor habitats.
type: Concept
notation: G03
definition: Professional and recreational marine fishing and shellfish harvesting activities causing physical loss and disturbance of seafloor habitats (e.g. bottom trawling, benthic dredging).
status: valid
status modified: 2018-05-18
accepted date: 2018-05-18
in scheme: Threats and pressures

Marine plant harvesting
type: Concept
notation: G04
definition: Commercial and non-professional harvesting of wild marine macro- and micro-algae .
status: valid
status modified: 2018-05-18
accepted date: 2018-05-18
in scheme: Threats and pressures

Freshwater fish and shellfish harvesting (professional)
type: Concept
notation: G05
definition: Professional freshwater fishing and shellfish harvesting causing increased direct mortality, reduction of species and/or prey populations and disturbance to species.
status: valid
status modified: 2018-05-18
accepted date: 2018-05-18
in scheme: Threats and pressures

Freshwater fish and shellfish harvesting (recreational)
type: Concept
notation: G06
definition: Recreational freshwater fishing and shellfish harvesting causing increased direct mortality, reduction of species and/or prey populations and disturbance to species.
status: valid
status modified: 2018-05-18
accepted date: 2018-05-18
in scheme: Threats and pressures

Hunting
type: Concept
notation: G07
definition: Hunting causing increased direct mortality, reduction of species and/or prey populations and disturbance to species.
status: valid
status modified: 2018-05-18
accepted date: 2018-05-18
in scheme: Threats and pressures

Management of fishing stocks and game
type: Concept
notation: G08
definition: Activities related to management of fishing stocks and game such as stocking or restocking with native fish species (including illegal restocking), management of game population (e.g. control of certain other predators, such as corvids, by gamekeepers), management of game habitat (e.g. burning of heather for Lagopus lagopus), feeding of game, damages due to overabundant game.
status: valid
status modified: 2018-05-18
accepted date: 2018-05-18
in scheme: Threats and pressures

Harvesting or collecting of other wild plants and animals (excluding hunting and leisure fishing)
type: Concept
notation: G09
definition: Harvesting or collecting of other wild plants and animals (excluding fish, shellfish and game) for example, honey, fruit or wild mushroom collection, reed cutting/harvesting, orchid collection, butterfly collecting, pillaging of floristic stations.
status: valid
status modified: 2018-05-18
accepted date: 2018-05-18
in scheme: Threats and pressures

Illegal shooting/killing
type: Concept
notation: G10
definition: Illegal shooting, killing or collecting of animal species. This includes, for example, illegal killing of game species, illegal taking of fish, illegal collecting of strictly protected animal species. Also includes hunting, capture or killing using methods and forms referred to in the Article 8 of the Birds Directive (e.g. 'indiscriminate' forms of hunting for birds such as snares) or in Article 15 of the Habitats Directive; or the practice of hunting and fishing activities that do not conform to e.g. quotas or seasonal restrictions.
status: valid
status modified: 2018-05-18
accepted date: 2018-05-18
in scheme: Threats and pressures

Illegal harvesting, collecting and taking
type: Concept
notation: G11
definition: Illegal harvesting, collecting and taking of plant species (e.g. collecting strictly protected species or illegal taking of other plants species for which harvesting is regulated).
status: valid
status modified: 2018-05-18
accepted date: 2018-05-18
in scheme: Threats and pressures

Bycatch and incidental killing (due to fishing and hunting activities)
type: Concept
notation: G12
definition: Bycatch and incidental killing due to fishing and hunting activities (e.g. 'accidentally' shooting of a non-target species, because of similarities with a target species, capture/drowning on long-lines and in fishing nets, entanglement in discarded/lost fishing gear).
status: valid
status modified: 2018-05-18
accepted date: 2018-05-18
in scheme: Threats and pressures

Poisoning of animals (excluding lead poisoning)
type: Concept
notation: G13
definition: Deliberate poisoning of animals including the effect of secondary poisoning.
status: valid
status modified: 2018-05-18
accepted date: 2018-05-18
in scheme: Threats and pressures

Use of lead ammunition or fishing weights
type: Concept
notation: G14
definition: Poisoning related to the use of lead shots, lead bullet fragments or fishing weights.
status: valid
status modified: 2018-05-18
accepted date: 2018-05-18
in scheme: Threats and pressures

Modification of coastal conditions for marine aquaculture
type: Concept
notation: G15
definition: Activities modifying coastal conditions triggered by marine aquaculture (e.g. habitat loss and degradation in coastal areas due to development and installation of infrastructure). Includes changes like changes in sedimentation rates due to operation of facilities and use of equipment and tools (e.g. for harvesting).
status: valid
status modified: 2018-05-18
accepted date: 2018-05-18
in scheme: Threats and pressures

Marine aquaculture generating marine pollution
type: Concept
notation: G16
definition: Marine pollution from marine aquaculture (e.g. nutrient input from feeding, pollution due to use of veterinary products or fertilisers or increased concentrations of organic material). Includes pollution by litter.
status: valid
status modified: 2018-05-18
accepted date: 2018-05-18
in scheme: Threats and pressures

Introduction and spread of species (including GMOs) in marine aquaculture
type: Concept
notation: G17
definition: Introduction and/or spread of allochthonous species or allochthonous genotypes and of genetically modified organisms in marine aquaculture. It also includes changes in interspecific relations between native wild species induced by marine aquaculture (e.g. changes in sexual behaviour of autochthonous population due to aquaculture, increased food supply for piscivorous species).
status: valid
status modified: 2018-05-18
accepted date: 2018-05-18
in scheme: Threats and pressures

Abandonment of marine aquaculture
type: Concept
notation: G18
definition: Abandonment of marine aquaculture.
status: valid
status modified: 2018-05-18
accepted date: 2018-05-18
in scheme: Threats and pressures

Other impacts from marine aquaculture, including infrastructure
type: Concept
notation: G19
definition: Other impacts from marine aquaculture and development and use of marine aquaculture facilities and infrastructure (e.g. disturbance due to noise and light from construction or operation of aquaculture farms, disturbance from anti-predator devices).
status: valid
status modified: 2018-05-18
accepted date: 2018-05-18
in scheme: Threats and pressures

Abstraction of water, flow diversion, dams and other modifications of hydrological conditions for freshwater aquaculture
type: Concept
notation: G20
definition: Abstraction of water, flow deviation, development and operation of dams and reservoirs and other changes to the physical structure of water bodies or hydrological flow or triggered by freshwater aquaculture.
status: valid
status modified: 2018-05-18
accepted date: 2018-05-18
in scheme: Threats and pressures

Freshwater aquaculture generating point source pollution to surface or ground waters
type: Concept
notation: G21
definition: Chemical or biological point pollution to surface or ground waters from freshwater aquaculture (e.g. nutrient input from feeding, pollution due to use of veterinary products or increased concentrations of organic material).
status: valid
status modified: 2018-05-18
accepted date: 2018-05-18
in scheme: Threats and pressures

Freshwater aquaculture generating diffuse source pollution to surface or ground waters
type: Concept
notation: G22
definition: Chemical or biological diffuse pollution to surface or ground waters from freshwater aquaculture (e.g. nutrient input from feeding, pollution due to use of veterinary products or increased concentrations of organic material).
status: valid
status modified: 2018-05-18
accepted date: 2018-05-18
in scheme: Threats and pressures

Freshwater aquaculture generating marine pollution
type: Concept
notation: G23
definition: Chemical or biological marine pollution from freshwater aquaculture (e.g. nutrient input from feeding, pollution due to use of veterinary products or fertilisers or increased concentrations of organic material).
status: valid
status modified: 2018-05-18
accepted date: 2018-05-18
in scheme: Threats and pressures

Introduction and spread of species (including alien species and GMOs) in freshwater aquaculture
type: Concept
notation: G24
definition: Introduction and/or spread of allochthonous species or allochthonous genotypes and of genetically modified organisms in freshwater aquaculture. It also includes changes in interspecific relationships between native wild species introduced by aquaculture (e.g. an increase of piscivorous fishes due to aquaculture practices that would exert added pressure on endangered amphibians, increase in food supply for native fish populations).
status: valid
status modified: 2018-05-18
accepted date: 2018-05-18
in scheme: Threats and pressures

Abandonment of freshwater aquaculture
type: Concept
notation: G25
definition: Abandonment of freshwater aquaculture.
status: valid
status modified: 2018-05-18
accepted date: 2018-05-18
in scheme: Threats and pressures

Other impacts from freshwater aquaculture, including infrastructure
type: Concept
notation: G26
definition: Other impacts from freshwater aquaculture and development and use of freshwater aquaculture facilities and infrastructure (e.g. disturbance due to noise and light from construction or operation of aquaculture farms).
status: valid
status modified: 2018-05-18
accepted date: 2018-05-18
in scheme: Threats and pressures

Other activities related to extraction and cultivation of biological living resources not referred to above
type: Concept
notation: G27
definition: Other activities related to extraction and cultivation of biological living resources not referred to above.
status: valid
status modified: 2018-05-18
accepted date: 2018-05-18
in scheme: Threats and pressures

Military, paramilitary or police exercises and operations on land
type: Concept
notation: H01
definition: Military, paramilitary or police infrastructure, exercises and operations on land (excluding military bases in urbanised areas). Includes, for example, munitions testing, restricted access to military training areas, military manoeuvres).
status: valid
status modified: 2018-05-18
accepted date: 2018-05-18
in scheme: Threats and pressures

Military, paramilitary or police exercises and operations in the freshwater and marine environment
type: Concept
notation: H02
definition: Military, paramilitary or police infrastructure, exercises and operations in the freshwater and marine environment (e.g. collisions with vessels, disturbance by sonar from military vessels).
status: valid
status modified: 2018-05-18
accepted date: 2018-05-18
in scheme: Threats and pressures

Abandonment of terrestrial military or similar exercises (loss of open habitats)
type: Concept
notation: H03
definition: Abandonment of terrestrial military or similar exercises (e.g. natural successions on open habitats due to cessation of military activities).
status: valid
status modified: 2018-05-18
accepted date: 2018-05-18
in scheme: Threats and pressures

Vandalism or arson
type: Concept
notation: H04
definition: Vandalism or arson, including for example larger scale wildfires initiated by arson.
status: valid
status modified: 2018-05-18
accepted date: 2018-05-18
in scheme: Threats and pressures

Tree surgery, felling/removal of roadside trees and vegetation for public safety
type: Concept
notation: H05
definition: Tree surgery, felling or removal of roadside trees and vegetation on the grounds of public safety (including interventions classified as public safety issue).
status: valid
status modified: 2018-05-18
accepted date: 2018-05-18
in scheme: Threats and pressures

Closure or restricted access to site/habitat
type: Concept
notation: H06
definition: Closure or restricted access to sites, like fencing of open sites, closure of caves, natural galleries and other types of restricted access to a habitat or site related to protection of private property and human safety.
status: valid
status modified: 2018-05-18
accepted date: 2018-05-18
in scheme: Threats and pressures

Intrusive and destructive research and monitoring activities
type: Concept
notation: H07
definition: Applied (intrusive) destructive research. Includes for example collection of animals/plants for scientific purposes.
status: valid
status modified: 2018-05-18
accepted date: 2018-05-18
in scheme: Threats and pressures

Other human intrusions and disturbance not mentioned above
type: Concept
notation: H08
definition: Other human intrusions and disturbance not mentioned above (e.g. illegal dumping).
status: valid
status modified: 2018-05-18
accepted date: 2018-05-18
in scheme: Threats and pressures

Invasive alien species of Union concern
type: Concept
notation: I01
definition: Problems related to invasive alien species of Union concern (under Regulation (EU) No 1143/2014) (e.g. clogging of aquatic habitats by Eichhornia crassipes,predation of adults and chicks/eggs by Myocastor coypus, Nyctereutes procyonoides and Procyon lotor, browsing of understorey habitats by Muntiacus reevesi, competition for food with Procambarus clarkii,hybridisation with Oxyura jamaicensis).
status: valid
status modified: 2018-05-18
accepted date: 2018-05-18
in scheme: Threats and pressures

Other invasive alien species (other then species of Union concern)
type: Concept
notation: I02
definition: Problems related to other 'invasive' alien species (any species introduced in modern period that is established in the wild outside its natural range and whose introduction and/or spread represent a threat or a potential threat to habitats and species, regardless of the invasive population dynamics) other than invasive alien species of Union concern (under Regulation (EU) No 1143/2014), for which code I01 should be used) (e.g. predation of adults and chicks/eggs by Genetta genetta, Neovison vison, Rattus norvegicus and R. rattus, loss of (native) prey species owing to competition with Crassostrea gigas,decline in the quality of native vegetation owing to spread of invasive plant species (e.g. Amorpha fruticosa and Hedychium gardnerianum),overgrowing of alluvial and lowland humid habitats with invasive plants (e.g. Solidago gigantea, S. canadensis, Aster lanceolatus, A. novi-belgii, Fallopia japonica, F. sachaliensis and Impatiens glandulifera)).
status: valid
status modified: 2018-05-18
accepted date: 2018-05-18
in scheme: Threats and pressures

DO NOT USE Other alien species (not invasive)
type: Concept
notation: I03
definition: This code should not be used for new entries. It has been restored for technical reason.
status: valid
status modified: 2018-05-18
accepted date: 2018-05-18
in scheme: Threats and pressures

Problematic native species
type: Concept
notation: I04
definition: Harmful plants, animals, that are originally found within the ecosystem(s) in question, but have become out-of-balance directly or indirectly due to human activities. It includes, for example, problems with feral native animals (e.g. cats, dog); overabundant algae due to loss of native grazing fish; predation of adults, fledglings and chicks/eggs by Mus musculus, native Mustela spp., Sus scrofa, Vulpes vulpes and domestic/feral Felis catus; interbreeding with feral Columba livia. This pressure should be used if problems with native species cannot be associated with other more specific drivers/pressures (e.g. when problems with native species can be associated with multiple human activities or more precise activities are unknown).
status: valid
status modified: 2018-05-18
accepted date: 2018-05-18
in scheme: Threats and pressures

Plant and animal diseases, pathogens and pests
type: Concept
notation: I05
definition: Problems related to plant and animal diseases, pathogens and pests (including insect and nematode pests) like plague affecting rodents or diseases such as those caused by Clostridium botulinum (avian botulism) and Trichomonas gallinae (trichomoniasis).
status: valid
status modified: 2018-05-18
accepted date: 2018-05-18
in scheme: Threats and pressures

Mixed source pollution to surface and ground waters (limnic and terrestrial)
type: Concept
notation: J01
definition: Mixed source pollution to surface and ground waters. Pollution should only be reported under this category when the key driver of the pollution is unclear or where pollution is related to several causes. (e.g. river eutrophication can be related to several direct and indirect sources like sewage, agricultural and industrial discharges, diffuse pollution from agriculture, decreased retention of alluvial vegetation due to inadequate management). Where a key sectoral driver can be identified, pollution should be reported under the corresponding sectoral pollution category.
status: valid
status modified: 2018-05-18
accepted date: 2018-05-18
in scheme: Threats and pressures

Mixed source marine water pollution (marine and coastal)
type: Concept
notation: J02
definition: Mixed source marine water pollution (marine and coastal). Pollution should only be reported under this category when the key driver of the pollution is unclear or where pollution is related to several causes (e.g. marine pollution by hydrocarbons can be related to several sources, like industrial discharges, water and land based transport operation, pollution, transport and exploitation accidents). Where a key sectoral driver can be identified, pollution should be reported under the corresponding sectoral pollution category.
status: valid
status modified: 2018-05-18
accepted date: 2018-05-18
in scheme: Threats and pressures

Mixed source air pollution, air-borne pollutants
type: Concept
notation: J03
definition: Mixed source air pollution, air-borne pollutants. Pollution should only be reported under this category when the key driver of the pollution is unclear or where pollution is related to several causes (e.g. source of pollutants for acid rain is usually a mix of emissions from vehicles, power plants etc.). Where a key sectoral driver can be identified, pollution should be reported under the corresponding sectoral pollution category.
status: valid
status modified: 2018-05-18
accepted date: 2018-05-18
in scheme: Threats and pressures

Mixed source soil pollution and solid waste (excluding discharges)
type: Concept
notation: J04
definition: Mixed source soil pollution and solid waste (excluding discharges). Pollution should only be reported under this category when the key driver of the pollution is unclear or where pollution is related to several causes. Where a key sectoral driver can be identified, pollution should be reported under the corresponding sectoral pollution category.
status: valid
status modified: 2018-05-18
accepted date: 2018-05-18
in scheme: Threats and pressures

Mixed source excess energy
type: Concept
notation: J05
definition: Mixed source excess energy. Pollution should only be reported under this category when the key driver of the pollution is unclear or where pollution is related to several causes. Where a key sectoral driver can be identified, pollution should be reported under the corresponding sectoral pollution category.
status: valid
status modified: 2018-05-18
accepted date: 2018-05-18
in scheme: Threats and pressures

Abstraction from groundwater, surface water or mixed water
type: Concept
notation: K01
definition: Abstractions from groundwater, surface water or mixed water should only be reported under this category when the key driver of the change is unclear or where these changes are related to several causes. Where a key sectoral driver(s) can be identified, the pressure/threat should be reported under the corresponding sectoral category.
status: valid
status modified: 2018-05-18
accepted date: 2018-05-18
in scheme: Threats and pressures

Drainage
type: Concept
notation: K02
definition: Drainage including landfill, land reclamation and drying out should only be reported under this category when the key driver of the change is unclear or where these changes are related to several causes. Where a key sectoral driver(s) can be identified, the pressure/threat should be reported under the corresponding sectoral category.
status: valid
status modified: 2018-05-18
accepted date: 2018-05-18
in scheme: Threats and pressures

Development and operation of dams
type: Concept
notation: K03
definition: Development and operation of dams should only be reported under this category when the key driver of the change is unclear or where these changes are related to several causes. Where a key sectoral driver(s) can be identified, the pressure/threat should be reported under the corresponding sectoral category.
status: valid
status modified: 2018-05-18
accepted date: 2018-05-18
in scheme: Threats and pressures

Modification of hydrological flow
type: Concept
notation: K04
definition: Modification of hydrological flow should only be reported under this category when the key driver of the change is unclear or where these changes are related to several causes. Where a key sectoral driver can be identified, the pressure/threat should be reported under the corresponding sectoral category. Includes, for example, modification of flooding regimes or cutting of aquatic and bank vegetation to improve water flow.
status: valid
status modified: 2018-05-18
accepted date: 2018-05-18
in scheme: Threats and pressures

Physical alteration of water bodies
type: Concept
notation: K05
definition: Physical alteration of water bodies should only be reported under this category when the key driver of the change is unclear or where these changes are related to several causes. Where a key sectoral driver(s) can be identified, the pressure/threat should be reported under the corresponding sectoral category. Includes, for example, removal of sediments, canalisation and water deviation.
status: valid
status modified: 2018-05-18
accepted date: 2018-05-18
in scheme: Threats and pressures

Abiotic natural processes (e.g. erosion, silting up, drying out, submersion, salinization)
type: Concept
notation: L01
definition: Abiotic natural processes (e.g. natural erosion in areas with naturally low vegetation cover). Includes natural abiotic processes only. The abiotic processes resulting from human activities or the abandonment of human activities should be reported under the appropriate pressures, for example, silting up as a result of erosion due to wood transport should be coded as B16 Wood transport.
status: valid
status modified: 2018-05-18
accepted date: 2018-05-18
in scheme: Threats and pressures

Natural succession resulting in species composition change (other than by direct changes of agricultural or forestry practices)
type: Concept
notation: L02
definition: Changes in a species composition due to natural succession (e.g. primary succession related to natural siltation of lakes or succession after natural disturbances). Includes natural succession only. Spontaneous succession following the abandonment of farming practices is to be coded using appropriate codes under the category A - Agriculture. Spontaneous succession following the abandonment of traditional forest practices is to be coded using respective codes under the category F - Forestry.
status: valid
status modified: 2018-05-18
accepted date: 2018-05-18
in scheme: Threats and pressures

Accumulation of organic material
type: Concept
notation: L03
definition: Accumulation of organic material. Includes natural processes accumulation of organic material only (e.g. peat formation) .
status: valid
status modified: 2018-05-18
accepted date: 2018-05-18
in scheme: Threats and pressures

Natural processes of eutrophication or acidification
type: Concept
notation: L04
definition: Natural processes of eutrophication or acidification (e.g. natural eutrophication of lakes or natural eutrophication due to natural drying out of peatlands in areas with insufficient precipitation rate). Includes natural processes of acidification or eutrophication only. Eutrophication resulting directly or indirectly from human activities should be reported under the appropriate pressures, for example, eutrophication due to the anthropogenic input of nitrogen should be reported under A20 or eutrophication due to drainage of fens or peatlands should be reported under codes that capture drainage, for example A31.
status: valid
status modified: 2018-05-18
accepted date: 2018-05-18
in scheme: Threats and pressures

Reduced fecundity / genetic depression (e.g. inbreeding or endogamy)
type: Concept
notation: L05
definition: Reduced fecundity and/or genetic depression resulting from e.g. inbreeding or endogamy. This pressure should be used for genetic depression in naturally small and/or isolated populations but also in populations which declined and/or became isolated in the past (excluding recent past) due to anthropogenic pressures.
status: valid
status modified: 2018-05-18
accepted date: 2018-05-18
in scheme: Threats and pressures

Interspecific relations (competition, predation, parasitism, pathogens)
type: Concept
notation: L06
definition: Interspecific relations (competition, predation, parasitism, pathogens). Includes natural relations (not induced by human activities) like plant pest damages (e.g. infection of seeds, like mildew infection, rust infection etc.), animal pest damages (e.g. damage to the plants reproductive organs by invertebrates, parasites) or native plants hybridization with other plants. Changes in interspecific relationships resulting from human activities should be reported under respective pressures for example I04 or G08.
status: valid
status modified: 2018-05-18
accepted date: 2018-05-18
in scheme: Threats and pressures

Absence or reduction of interspecific faunal and floral relations (e.g. pollinators)
type: Concept
notation: L07
definition: Absence or reduction of interspecific relations (e.g. lack of pollinators or lack of prey). Includes absence or reduction of interspecific relations due to natural reasons (e.g. lack of prey due to spread of diseases).
status: valid
status modified: 2018-05-18
accepted date: 2018-05-18
in scheme: Threats and pressures

Volcanic activity
type: Concept
notation: M01
definition: Volcanic activity.
status: valid
status modified: 2018-05-18
accepted date: 2018-05-18
in scheme: Threats and pressures

Tidal waves, tsunamis
type: Concept
notation: M02
definition: Tidal waves, tsunamis. Includes geologically caused tidal waves/tsunamis.
status: valid
status modified: 2018-05-18
accepted date: 2018-05-18
in scheme: Threats and pressures

Earthquake
type: Concept
notation: M03
definition: Earthquakes.
status: valid
status modified: 2018-05-18
accepted date: 2018-05-18
in scheme: Threats and pressures

Avalanche (snow)
type: Concept
notation: M04
definition: Avalanche (snow). Includes avalanches which are not triggered by human activities, such as off piste skiing.
status: valid
status modified: 2018-05-18
accepted date: 2018-05-18
in scheme: Threats and pressures

Collapse of terrain, landslide
type: Concept
notation: M05
definition: Collapses of terrain, landslides.
status: valid
status modified: 2018-05-18
accepted date: 2018-05-18
in scheme: Threats and pressures

Underground collapses (natural processes)
type: Concept
notation: M06
definition: Underground collapses (natural processes).
status: valid
status modified: 2018-05-18
accepted date: 2018-05-18
in scheme: Threats and pressures

Storm, cyclone
type: Concept
notation: M07
definition: Storm, cyclone. Direct impact of storm or cyclone such as loss of clutches/broods of coastal-nesting species during storm surges, at-sea mortality ('wrecks') of seabirds during winter storms, damage to nests during high winds, direct impacts of heavy rain.
status: valid
status modified: 2018-05-18
accepted date: 2018-05-18
in scheme: Threats and pressures

Flooding (natural processes)
type: Concept
notation: M08
definition: Natural flooding causing e.g. loss of nests of species nesting on the ground or in emergent vegetation along rivers, in marshes and low-lying areas such as floodplains; reduced access to food resources in these areas during prolonged flooding.
status: valid
status modified: 2018-05-18
accepted date: 2018-05-18
in scheme: Threats and pressures

Fire (natural)
type: Concept
notation: M09
definition: Natural fires (e.g. natural forest fires).
status: valid
status modified: 2018-05-18
accepted date: 2018-05-18
in scheme: Threats and pressures

Other natural catastrophes
type: Concept
notation: M10
definition: Other natural catastrophes.
status: valid
status modified: 2018-05-18
accepted date: 2018-05-18
in scheme: Threats and pressures

Temperature changes (e.g. rise of temperature & extremes) due to climate change
type: Concept
notation: N01
definition: Periods in which temperatures exceed or go below the normal range of variation. Includes, for example, heat waves, cold spells, oceanic temperature changes, disappearance of glaciers/sea ice.
status: valid
status modified: 2018-05-18
accepted date: 2018-05-18
in scheme: Threats and pressures

Droughts and decreases in precipitation due to climate change
type: Concept
notation: N02
definition: Periods in which rainfall falls below the normal range of variation. Includes, for example, severe lack of rain, loss of surface water sources.
status: valid
status modified: 2018-05-18
accepted date: 2018-05-18
in scheme: Threats and pressures

Increases or changes in precipitation due to climate change
type: Concept
notation: N03
definition: Increased precipitation due to climate change. Also includes increased quantity and intensity of storms.
status: valid
status modified: 2018-05-18
accepted date: 2018-05-18
in scheme: Threats and pressures

Sea-level and wave exposure changes due to climate change
type: Concept
notation: N04
definition: Sea-level and wave exposure changes due to climate change.
status: valid
status modified: 2018-05-18
accepted date: 2018-05-18
in scheme: Threats and pressures

Change of habitat location, size, and / or quality due to climate change
type: Concept
notation: N05
definition: Change of habitat location, size, and / or quality due to climate change (e.g. changes in pH or ocean acidification).
status: valid
status modified: 2018-05-18
accepted date: 2018-05-18
in scheme: Threats and pressures

Desynchronisation of biological / ecological processes due to climate change
type: Concept
notation: N06
definition: Desynchronisation of biological / ecological processes due to climate change.
status: valid
status modified: 2018-05-18
accepted date: 2018-05-18
in scheme: Threats and pressures

Decline or extinction of related species (e.g. food source / prey, predator / parasite, symbiote, etc.) due to climate change
type: Concept
notation: N07
definition: Decline or extinction of related species (e.g. food source / prey, predator / parasite, symbiote, etc.) due to climate change.
status: valid
status modified: 2018-05-18
accepted date: 2018-05-18
in scheme: Threats and pressures

Change of species distribution (natural newcomers) due to climate change
type: Concept
notation: N08
definition: Change of species distribution (natural newcomers) due to climate change.
status: valid
status modified: 2018-05-18
accepted date: 2018-05-18
in scheme: Threats and pressures

Other climate related changes in abiotic conditions
type: Concept
notation: N09
definition: Other climate related changes in abiotic conditions e.g. water flow changes (limnic, tidal and oceanic) due to climate change.
status: valid
status modified: 2018-05-18
accepted date: 2018-05-18
in scheme: Threats and pressures

Unknown pressure
type: Concept
notation: Xu
definition: Pressure is acting, but not possible to clearly identify.
status: valid
status modified: 2018-05-18
accepted date: 2018-05-18
in scheme: Threats and pressures

No pressures
type: Concept
notation: Xxp
definition: There are no proven pressures.
status: valid
status modified: 2018-05-18
accepted date: 2018-05-18
in scheme: Threats and pressures

No threats
type: Concept
notation: Xxt
definition: There are no predicted threats.
status: valid
status modified: 2018-05-18
accepted date: 2018-05-18
in scheme: Threats and pressures

No information on pressures
type: Concept
notation: Xp
definition: No data on pressures.
status: valid
status modified: 2018-05-18
accepted date: 2018-05-18
in scheme: Threats and pressures

No information on threats
type: Concept
notation: Xt
definition: No data on threats.
status: valid
status modified: 2018-05-18
accepted date: 2018-05-18
in scheme: Threats and pressures

Threats and pressures from outside the EU territory
type: Concept
notation: Xe
definition: Threats and pressures from outside the EU territory (for the Article 17 reporting only).
status: valid
status modified: 2018-05-18
accepted date: 2018-05-18
in scheme: Threats and pressures

Threats and pressures from outside the Member State
type: Concept
notation: Xo
definition: Threats and pressures from outside the Member State (for the Article 17 reporting only).
status: valid
status modified: 2018-05-18
accepted date: 2018-05-18
in scheme: Threats and pressures

Trends
type: ConceptScheme
notation: trends
is part of: Birds directive Art. 12 reporting in year 2018
registration status: Public draft
user modified: roschsab
date modified: 2017-10-12 13:51:20.0
vocabulary type: Common
is numeric concept identifiers: false
is notations equal identifiers: false

Decreasing
type: Concept
notation: D
status: valid
status modified: 2017-07-25
in scheme: Trends

Fluctuating
type: Concept
notation: F
status: valid
status modified: 2017-10-12
in scheme: Trends

Increasing
type: Concept
notation: I
status: valid
status modified: 2017-07-25
in scheme: Trends

Stable
type: Concept
notation: S
status: valid
status modified: 2017-07-25
in scheme: Trends

Uncertain
type: Concept
notation: U
status: valid
status modified: 2017-07-27
in scheme: Trends

Unknown
type: Concept
notation: Unk
status: valid
status modified: 2017-07-25
in scheme: Trends

Type of estimate for population size
type: ConceptScheme
notation: typeEstimate
is part of: Birds directive Art. 12 reporting in year 2018
registration status: Public draft
user modified: roschsab
date modified: 2017-10-12 13:54:00.0
vocabulary type: Common
is numeric concept identifiers: false
is notations equal identifiers: false

Best estimate
type: Concept
notation: estimate
status: valid
status modified: 2017-07-25
in scheme: Type of estimate for population size

95% confidence interval
type: Concept
notation: interval
status: valid
status modified: 2017-07-25
in scheme: Type of estimate for population size

Multi-year mean
type: Concept
notation: mean
status: valid
status modified: 2017-07-25
in scheme: Type of estimate for population size

Minimum
type: Concept
notation: minimum
status: valid
status modified: 2017-07-25
in scheme: Type of estimate for population size

Type of international plan
type: ConceptScheme
notation: typeOfPlan
is part of: Birds directive Art. 12 reporting in year 2018
registration status: Public draft
user modified: roschsab
date modified: 2017-10-13 07:23:40.0
vocabulary type: Common
is numeric concept identifiers: false
is notations equal identifiers: false

Brief Management Statement
type: Concept
notation: BMS
status: valid
status modified: 2017-10-12
in scheme: Type of international plan

Management plan
type: Concept
notation: MP
status: valid
status modified: 2017-10-12
in scheme: Type of international plan

No plan
type: Concept
notation: NA
status: valid
status modified: 2017-10-12
in scheme: Type of international plan

Species action plan
type: Concept
notation: SAP
status: valid
status modified: 2017-10-12
in scheme: Type of international plan