Air Quality Directive e-Reporting
type: Collection
notation: aq
has part: AQ - Adjustment Source Type
has part: AQD - Adjustment Type
has part: AQD - Airbase administrative levels
has part: AQD - Aggregation Process
has part: AQD - Analytical Techniques*
has part: Criteria for determining the minimum number of sampling points for fixed measurement
has part: AQD - Area Classification
has part: Criteria for determining the minimum number of sampling points for fixed measurement for ozone when supplementary methods like modelling is used (according to Article 10)
has part: AQD - Assessment Threshold Exceedance
has part: AQD - Assessment Types
has part: Authority instances
has part: Code list that corresponds to the context of the authority’s role
has part: Indication whether the authority is "active" or "inactive”
has part: AQD - Quality control and assurance on CDR
has part: Contribution type
has part: datatable
has part: AQD - Local dispersion situation**
has part: AQD - Regional dispersion situation
has part: documentobject
has part: AQD - MainEmissionSources
has part: AQD - Environmental objective combinations
has part: AQD - EquivalenceDemonstrated
has part: AQ - Exceedance metric in attainment
has part: AQD - Exceedance Reason
has part: Exposure Reduction Target
has part: AQD - AQ Plans - Measure Classification
has part: AQD - AQ Plans - Measure implementation status
has part: AQD - Measurement Equipment**
has part: AQD - Measurement Methods
has part: AQD - Measurement Type
has part: AQD - AQ Plans - Measure Type
has part: AQD - Meteo parameter
has part: AQD - Model application
has part: AQD - Model or objective estimation input parameters
has part: Spatial model resolution
has part: AQD - Model type
has part: AQD - Namespace
has part: AQD - Network Type
has part: AQD - Objective Type
has part: AQD - Observation Validity
has part: AQD - Observation Verification
has part: AQD - Organisational Level
has part: Plan category
has part: PNSDinversion
has part: AQD - Air Quality Pollutants
has part: AQD - Primary Observations Time
has part: AQD - Primary observation range
has part: primaryObservationRangeCountry
has part: AQD - Process Parameter
has part: AQD - ProtectionTarget
has part: Reason if measure not used
has part: AQD - Reporting Level
has part: AQD - Reporting Metric *
has part: AQD - Specific encoding of results provided (inline/external)
has part: AQD - Specific format of results provided
has part: AQD - Sampling Equipment**
has part: AQD - Sampling Methods*
has part: AQD - Purpose of Sampling Point
has part: Scenario category
has part: AQD - AQ Plans - Source Sectors
has part: spatialresolution
has part: AQD - AQ Plans - Spatial Scale
has part: SRapplication
has part: AQD - Station Classification
has part: AQD - AQ Plans - Status AQ Plan
has part: AQD - Time Extension Types
has part: AQD - AQ Plans - Timeascale
has part: AQD Time Zone - used for aggregated data & statistics
has part: Zone category
has part: AQD - AQ Assessment & Management Zone Type

AQ - Adjustment Source Type
type: ConceptScheme
notation: adjustmentsourcetype
is part of: Air Quality Directive e-Reporting
registration status: Public draft
user modified: targajau
date modified: 2022-07-14 14:12:37.0
vocabulary type: Common
is numeric concept identifiers: false
is notations equal identifiers: false

Volcanic eruption inside the Member State
type: Concept
notation: A1
definition: Volcanic eruption or volcanism inside the Member State. Applicable to PM & SO2.
status: valid
status modified: 2013-04-17
accepted date: 2013-04-17
in scheme: AQ - Adjustment Source Type

Volcanism outside the Member State
type: Concept
notation: A2
definition: Volcanic eruption or volcanism outside the Member State. Applicable to PM & SO2.
status: valid
status modified: 2013-04-17
accepted date: 2013-04-17
in scheme: AQ - Adjustment Source Type

Coastal wetlands
type: Concept
notation: B
definition: Coastal wetlands. Applicable to SO2.
status: valid
status modified: 2013-04-17
accepted date: 2013-04-17
in scheme: AQ - Adjustment Source Type

Seismic activity inside the Member State
type: Concept
notation: B1
definition: Seismic activity inside the Member State. Applicable to PM only.
status: valid
status modified: 2013-04-17
accepted date: 2013-04-17
in scheme: AQ - Adjustment Source Type

Seismic activity outside the Member State
type: Concept
notation: B2
definition: Seismic activity outside the Member State. Applicable to PM only.
status: valid
status modified: 2013-04-17
accepted date: 2013-04-17
in scheme: AQ - Adjustment Source Type

Geothermal activity inside the Member State
type: Concept
notation: C1
definition: Geothermal activity inside the Member State. Applicable to PM only.
status: valid
status modified: 2013-04-17
accepted date: 2013-04-17
in scheme: AQ - Adjustment Source Type

Geothermal activity outside the Member State
type: Concept
notation: C2
definition: Geothermal activity outside the Member State. Applicable to PM only.
status: valid
status modified: 2013-04-17
accepted date: 2013-04-17
in scheme: AQ - Adjustment Source Type

Wild-land fire inside the Member State
type: Concept
notation: D1
definition: Wild-land/natural fire inside the Member State. Applicable to PM & SO2.
status: valid
status modified: 2013-04-17
accepted date: 2013-04-17
in scheme: AQ - Adjustment Source Type

Wild-land fire outside the Member State
type: Concept
notation: D2
definition: Wild-land/natural fire outside the Member State. Applicable to PM & SO2.
status: valid
status modified: 2013-04-17
accepted date: 2013-04-17
in scheme: AQ - Adjustment Source Type

High wind event inside the Member State
type: Concept
notation: E1
definition: High wind event inside the Member State. Applicable to PM & SO2.
status: valid
status modified: 2013-04-17
accepted date: 2013-04-17
in scheme: AQ - Adjustment Source Type

High wind event outside the Member State
type: Concept
notation: E2
definition: High wind event outside the Member State. Applicable to PM & SO2.
status: valid
status modified: 2013-04-17
accepted date: 2013-04-17
in scheme: AQ - Adjustment Source Type

Atmospheric resuspension inside the Member State
type: Concept
notation: F1
definition: Atmospheric resuspension inside the Member State. Applicable to PM only.
status: valid
status modified: 2013-04-17
accepted date: 2013-04-17
in scheme: AQ - Adjustment Source Type

Atmospheric resuspension outside the Member State
type: Concept
notation: F2
definition: Atmospheric resuspension outside the Member State. Applicable to PM only.
status: valid
status modified: 2013-04-17
accepted date: 2013-04-17
in scheme: AQ - Adjustment Source Type

Transport of natural particles from dry regions inside the Member State
type: Concept
notation: G1
definition: Transport of natural particles from dry regions inside the Member State. Applicable to PM only.
status: valid
status modified: 2013-04-17
accepted date: 2013-04-17
in scheme: AQ - Adjustment Source Type

Transport of natural particles from dry regions outside the Member State
type: Concept
notation: G2
definition: Transport of natural particles from dry regions outside the Member State. Applicable to PM only.
status: valid
status modified: 2013-04-17
accepted date: 2013-04-17
in scheme: AQ - Adjustment Source Type

Sea spray
type: Concept
notation: H
definition: Sea spray. Applicable to PM only.
status: valid
status modified: 2013-04-17
accepted date: 2013-04-17
in scheme: AQ - Adjustment Source Type

AQD - Adjustment Type
type: ConceptScheme
notation: adjustmenttype
is part of: Air Quality Directive e-Reporting
registration status: Public draft
user modified: targajau
date modified: 2014-03-18 11:59:27.0
vocabulary type: Common
is numeric concept identifiers: false
is notations equal identifiers: false

Fully corrected
type: Concept
notation: fullyCorrected
definition: All corrections for natural source & winter sanding or salting applied
status: valid
status modified: 2013-06-04
accepted date: 2013-06-04
in scheme: AQD - Adjustment Type

No corrections applicable
type: Concept
notation: noneApplicable
definition: No adjustment is due to NS or WSS have been applied or are applicable to the observed levels for this pollutant.
status: valid
status modified: 2013-05-07
accepted date: 2013-05-07
in scheme: AQD - Adjustment Type

None applied
type: Concept
notation: noneApplied
definition: No corrections have been applied to adjust for contributions from natural sources or winter sanding & salting.
status: valid
status modified: 2013-07-04
accepted date: 2013-07-04
in scheme: AQD - Adjustment Type

Natural source correction
type: Concept
notation: nsCorrection
definition: An adjustment to corrected observed concentrations for contributions from natural sources has been applied.
status: valid
status modified: 2013-05-07
accepted date: 2013-05-07
in scheme: AQD - Adjustment Type

Winter-sanding or -salting correction
type: Concept
notation: wssCorrection
definition: An adjustment to corrected observed concentrations for contributions from winter sanding or salting has been applied.
status: valid
status modified: 2013-05-07
accepted date: 2013-05-07
in scheme: AQD - Adjustment Type

AQD - Airbase administrative levels
type: ConceptScheme
notation: administrativelevel
is part of: Air Quality Directive e-Reporting
registration status: Public draft
user modified: targajau
date modified: 2024-06-11 15:53:07.0
vocabulary type: Common
is numeric concept identifiers: false
is notations equal identifiers: false

Local
type: Concept
notation: local
definition: tbd
status: valid
status modified: 2013-03-22
accepted date: 2013-03-22
in scheme: AQD - Airbase administrative levels

National
type: Concept
notation: national
definition: tbd
status: valid
status modified: 2013-03-22
accepted date: 2013-03-22
in scheme: AQD - Airbase administrative levels

Regional
type: Concept
notation: regional
definition: tbd
status: valid
status modified: 2013-03-22
accepted date: 2013-03-22
in scheme: AQD - Airbase administrative levels

AQD - Aggregation Process
type: ConceptScheme
notation: aggregationprocess
is part of: Air Quality Directive e-Reporting
registration status: Released
user modified: colinmar
date modified: 2025-07-10 12:51:57.0
vocabulary type: Common
is numeric concept identifiers: false
is notations equal identifiers: true

AOT40 vegetation protection
type: Concept
notation: AOT40c
definition: Accumulated Ozone Exposure 40 (expressed in (ug/m3) XXX hours) means the sum of the difference between hourly concentrations greater than 80 ug/m3 and 80 ug/m3 between 1 May to 31 July using only the one-hour values measured between 8.00 and 20.00 Central European Time (CET) each day.
status: valid
status modified: 2014-04-15
accepted date: 2014-04-15
in scheme: AQD - Aggregation Process
scope note: Described in section 5.2.4 of the Aggregation Document
broader metric: AOT40 vegetation protection
related pollutant: Ozone (air)

AOT40 vegetation protection averaged over 5 years
type: Concept
notation: AOT40c-P5Y
definition: AOT40 vegetation protection (AOT40) averaged over 5 years. Following Directive 2008/50/EC: If the three or five year averages cannot be determined on the basis of a full and consecutive set of annual data- the minimum annual data required for checking compliance with the target values will be as follows for the target value for the protection of vegetation: valid data for three years.
status: valid
status modified: 2014-04-15
accepted date: 2014-04-15
in scheme: AQD - Aggregation Process
scope note: Described in section 5.2.4 of the Aggregation Document
broader metric: AOT40 vegetation protection averaged over 5 years
related pollutant: Ozone (air)

Number of valid hourly value for AOTc calculations
type: Concept
notation: AOT40c-nv
definition: Number of valid hourly values (flag 1, 2, 3) between StartTime => 07:00 UTC and EndTime =< 19:00 AND YYYY-05-01T01:00:00+00:00 and YYYY-07-31T24:00:00+00:00
status: valid
status modified: 2014-06-03
accepted date: 2014-06-03
in scheme: AQD - Aggregation Process

AOT40c UNCORRECTED for data capture
type: Concept
notation: AOT40cmeasured
definition: SUM of all AOT40h between YYYY-05-01T01:00:00+00:00 and YYYY-07-31T24:00:00+00:00
status: valid
status modified: 2014-06-03
accepted date: 2014-06-03
in scheme: AQD - Aggregation Process

Number of valid hourly value for AOTf calculations
type: Concept
notation: AOT40f-nv
definition: Number of valid hourly values (flag 1, 2, 3) between StartTime => 07:00 UTC and EndTime =< 19:00 AND YYYY-04-01T01:00:00+00:00 and YYYY-09-31T24:00:00+00:00)
status: valid
status modified: 2014-06-03
accepted date: 2014-06-03
in scheme: AQD - Aggregation Process

AOT40f UNCORRECTED for data capture
type: Concept
notation: AOT40fmeasured
definition: SUM of all AOT40h between YYYY-04-01T01:00:00+00:00 and YYYY-09-31T24:00:00+00:00
status: valid
status modified: 2014-06-03
accepted date: 2014-06-03
in scheme: AQD - Aggregation Process

Preliminary hourly calculation for AOT40 for AOT40c & AOT40f
type: Concept
notation: AOT40h
definition: max (0, hourly concentration - 80) for hours with StartTime => 07:00 UTC and EndTime =< 19:00 and period YYYY-04-01T01:00:00+00:00 and YYYY-09-31T24:00:00
status: valid
status modified: 2014-06-03
accepted date: 2014-06-03
in scheme: AQD - Aggregation Process
broader metric: AOT40 vegetation protection
related pollutant: Ozone (air)

Daily average (24-hour mean)
type: Concept
notation: P1D
definition: The daily average or daily mean is the average of all valid hourly values for a day. A daily or 24-hourly average is calculated if at least 18 valid hourly values are available.
status: valid
status modified: 2014-04-15
accepted date: 2014-04-15
in scheme: AQD - Aggregation Process
scope note: Base aggregation - described in section 3.1 of Aggregation document
related pollutant: Particulate matter < 10 µm (aerosol)
related pollutant: Particulate matter < 2.5 µm (aerosol)
related pollutant: Sulphur dioxide (air)

Data capture of hourly values in 1 day
type: Concept
notation: P1D-dc
definition: Data capture for one day. This is an aggregation type added by EEA
status: valid
status modified: 2014-04-15
accepted date: 2014-04-15
in scheme: AQD - Aggregation Process
scope note: Internal calculation - described in section 4.1.1 of Aggregation document

1 day hour max
type: Concept
notation: P1D-hr-max
definition: The highest hourly value of the day
status: valid
status modified: 2021-08-13
in scheme: AQD - Aggregation Process

1 day exceed 180
type: Concept
notation: P1D-hrsAbove180
definition: Number of hours with values higher than 180 (unit) in given day
status: valid
status modified: 2021-08-13
in scheme: AQD - Aggregation Process
related pollutant: Ozone (air)

1 day exceed 240
type: Concept
notation: P1D-hrsAbove240
definition: Number of hours with values higher than 240 (unit) in given day
status: valid
status modified: 2021-08-13
in scheme: AQD - Aggregation Process
related pollutant: Ozone (air)

1 day missing data fractions
type: Concept
notation: P1D-mf
definition: Data fractions missing due to calibration or station repaire. This is an aggregation type added by EEA
status: valid
status modified: 2014-04-15
accepted date: 2014-04-15
in scheme: AQD - Aggregation Process
scope note: Internal calculation - described in section 4 of Aggregation document

Monthly average
type: Concept
notation: P1M
definition: Average between 1 hour/day of month X to last hour/day of month X (example for 31 days month: 1/X/YearY - 31/X/YearY)
status: valid
status modified: 2018-05-04
in scheme: AQD - Aggregation Process
related pollutant: Particulate matter < 2.5 µm (aerosol)
related pollutant: Particulate matter < 10 µm (aerosol)
related pollutant: Ozone (air)
related pollutant: Nitrogen oxides (air)
related pollutant: Nitrogen dioxide (air)
related pollutant: Benzo(a)pyrene in PM10 (aerosol)

1 month daymax exceed 100
type: Concept
notation: P1M-dmaxAbove100
definition: Number of days with daymax (P8H-dmax) values higher than 100 (unit) in given month
status: valid
status modified: 2021-08-13
in scheme: AQD - Aggregation Process
related pollutant: Ozone (air)

1 month daymax exceed 120
type: Concept
notation: P1M-dmaxAbove120
definition: Number of days with daymax (P8H-dmax) values higher than 120 (unit) in given month
status: valid
status modified: 2021-08-13
in scheme: AQD - Aggregation Process
related pollutant: Ozone (air)

1 year exceed 180
type: Concept
notation: P1M-hrsAbove180
definition: Number of hours with values higher than 180 (unit) in given month
status: valid
status modified: 2014-04-15
accepted date: 2014-04-15
in scheme: AQD - Aggregation Process
scope note: Described in section 5.3.2 of the Aggregation Document
related pollutant: Ozone (air)

1 year exceed 200
type: Concept
notation: P1M-hrsAbove200
definition: Number of hours with values higher than 200 (unit) in given month
status: valid
status modified: 2014-04-15
accepted date: 2014-04-15
in scheme: AQD - Aggregation Process
scope note: Described in section 5.3.2 of the Aggregation Document

1 year exceed 240
type: Concept
notation: P1M-hrsAbove240
definition: Number of hours with values higher than 240 (unit) in given month
status: valid
status modified: 2014-04-15
accepted date: 2014-04-15
in scheme: AQD - Aggregation Process
scope note: Described in section 5.3.2 of the Aggregation Document

1 year exceed 350
type: Concept
notation: P1M-hrsAbove350
definition: Number of hours with values higher than 350 (unit) in given month
status: valid
status modified: 2014-04-15
accepted date: 2014-04-15
in scheme: AQD - Aggregation Process
scope note: Described in section 5.3.2 of the Aggregation Document

1 year exceed 400
type: Concept
notation: P1M-hrsAbove400
definition: Number of hours with values higher than 400 (unit) in given month
status: valid
status modified: 2014-04-15
accepted date: 2014-04-15
in scheme: AQD - Aggregation Process
scope note: Described in section 5.3.2 of the Aggregation Document

Annual mean / 1 calendar year
type: Concept
notation: P1Y
definition: Average between 1st January to 31st December Year X (1/1/YearX - 31/12/YearX)
status: valid
status modified: 2014-04-15
accepted date: 2014-04-15
in scheme: AQD - Aggregation Process
scope note: Described in section 5.1 of Aggregation document (Averages and means)
broader metric: Annual mean / average

3 consecutive days in exceedance of 50
type: Concept
notation: P1Y-3daysAbove50
definition: Number of periods when 3 consecutive days are higher than 50 in a given year
status: valid
status modified: 2024-10-29
accepted date: 2024-10-29
in scheme: AQD - Aggregation Process
broader metric: Three consecutive days in exceedance
related pollutant: Particulate matter < 2.5 µm (aerosol)

3 consecutive days in exceedance of 90
type: Concept
notation: P1Y-3daysAbove90
definition: Number of periods when 3 consecutive days are higher than 90 in a given year
status: valid
status modified: 2024-10-29
accepted date: 2024-10-29
in scheme: AQD - Aggregation Process
broader metric: Three consecutive days in exceedance
related pollutant: Particulate matter < 10 µm (aerosol)

3 consecutive hours in exceedance of 200
type: Concept
notation: P1Y-3hAbove200
definition: Number of periods when 3 consecutive hours are higher than 200 in a given year
status: valid
status modified: 2024-10-29
accepted date: 2024-10-29
in scheme: AQD - Aggregation Process
broader metric: Three consecutive hours in exceedance
related pollutant: Nitrogen dioxide (air)

3 consecutive hours in exceedance of 350
type: Concept
notation: P1Y-3hAbove350
definition: Number of periods when 3 consecutive hours are higher than 350 in a given year
status: valid
status modified: 2024-10-29
accepted date: 2024-10-29
in scheme: AQD - Aggregation Process
broader metric: Three consecutive hours in exceedance
related pollutant: Sulphur dioxide (air)

3 consecutive hours in exceedance of 400
type: Concept
notation: P1Y-3hAbove400
definition: Number of periods when 3 consecutive hours are higher than 400 in a given year
status: valid
status modified: 2014-04-15
accepted date: 2014-04-15
in scheme: AQD - Aggregation Process
scope note: Described in section 5.3.3 of the Aggregation Document
broader metric: Three consecutive hours in exceedance
related pollutant: Nitrogen dioxide (air)

3 consecutive hours in exceedance of 500
type: Concept
notation: P1Y-3hAbove500
definition: Number of periods when 3 consecutive hours are higher than 500 in a given year
status: valid
status modified: 2014-04-15
accepted date: 2014-04-15
in scheme: AQD - Aggregation Process
scope note: Described in section 5.3.3 of the Aggregation Document
broader metric: Three consecutive hours in exceedance
related pollutant: Sulphur dioxide (air)

1 year daymax exceed 10
type: Concept
notation: P1Y-8hdmxAbove10
definition: Number of days with daymax values (P8H_dmax) higher than 10 (unit) in given year
status: valid
status modified: 2014-04-15
accepted date: 2014-04-15
in scheme: AQD - Aggregation Process
scope note: Described in section 5.3.2 of the Aggregation Document
broader metric: Days in exceedance in a calendar year
related pollutant: Carbon monoxide (air)

1 year 90.4 percentile - COMPLIANCE
type: Concept
notation: P1Y-P1D-per90.4
definition: The 90.4th percentile of daily averages (P1D) in a given year Aggregation for Compliance.
status: valid
status modified: 2014-06-03
accepted date: 2014-06-03
in scheme: AQD - Aggregation Process
scope note: Described in section 5.2.1 of the Aggregation Document
broader metric: Days in exceedance in a calendar year
related pollutant: Particulate matter < 10 µm (aerosol)

1 year 90.41 percentile
type: Concept
notation: P1Y-P1D-per90.41
definition: The 90.41th percentile of daily averages (P1D) in a given year
status: valid
status modified: 2014-04-15
accepted date: 2014-04-15
in scheme: AQD - Aggregation Process
scope note: Described in section 5.2.1 of the Aggregation Document
broader metric: Days in exceedance in a calendar year
related pollutant: Particulate matter < 10 µm (aerosol)

1 year 95.07 percentile of daily means (P1D) or .../aq/primaryObservation/day
type: Concept
notation: P1Y-P1D-per95.07
definition: The 95.07th percentile of daily averages in a given year associated to New Directive for pollutants (corresponding with the 19th highest daily value)
status: valid
status modified: 2024-10-29
accepted date: 2024-10-29
in scheme: AQD - Aggregation Process
related pollutant: Sulphur dioxide (air)
related pollutant: Carbon monoxide (air)
related pollutant: Particulate matter < 10 µm (aerosol)
related pollutant: Particulate matter < 2.5 µm (aerosol)
related pollutant: Nitrogen dioxide (air)

1 year 99 percentile of daily means (P1D) or .../aq/primaryObservation/day
type: Concept
notation: P1Y-P1D-per99
definition: The 99th percentile of daily averages in a given year associated to WHO guidelines for pollutants PM10 (5), PM2.5 (6001), NO2 (8), SO2 (1) and CO (10)
status: valid
status modified: 2017-03-22
accepted date: 2021-12-20
in scheme: AQD - Aggregation Process
scope note: New aggregates for new AQ 2021 WHO guidelines
related pollutant: Carbon monoxide (air)
related pollutant: Sulphur dioxide (air)
related pollutant: Nitrogen dioxide (air)
related pollutant: Particulate matter < 2.5 µm (aerosol)
related pollutant: Particulate matter < 10 µm (aerosol)

1 year 99.18 percentile of daily value/mean (see P1Y-day-max-per99.18)
type: Concept
notation: P1Y-P1D-per99.18
definition: The 99.18th percentile of daily averages (P1Y-P1D) in a given year (corresponding with the 4th highest daily value) - Aggregation uses P1Y-day-max-per99.18
status: valid
status modified: 2017-12-14
in scheme: AQD - Aggregation Process

yearly mean weighted average
type: Concept
notation: P1Y-WA-avg
definition: The mean for a multi-__day sampler based data types shall be evaluated in a similar way to the data capture (see section 4.2)- although in this instance is calculated as the time weighted mean of valid measurements over the sample period. mean = _i DCi * Nvalid-i Cvalid-i / _i DCi * Nvalid-i i=1.... n where DCi = the data capture of sample i Nvalid-i = the number of hours of the valid sampling period i Cvalid-i = concentration for valid sampling period i
status: valid
status modified: 2014-04-15
accepted date: 2014-04-15
in scheme: AQD - Aggregation Process
broader metric: Annual mean / average

1 year weighted average data capture
type: Concept
notation: P1Y-WA-dc
definition: The data capture for multi day sampler based data types integrated over an averaging period is calculated as the proportion of valid measurement time (at a minimum seconds- alternatively decimal hours or days) relative total measured time in the averaging period- expressed as an percentage. The data capture for a given averagingperiod shall be calculated as follows: Data capture = _i DCi * Nvalid-i / _i Ni * 100 % where DCi = the data capture (in %) of the valid sample I- that is- the effective sampling time in a measuring period Nvalid-i = the number of hours in the valid sample i (validity flag sample > 0) Ni = number of hours in sample i
status: valid
status modified: 2014-04-15
accepted date: 2014-04-15
in scheme: AQD - Aggregation Process

1 year weighted average time coverage
type: Concept
notation: P1Y-WA-tc
definition: The time coverage is the percentage of measurement time in a given averaging period. Also the time coverage is calculated on base of the number of hours in the sample periods. The time coverage for a given averaging period is calculated as follows (weighted average): Time coverage = _i TCi * Ni / Naveraging_period * 100 % where TCi = the time coverage of sample i Ni = number of hours in sample i Naveraging_period = the total number of hours in the given averaging period (e.g. a year)
status: valid
status modified: 2014-04-15
accepted date: 2014-04-15
in scheme: AQD - Aggregation Process

1 year day max
type: Concept
notation: P1Y-day-max
definition: The highest daily value of the year
status: valid
status modified: 2014-04-15
accepted date: 2014-04-15
in scheme: AQD - Aggregation Process
scope note: Extra aggregation - described in section 5.2.2 of the Aggregation Document

1 year 99.18 percentile of daily MEAN (P1Y-P1D-per99.18)
type: Concept
notation: P1Y-day-max-per99.18
definition: The 99.18th percentile of daily MEAN (P1Y-P1D) in a given year (corresponding with the 4th highest daily value) - DESCRIPTION UPDATE - notation SHOULD REALLY BE P1Y-P1D-per99.18
status: valid
status modified: 2014-06-03
accepted date: 2014-06-03
in scheme: AQD - Aggregation Process
scope note: Described in section 5.2.1 of the Aggregation Document
related pollutant: Sulphur dioxide (air)

1 year day max 36
type: Concept
notation: P1Y-day-max36
definition: The 36th highest daily average value in a given year
status: valid
status modified: 2014-04-15
accepted date: 2014-04-15
in scheme: AQD - Aggregation Process
scope note: Described in section 5.2.1 of the Aggregation Document
related pollutant: Particulate matter < 10 µm (aerosol)

1 year day max 4
type: Concept
notation: P1Y-day-max4
definition: The 4th highest daily value in a given year
status: valid
status modified: 2014-04-15
accepted date: 2014-04-15
in scheme: AQD - Aggregation Process
scope note: Described in section 5.2.1 of the Aggregation Document
related pollutant: Sulphur dioxide (air)

1 year day min
type: Concept
notation: P1Y-day-min
definition: The lowest daily value of the year
status: valid
status modified: 2014-04-15
accepted date: 2014-04-15
in scheme: AQD - Aggregation Process
scope note: Extra aggregation

1 year 50 %ile of daily values in a year
type: Concept
notation: P1Y-day-per50
definition: The 50th percentile of DAILY values in a given year
status: valid
status modified: 2014-06-03
accepted date: 2014-06-03
in scheme: AQD - Aggregation Process

1 year exceed 100
type: Concept
notation: P1Y-daysAbove100
definition: Number of days with values higher than 100 (unit) in given year
status: valid
status modified: 2014-04-15
accepted date: 2014-04-15
in scheme: AQD - Aggregation Process
scope note: Described in section 5.3.2 of the Aggregation Document
broader metric: Days in exceedance in a calendar year

1 year day exceed 125
type: Concept
notation: P1Y-daysAbove125
definition: Number of days with daily average values higher than 125 (unit) in given year
status: valid
status modified: 2014-04-15
accepted date: 2014-04-15
in scheme: AQD - Aggregation Process
scope note: Described in section 5.3.2 of the Aggregation Document
broader metric: Days in exceedance in a calendar year
related pollutant: Sulphur dioxide (air)

1 year day exceed 25
type: Concept
notation: P1Y-daysAbove25
definition: Number of days with daily average values higher than 25 (unit) in given year
status: valid
status modified: 2024-10-29
accepted date: 2024-10-29
in scheme: AQD - Aggregation Process
broader metric: Days in exceedance in a calendar year
related pollutant: Particulate matter < 2.5 µm (aerosol)

1 year day exceed 4
type: Concept
notation: P1Y-daysAbove4
definition: Number of days with daily average values higher than 4 (unit) in given year
status: valid
status modified: 2024-10-29
accepted date: 2024-10-29
in scheme: AQD - Aggregation Process
broader metric: Days in exceedance in a calendar year
related pollutant: Carbon monoxide (air)

1 year day exceed 45
type: Concept
notation: P1Y-daysAbove45
definition: Number of days with daily average values higher than 45 (unit) in given year
status: valid
status modified: 2024-10-29
accepted date: 2024-10-29
in scheme: AQD - Aggregation Process
broader metric: Days in exceedance in a calendar year
related pollutant: Particulate matter < 10 µm (aerosol)

1 year day exceed 50
type: Concept
notation: P1Y-daysAbove50
definition: Number of days with daily average values higher than 50 (unit) in given year
status: valid
status modified: 2014-04-15
accepted date: 2014-04-15
in scheme: AQD - Aggregation Process
scope note: Described in section 5.3.2 of the Aggregation Document
broader metric: Days in exceedance in a calendar year
related pollutant: Sulphur dioxide (air)
related pollutant: Particulate matter < 2.5 µm (aerosol)
related pollutant: Nitrogen dioxide (air)
related pollutant: Particulate matter < 10 µm (aerosol)

1 year day exceed 90
type: Concept
notation: P1Y-daysAbove90
definition: Number of days with daily average values higher than 90 (unit) in given year
status: valid
status modified: 2024-10-29
accepted date: 2024-10-29
in scheme: AQD - Aggregation Process
broader metric: Days in exceedance in a calendar year
related pollutant: Particulate matter < 10 µm (aerosol)

Data capture of reported units in 1 year
type: Concept
notation: P1Y-dc
definition: Data capture of primary reported units (like hour/day XXX) for the given year
status: valid
status modified: 2014-04-15
accepted date: 2014-04-15
in scheme: AQD - Aggregation Process
scope note: Described in section 4.1.1 of Aggregation document

1 year 93.15 percentile daily 8h maximum
type: Concept
notation: P1Y-dmax-per93.15
definition: The 93.15th percentile of daily 8h maximum (P8H-dmax) in a given year
status: valid
status modified: 2014-06-03
accepted date: 2014-06-03
in scheme: AQD - Aggregation Process
scope note: Described in section 5.2.1 of the Aggregation Document
related pollutant: Ozone (air)

1 year 95.07 percentile daily 8h maximum
type: Concept
notation: P1Y-dmax-per95.07
definition: The 95.07th percentile of daily 8h maximum (P8H-dmax) in a given year
status: valid
status modified: 2024-10-29
accepted date: 2024-10-29
in scheme: AQD - Aggregation Process
related pollutant: Ozone (air)

1 year 99 percentile daily 8h maximum
type: Concept
notation: P1Y-dmax-per99
definition: The 99th percentile of daily 8h maximum (P8H-dmax) in a given year
status: valid
status modified: 2022-03-16
accepted date: 2022-03-16
in scheme: AQD - Aggregation Process
related pollutant: Ozone (air)

1 year daymax exceed 100
type: Concept
notation: P1Y-dmaxAbove100
definition: Number of days with daymax (P8H-dmax) values higher than 100 (unit) in given year
status: valid
status modified: 2024-10-29
accepted date: 2024-10-29
in scheme: AQD - Aggregation Process
broader metric: Days in exceedance in a calendar year
related pollutant: Ozone (air)

1 year daymax exceed 120
type: Concept
notation: P1Y-dmaxAbove120
definition: Number of days with daymax (P8H-dmax) values higher than 120 (unit) in given year
status: valid
status modified: 2014-04-15
accepted date: 2014-04-15
in scheme: AQD - Aggregation Process
scope note: Described in section 5.3.2 of the Aggregation Document
broader metric: Days in exceedance in a calendar year
related pollutant: Ozone (air)

1 year daymax average
type: Concept
notation: P1Y-dx-avg
definition: Average day max value between 1st January to 31st December Year X (1/1/YearX - 31/12/YearX)
status: valid
status modified: 2014-04-15
accepted date: 2014-04-15
in scheme: AQD - Aggregation Process
scope note: Described in section 3.1 of Aggregation document

Data capture of daily maximum values in 1 year
type: Concept
notation: P1Y-dx-dc
definition: Day max data capture for given year
status: valid
status modified: 2014-04-15
accepted date: 2014-04-15
in scheme: AQD - Aggregation Process
scope note: Described in section 4.1.1 of Aggregation document

1 year P8H-dmax
type: Concept
notation: P1Y-dx-max
definition: The highest P8H-dmax value in given year
status: valid
status modified: 2014-04-15
accepted date: 2014-04-15
in scheme: AQD - Aggregation Process
scope note: Extra aggregation - described in section 5.2.2 of the Aggregation Document
scope note: It is the highest P8H-dmax (https://dd.eionet.europa.eu/vocabularyconcept/aq/aggregationprocess/P8H-dmax/view) value in a year, and because of that, only calculated for O3 and CO.

1 year daymax max 26
type: Concept
notation: P1Y-dx-max26
definition: The 26th highest daymax value in a given year
status: valid
status modified: 2014-04-15
accepted date: 2014-04-15
in scheme: AQD - Aggregation Process
scope note: Described in section 5.2.1 of the Aggregation Document
related pollutant: Ozone (air)

1 year day-max min
type: Concept
notation: P1Y-dx-min
definition: The lowest day max value in given year
status: valid
status modified: 2014-04-15
accepted date: 2014-04-15
in scheme: AQD - Aggregation Process
scope note: Extra aggregation

1 year day-max Nvalid
type: Concept
notation: P1Y-dx-nv
definition: Number of valid daymax values in given year
status: valid
status modified: 2014-04-15
accepted date: 2014-04-15
in scheme: AQD - Aggregation Process
scope note: Internal calculation - described in section 4 of Aggregation document

1 year hour max
type: Concept
notation: P1Y-hr-max
definition: The highest hourly value of the year
status: valid
status modified: 2014-04-15
accepted date: 2014-04-15
in scheme: AQD - Aggregation Process
scope note: Extra aggregation

1 year 99.73 %ile of hourly values in a given year
type: Concept
notation: P1Y-hr-max-per99.73
definition: The 99.73th percentile of hourly values (/hour) in a given year (equivalent to 25th highest hourly value)
status: valid
status modified: 2014-06-03
accepted date: 2014-06-03
in scheme: AQD - Aggregation Process
scope note: Described in section 5.2.1 of the Aggregation Document
related pollutant: Sulphur dioxide (air)

1 year 99.79 %ile of hourly values in a given year
type: Concept
notation: P1Y-hr-max-per99.79
definition: The 99.79 percentile of hourly values in a given year (corresponding to 19th highest hourly value)
status: valid
status modified: 2014-06-03
accepted date: 2014-06-03
in scheme: AQD - Aggregation Process
related pollutant: Nitrogen dioxide (air)

1 year 99.97 %ile of hourly values in a given year
type: Concept
notation: P1Y-hr-max-per99.97
definition: The 99.97th percentile of hourly values (/hour) in a given year (equivalent to 4th highest hourly value)
status: valid
status modified: 2024-10-29
accepted date: 2024-10-29
in scheme: AQD - Aggregation Process
related pollutant: Sulphur dioxide (air)
related pollutant: Nitrogen dioxide (air)

1 year hour max19
type: Concept
notation: P1Y-hr-max19
definition: The 19th highest hourly value in a given year
status: valid
status modified: 2014-04-15
accepted date: 2014-04-15
in scheme: AQD - Aggregation Process
scope note: Described in section 5.2.1 of the Aggregation Document
related pollutant: Nitrogen dioxide (air)

1 year hour max 25
type: Concept
notation: P1Y-hr-max25
definition: The 25th highest hourly value in a given year
status: valid
status modified: 2014-04-15
accepted date: 2014-04-15
in scheme: AQD - Aggregation Process
scope note: Described in section 5.2.1 of the Aggregation Document
related pollutant: Sulphur dioxide (air)

1 year hour min
type: Concept
notation: P1Y-hr-min
definition: The lowest hourly value of the year
status: valid
status modified: 2014-04-15
accepted date: 2014-04-15
in scheme: AQD - Aggregation Process
scope note: Extra aggregation

1 year 50 percentile
type: Concept
notation: P1Y-hr-per50
definition: The 50th percentile of HOURLY values in a given year
status: valid
status modified: 2014-04-15
accepted date: 2014-04-15
in scheme: AQD - Aggregation Process
scope note: Described in section 5.2.1 of the Aggregation Document

1 year hour exceed 150
type: Concept
notation: P1Y-hrsAbove150
definition: Number of hours with values higher than 150 (unit) in given year
status: valid
status modified: 2024-10-29
accepted date: 2024-10-29
in scheme: AQD - Aggregation Process
broader metric: Hours in exceedance in a calendar year
related pollutant: Nitrogen dioxide (air)

1 year hour exceed 180
type: Concept
notation: P1Y-hrsAbove180
definition: Number of hours with values higher than 180 (unit) in given year
status: valid
status modified: 2014-04-15
accepted date: 2014-04-15
in scheme: AQD - Aggregation Process
scope note: Described in section 5.3.2 of the Aggregation Document
broader metric: Hours in exceedance in a calendar year
related pollutant: Ozone (air)

1 year hour exceed 200
type: Concept
notation: P1Y-hrsAbove200
definition: Number of hours with values higher than 200 (unit) in given year
status: valid
status modified: 2014-04-15
accepted date: 2014-04-15
in scheme: AQD - Aggregation Process
scope note: Described in section 5.3.2 of the Aggregation Document
broader metric: Hours in exceedance in a calendar year
related pollutant: Nitrogen dioxide (air)

1 year hour exceed 240
type: Concept
notation: P1Y-hrsAbove240
definition: Number of hours with values higher than 240 (unit) in given year
status: valid
status modified: 2014-04-15
accepted date: 2014-04-15
in scheme: AQD - Aggregation Process
scope note: Described in section 5.3.2 of the Aggregation Document
broader metric: Hours in exceedance in a calendar year
related pollutant: Ozone (air)

1 year hour exceed 275
type: Concept
notation: P1Y-hrsAbove275
definition: Number of hours with values higher than 275 (unit) in given year
status: valid
status modified: 2024-10-29
accepted date: 2024-10-29
in scheme: AQD - Aggregation Process
broader metric: Hours in exceedance in a calendar year
related pollutant: Sulphur dioxide (air)

1 year hour exceed 350
type: Concept
notation: P1Y-hrsAbove350
definition: Number of hours with values higher than 350 (unit) in given year
status: valid
status modified: 2014-04-15
accepted date: 2014-04-15
in scheme: AQD - Aggregation Process
scope note: Described in section 5.3.2 of the Aggregation Document
broader metric: Hours in exceedance in a calendar year
related pollutant: Sulphur dioxide (air)

1 year hour exceed 400
type: Concept
notation: P1Y-hrsAbove400
definition: Number of hours with values higher than 400 (unit) in given year
status: valid
status modified: 2014-04-15
accepted date: 2014-04-15
in scheme: AQD - Aggregation Process
scope note: Described in section 5.3.2 of the Aggregation Document
broader metric: Hours in exceedance in a calendar year
related pollutant: Nitrogen dioxide (air)

Yearly highest six monthly average of daily maximum 8-hour mean concentration
type: Concept
notation: P1Y-maxP6M-P8H-dmax
definition: Average of daily maxiumum 8-hour mean concentration in the six consecutive months (P6M-P8H-dmax) with the highest P6M-P8H-dmax in the year
status: valid
status modified: 2022-03-07
accepted date: 2022-03-07
in scheme: AQD - Aggregation Process
scope note: Author's note: this differs to P1Y-peakP6M-P8H-dmax where the yearly 6 month average is selected according to the highest six-month running-average concentration (highest P6M in the year).
related pollutant: Ozone (air)

1 year Ntotal
type: Concept
notation: P1Y-nt
definition: Total number of primary reported units (like hours/days XXX) in current year
status: valid
status modified: 2014-04-15
accepted date: 2014-04-15
in scheme: AQD - Aggregation Process
scope note: Internal calculation - described in section 4 of Aggregation document

1 year Nvalid
type: Concept
notation: P1Y-nv
definition: Total number of valid primary reported units (like hours/days...) in current year
status: valid
status modified: 2014-04-15
accepted date: 2014-04-15
in scheme: AQD - Aggregation Process
scope note: Internal calculation - described in section 4 of Aggregation document

P1Y-peakP6M-P8H-dmax
type: Concept
notation: P1Y-peakP6M-P8H-dmax
definition: Average of daily maxiumum 8-hour mean concentration in the six consecutive months (P6M-P8H-dmax) with the highest six-month running-average concentration (highest P6M in the year).
status: valid
status modified: 2021-12-23
accepted date: 2021-12-23
in scheme: AQD - Aggregation Process
scope note: ETC has done some work on the proposed methodology for P1Y-peakP6M-P8H-dmax and agreed with EEA, we have decided to simplify the process and calculate, for now, P1Y-maxP6M-P8H-dmax P1Y-maxP6M-P8H-dmax is the maximum P6M-P8H-dmax of the year (using date-end. NOTE: remember that you are storing end date as 01/XX/YYYY instead of end of the period). DC should be calculated base on the number of P6M-P8h-dmax valid in the year and following similar approach for DataCapture, MissingData and TimeCoverage. Example: if for 2020 we have 12 P6M-P8h-dmax with end time within 2020 of which 11 are valid (above 75% DC) then, the DC for P1Y-maxP6M-P8h-dmax will be 11/12 -> 91.67%
related pollutant: Ozone (air)

3 subsequent calendar years mean
type: Concept
notation: P3Y
definition: Three-year running mean concentration. Average between 1st January Year X-2 to 31st December Year X (1/1/Year X-2 - 31/12/Year X)
status: valid
status modified: 2014-04-15
accepted date: 2014-04-15
in scheme: AQD - Aggregation Process

Daymax exceed 120 averaged over 3 consecutive years
type: Concept
notation: P3Y-dmaxAbove120
definition: Number of days with daymax values higher than 120 (unit) averaged over 3 years
status: valid
status modified: 2014-06-03
accepted date: 2014-06-03
in scheme: AQD - Aggregation Process
scope note: Described in section 5.3.2 of the Aggregation Document
broader metric: Days in exceedance averaged over 3 calendar years
related pollutant: Ozone (air)

6 monthly average
type: Concept
notation: P6M
definition: Average between 1 hour/day of month X-5 to last hour/day of month X (example for first 6 month's in the year: 1/1/2021 to 31/6/2021) (example for months between years: 1/8/2021 to 31/1/2022)
status: valid
status modified: 2021-12-23
accepted date: 2021-12-23
in scheme: AQD - Aggregation Process
scope note: For new WHO AQ Guidelines
related pollutant: Ozone (air)

Average of the daily maximum eight-hour mean (P8H-dmax) in 6 consecutive months
type: Concept
notation: P6M-P8H-dmax
definition: Average of the daily maximum eight-hour mean (P8H-dmax) in 6 consecutive months.
status: valid
status modified: 2021-12-23
accepted date: 2021-12-23
in scheme: AQD - Aggregation Process
related pollutant: Ozone (air)

Maximum daily eight-hour mean
type: Concept
notation: P8H-dmax
definition: The daily maximum 8-hour running mean for a day is the maximum of the valid hourly 8-hour running means for that day. A daily maximum 8-hour mean is calculated if at least 18 valid hourly 8-hour running means are available for that particular day.
status: valid
status modified: 2014-04-15
accepted date: 2014-04-15
in scheme: AQD - Aggregation Process
scope note: Base aggregation - described in section 3.2 of Aggregation document
related pollutant: Carbon monoxide (air)
related pollutant: Ozone (air)

8-hour running mean
type: Concept
notation: P8H-run
definition: The 8-hour running mean value for each hour is calculated as the average of the valid values for that hour and the 7 foregoing hours (averaging period). So- the averaging period of hour1 of dayn is hour17 of dayn-1 until hour1 of dayn. The averaging period of hour24 of dayn is hour16 of dayn until hour24 of dayn. A 8-hourly running averaged concentration is calculated if at least 6 valid hourly values are available.
status: valid
status modified: 2014-04-15
accepted date: 2014-04-15
in scheme: AQD - Aggregation Process
scope note: Base aggregation - described in section 3.2 of Aggregation document
related pollutant: Ozone (air)
related pollutant: Carbon monoxide (air)

Sum of Ozone Means Over 10 ppb
type: Concept
notation: SOMO10
definition: For quantification of the health impacts the World Health Organisation recommends the use of the SOMO35 indicator. SOMO10 stands for means the sum of the differences between maximum daily 8-hour running mean concentrations greater than 20 µg/m3 (= 10 parts per billion) and 20 µg/m3
status: valid
status modified: 2020-03-05
in scheme: AQD - Aggregation Process

Sum of Ozone Means Over 35 ppb
type: Concept
notation: SOMO35
definition: For quantification of the health impacts the World Health Organisation recommends the use of the SOMO35 indicator. SOMO35 stands for means the sum of the differences between maximum daily 8-hour running mean concentrations greater than 70 µg/m3 (= 35 parts per billion) and 70 µg/m3
status: valid
status modified: 2014-06-03
accepted date: 2014-06-03
in scheme: AQD - Aggregation Process
scope note: Not yet described
related pollutant: Ozone (air)

High summer mean
type: Concept
notation: highsummer
definition: Average between 1st May to 31th July Year X.
status: valid
status modified: 2014-04-15
accepted date: 2014-04-15
in scheme: AQD - Aggregation Process
scope note: Described in section 5.1 of Aggregation document (Averages and means)

Summer mean
type: Concept
notation: summer-avg
definition: Average between 1st April to 30th September Year X.
status: valid
status modified: 2014-04-15
accepted date: 2014-04-15
in scheme: AQD - Aggregation Process
scope note: Described in section 5.1 of Aggregation document (Averages and means)

Winter mean
type: Concept
notation: winter-avg
definition: Average between 1st October Year X-1 to 31st March Year X.
status: valid
status modified: 2014-04-15
accepted date: 2014-04-15
in scheme: AQD - Aggregation Process
scope note: Described in section 5.1 of Aggregation document (Averages and means)
broader metric: Winter Mean
related pollutant: Sulphur dioxide (air)

AOT40 forest protection
type: Concept
notation: AOT40f
definition: Accumulated Ozone Exposure 40 (expressed in (ug/m3) XXX hours) means the sum of the difference between hourly concentrations greater than 80 ug/m3 and 80 ug/m3 between 1 April to 30 September using only the one-hour values measured between 8.00 and 20.00 Central European Time (CET) each day.
status: valid
status modified: 2025-07-10
accepted date: 2025-07-10
in scheme: AQD - Aggregation Process
related pollutant: Ozone (air)

AQD - Analytical Techniques*
type: ConceptScheme
notation: analyticaltechnique
is part of: Air Quality Directive e-Reporting
registration status: Public draft
user modified: targajau
date modified: 2025-07-10 12:16:04.0
vocabulary type: Common
is numeric concept identifiers: false
is notations equal identifiers: false

Atomic absorption spectrometry (AAS)
type: Concept
notation: AAS
definition: Atomic absorption spectroscopy (AAS) is a spectroanalytical procedure for the quantitative determination of chemical elements employing the absorption of optical radiation (light) by free atoms in the gaseous state. In analytical chemistry the technique is used for determining the concentration of a particular element (the analyte) in a sample to be analyzed. AAS can be used to determine over 70 different elements in solution or directly in solid samples (source: http://en.wikipedia.org/wiki/Atomic_absorption_spectroscopy)
status: valid
status modified: 2013-03-22
accepted date: 2013-03-22
in scheme: AQD - Analytical Techniques*

Capillary electrophoresis (CE)
type: Concept
notation: CE
definition: Capillary electrophoresis (CE)
status: valid
status modified: 2017-09-14
in scheme: AQD - Analytical Techniques*

Continous flow analysis (CFA)
type: Concept
notation: CFA
status: valid
status modified: 2013-03-22
accepted date: 2013-03-22
in scheme: AQD - Analytical Techniques*

Chemiluminescence
type: Concept
notation: CHEMI
definition: Luminescence is the phenomenon whereby matter emits light of a specific wavelength without emitting heat and returns to a ground state from an excited state after having absorbed external energy from an electromagnetic wave, heat, friction, electric field, or chemical reaction (Fig. 1). When the source of the energy absorbed is a chemical reaction, this phenomenon is called chemiluminescence
status: valid
status modified: 2024-09-30
accepted date: 2024-09-30
in scheme: AQD - Analytical Techniques*

Conditional time averaged gradient
type: Concept
notation: COTAG
definition: The COTAG system determines the exchange of ammonia by means of the aerodynamic flux-gradient method
status: valid
status modified: 2024-09-24
accepted date: 2024-09-24
in scheme: AQD - Analytical Techniques*

Cold vapour atomic absorption spectrometry (CV-AAS)
type: Concept
notation: CV-AAS
status: valid
status modified: 2013-03-22
accepted date: 2013-03-22
in scheme: AQD - Analytical Techniques*
scope note: Analysis of Hg

Cold vapour atomic fluorescence spectrometry
type: Concept
notation: CV-AFS
definition: Cold vapour atomic fluorescence spectroscopy is a subset of the analytical technique known as atomic fluorescence spectroscopy (AFS). Used in the measurement of trace amounts of volatile heavy metals such as mercury, cold vapour AFS makes use of the unique characteristic of mercury that allows vapour measurement at room temperature. Free mercury atoms in a carrier gas are excited by a collimated ultraviolet light source at a wavelength of 253.7 nanometres. The excited atoms re-radiate their absorbed energy (fluoresce) at this same wavelength.
status: valid
status modified: 2013-03-22
accepted date: 2013-03-22
in scheme: AQD - Analytical Techniques*
scope note: Analysis of Hg
editorial note: Source: http://en.wikipedia.org/wiki/Cold_vapour_atomic_fluorescence_spectroscopy

Energy dispersive X-Ray fluorescense (ED-XRF)
type: Concept
notation: ED-XRF
definition: Energy Dispersive X-ray Fluorescence (EDXRF) is one of two general types of X-ray Fluorescence techniques used for elemental analysis applications. In EDXRF spectrometers, all of the elements in the sample are excited simultaneously, and an energy dispersive detector in combination with a multi-channel analyzer is used to simultaneously collect the fluorescence radiation emitted from the sample and then separate the different energies of the characteristic radiation from each of the different sample elements.
status: valid
status modified: 2024-09-24
accepted date: 2024-09-24
in scheme: AQD - Analytical Techniques*

Flame atomic absorption spectrometry (F-AAS)
type: Concept
notation: F-AAS
status: valid
status modified: 2013-03-22
accepted date: 2013-03-22
in scheme: AQD - Analytical Techniques*

FIAS-Furnace coupling technique (FI-FU)
type: Concept
notation: FI-FU
status: valid
status modified: 2013-03-22
accepted date: 2013-03-22
in scheme: AQD - Analytical Techniques*

Flow injection analysis (FIA)
type: Concept
notation: FIA
definition: Flow injection analysis (FIA)
status: valid
status modified: 2017-09-14
in scheme: AQD - Analytical Techniques*

Flame ionization detection (FID)
type: Concept
notation: FID
definition: A flame ionization detector (FID) is a type of gas detector used in gas chromatography. The detection of organic compounds is most effectively done with flame ionization.
status: valid
status modified: 2013-03-22
accepted date: 2013-03-22
in scheme: AQD - Analytical Techniques*

Gas chromatograph with Electron Capture Detector
type: Concept
notation: GC-ECD
definition: Gas chromatograph with Electron Capture Detector
status: valid
status modified: 2019-11-27
in scheme: AQD - Analytical Techniques*

GC-FID
type: Concept
notation: GC-FID
definition: Gas chromatography (GC) + flame ionisation (GC-FID)
status: valid
status modified: 2013-03-22
accepted date: 2013-03-22
in scheme: AQD - Analytical Techniques*

GC-FID type
type: Concept
notation: GC-FID-ECD
definition: Gas chromatography (GC) + flame ionisation (FID) + ECD (GC-FID-ECD)
status: valid
status modified: 2013-03-22
accepted date: 2013-03-22
in scheme: AQD - Analytical Techniques*
scope note: Analysis of VOCs

GC-FID type
type: Concept
notation: GC-FIDa
definition: Gas chromatography + flame ionisation detection GC-FID after solvent or thermal desorption
status: valid
status modified: 2013-03-22
accepted date: 2013-03-22
in scheme: AQD - Analytical Techniques*

GC-FID type
type: Concept
notation: GC-FIDsm
definition: Gas chromatography (separation from methane), flame ionization detection (GC (sep methane)-FID)
status: valid
status modified: 2013-03-22
accepted date: 2013-03-22
in scheme: AQD - Analytical Techniques*

Gas chromatograph with high-resolution mass spectrometry
type: Concept
notation: GC-HRMS
definition: Gas chromatograph with high-resolution mass spectrometry
status: valid
status modified: 2019-11-27
in scheme: AQD - Analytical Techniques*

Gas chromatography + mass spectrometry (GC-MS)
type: Concept
notation: GC-MS
definition: Gas chromatography–mass spectrometry (GC-MS) is a method that combines the features of gas-liquid chromatography and mass spectrometry to identify different substances within a test sample. Applications of GC-MS include drug detection, fire investigation, environmental analysis, explosives investigation, and identification of unknown samples. GC-MS can also be used in airport security to detect substances in luggage or on human beings. Additionally, it can identify trace elements in materials that were previously thought to have disintegrated beyond identification.
status: valid
status modified: 2013-03-22
accepted date: 2013-03-22
in scheme: AQD - Analytical Techniques*
scope note: Analysis VOC, PAH, B(a)P (Reference)

GC-MS type
type: Concept
notation: GC-MSa
definition: Gas chromatography + mass spectrometry GC-MS after solvent or thermal desorption
status: valid
status modified: 2013-03-22
accepted date: 2013-03-22
in scheme: AQD - Analytical Techniques*

GC-NPD
type: Concept
notation: GC-NPD
definition: Gas Chromatography with Nitrogen Phosphorous Detector GC-NPD
status: valid
status modified: 2013-03-22
accepted date: 2013-03-22
in scheme: AQD - Analytical Techniques*

Gas chromatography followed by photo ionization detection (GC-PID)
type: Concept
notation: GC-PID
definition: Gas chromatography followed by photo ionization detection (GC-PID)
status: valid
status modified: 2017-09-14
in scheme: AQD - Analytical Techniques*

Graphite furnace atomic absorption spectrometry (GF-AAS)
type: Concept
notation: GF-AAS
definition: Graphite furnace atomic absorption spectrometry (GF-AAS) (also known as Electrothermal Atomic Absorption Spectrometry (ET-AAS)) is a type of spectrometry that uses a graphite-coated furnace to vaporize the sample. Briefly, the technique is based on the fact that free atoms will absorb light at frequencies or wavelengths characteristic of the element of interest (hence the name atomic absorption spectrometry). Within certain limits, the amount of light absorbed can be linearly correlated to the concentration of analyte present. Free atoms of most elements can be produced from samples by the application of high temperatures. Source: http://en.wikipedia.org/wiki/Graphite_furnace_atomic_absorption
status: valid
status modified: 2013-03-22
accepted date: 2013-03-22
in scheme: AQD - Analytical Techniques*
scope note: Analysis of Pb, As, Cd, Ni (Reference) & Hg

Griess-Saltzman reaction
type: Concept
notation: GS
definition: Analysis of NO2 based on the Griess-Saltzman reaction
status: valid
status modified: 2013-03-22
accepted date: 2013-03-22
in scheme: AQD - Analytical Techniques*
scope note: Analysis of NO2

Hydride generation electrothermal - atomic absorption spectrometry (HG-ET-AAS)
type: Concept
notation: HG-ET-AAS
status: valid
status modified: 2013-03-22
accepted date: 2013-03-22
in scheme: AQD - Analytical Techniques*

High performance liquid chromatography - fluorescence detection (HPLC-FLD)
type: Concept
notation: HPLC-FLD
definition: High-performance liquid chromatography (sometimes referred to as high-pressure liquid chromatography), HPLC, is a chromatographic technique used to separate a mixture of compounds in analytical chemistry and biochemistry with the purpose of identifying, quantifying and purifying the individual components of the mixture. HPLC-FLD is done with fluorescence detection.
status: valid
status modified: 2013-03-22
accepted date: 2013-03-22
in scheme: AQD - Analytical Techniques*
scope note: Analysis of PAH

High performance liquid chromatography HPLC with UV detection (HPLC-UV)
type: Concept
notation: HPLC-UV
definition: High-performance liquid chromatography (sometimes referred to as high-pressure liquid chromatography), HPLC, is a chromatographic technique used to separate a mixture of compounds in analytical chemistry and biochemistry with the purpose of identifying, quantifying and purifying the individual components of the mixture. HPLC-FLD is done with UV detection.
status: valid
status modified: 2013-03-22
accepted date: 2013-03-22
in scheme: AQD - Analytical Techniques*

High-resolution gas chromatograph with mass spectrometry
type: Concept
notation: HRGC-MS
definition: High-resolution gas chromatograph with mass spectrometry
status: valid
status modified: 2019-11-27
in scheme: AQD - Analytical Techniques*

High performance liquid chromatography - mass spectrometry (HPLC-MS)
type: Concept
notation: HPLC-MS
definition: High performance liquid chromatography–mass spectrometry (HPLC-MS, or alternatively LC-MS) is an analytical chemistry technique that combines the physical separation capabilities of liquid chromatography (or HPLC) with the mass analysis capabilities of mass spectrometry. LC-MS is a powerful technique used for many applications which has very high sensitivity and selectivity. Generally its application is oriented towards the general detection and potential identification of chemicals in the presence of other chemicals (in a complex mixture). The limitations of LC-MS in urine analysis drug screening is that it often fails to distinguish between specific metabolites, in particular with hydrocodone and its metabolites.
status: valid
status modified: 2013-03-22
accepted date: 2013-03-22
in scheme: AQD - Analytical Techniques*

High resolution continuum source atomic absorption spectrometry (HR-CS-AAS)
type: Concept
notation: HR-CS-AAS
definition: When a continuum radiation source is used for AAS measurement it is indispensable to work with a high-resolution monochromator. The resolution has to be equal to or better than the half width of an atomic absorption line (about 2 pm) in order to avoid losses of sensitivity and linearity of the calibration graph. These spectrometers use a compact double monochromator with a prism pre-monochromator and an echelle grating monochromator for high resolution. A linear charge coupled device (CCD) array with 200 pixels is used as the detector. The second monochromator does not have an exit slit; hence the spectral environment at both sides of the analytical line becomes visible at high resolution. As typically only 3–5 pixels are used to measure the atomic absorption, the other pixels are available for correction purposes. One of these corrections is that for lamp flicker noise, which is independent of wavelength, resulting in measurements with very low noise level; other corrections are those for background absorption, as will be discussed later.
status: valid
status modified: 2013-03-22
accepted date: 2013-03-22
in scheme: AQD - Analytical Techniques*
scope note: Analysis of Pb, As, Cd, Ni (Reference)

Ion chromatography
type: Concept
notation: IC
definition: Ion chromatography (or ion-exchange chromatography) is a process that allows the separation of ions and polar molecules based on their charge. It can be used for almost any kind of charged molecule including large proteins, small nucleotides and amino acids. The solution to be injected is usually called a sample, and the individually separated components are called analytes. It is often used in protein purification, water analysis, and quality control.
status: valid
status modified: 2013-03-22
accepted date: 2013-03-22
in scheme: AQD - Analytical Techniques*

Inductive coupled plasma atomic emission spectrometry (ICP-AES)
type: Concept
notation: ICP-AES
definition: Inductively coupled plasma atomic emission spectroscopy (ICP-AES), also referred to as inductively coupled plasma optical emission spectrometry (ICP-OES), is an analytical technique used for the detection of trace metals. It is a type of emission spectroscopy that uses the inductively coupled plasma to produce excited atoms and ions that emit electromagnetic radiation at wavelengths characteristic of a particular element.[1][2] The intensity of this emission is indicative of the concentration of the element within the sample.
status: valid
status modified: 2013-03-22
accepted date: 2013-03-22
in scheme: AQD - Analytical Techniques*
scope note: Analysis of As & Ni

Inductive coupled plasma mass spectrometryscopy (ICP-MS)
type: Concept
notation: ICP-MS
definition: Inductively coupled plasma mass spectrometry (ICP-MS) is a type of mass spectrometry which is capable of detecting metals and several non-metals at concentrations as low as one part in 1012 (part per trillion). This is achieved by ionizing the sample with inductively coupled plasma and then using a mass spectrometer to separate and quantify those ions.
status: valid
status modified: 2013-03-22
accepted date: 2013-03-22
in scheme: AQD - Analytical Techniques*
scope note: Analysis of Pb, As, Cd & Ni

Isotope dilution
type: Concept
notation: ID
definition: Isotope dilution analysis is a technique to increase the precision and accuracy of chemical analysis. The isotopic composition of the sample will be slightly changed. Then, by measuring each isotope, the amount of a single element/pollutant in the original sample can be calculated. In a typical gas chromatography analysis, isotopic dilution can decrease the error of injection from 5% to 1%. It can also be used in mass spectrometry (commonly referred to as isotopic dilution mass spectrometry or IDMS), in which the isotopic ratio can be determined with precision typically better than 0.25%.
status: valid
status modified: 2013-03-22
accepted date: 2013-03-22
in scheme: AQD - Analytical Techniques*

Isotope-ratio mass spectometry
type: Concept
notation: IR-MS
definition: Isotope-ratio mass spectrometry (IRMS) is a spectroscopic analysis method used to determine the ratio of different isotopes within a sample. IRMS can help establish the sample's isotope fingerprint, which gives it applications in evaluating the authenticity and geographical origin of products and materials.
status: valid
status modified: 2024-09-24
accepted date: 2024-09-24
in scheme: AQD - Analytical Techniques*

Optical methods
type: Concept
notation: OPT-MET
status: valid
status modified: 2024-09-30
accepted date: 2024-09-30
in scheme: AQD - Analytical Techniques*

pH-meter Electrode
type: Concept
notation: PH-ELEC
status: valid
status modified: 2024-09-24
accepted date: 2024-09-24
in scheme: AQD - Analytical Techniques*

Selective ion conductivity
type: Concept
notation: SIC
definition: The extracted samples are analyzed for ammonium on the high sensitivity AMFIA (AMmonia Flow Injection Analysis) system, which is an automated system developed at ECN, Petten, NL (Wyers et al. 1993). AMFIA is based on the selective dialysis of ammonia across a membrane at high pH with subsequent analysis of conductivity.
status: valid
status modified: 2013-03-22
accepted date: 2013-03-22
in scheme: AQD - Analytical Techniques*
example: AMFIA technique: The ammonium moves through a membrane with concentration measured by coductivity

Spectrophotometry
type: Concept
notation: SP
definition: Spectrophotometry is the quantitative measurement of the reflection or transmission properties of a material as a function of wavelength. It is more specific than the general term electromagnetic spectroscopy in that spectrophotometry deals with visible light, near-ultraviolet, and near-infrared, but does not cover time-resolved spectroscopic techniques. Spectrophotometry involves the use of a spectrophotometer. A spectrophotometer is a photometer that can measure intensity as a function of the light source wavelength. Important features of spectrophotometers are spectral bandwidth and linear range of absorption or reflectance measurement.
status: valid
status modified: 2013-03-22
accepted date: 2013-03-22
in scheme: AQD - Analytical Techniques*

Specifique Electrodes
type: Concept
notation: SPEC-ELEC
status: valid
status modified: 2024-09-24
accepted date: 2024-09-24
in scheme: AQD - Analytical Techniques*

Thermo-optical EC/OC measurement
type: Concept
notation: TO-ECOC
definition: Thermal-optical analysis is currently under consideration by the European standardization body (CEN) as the reference method to quantitatively determine organic carbon (OC) and elemental carbon (EC) in ambient air.
status: valid
status modified: 2024-09-24
accepted date: 2024-09-24
in scheme: AQD - Analytical Techniques*

Thermal-optical carbon analysis
type: Concept
notation: TOCA
status: valid
status modified: 2013-03-22
accepted date: 2013-03-22
in scheme: AQD - Analytical Techniques*

Ultra Performance Liquid Chromatography (UPLC)
type: Concept
notation: UPLC
definition: Ultra Performance Liquid Chromatography (UPLC)
status: valid
status modified: 2017-09-14
in scheme: AQD - Analytical Techniques*

Wavelength Dispersive X-ray fluorescense (WD-XRF)
type: Concept
notation: WD-XRF
definition: Wavelength Dispersive X-ray Fluorescence (WDXRF) is one of two general types of X-ray Fluorescence instrumentation used for elemental analysis applications. In WDXRF spectrometers, all of the elements in the sample are excited simultaneously. The different energies of the characteristic radiation emitted from the sample are diffracted into different directions by an analyzing crystal or monochrometer (similar to the action of a prism dispersing different colors of visible light into different directions). By placing the detector at a certain angle, the intensity of X-rays with a certain wavelength can be measured.
status: valid
status modified: 2024-09-24
accepted date: 2024-09-24
in scheme: AQD - Analytical Techniques*

X-ray fluorescence spectroscopy (XRF)
type: Concept
notation: XRF
definition: X-ray fluorescence (XRF) is the emission of characteristic "secondary" (or fluorescent) X-rays from a material that has been excited by bombarding with high-energy X-rays or gamma rays. The phenomenon is widely used for elemental analysis and chemical analysis, particularly in the investigation of metals, glass, ceramics and building materials, and for research in geochemistry, forensic science and archaeology.
status: valid
status modified: 2013-03-22
accepted date: 2013-03-22
in scheme: AQD - Analytical Techniques*
scope note: Analysis of As, Cd, Pb & Ni

Zeeman atomic absorption spectrometry (ZeemanAAS)
type: Concept
notation: ZeemanAAS
definition: Analysis of Pb, As, Cd & Ni - reference method EN14902
status: valid
status modified: 2013-03-22
accepted date: 2013-03-22
in scheme: AQD - Analytical Techniques*
scope note: Analysis of Pb, As, Cd & Ni

colorimetry
type: Concept
notation: colorimetry
definition: Colorimetric or colourimetric determination of concentration. Example: Colorimetric with p-rosaniline for SO2
status: valid
status modified: 2013-03-22
accepted date: 2013-03-22
in scheme: AQD - Analytical Techniques*
scope note: Analysis of SO2

Conductimetry
type: Concept
notation: conduct
status: valid
status modified: 2013-03-22
accepted date: 2013-03-22
in scheme: AQD - Analytical Techniques*

COULOMETRY
type: Concept
notation: coulometry
status: valid
status modified: 2013-10-04
accepted date: 2013-10-04
in scheme: AQD - Analytical Techniques*

Gravimetric analysis
type: Concept
notation: gravi
definition: Gravimetric analysis describes a set of methods in analytical chemistry for the quantitative determination of an analyte based on the mass of a solid. A simple example is the measurement of solids suspended in air sample: A known volume of air is filtered, and the collected solids are weighed
status: valid
status modified: 2013-03-22
accepted date: 2013-03-22
in scheme: AQD - Analytical Techniques*
scope note: Analysis of PM10, PM2,5, PM1 (Reference)

nephelometry
type: Concept
notation: nephelometry
definition: Nephelometry is a light scattering method to detect particles in liquid samples. The principle is to measure forwarded scattered light when a laser beam passes through a sample and the light is deflected by the particles.
status: valid
status modified: 2013-10-04
accepted date: 2013-10-04
in scheme: AQD - Analytical Techniques*

Other, please specify
type: Concept
notation: other
definition: Other, please specify
status: valid
status modified: 2013-03-22
accepted date: 2013-03-22
in scheme: AQD - Analytical Techniques*

Photometry
type: Concept
notation: photo
definition: Photometry is the science of the measurement of light, in terms of its perceived brightness to the human eye.[1] It is distinct from radiometry, which is the science of measurement of radiant energy (including light) in terms of absolute power; rather, in photometry, the radiant power at each wavelength is weighted by a luminosity function (a.k.a. visual sensitivity function) that models human brightness sensitivity.
status: valid
status modified: 2013-03-22
accepted date: 2013-03-22
in scheme: AQD - Analytical Techniques*

Potentiometry
type: Concept
notation: potentio
status: valid
status modified: 2013-03-22
accepted date: 2013-03-22
in scheme: AQD - Analytical Techniques*

Reflectometry
type: Concept
notation: reflecto
status: valid
status modified: 2013-03-22
accepted date: 2013-03-22
in scheme: AQD - Analytical Techniques*

Spectrometry
type: Concept
notation: spectro
status: valid
status modified: 2013-03-22
accepted date: 2013-03-22
in scheme: AQD - Analytical Techniques*

Titration
type: Concept
notation: titration
definition: Titration, also known as titrimetry, is a common laboratory method of quantitative chemical analysis that is used to determine the unknown concentration of an identified analyte. Because volume measurements play a key role in titration, it is also known as volumetric analysis.
status: valid
status modified: 2013-03-22
accepted date: 2013-03-22
in scheme: AQD - Analytical Techniques*

Volumetry
type: Concept
notation: volume
status: valid
status modified: 2013-03-22
accepted date: 2013-03-22
in scheme: AQD - Analytical Techniques*

Criteria for determining the minimum number of sampling points for fixed measurement
type: ConceptScheme
notation: anexV_IX_minimum_spo
is part of: Air Quality Directive e-Reporting
registration status: Public draft
user modified: targajau
date modified: 2024-09-12 12:52:25.0
vocabulary type: Common
is numeric concept identifiers: true
is notations equal identifiers: true

Minimum requirement for pollutant 1 for pop between 0 and 999999 when assessment is LAT-UAT - zone type is not considered
type: Concept
notation: 1
definition: Minimum requirement for pollutant 1 for pop between 0 and 999999 when assessment is LAT-UAT - zone type is not considered
status: valid
status modified: 2024-09-12
accepted date: 2024-09-12
in scheme: Criteria for determining the minimum number of sampling points for fixed measurement
related pollutant: Sulphur dioxide (air)
assessment threshold: Between Lower and Upper Assessment Threshold (LAT-UAT)
minimum population: 0
maximum population: 999999
minimum SPO: 1

Minimum requirement for pollutant 1 for pop between 1000000 and 1999999 when assessment is LAT-UAT - zone type is not considered
type: Concept
notation: 2
definition: Minimum requirement for pollutant 1 for pop between 1000000 and 1999999 when assessment is LAT-UAT - zone type is not considered
status: valid
status modified: 2024-09-12
accepted date: 2024-09-12
in scheme: Criteria for determining the minimum number of sampling points for fixed measurement
related pollutant: Sulphur dioxide (air)
assessment threshold: Between Lower and Upper Assessment Threshold (LAT-UAT)
minimum population: 1000000
maximum population: 1999999
minimum SPO: 2

Minimum requirement for pollutant 1 for pop between 2000000 and 4749999 when assessment is LAT-UAT - zone type is not considered
type: Concept
notation: 3
definition: Minimum requirement for pollutant 1 for pop between 2000000 and 4749999 when assessment is LAT-UAT - zone type is not considered
status: valid
status modified: 2024-09-12
accepted date: 2024-09-12
in scheme: Criteria for determining the minimum number of sampling points for fixed measurement
related pollutant: Sulphur dioxide (air)
assessment threshold: Between Lower and Upper Assessment Threshold (LAT-UAT)
minimum population: 2000000
maximum population: 4749999
minimum SPO: 3

Minimum requirement for pollutant 1 for pop between 4750000 and 1000000000 when assessment is LAT-UAT - zone type is not considered
type: Concept
notation: 4
definition: Minimum requirement for pollutant 1 for pop between 4750000 and 1000000000 when assessment is LAT-UAT - zone type is not considered
status: valid
status modified: 2024-09-12
accepted date: 2024-09-12
in scheme: Criteria for determining the minimum number of sampling points for fixed measurement
related pollutant: Sulphur dioxide (air)
assessment threshold: Between Lower and Upper Assessment Threshold (LAT-UAT)
minimum population: 4750000
maximum population: 1000000000
minimum SPO: 4

Minimum requirement for pollutant 1 for pop between 0 and 249999 when assessment is aboveUAT - zone type is not considered
type: Concept
notation: 5
definition: Minimum requirement for pollutant 1 for pop between 0 and 249999 when assessment is aboveUAT - zone type is not considered
status: valid
status modified: 2024-09-12
accepted date: 2024-09-12
in scheme: Criteria for determining the minimum number of sampling points for fixed measurement
related pollutant: Sulphur dioxide (air)
assessment threshold: Above Upper Assessment Threshold (>UAT)
minimum population: 0
maximum population: 249999
minimum SPO: 1

Minimum requirement for pollutant 1 for pop between 250000 and 749999 when assessment is aboveUAT - zone type is not considered
type: Concept
notation: 6
definition: Minimum requirement for pollutant 1 for pop between 250000 and 749999 when assessment is aboveUAT - zone type is not considered
status: valid
status modified: 2024-09-12
accepted date: 2024-09-12
in scheme: Criteria for determining the minimum number of sampling points for fixed measurement
related pollutant: Sulphur dioxide (air)
assessment threshold: Above Upper Assessment Threshold (>UAT)
minimum population: 250000
maximum population: 749999
minimum SPO: 2

Minimum requirement for pollutant 1 for pop between 750000 and 999999 when assessment is aboveUAT - zone type is not considered
type: Concept
notation: 7
definition: Minimum requirement for pollutant 1 for pop between 750000 and 999999 when assessment is aboveUAT - zone type is not considered
status: valid
status modified: 2024-09-12
accepted date: 2024-09-12
in scheme: Criteria for determining the minimum number of sampling points for fixed measurement
related pollutant: Sulphur dioxide (air)
assessment threshold: Above Upper Assessment Threshold (>UAT)
minimum population: 750000
maximum population: 999999
minimum SPO: 3

Minimum requirement for pollutant 1 for pop between 1000000 and 1499999 when assessment is aboveUAT - zone type is not considered
type: Concept
notation: 8
definition: Minimum requirement for pollutant 1 for pop between 1000000 and 1499999 when assessment is aboveUAT - zone type is not considered
status: valid
status modified: 2024-09-12
accepted date: 2024-09-12
in scheme: Criteria for determining the minimum number of sampling points for fixed measurement
related pollutant: Sulphur dioxide (air)
assessment threshold: Above Upper Assessment Threshold (>UAT)
minimum population: 1000000
maximum population: 1499999
minimum SPO: 4

Minimum requirement for pollutant 1 for pop between 1500000 and 1999999 when assessment is aboveUAT - zone type is not considered
type: Concept
notation: 9
definition: Minimum requirement for pollutant 1 for pop between 1500000 and 1999999 when assessment is aboveUAT - zone type is not considered
status: valid
status modified: 2024-09-12
accepted date: 2024-09-12
in scheme: Criteria for determining the minimum number of sampling points for fixed measurement
related pollutant: Sulphur dioxide (air)
assessment threshold: Above Upper Assessment Threshold (>UAT)
minimum population: 1500000
maximum population: 1999999
minimum SPO: 5

Minimum requirement for pollutant 1 for pop between 2000000 and 2749999 when assessment is aboveUAT - zone type is not considered
type: Concept
notation: 10
definition: Minimum requirement for pollutant 1 for pop between 2000000 and 2749999 when assessment is aboveUAT - zone type is not considered
status: valid
status modified: 2024-09-12
accepted date: 2024-09-12
in scheme: Criteria for determining the minimum number of sampling points for fixed measurement
related pollutant: Sulphur dioxide (air)
assessment threshold: Above Upper Assessment Threshold (>UAT)
minimum population: 2000000
maximum population: 2749999
minimum SPO: 6

Minimum requirement for pollutant 1 for pop between 2750000 and 3749999 when assessment is aboveUAT - zone type is not considered
type: Concept
notation: 11
definition: Minimum requirement for pollutant 1 for pop between 2750000 and 3749999 when assessment is aboveUAT - zone type is not considered
status: valid
status modified: 2024-09-12
accepted date: 2024-09-12
in scheme: Criteria for determining the minimum number of sampling points for fixed measurement
related pollutant: Sulphur dioxide (air)
assessment threshold: Above Upper Assessment Threshold (>UAT)
minimum population: 2750000
maximum population: 3749999
minimum SPO: 7

Minimum requirement for pollutant 1 for pop between 3750000 and 4749999 when assessment is aboveUAT - zone type is not considered
type: Concept
notation: 12
definition: Minimum requirement for pollutant 1 for pop between 3750000 and 4749999 when assessment is aboveUAT - zone type is not considered
status: valid
status modified: 2024-09-12
accepted date: 2024-09-12
in scheme: Criteria for determining the minimum number of sampling points for fixed measurement
related pollutant: Sulphur dioxide (air)
assessment threshold: Above Upper Assessment Threshold (>UAT)
minimum population: 3750000
maximum population: 4749999
minimum SPO: 8

Minimum requirement for pollutant 1 for pop between 4750000 and 5999999 when assessment is aboveUAT - zone type is not considered
type: Concept
notation: 13
definition: Minimum requirement for pollutant 1 for pop between 4750000 and 5999999 when assessment is aboveUAT - zone type is not considered
status: valid
status modified: 2024-09-12
accepted date: 2024-09-12
in scheme: Criteria for determining the minimum number of sampling points for fixed measurement
related pollutant: Sulphur dioxide (air)
assessment threshold: Above Upper Assessment Threshold (>UAT)
minimum population: 4750000
maximum population: 5999999
minimum SPO: 9

Minimum requirement for pollutant 1 for pop between 6000000 and 1000000000 when assessment is aboveUAT - zone type is not considered
type: Concept
notation: 14
definition: Minimum requirement for pollutant 1 for pop between 6000000 and 1000000000 when assessment is aboveUAT - zone type is not considered
status: valid
status modified: 2024-09-12
accepted date: 2024-09-12
in scheme: Criteria for determining the minimum number of sampling points for fixed measurement
related pollutant: Sulphur dioxide (air)
assessment threshold: Above Upper Assessment Threshold (>UAT)
minimum population: 6000000
maximum population: 1000000000
minimum SPO: 10

Minimum requirement for pollutant 10 for pop between 0 and 999999 when assessment is LAT-UAT - zone type is not considered
type: Concept
notation: 15
definition: Minimum requirement for pollutant 10 for pop between 0 and 999999 when assessment is LAT-UAT - zone type is not considered
status: valid
status modified: 2024-09-12
accepted date: 2024-09-12
in scheme: Criteria for determining the minimum number of sampling points for fixed measurement
related pollutant: Carbon monoxide (air)
assessment threshold: Between Lower and Upper Assessment Threshold (LAT-UAT)
minimum population: 0
maximum population: 999999
minimum SPO: 1

Minimum requirement for pollutant 10 for pop between 1000000 and 1999999 when assessment is LAT-UAT - zone type is not considered
type: Concept
notation: 16
definition: Minimum requirement for pollutant 10 for pop between 1000000 and 1999999 when assessment is LAT-UAT - zone type is not considered
status: valid
status modified: 2024-09-12
accepted date: 2024-09-12
in scheme: Criteria for determining the minimum number of sampling points for fixed measurement
related pollutant: Carbon monoxide (air)
assessment threshold: Between Lower and Upper Assessment Threshold (LAT-UAT)
minimum population: 1000000
maximum population: 1999999
minimum SPO: 2

Minimum requirement for pollutant 10 for pop between 2000000 and 4749999 when assessment is LAT-UAT - zone type is not considered
type: Concept
notation: 17
definition: Minimum requirement for pollutant 10 for pop between 2000000 and 4749999 when assessment is LAT-UAT - zone type is not considered
status: valid
status modified: 2024-09-12
accepted date: 2024-09-12
in scheme: Criteria for determining the minimum number of sampling points for fixed measurement
related pollutant: Carbon monoxide (air)
assessment threshold: Between Lower and Upper Assessment Threshold (LAT-UAT)
minimum population: 2000000
maximum population: 4749999
minimum SPO: 3

Minimum requirement for pollutant 10 for pop between 4750000 and 1000000000 when assessment is LAT-UAT - zone type is not considered
type: Concept
notation: 18
definition: Minimum requirement for pollutant 10 for pop between 4750000 and 1000000000 when assessment is LAT-UAT - zone type is not considered
status: valid
status modified: 2024-09-12
accepted date: 2024-09-12
in scheme: Criteria for determining the minimum number of sampling points for fixed measurement
related pollutant: Carbon monoxide (air)
assessment threshold: Between Lower and Upper Assessment Threshold (LAT-UAT)
minimum population: 4750000
maximum population: 1000000000
minimum SPO: 4

Minimum requirement for pollutant 10 for pop between 0 and 249999 when assessment is aboveUAT - zone type is not considered
type: Concept
notation: 19
definition: Minimum requirement for pollutant 10 for pop between 0 and 249999 when assessment is aboveUAT - zone type is not considered
status: valid
status modified: 2024-09-12
accepted date: 2024-09-12
in scheme: Criteria for determining the minimum number of sampling points for fixed measurement
related pollutant: Carbon monoxide (air)
assessment threshold: Above Upper Assessment Threshold (>UAT)
minimum population: 0
maximum population: 249999
minimum SPO: 1

Minimum requirement for pollutant 10 for pop between 250000 and 749999 when assessment is aboveUAT - zone type is not considered
type: Concept
notation: 20
definition: Minimum requirement for pollutant 10 for pop between 250000 and 749999 when assessment is aboveUAT - zone type is not considered
status: valid
status modified: 2024-09-12
accepted date: 2024-09-12
in scheme: Criteria for determining the minimum number of sampling points for fixed measurement
related pollutant: Carbon monoxide (air)
assessment threshold: Above Upper Assessment Threshold (>UAT)
minimum population: 250000
maximum population: 749999
minimum SPO: 2

Minimum requirement for pollutant 10 for pop between 750000 and 999999 when assessment is aboveUAT - zone type is not considered
type: Concept
notation: 21
definition: Minimum requirement for pollutant 10 for pop between 750000 and 999999 when assessment is aboveUAT - zone type is not considered
status: valid
status modified: 2024-09-12
accepted date: 2024-09-12
in scheme: Criteria for determining the minimum number of sampling points for fixed measurement
related pollutant: Carbon monoxide (air)
assessment threshold: Above Upper Assessment Threshold (>UAT)
minimum population: 750000
maximum population: 999999
minimum SPO: 3

Minimum requirement for pollutant 10 for pop between 1000000 and 1499999 when assessment is aboveUAT - zone type is not considered
type: Concept
notation: 22
definition: Minimum requirement for pollutant 10 for pop between 1000000 and 1499999 when assessment is aboveUAT - zone type is not considered
status: valid
status modified: 2024-09-12
accepted date: 2024-09-12
in scheme: Criteria for determining the minimum number of sampling points for fixed measurement
related pollutant: Carbon monoxide (air)
assessment threshold: Above Upper Assessment Threshold (>UAT)
minimum population: 1000000
maximum population: 1499999
minimum SPO: 4

Minimum requirement for pollutant 10 for pop between 1500000 and 1999999 when assessment is aboveUAT - zone type is not considered
type: Concept
notation: 23
definition: Minimum requirement for pollutant 10 for pop between 1500000 and 1999999 when assessment is aboveUAT - zone type is not considered
status: valid
status modified: 2024-09-12
accepted date: 2024-09-12
in scheme: Criteria for determining the minimum number of sampling points for fixed measurement
related pollutant: Carbon monoxide (air)
assessment threshold: Above Upper Assessment Threshold (>UAT)
minimum population: 1500000
maximum population: 1999999
minimum SPO: 5

Minimum requirement for pollutant 10 for pop between 2000000 and 2749999 when assessment is aboveUAT - zone type is not considered
type: Concept
notation: 24
definition: Minimum requirement for pollutant 10 for pop between 2000000 and 2749999 when assessment is aboveUAT - zone type is not considered
status: valid
status modified: 2024-09-12
accepted date: 2024-09-12
in scheme: Criteria for determining the minimum number of sampling points for fixed measurement
related pollutant: Carbon monoxide (air)
assessment threshold: Above Upper Assessment Threshold (>UAT)
minimum population: 2000000
maximum population: 2749999
minimum SPO: 6

Minimum requirement for pollutant 10 for pop between 2750000 and 3749999 when assessment is aboveUAT - zone type is not considered
type: Concept
notation: 25
definition: Minimum requirement for pollutant 10 for pop between 2750000 and 3749999 when assessment is aboveUAT - zone type is not considered
status: valid
status modified: 2024-09-12
accepted date: 2024-09-12
in scheme: Criteria for determining the minimum number of sampling points for fixed measurement
related pollutant: Carbon monoxide (air)
assessment threshold: Above Upper Assessment Threshold (>UAT)
minimum population: 2750000
maximum population: 3749999
minimum SPO: 7

Minimum requirement for pollutant 10 for pop between 3750000 and 4749999 when assessment is aboveUAT - zone type is not considered
type: Concept
notation: 26
definition: Minimum requirement for pollutant 10 for pop between 3750000 and 4749999 when assessment is aboveUAT - zone type is not considered
status: valid
status modified: 2024-09-12
accepted date: 2024-09-12
in scheme: Criteria for determining the minimum number of sampling points for fixed measurement
related pollutant: Carbon monoxide (air)
assessment threshold: Above Upper Assessment Threshold (>UAT)
minimum population: 3750000
maximum population: 4749999
minimum SPO: 8

Minimum requirement for pollutant 10 for pop between 4750000 and 5999999 when assessment is aboveUAT - zone type is not considered
type: Concept
notation: 27
definition: Minimum requirement for pollutant 10 for pop between 4750000 and 5999999 when assessment is aboveUAT - zone type is not considered
status: valid
status modified: 2024-09-12
accepted date: 2024-09-12
in scheme: Criteria for determining the minimum number of sampling points for fixed measurement
related pollutant: Carbon monoxide (air)
assessment threshold: Above Upper Assessment Threshold (>UAT)
minimum population: 4750000
maximum population: 5999999
minimum SPO: 9

Minimum requirement for pollutant 10 for pop between 6000000 and 1000000000 when assessment is aboveUAT - zone type is not considered
type: Concept
notation: 28
definition: Minimum requirement for pollutant 10 for pop between 6000000 and 1000000000 when assessment is aboveUAT - zone type is not considered
status: valid
status modified: 2024-09-12
accepted date: 2024-09-12
in scheme: Criteria for determining the minimum number of sampling points for fixed measurement
related pollutant: Carbon monoxide (air)
assessment threshold: Above Upper Assessment Threshold (>UAT)
minimum population: 6000000
maximum population: 1000000000
minimum SPO: 10

Minimum requirement for pollutant 20 for pop between 0 and 999999 when assessment is LAT-UAT - zone type is not considered
type: Concept
notation: 29
definition: Minimum requirement for pollutant 20 for pop between 0 and 999999 when assessment is LAT-UAT - zone type is not considered
status: valid
status modified: 2024-09-12
accepted date: 2024-09-12
in scheme: Criteria for determining the minimum number of sampling points for fixed measurement
related pollutant: Benzene (air)
assessment threshold: Between Lower and Upper Assessment Threshold (LAT-UAT)
minimum population: 0
maximum population: 999999
minimum SPO: 1

Minimum requirement for pollutant 20 for pop between 1000000 and 1999999 when assessment is LAT-UAT - zone type is not considered
type: Concept
notation: 30
definition: Minimum requirement for pollutant 20 for pop between 1000000 and 1999999 when assessment is LAT-UAT - zone type is not considered
status: valid
status modified: 2024-09-12
accepted date: 2024-09-12
in scheme: Criteria for determining the minimum number of sampling points for fixed measurement
related pollutant: Benzene (air)
assessment threshold: Between Lower and Upper Assessment Threshold (LAT-UAT)
minimum population: 1000000
maximum population: 1999999
minimum SPO: 2

Minimum requirement for pollutant 20 for pop between 2000000 and 4749999 when assessment is LAT-UAT - zone type is not considered
type: Concept
notation: 31
definition: Minimum requirement for pollutant 20 for pop between 2000000 and 4749999 when assessment is LAT-UAT - zone type is not considered
status: valid
status modified: 2024-09-12
accepted date: 2024-09-12
in scheme: Criteria for determining the minimum number of sampling points for fixed measurement
related pollutant: Benzene (air)
assessment threshold: Between Lower and Upper Assessment Threshold (LAT-UAT)
minimum population: 2000000
maximum population: 4749999
minimum SPO: 3

Minimum requirement for pollutant 20 for pop between 4750000 and 1000000000 when assessment is LAT-UAT - zone type is not considered
type: Concept
notation: 32
definition: Minimum requirement for pollutant 20 for pop between 4750000 and 1000000000 when assessment is LAT-UAT - zone type is not considered
status: valid
status modified: 2024-09-12
accepted date: 2024-09-12
in scheme: Criteria for determining the minimum number of sampling points for fixed measurement
related pollutant: Benzene (air)
assessment threshold: Between Lower and Upper Assessment Threshold (LAT-UAT)
minimum population: 4750000
maximum population: 1000000000
minimum SPO: 4

Minimum requirement for pollutant 20 for pop between 0 and 249999 when assessment is aboveUAT - zone type is not considered
type: Concept
notation: 33
definition: Minimum requirement for pollutant 20 for pop between 0 and 249999 when assessment is aboveUAT - zone type is not considered
status: valid
status modified: 2024-09-12
accepted date: 2024-09-12
in scheme: Criteria for determining the minimum number of sampling points for fixed measurement
related pollutant: Benzene (air)
assessment threshold: Above Upper Assessment Threshold (>UAT)
minimum population: 0
maximum population: 249999
minimum SPO: 1

Minimum requirement for pollutant 20 for pop between 250000 and 749999 when assessment is aboveUAT - zone type is not considered
type: Concept
notation: 34
definition: Minimum requirement for pollutant 20 for pop between 250000 and 749999 when assessment is aboveUAT - zone type is not considered
status: valid
status modified: 2024-09-12
accepted date: 2024-09-12
in scheme: Criteria for determining the minimum number of sampling points for fixed measurement
related pollutant: Benzene (air)
assessment threshold: Above Upper Assessment Threshold (>UAT)
minimum population: 250000
maximum population: 749999
minimum SPO: 2

Minimum requirement for pollutant 20 for pop between 750000 and 999999 when assessment is aboveUAT - zone type is not considered
type: Concept
notation: 35
definition: Minimum requirement for pollutant 20 for pop between 750000 and 999999 when assessment is aboveUAT - zone type is not considered
status: valid
status modified: 2024-09-12
accepted date: 2024-09-12
in scheme: Criteria for determining the minimum number of sampling points for fixed measurement
related pollutant: Benzene (air)
assessment threshold: Above Upper Assessment Threshold (>UAT)
minimum population: 750000
maximum population: 999999
minimum SPO: 3

Minimum requirement for pollutant 20 for pop between 1000000 and 1499999 when assessment is aboveUAT - zone type is not considered
type: Concept
notation: 36
definition: Minimum requirement for pollutant 20 for pop between 1000000 and 1499999 when assessment is aboveUAT - zone type is not considered
status: valid
status modified: 2024-09-12
accepted date: 2024-09-12
in scheme: Criteria for determining the minimum number of sampling points for fixed measurement
related pollutant: Benzene (air)
assessment threshold: Above Upper Assessment Threshold (>UAT)
minimum population: 1000000
maximum population: 1499999
minimum SPO: 4

Minimum requirement for pollutant 20 for pop between 1500000 and 1999999 when assessment is aboveUAT - zone type is not considered
type: Concept
notation: 37
definition: Minimum requirement for pollutant 20 for pop between 1500000 and 1999999 when assessment is aboveUAT - zone type is not considered
status: valid
status modified: 2024-09-12
accepted date: 2024-09-12
in scheme: Criteria for determining the minimum number of sampling points for fixed measurement
related pollutant: Benzene (air)
assessment threshold: Above Upper Assessment Threshold (>UAT)
minimum population: 1500000
maximum population: 1999999
minimum SPO: 5

Minimum requirement for pollutant 20 for pop between 2000000 and 2749999 when assessment is aboveUAT - zone type is not considered
type: Concept
notation: 38
definition: Minimum requirement for pollutant 20 for pop between 2000000 and 2749999 when assessment is aboveUAT - zone type is not considered
status: valid
status modified: 2024-09-12
accepted date: 2024-09-12
in scheme: Criteria for determining the minimum number of sampling points for fixed measurement
related pollutant: Benzene (air)
assessment threshold: Above Upper Assessment Threshold (>UAT)
minimum population: 2000000
maximum population: 2749999
minimum SPO: 6

Minimum requirement for pollutant 20 for pop between 2750000 and 3749999 when assessment is aboveUAT - zone type is not considered
type: Concept
notation: 39
definition: Minimum requirement for pollutant 20 for pop between 2750000 and 3749999 when assessment is aboveUAT - zone type is not considered
status: valid
status modified: 2024-09-12
accepted date: 2024-09-12
in scheme: Criteria for determining the minimum number of sampling points for fixed measurement
related pollutant: Benzene (air)
assessment threshold: Above Upper Assessment Threshold (>UAT)
minimum population: 2750000
maximum population: 3749999
minimum SPO: 7

Minimum requirement for pollutant 20 for pop between 3750000 and 4749999 when assessment is aboveUAT - zone type is not considered
type: Concept
notation: 40
definition: Minimum requirement for pollutant 20 for pop between 3750000 and 4749999 when assessment is aboveUAT - zone type is not considered
status: valid
status modified: 2024-09-12
accepted date: 2024-09-12
in scheme: Criteria for determining the minimum number of sampling points for fixed measurement
related pollutant: Benzene (air)
assessment threshold: Above Upper Assessment Threshold (>UAT)
minimum population: 3750000
maximum population: 4749999
minimum SPO: 8

Minimum requirement for pollutant 20 for pop between 4750000 and 5999999 when assessment is aboveUAT - zone type is not considered
type: Concept
notation: 41
definition: Minimum requirement for pollutant 20 for pop between 4750000 and 5999999 when assessment is aboveUAT - zone type is not considered
status: valid
status modified: 2024-09-12
accepted date: 2024-09-12
in scheme: Criteria for determining the minimum number of sampling points for fixed measurement
related pollutant: Benzene (air)
assessment threshold: Above Upper Assessment Threshold (>UAT)
minimum population: 4750000
maximum population: 5999999
minimum SPO: 9

Minimum requirement for pollutant 20 for pop between 6000000 and 1000000000 when assessment is aboveUAT - zone type is not considered
type: Concept
notation: 42
definition: Minimum requirement for pollutant 20 for pop between 6000000 and 1000000000 when assessment is aboveUAT - zone type is not considered
status: valid
status modified: 2024-09-12
accepted date: 2024-09-12
in scheme: Criteria for determining the minimum number of sampling points for fixed measurement
related pollutant: Benzene (air)
assessment threshold: Above Upper Assessment Threshold (>UAT)
minimum population: 6000000
maximum population: 1000000000
minimum SPO: 10

Minimum requirement for pollutant 5 for pop between 0 and 249999 when assessment is LAT-UAT - zone type is not considered
type: Concept
notation: 43
definition: Minimum requirement for pollutant 5 for pop between 0 and 249999 when assessment is LAT-UAT - zone type is not considered
status: valid
status modified: 2024-09-12
accepted date: 2024-09-12
in scheme: Criteria for determining the minimum number of sampling points for fixed measurement
related pollutant: Particulate matter < 10 µm (aerosol)
assessment threshold: Between Lower and Upper Assessment Threshold (LAT-UAT)
minimum population: 0
maximum population: 249999
minimum SPO: 1

Minimum requirement for pollutant 5 for pop between 250000 and 999999 when assessment is LAT-UAT - zone type is not considered
type: Concept
notation: 44
definition: Minimum requirement for pollutant 5 for pop between 250000 and 999999 when assessment is LAT-UAT - zone type is not considered
status: valid
status modified: 2024-09-12
accepted date: 2024-09-12
in scheme: Criteria for determining the minimum number of sampling points for fixed measurement
related pollutant: Particulate matter < 10 µm (aerosol)
assessment threshold: Between Lower and Upper Assessment Threshold (LAT-UAT)
minimum population: 250000
maximum population: 999999
minimum SPO: 2

Minimum requirement for pollutant 5 for pop between 1000000 and 1999999 when assessment is LAT-UAT - zone type is not considered
type: Concept
notation: 45
definition: Minimum requirement for pollutant 5 for pop between 1000000 and 1999999 when assessment is LAT-UAT - zone type is not considered
status: valid
status modified: 2024-09-12
accepted date: 2024-09-12
in scheme: Criteria for determining the minimum number of sampling points for fixed measurement
related pollutant: Particulate matter < 10 µm (aerosol)
assessment threshold: Between Lower and Upper Assessment Threshold (LAT-UAT)
minimum population: 1000000
maximum population: 1999999
minimum SPO: 3

Minimum requirement for pollutant 5 for pop between 2000000 and 3749999 when assessment is LAT-UAT - zone type is not considered
type: Concept
notation: 46
definition: Minimum requirement for pollutant 5 for pop between 2000000 and 3749999 when assessment is LAT-UAT - zone type is not considered
status: valid
status modified: 2024-09-12
accepted date: 2024-09-12
in scheme: Criteria for determining the minimum number of sampling points for fixed measurement
related pollutant: Particulate matter < 10 µm (aerosol)
assessment threshold: Between Lower and Upper Assessment Threshold (LAT-UAT)
minimum population: 2000000
maximum population: 3749999
minimum SPO: 4

Minimum requirement for pollutant 5 for pop between 3750000 and 5999999 when assessment is LAT-UAT - zone type is not considered
type: Concept
notation: 47
definition: Minimum requirement for pollutant 5 for pop between 3750000 and 5999999 when assessment is LAT-UAT - zone type is not considered
status: valid
status modified: 2024-09-12
accepted date: 2024-09-12
in scheme: Criteria for determining the minimum number of sampling points for fixed measurement
related pollutant: Particulate matter < 10 µm (aerosol)
assessment threshold: Between Lower and Upper Assessment Threshold (LAT-UAT)
minimum population: 3750000
maximum population: 5999999
minimum SPO: 6

Minimum requirement for pollutant 5 for pop between 6000000 and 1000000000 when assessment is LAT-UAT - zone type is not considered
type: Concept
notation: 48
definition: Minimum requirement for pollutant 5 for pop between 6000000 and 1000000000 when assessment is LAT-UAT - zone type is not considered
status: valid
status modified: 2024-09-12
accepted date: 2024-09-12
in scheme: Criteria for determining the minimum number of sampling points for fixed measurement
related pollutant: Particulate matter < 10 µm (aerosol)
assessment threshold: Between Lower and Upper Assessment Threshold (LAT-UAT)
minimum population: 6000000
maximum population: 1000000000
minimum SPO: 7

Minimum requirement for pollutant 5 for pop between 0 and 249999 when assessment is aboveUAT - zone type is not considered
type: Concept
notation: 49
definition: Minimum requirement for pollutant 5 for pop between 0 and 249999 when assessment is aboveUAT - zone type is not considered
status: valid
status modified: 2024-09-12
accepted date: 2024-09-12
in scheme: Criteria for determining the minimum number of sampling points for fixed measurement
related pollutant: Particulate matter < 10 µm (aerosol)
assessment threshold: Above Upper Assessment Threshold (>UAT)
minimum population: 0
maximum population: 249999
minimum SPO: 2

Minimum requirement for pollutant 5 for pop between 250000 and 749999 when assessment is aboveUAT - zone type is not considered
type: Concept
notation: 50
definition: Minimum requirement for pollutant 5 for pop between 250000 and 749999 when assessment is aboveUAT - zone type is not considered
status: valid
status modified: 2024-09-12
accepted date: 2024-09-12
in scheme: Criteria for determining the minimum number of sampling points for fixed measurement
related pollutant: Particulate matter < 10 µm (aerosol)
assessment threshold: Above Upper Assessment Threshold (>UAT)
minimum population: 250000
maximum population: 749999
minimum SPO: 3

Minimum requirement for pollutant 5 for pop between 750000 and 999999 when assessment is aboveUAT - zone type is not considered
type: Concept
notation: 51
definition: Minimum requirement for pollutant 5 for pop between 750000 and 999999 when assessment is aboveUAT - zone type is not considered
status: valid
status modified: 2024-09-12
accepted date: 2024-09-12
in scheme: Criteria for determining the minimum number of sampling points for fixed measurement
related pollutant: Particulate matter < 10 µm (aerosol)
assessment threshold: Above Upper Assessment Threshold (>UAT)
minimum population: 750000
maximum population: 999999
minimum SPO: 4

Minimum requirement for pollutant 5 for pop between 1000000 and 1499999 when assessment is aboveUAT - zone type is not considered
type: Concept
notation: 52
definition: Minimum requirement for pollutant 5 for pop between 1000000 and 1499999 when assessment is aboveUAT - zone type is not considered
status: valid
status modified: 2024-09-12
accepted date: 2024-09-12
in scheme: Criteria for determining the minimum number of sampling points for fixed measurement
related pollutant: Particulate matter < 10 µm (aerosol)
assessment threshold: Above Upper Assessment Threshold (>UAT)
minimum population: 1000000
maximum population: 1499999
minimum SPO: 6

Minimum requirement for pollutant 5 for pop between 1500000 and 1999999 when assessment is aboveUAT - zone type is not considered
type: Concept
notation: 53
definition: Minimum requirement for pollutant 5 for pop between 1500000 and 1999999 when assessment is aboveUAT - zone type is not considered
status: valid
status modified: 2024-09-12
accepted date: 2024-09-12
in scheme: Criteria for determining the minimum number of sampling points for fixed measurement
related pollutant: Particulate matter < 10 µm (aerosol)
assessment threshold: Above Upper Assessment Threshold (>UAT)
minimum population: 1500000
maximum population: 1999999
minimum SPO: 7

Minimum requirement for pollutant 5 for pop between 2000000 and 2749999 when assessment is aboveUAT - zone type is not considered
type: Concept
notation: 54
definition: Minimum requirement for pollutant 5 for pop between 2000000 and 2749999 when assessment is aboveUAT - zone type is not considered
status: valid
status modified: 2024-09-12
accepted date: 2024-09-12
in scheme: Criteria for determining the minimum number of sampling points for fixed measurement
related pollutant: Particulate matter < 10 µm (aerosol)
assessment threshold: Above Upper Assessment Threshold (>UAT)
minimum population: 2000000
maximum population: 2749999
minimum SPO: 8

Minimum requirement for pollutant 5 for pop between 2750000 and 3749999 when assessment is aboveUAT - zone type is not considered
type: Concept
notation: 55
definition: Minimum requirement for pollutant 5 for pop between 2750000 and 3749999 when assessment is aboveUAT - zone type is not considered
status: valid
status modified: 2024-09-12
accepted date: 2024-09-12
in scheme: Criteria for determining the minimum number of sampling points for fixed measurement
related pollutant: Particulate matter < 10 µm (aerosol)
assessment threshold: Above Upper Assessment Threshold (>UAT)
minimum population: 2750000
maximum population: 3749999
minimum SPO: 10

Minimum requirement for pollutant 5 for pop between 3750000 and 4749999 when assessment is aboveUAT - zone type is not considered
type: Concept
notation: 56
definition: Minimum requirement for pollutant 5 for pop between 3750000 and 4749999 when assessment is aboveUAT - zone type is not considered
status: valid
status modified: 2024-09-12
accepted date: 2024-09-12
in scheme: Criteria for determining the minimum number of sampling points for fixed measurement
related pollutant: Particulate matter < 10 µm (aerosol)
assessment threshold: Above Upper Assessment Threshold (>UAT)
minimum population: 3750000
maximum population: 4749999
minimum SPO: 11

Minimum requirement for pollutant 5 for pop between 4750000 and 5999999 when assessment is aboveUAT - zone type is not considered
type: Concept
notation: 57
definition: Minimum requirement for pollutant 5 for pop between 4750000 and 5999999 when assessment is aboveUAT - zone type is not considered
status: valid
status modified: 2024-09-12
accepted date: 2024-09-12
in scheme: Criteria for determining the minimum number of sampling points for fixed measurement
related pollutant: Particulate matter < 10 µm (aerosol)
assessment threshold: Above Upper Assessment Threshold (>UAT)
minimum population: 4750000
maximum population: 5999999
minimum SPO: 13

Minimum requirement for pollutant 5 for pop between 6000000 and 1000000000 when assessment is aboveUAT - zone type is not considered
type: Concept
notation: 58
definition: Minimum requirement for pollutant 5 for pop between 6000000 and 1000000000 when assessment is aboveUAT - zone type is not considered
status: valid
status modified: 2024-09-12
accepted date: 2024-09-12
in scheme: Criteria for determining the minimum number of sampling points for fixed measurement
related pollutant: Particulate matter < 10 µm (aerosol)
assessment threshold: Above Upper Assessment Threshold (>UAT)
minimum population: 6000000
maximum population: 1000000000
minimum SPO: 15

Minimum requirement for pollutant 5012 for pop between 0 and 999999 when assessment is LAT-UAT - zone type is not considered
type: Concept
notation: 59
definition: Minimum requirement for pollutant 5012 for pop between 0 and 999999 when assessment is LAT-UAT - zone type is not considered
status: valid
status modified: 2024-09-12
accepted date: 2024-09-12
in scheme: Criteria for determining the minimum number of sampling points for fixed measurement
related pollutant: Lead in PM10 (aerosol)
assessment threshold: Between Lower and Upper Assessment Threshold (LAT-UAT)
minimum population: 0
maximum population: 999999
minimum SPO: 1

Minimum requirement for pollutant 5012 for pop between 999999 and 1999999 when assessment is LAT-UAT - zone type is not considered
type: Concept
notation: 60
definition: Minimum requirement for pollutant 5012 for pop between 999999 and 1999999 when assessment is LAT-UAT - zone type is not considered
status: valid
status modified: 2024-09-12
accepted date: 2024-09-12
in scheme: Criteria for determining the minimum number of sampling points for fixed measurement
related pollutant: Lead in PM10 (aerosol)
assessment threshold: Between Lower and Upper Assessment Threshold (LAT-UAT)
minimum population: 999999
maximum population: 1999999
minimum SPO: 2

Minimum requirement for pollutant 5012 for pop between 1999999 and 4749999 when assessment is LAT-UAT - zone type is not considered
type: Concept
notation: 61
definition: Minimum requirement for pollutant 5012 for pop between 1999999 and 4749999 when assessment is LAT-UAT - zone type is not considered
status: valid
status modified: 2024-09-12
accepted date: 2024-09-12
in scheme: Criteria for determining the minimum number of sampling points for fixed measurement
related pollutant: Lead in PM10 (aerosol)
assessment threshold: Between Lower and Upper Assessment Threshold (LAT-UAT)
minimum population: 1999999
maximum population: 4749999
minimum SPO: 3

Minimum requirement for pollutant 5012 for pop between 4749999 and 1000000000 when assessment is LAT-UAT - zone type is not considered
type: Concept
notation: 62
definition: Minimum requirement for pollutant 5012 for pop between 4749999 and 1000000000 when assessment is LAT-UAT - zone type is not considered
status: valid
status modified: 2024-09-12
accepted date: 2024-09-12
in scheme: Criteria for determining the minimum number of sampling points for fixed measurement
related pollutant: Lead in PM10 (aerosol)
assessment threshold: Between Lower and Upper Assessment Threshold (LAT-UAT)
minimum population: 4749999
maximum population: 1000000000
minimum SPO: 4

Minimum requirement for pollutant 5012 for pop between 0 and 249999 when assessment is aboveUAT - zone type is not considered
type: Concept
notation: 63
definition: Minimum requirement for pollutant 5012 for pop between 0 and 249999 when assessment is aboveUAT - zone type is not considered
status: valid
status modified: 2024-09-12
accepted date: 2024-09-12
in scheme: Criteria for determining the minimum number of sampling points for fixed measurement
related pollutant: Lead in PM10 (aerosol)
assessment threshold: Above Upper Assessment Threshold (>UAT)
minimum population: 0
maximum population: 249999
minimum SPO: 1

Minimum requirement for pollutant 5012 for pop between 249999 and 749999 when assessment is aboveUAT - zone type is not considered
type: Concept
notation: 64
definition: Minimum requirement for pollutant 5012 for pop between 249999 and 749999 when assessment is aboveUAT - zone type is not considered
status: valid
status modified: 2024-09-12
accepted date: 2024-09-12
in scheme: Criteria for determining the minimum number of sampling points for fixed measurement
related pollutant: Lead in PM10 (aerosol)
assessment threshold: Above Upper Assessment Threshold (>UAT)
minimum population: 249999
maximum population: 749999
minimum SPO: 2

Minimum requirement for pollutant 5012 for pop between 749999 and 999999 when assessment is aboveUAT - zone type is not considered
type: Concept
notation: 65
definition: Minimum requirement for pollutant 5012 for pop between 749999 and 999999 when assessment is aboveUAT - zone type is not considered
status: valid
status modified: 2024-09-12
accepted date: 2024-09-12
in scheme: Criteria for determining the minimum number of sampling points for fixed measurement
related pollutant: Lead in PM10 (aerosol)
assessment threshold: Above Upper Assessment Threshold (>UAT)
minimum population: 749999
maximum population: 999999
minimum SPO: 3

Minimum requirement for pollutant 5012 for pop between 999999 and 1499999 when assessment is aboveUAT - zone type is not considered
type: Concept
notation: 66
definition: Minimum requirement for pollutant 5012 for pop between 999999 and 1499999 when assessment is aboveUAT - zone type is not considered
status: valid
status modified: 2024-09-12
accepted date: 2024-09-12
in scheme: Criteria for determining the minimum number of sampling points for fixed measurement
related pollutant: Lead in PM10 (aerosol)
assessment threshold: Above Upper Assessment Threshold (>UAT)
minimum population: 999999
maximum population: 1499999
minimum SPO: 4

Minimum requirement for pollutant 5012 for pop between 1499999 and 1999999 when assessment is aboveUAT - zone type is not considered
type: Concept
notation: 67
definition: Minimum requirement for pollutant 5012 for pop between 1499999 and 1999999 when assessment is aboveUAT - zone type is not considered
status: valid
status modified: 2024-09-12
accepted date: 2024-09-12
in scheme: Criteria for determining the minimum number of sampling points for fixed measurement
related pollutant: Lead in PM10 (aerosol)
assessment threshold: Above Upper Assessment Threshold (>UAT)
minimum population: 1499999
maximum population: 1999999
minimum SPO: 5

Minimum requirement for pollutant 5012 for pop between 1999999 and 2749999 when assessment is aboveUAT - zone type is not considered
type: Concept
notation: 68
definition: Minimum requirement for pollutant 5012 for pop between 1999999 and 2749999 when assessment is aboveUAT - zone type is not considered
status: valid
status modified: 2024-09-12
accepted date: 2024-09-12
in scheme: Criteria for determining the minimum number of sampling points for fixed measurement
related pollutant: Lead in PM10 (aerosol)
assessment threshold: Above Upper Assessment Threshold (>UAT)
minimum population: 1999999
maximum population: 2749999
minimum SPO: 6

Minimum requirement for pollutant 5012 for pop between 2749999 and 3749999 when assessment is aboveUAT - zone type is not considered
type: Concept
notation: 69
definition: Minimum requirement for pollutant 5012 for pop between 2749999 and 3749999 when assessment is aboveUAT - zone type is not considered
status: valid
status modified: 2024-09-12
accepted date: 2024-09-12
in scheme: Criteria for determining the minimum number of sampling points for fixed measurement
related pollutant: Lead in PM10 (aerosol)
assessment threshold: Above Upper Assessment Threshold (>UAT)
minimum population: 2749999
maximum population: 3749999
minimum SPO: 7

Minimum requirement for pollutant 5012 for pop between 3749999 and 4749999 when assessment is aboveUAT - zone type is not considered
type: Concept
notation: 70
definition: Minimum requirement for pollutant 5012 for pop between 3749999 and 4749999 when assessment is aboveUAT - zone type is not considered
status: valid
status modified: 2024-09-12
accepted date: 2024-09-12
in scheme: Criteria for determining the minimum number of sampling points for fixed measurement
related pollutant: Lead in PM10 (aerosol)
assessment threshold: Above Upper Assessment Threshold (>UAT)
minimum population: 3749999
maximum population: 4749999
minimum SPO: 8

Minimum requirement for pollutant 5012 for pop between 4749999 and 5999999 when assessment is aboveUAT - zone type is not considered
type: Concept
notation: 71
definition: Minimum requirement for pollutant 5012 for pop between 4749999 and 5999999 when assessment is aboveUAT - zone type is not considered
status: valid
status modified: 2024-09-12
accepted date: 2024-09-12
in scheme: Criteria for determining the minimum number of sampling points for fixed measurement
related pollutant: Lead in PM10 (aerosol)
assessment threshold: Above Upper Assessment Threshold (>UAT)
minimum population: 4749999
maximum population: 5999999
minimum SPO: 9

Minimum requirement for pollutant 5012 for pop between 5999999 and 1000000000 when assessment is aboveUAT - zone type is not considered
type: Concept
notation: 72
definition: Minimum requirement for pollutant 5012 for pop between 5999999 and 1000000000 when assessment is aboveUAT - zone type is not considered
status: valid
status modified: 2024-09-12
accepted date: 2024-09-12
in scheme: Criteria for determining the minimum number of sampling points for fixed measurement
related pollutant: Lead in PM10 (aerosol)
assessment threshold: Above Upper Assessment Threshold (>UAT)
minimum population: 5999999
maximum population: 1000000000
minimum SPO: 10

Minimum requirement for pollutant 5014 for pop between 0 and 3749999 when assessment is LAT-UAT - zone type is not considered
type: Concept
notation: 73
definition: Minimum requirement for pollutant 5014 for pop between 0 and 3749999 when assessment is LAT-UAT - zone type is not considered
status: valid
status modified: 2024-09-12
accepted date: 2024-09-12
in scheme: Criteria for determining the minimum number of sampling points for fixed measurement
related pollutant: Cadmium in PM10 (aerosol)
assessment threshold: Between Lower and Upper Assessment Threshold (LAT-UAT)
minimum population: 0
maximum population: 3749999
minimum SPO: 1

Minimum requirement for pollutant 5014 for pop between 3750000 and 1000000000 when assessment is LAT-UAT - zone type is not considered
type: Concept
notation: 74
definition: Minimum requirement for pollutant 5014 for pop between 3750000 and 1000000000 when assessment is LAT-UAT - zone type is not considered
status: valid
status modified: 2024-09-12
accepted date: 2024-09-12
in scheme: Criteria for determining the minimum number of sampling points for fixed measurement
related pollutant: Cadmium in PM10 (aerosol)
assessment threshold: Between Lower and Upper Assessment Threshold (LAT-UAT)
minimum population: 3750000
maximum population: 1000000000
minimum SPO: 2

Minimum requirement for pollutant 5014 for pop between 0 and 749999 when assessment is aboveUAT - zone type is not considered
type: Concept
notation: 75
definition: Minimum requirement for pollutant 5014 for pop between 0 and 749999 when assessment is aboveUAT - zone type is not considered
status: valid
status modified: 2024-09-12
accepted date: 2024-09-12
in scheme: Criteria for determining the minimum number of sampling points for fixed measurement
related pollutant: Cadmium in PM10 (aerosol)
assessment threshold: Above Upper Assessment Threshold (>UAT)
minimum population: 0
maximum population: 749999
minimum SPO: 1

Minimum requirement for pollutant 5014 for pop between 750000 and 3749999 when assessment is aboveUAT - zone type is not considered
type: Concept
notation: 76
definition: Minimum requirement for pollutant 5014 for pop between 750000 and 3749999 when assessment is aboveUAT - zone type is not considered
status: valid
status modified: 2024-09-12
accepted date: 2024-09-12
in scheme: Criteria for determining the minimum number of sampling points for fixed measurement
related pollutant: Cadmium in PM10 (aerosol)
assessment threshold: Above Upper Assessment Threshold (>UAT)
minimum population: 750000
maximum population: 3749999
minimum SPO: 2

Minimum requirement for pollutant 5014 for pop between 3750000 and 4749999 when assessment is aboveUAT - zone type is not considered
type: Concept
notation: 77
definition: Minimum requirement for pollutant 5014 for pop between 3750000 and 4749999 when assessment is aboveUAT - zone type is not considered
status: valid
status modified: 2024-09-12
accepted date: 2024-09-12
in scheme: Criteria for determining the minimum number of sampling points for fixed measurement
related pollutant: Cadmium in PM10 (aerosol)
assessment threshold: Above Upper Assessment Threshold (>UAT)
minimum population: 3750000
maximum population: 4749999
minimum SPO: 3

Minimum requirement for pollutant 5014 for pop between 4750000 and 5999999 when assessment is aboveUAT - zone type is not considered
type: Concept
notation: 78
definition: Minimum requirement for pollutant 5014 for pop between 4750000 and 5999999 when assessment is aboveUAT - zone type is not considered
status: valid
status modified: 2024-09-12
accepted date: 2024-09-12
in scheme: Criteria for determining the minimum number of sampling points for fixed measurement
related pollutant: Cadmium in PM10 (aerosol)
assessment threshold: Above Upper Assessment Threshold (>UAT)
minimum population: 4750000
maximum population: 5999999
minimum SPO: 4

Minimum requirement for pollutant 5014 for pop between 6000000 and 1000000000 when assessment is aboveUAT - zone type is not considered
type: Concept
notation: 79
definition: Minimum requirement for pollutant 5014 for pop between 6000000 and 1000000000 when assessment is aboveUAT - zone type is not considered
status: valid
status modified: 2024-09-12
accepted date: 2024-09-12
in scheme: Criteria for determining the minimum number of sampling points for fixed measurement
related pollutant: Cadmium in PM10 (aerosol)
assessment threshold: Above Upper Assessment Threshold (>UAT)
minimum population: 6000000
maximum population: 1000000000
minimum SPO: 5

Minimum requirement for pollutant 5015 for pop between 0 and 3749999 when assessment is LAT-UAT - zone type is not considered
type: Concept
notation: 80
definition: Minimum requirement for pollutant 5015 for pop between 0 and 3749999 when assessment is LAT-UAT - zone type is not considered
status: valid
status modified: 2024-09-12
accepted date: 2024-09-12
in scheme: Criteria for determining the minimum number of sampling points for fixed measurement
related pollutant: Nickel in PM10 (aerosol)
assessment threshold: Between Lower and Upper Assessment Threshold (LAT-UAT)
minimum population: 0
maximum population: 3749999
minimum SPO: 1

Minimum requirement for pollutant 5015 for pop between 3750000 and 1000000000 when assessment is LAT-UAT - zone type is not considered
type: Concept
notation: 81
definition: Minimum requirement for pollutant 5015 for pop between 3750000 and 1000000000 when assessment is LAT-UAT - zone type is not considered
status: valid
status modified: 2024-09-12
accepted date: 2024-09-12
in scheme: Criteria for determining the minimum number of sampling points for fixed measurement
related pollutant: Nickel in PM10 (aerosol)
assessment threshold: Between Lower and Upper Assessment Threshold (LAT-UAT)
minimum population: 3750000
maximum population: 1000000000
minimum SPO: 2

Minimum requirement for pollutant 5015 for pop between 0 and 749999 when assessment is aboveUAT - zone type is not considered
type: Concept
notation: 82
definition: Minimum requirement for pollutant 5015 for pop between 0 and 749999 when assessment is aboveUAT - zone type is not considered
status: valid
status modified: 2024-09-12
accepted date: 2024-09-12
in scheme: Criteria for determining the minimum number of sampling points for fixed measurement
related pollutant: Nickel in PM10 (aerosol)
assessment threshold: Above Upper Assessment Threshold (>UAT)
minimum population: 0
maximum population: 749999
minimum SPO: 1

Minimum requirement for pollutant 5015 for pop between 750000 and 3749999 when assessment is aboveUAT - zone type is not considered
type: Concept
notation: 83
definition: Minimum requirement for pollutant 5015 for pop between 750000 and 3749999 when assessment is aboveUAT - zone type is not considered
status: valid
status modified: 2024-09-12
accepted date: 2024-09-12
in scheme: Criteria for determining the minimum number of sampling points for fixed measurement
related pollutant: Nickel in PM10 (aerosol)
assessment threshold: Above Upper Assessment Threshold (>UAT)
minimum population: 750000
maximum population: 3749999
minimum SPO: 2

Minimum requirement for pollutant 5015 for pop between 3750000 and 4749999 when assessment is aboveUAT - zone type is not considered
type: Concept
notation: 84
definition: Minimum requirement for pollutant 5015 for pop between 3750000 and 4749999 when assessment is aboveUAT - zone type is not considered
status: valid
status modified: 2024-09-12
accepted date: 2024-09-12
in scheme: Criteria for determining the minimum number of sampling points for fixed measurement
related pollutant: Nickel in PM10 (aerosol)
assessment threshold: Above Upper Assessment Threshold (>UAT)
minimum population: 3750000
maximum population: 4749999
minimum SPO: 3

Minimum requirement for pollutant 5015 for pop between 4750000 and 5999999 when assessment is aboveUAT - zone type is not considered
type: Concept
notation: 85
definition: Minimum requirement for pollutant 5015 for pop between 4750000 and 5999999 when assessment is aboveUAT - zone type is not considered
status: valid
status modified: 2024-09-12
accepted date: 2024-09-12
in scheme: Criteria for determining the minimum number of sampling points for fixed measurement
related pollutant: Nickel in PM10 (aerosol)
assessment threshold: Above Upper Assessment Threshold (>UAT)
minimum population: 4750000
maximum population: 5999999
minimum SPO: 4

Minimum requirement for pollutant 5015 for pop between 6000000 and 1000000000 when assessment is aboveUAT - zone type is not considered
type: Concept
notation: 86
definition: Minimum requirement for pollutant 5015 for pop between 6000000 and 1000000000 when assessment is aboveUAT - zone type is not considered
status: valid
status modified: 2024-09-12
accepted date: 2024-09-12
in scheme: Criteria for determining the minimum number of sampling points for fixed measurement
related pollutant: Nickel in PM10 (aerosol)
assessment threshold: Above Upper Assessment Threshold (>UAT)
minimum population: 6000000
maximum population: 1000000000
minimum SPO: 5

Minimum requirement for pollutant 5018 for pop between 0 and 3749999 when assessment is LAT-UAT - zone type is not considered
type: Concept
notation: 87
definition: Minimum requirement for pollutant 5018 for pop between 0 and 3749999 when assessment is LAT-UAT - zone type is not considered
status: valid
status modified: 2024-09-12
accepted date: 2024-09-12
in scheme: Criteria for determining the minimum number of sampling points for fixed measurement
related pollutant: Arsenic in PM10 (aerosol)
assessment threshold: Between Lower and Upper Assessment Threshold (LAT-UAT)
minimum population: 0
maximum population: 3749999
minimum SPO: 1

Minimum requirement for pollutant 5018 for pop between 3750000 and 1000000000 when assessment is LAT-UAT - zone type is not considered
type: Concept
notation: 88
definition: Minimum requirement for pollutant 5018 for pop between 3750000 and 1000000000 when assessment is LAT-UAT - zone type is not considered
status: valid
status modified: 2024-09-12
accepted date: 2024-09-12
in scheme: Criteria for determining the minimum number of sampling points for fixed measurement
related pollutant: Arsenic in PM10 (aerosol)
assessment threshold: Between Lower and Upper Assessment Threshold (LAT-UAT)
minimum population: 3750000
maximum population: 1000000000
minimum SPO: 2

Minimum requirement for pollutant 5018 for pop between 0 and 749999 when assessment is aboveUAT - zone type is not considered
type: Concept
notation: 89
definition: Minimum requirement for pollutant 5018 for pop between 0 and 749999 when assessment is aboveUAT - zone type is not considered
status: valid
status modified: 2024-09-12
accepted date: 2024-09-12
in scheme: Criteria for determining the minimum number of sampling points for fixed measurement
related pollutant: Arsenic in PM10 (aerosol)
assessment threshold: Above Upper Assessment Threshold (>UAT)
minimum population: 0
maximum population: 749999
minimum SPO: 1

Minimum requirement for pollutant 5018 for pop between 750000 and 3749999 when assessment is aboveUAT - zone type is not considered
type: Concept
notation: 90
definition: Minimum requirement for pollutant 5018 for pop between 750000 and 3749999 when assessment is aboveUAT - zone type is not considered
status: valid
status modified: 2024-09-12
accepted date: 2024-09-12
in scheme: Criteria for determining the minimum number of sampling points for fixed measurement
related pollutant: Arsenic in PM10 (aerosol)
assessment threshold: Above Upper Assessment Threshold (>UAT)
minimum population: 750000
maximum population: 3749999
minimum SPO: 2

Minimum requirement for pollutant 5018 for pop between 3750000 and 4749999 when assessment is aboveUAT - zone type is not considered
type: Concept
notation: 91
definition: Minimum requirement for pollutant 5018 for pop between 3750000 and 4749999 when assessment is aboveUAT - zone type is not considered
status: valid
status modified: 2024-09-12
accepted date: 2024-09-12
in scheme: Criteria for determining the minimum number of sampling points for fixed measurement
related pollutant: Arsenic in PM10 (aerosol)
assessment threshold: Above Upper Assessment Threshold (>UAT)
minimum population: 3750000
maximum population: 4749999
minimum SPO: 3

Minimum requirement for pollutant 5018 for pop between 4750000 and 5999999 when assessment is aboveUAT - zone type is not considered
type: Concept
notation: 92
definition: Minimum requirement for pollutant 5018 for pop between 4750000 and 5999999 when assessment is aboveUAT - zone type is not considered
status: valid
status modified: 2024-09-12
accepted date: 2024-09-12
in scheme: Criteria for determining the minimum number of sampling points for fixed measurement
related pollutant: Arsenic in PM10 (aerosol)
assessment threshold: Above Upper Assessment Threshold (>UAT)
minimum population: 4750000
maximum population: 5999999
minimum SPO: 4

Minimum requirement for pollutant 5018 for pop between 6000000 and 1000000000 when assessment is aboveUAT - zone type is not considered
type: Concept
notation: 93
definition: Minimum requirement for pollutant 5018 for pop between 6000000 and 1000000000 when assessment is aboveUAT - zone type is not considered
status: valid
status modified: 2024-09-12
accepted date: 2024-09-12
in scheme: Criteria for determining the minimum number of sampling points for fixed measurement
related pollutant: Arsenic in PM10 (aerosol)
assessment threshold: Above Upper Assessment Threshold (>UAT)
minimum population: 6000000
maximum population: 1000000000
minimum SPO: 5

Minimum requirement for pollutant 5029 for pop between 0 and 3749999 when assessment is LAT-UAT - zone type is not considered
type: Concept
notation: 94
definition: Minimum requirement for pollutant 5029 for pop between 0 and 3749999 when assessment is LAT-UAT - zone type is not considered
status: valid
status modified: 2024-09-12
accepted date: 2024-09-12
in scheme: Criteria for determining the minimum number of sampling points for fixed measurement
related pollutant: Benzo(a)pyrene in PM10 (aerosol)
assessment threshold: Between Lower and Upper Assessment Threshold (LAT-UAT)
minimum population: 0
maximum population: 3749999
minimum SPO: 1

Minimum requirement for pollutant 5029 for pop between 3750000 and 1000000000 when assessment is LAT-UAT - zone type is not considered
type: Concept
notation: 95
definition: Minimum requirement for pollutant 5029 for pop between 3750000 and 1000000000 when assessment is LAT-UAT - zone type is not considered
status: valid
status modified: 2024-09-12
accepted date: 2024-09-12
in scheme: Criteria for determining the minimum number of sampling points for fixed measurement
related pollutant: Benzo(a)pyrene in PM10 (aerosol)
assessment threshold: Between Lower and Upper Assessment Threshold (LAT-UAT)
minimum population: 3750000
maximum population: 1000000000
minimum SPO: 2

Minimum requirement for pollutant 5029 for pop between 0 and 749999 when assessment is aboveUAT - zone type is not considered
type: Concept
notation: 96
definition: Minimum requirement for pollutant 5029 for pop between 0 and 749999 when assessment is aboveUAT - zone type is not considered
status: valid
status modified: 2024-09-12
accepted date: 2024-09-12
in scheme: Criteria for determining the minimum number of sampling points for fixed measurement
related pollutant: Benzo(a)pyrene in PM10 (aerosol)
assessment threshold: Above Upper Assessment Threshold (>UAT)
minimum population: 0
maximum population: 749999
minimum SPO: 1

Minimum requirement for pollutant 5029 for pop between 750000 and 1999999 when assessment is aboveUAT - zone type is not considered
type: Concept
notation: 97
definition: Minimum requirement for pollutant 5029 for pop between 750000 and 1999999 when assessment is aboveUAT - zone type is not considered
status: valid
status modified: 2024-09-12
accepted date: 2024-09-12
in scheme: Criteria for determining the minimum number of sampling points for fixed measurement
related pollutant: Benzo(a)pyrene in PM10 (aerosol)
assessment threshold: Above Upper Assessment Threshold (>UAT)
minimum population: 750000
maximum population: 1999999
minimum SPO: 2

Minimum requirement for pollutant 5029 for pop between 2000000 and 3749999 when assessment is aboveUAT - zone type is not considered
type: Concept
notation: 98
definition: Minimum requirement for pollutant 5029 for pop between 2000000 and 3749999 when assessment is aboveUAT - zone type is not considered
status: valid
status modified: 2024-09-12
accepted date: 2024-09-12
in scheme: Criteria for determining the minimum number of sampling points for fixed measurement
related pollutant: Benzo(a)pyrene in PM10 (aerosol)
assessment threshold: Above Upper Assessment Threshold (>UAT)
minimum population: 2000000
maximum population: 3749999
minimum SPO: 3

Minimum requirement for pollutant 5029 for pop between 3750000 and 4749999 when assessment is aboveUAT - zone type is not considered
type: Concept
notation: 99
definition: Minimum requirement for pollutant 5029 for pop between 3750000 and 4749999 when assessment is aboveUAT - zone type is not considered
status: valid
status modified: 2024-09-12
accepted date: 2024-09-12
in scheme: Criteria for determining the minimum number of sampling points for fixed measurement
related pollutant: Benzo(a)pyrene in PM10 (aerosol)
assessment threshold: Above Upper Assessment Threshold (>UAT)
minimum population: 3750000
maximum population: 4749999
minimum SPO: 4

Minimum requirement for pollutant 5029 for pop between 4750000 and 1000000000 when assessment is aboveUAT - zone type is not considered
type: Concept
notation: 100
definition: Minimum requirement for pollutant 5029 for pop between 4750000 and 1000000000 when assessment is aboveUAT - zone type is not considered
status: valid
status modified: 2024-09-12
accepted date: 2024-09-12
in scheme: Criteria for determining the minimum number of sampling points for fixed measurement
related pollutant: Benzo(a)pyrene in PM10 (aerosol)
assessment threshold: Above Upper Assessment Threshold (>UAT)
minimum population: 4750000
maximum population: 1000000000
minimum SPO: 5

Minimum requirement for pollutant 6001 for pop between 0 and 249999 when assessment is LAT-UAT - zone type is not considered
type: Concept
notation: 101
definition: Minimum requirement for pollutant 6001 for pop between 0 and 249999 when assessment is LAT-UAT - zone type is not considered
status: valid
status modified: 2024-09-12
accepted date: 2024-09-12
in scheme: Criteria for determining the minimum number of sampling points for fixed measurement
related pollutant: Particulate matter < 2.5 µm (aerosol)
assessment threshold: Between Lower and Upper Assessment Threshold (LAT-UAT)
minimum population: 0
maximum population: 249999
minimum SPO: 1

Minimum requirement for pollutant 6001 for pop between 250000 and 999999 when assessment is LAT-UAT - zone type is not considered
type: Concept
notation: 102
definition: Minimum requirement for pollutant 6001 for pop between 250000 and 999999 when assessment is LAT-UAT - zone type is not considered
status: valid
status modified: 2024-09-12
accepted date: 2024-09-12
in scheme: Criteria for determining the minimum number of sampling points for fixed measurement
related pollutant: Particulate matter < 2.5 µm (aerosol)
assessment threshold: Between Lower and Upper Assessment Threshold (LAT-UAT)
minimum population: 250000
maximum population: 999999
minimum SPO: 2

Minimum requirement for pollutant 6001 for pop between 1000000 and 1999999 when assessment is LAT-UAT - zone type is not considered
type: Concept
notation: 103
definition: Minimum requirement for pollutant 6001 for pop between 1000000 and 1999999 when assessment is LAT-UAT - zone type is not considered
status: valid
status modified: 2024-09-12
accepted date: 2024-09-12
in scheme: Criteria for determining the minimum number of sampling points for fixed measurement
related pollutant: Particulate matter < 2.5 µm (aerosol)
assessment threshold: Between Lower and Upper Assessment Threshold (LAT-UAT)
minimum population: 1000000
maximum population: 1999999
minimum SPO: 3

Minimum requirement for pollutant 6001 for pop between 2000000 and 3749999 when assessment is LAT-UAT - zone type is not considered
type: Concept
notation: 104
definition: Minimum requirement for pollutant 6001 for pop between 2000000 and 3749999 when assessment is LAT-UAT - zone type is not considered
status: valid
status modified: 2024-09-12
accepted date: 2024-09-12
in scheme: Criteria for determining the minimum number of sampling points for fixed measurement
related pollutant: Particulate matter < 2.5 µm (aerosol)
assessment threshold: Between Lower and Upper Assessment Threshold (LAT-UAT)
minimum population: 2000000
maximum population: 3749999
minimum SPO: 4

Minimum requirement for pollutant 6001 for pop between 3750000 and 5999999 when assessment is LAT-UAT - zone type is not considered
type: Concept
notation: 105
definition: Minimum requirement for pollutant 6001 for pop between 3750000 and 5999999 when assessment is LAT-UAT - zone type is not considered
status: valid
status modified: 2024-09-12
accepted date: 2024-09-12
in scheme: Criteria for determining the minimum number of sampling points for fixed measurement
related pollutant: Particulate matter < 2.5 µm (aerosol)
assessment threshold: Between Lower and Upper Assessment Threshold (LAT-UAT)
minimum population: 3750000
maximum population: 5999999
minimum SPO: 6

Minimum requirement for pollutant 6001 for pop between 6000000 and 1000000000 when assessment is LAT-UAT - zone type is not considered
type: Concept
notation: 106
definition: Minimum requirement for pollutant 6001 for pop between 6000000 and 1000000000 when assessment is LAT-UAT - zone type is not considered
status: valid
status modified: 2024-09-12
accepted date: 2024-09-12
in scheme: Criteria for determining the minimum number of sampling points for fixed measurement
related pollutant: Particulate matter < 2.5 µm (aerosol)
assessment threshold: Between Lower and Upper Assessment Threshold (LAT-UAT)
minimum population: 6000000
maximum population: 1000000000
minimum SPO: 7

Minimum requirement for pollutant 6001 for pop between 0 and 249999 when assessment is aboveUAT - zone type is not considered
type: Concept
notation: 107
definition: Minimum requirement for pollutant 6001 for pop between 0 and 249999 when assessment is aboveUAT - zone type is not considered
status: valid
status modified: 2024-09-12
accepted date: 2024-09-12
in scheme: Criteria for determining the minimum number of sampling points for fixed measurement
related pollutant: Particulate matter < 2.5 µm (aerosol)
assessment threshold: Above Upper Assessment Threshold (>UAT)
minimum population: 0
maximum population: 249999
minimum SPO: 2

Minimum requirement for pollutant 6001 for pop between 250000 and 749999 when assessment is aboveUAT - zone type is not considered
type: Concept
notation: 108
definition: Minimum requirement for pollutant 6001 for pop between 250000 and 749999 when assessment is aboveUAT - zone type is not considered
status: valid
status modified: 2024-09-12
accepted date: 2024-09-12
in scheme: Criteria for determining the minimum number of sampling points for fixed measurement
related pollutant: Particulate matter < 2.5 µm (aerosol)
assessment threshold: Above Upper Assessment Threshold (>UAT)
minimum population: 250000
maximum population: 749999
minimum SPO: 3

Minimum requirement for pollutant 6001 for pop between 750000 and 999999 when assessment is aboveUAT - zone type is not considered
type: Concept
notation: 109
definition: Minimum requirement for pollutant 6001 for pop between 750000 and 999999 when assessment is aboveUAT - zone type is not considered
status: valid
status modified: 2024-09-12
accepted date: 2024-09-12
in scheme: Criteria for determining the minimum number of sampling points for fixed measurement
related pollutant: Particulate matter < 2.5 µm (aerosol)
assessment threshold: Above Upper Assessment Threshold (>UAT)
minimum population: 750000
maximum population: 999999
minimum SPO: 4

Minimum requirement for pollutant 6001 for pop between 1000000 and 1499999 when assessment is aboveUAT - zone type is not considered
type: Concept
notation: 110
definition: Minimum requirement for pollutant 6001 for pop between 1000000 and 1499999 when assessment is aboveUAT - zone type is not considered
status: valid
status modified: 2024-09-12
accepted date: 2024-09-12
in scheme: Criteria for determining the minimum number of sampling points for fixed measurement
related pollutant: Particulate matter < 2.5 µm (aerosol)
assessment threshold: Above Upper Assessment Threshold (>UAT)
minimum population: 1000000
maximum population: 1499999
minimum SPO: 6

Minimum requirement for pollutant 6001 for pop between 1500000 and 1999999 when assessment is aboveUAT - zone type is not considered
type: Concept
notation: 111
definition: Minimum requirement for pollutant 6001 for pop between 1500000 and 1999999 when assessment is aboveUAT - zone type is not considered
status: valid
status modified: 2024-09-12
accepted date: 2024-09-12
in scheme: Criteria for determining the minimum number of sampling points for fixed measurement
related pollutant: Particulate matter < 2.5 µm (aerosol)
assessment threshold: Above Upper Assessment Threshold (>UAT)
minimum population: 1500000
maximum population: 1999999
minimum SPO: 7

Minimum requirement for pollutant 6001 for pop between 2000000 and 2749999 when assessment is aboveUAT - zone type is not considered
type: Concept
notation: 112
definition: Minimum requirement for pollutant 6001 for pop between 2000000 and 2749999 when assessment is aboveUAT - zone type is not considered
status: valid
status modified: 2024-09-12
accepted date: 2024-09-12
in scheme: Criteria for determining the minimum number of sampling points for fixed measurement
related pollutant: Particulate matter < 2.5 µm (aerosol)
assessment threshold: Above Upper Assessment Threshold (>UAT)
minimum population: 2000000
maximum population: 2749999
minimum SPO: 8

Minimum requirement for pollutant 6001 for pop between 2750000 and 3749999 when assessment is aboveUAT - zone type is not considered
type: Concept
notation: 113
definition: Minimum requirement for pollutant 6001 for pop between 2750000 and 3749999 when assessment is aboveUAT - zone type is not considered
status: valid
status modified: 2024-09-12
accepted date: 2024-09-12
in scheme: Criteria for determining the minimum number of sampling points for fixed measurement
related pollutant: Particulate matter < 2.5 µm (aerosol)
assessment threshold: Above Upper Assessment Threshold (>UAT)
minimum population: 2750000
maximum population: 3749999
minimum SPO: 10

Minimum requirement for pollutant 6001 for pop between 3750000 and 4749999 when assessment is aboveUAT - zone type is not considered
type: Concept
notation: 114
definition: Minimum requirement for pollutant 6001 for pop between 3750000 and 4749999 when assessment is aboveUAT - zone type is not considered
status: valid
status modified: 2024-09-12
accepted date: 2024-09-12
in scheme: Criteria for determining the minimum number of sampling points for fixed measurement
related pollutant: Particulate matter < 2.5 µm (aerosol)
assessment threshold: Above Upper Assessment Threshold (>UAT)
minimum population: 3750000
maximum population: 4749999
minimum SPO: 11

Minimum requirement for pollutant 6001 for pop between 4750000 and 5999999 when assessment is aboveUAT - zone type is not considered
type: Concept
notation: 115
definition: Minimum requirement for pollutant 6001 for pop between 4750000 and 5999999 when assessment is aboveUAT - zone type is not considered
status: valid
status modified: 2024-09-12
accepted date: 2024-09-12
in scheme: Criteria for determining the minimum number of sampling points for fixed measurement
related pollutant: Particulate matter < 2.5 µm (aerosol)
minimum population: 4750000
maximum population: 5999999
minimum SPO: 13

Minimum requirement for pollutant 6001 for pop between 6000000 and 1000000000 when assessment is aboveUAT - zone type is not considered
type: Concept
notation: 116
definition: Minimum requirement for pollutant 6001 for pop between 6000000 and 1000000000 when assessment is aboveUAT - zone type is not considered
status: valid
status modified: 2024-09-12
accepted date: 2024-09-12
in scheme: Criteria for determining the minimum number of sampling points for fixed measurement
related pollutant: Particulate matter < 2.5 µm (aerosol)
minimum population: 6000000
maximum population: 1000000000
minimum SPO: 15

Minimum requirement for pollutant 7 for pop between 0 and 249999 when assessment is - zone type is agg
type: Concept
notation: 117
definition: Minimum requirement for pollutant 7 for pop between 0 and 249999 when assessment is - zone type is agg
status: valid
status modified: 2024-09-12
accepted date: 2024-09-12
in scheme: Criteria for determining the minimum number of sampling points for fixed measurement
related pollutant: Ozone (air)
minimum population: 0
maximum population: 249999
aq zonetype: Agglomeration
minimum SPO: 0

Minimum requirement for pollutant 7 for pop between 0 and 249999 when assessment is - zone type is noagg
type: Concept
notation: 118
definition: Minimum requirement for pollutant 7 for pop between 0 and 249999 when assessment is - zone type is noagg
status: valid
status modified: 2024-09-12
accepted date: 2024-09-12
in scheme: Criteria for determining the minimum number of sampling points for fixed measurement
related pollutant: Ozone (air)
minimum population: 0
maximum population: 249999
aq zonetype: Non-agglomeration
minimum SPO: 1

Minimum requirement for pollutant 7 for pop between 249999 and 499999 when assessment is - zone type is agg
type: Concept
notation: 119
definition: Minimum requirement for pollutant 7 for pop between 249999 and 499999 when assessment is - zone type is agg
status: valid
status modified: 2024-09-12
accepted date: 2024-09-12
in scheme: Criteria for determining the minimum number of sampling points for fixed measurement
related pollutant: Ozone (air)
minimum population: 249999
maximum population: 499999
aq zonetype: Agglomeration
minimum SPO: 1

Minimum requirement for pollutant 7 for pop between 249999 and 999999 when assessment is - zone type is agg
type: Concept
notation: 120
definition: Minimum requirement for pollutant 7 for pop between 249999 and 999999 when assessment is - zone type is agg
status: valid
status modified: 2024-09-12
accepted date: 2024-09-12
in scheme: Criteria for determining the minimum number of sampling points for fixed measurement
related pollutant: Ozone (air)
minimum population: 249999
maximum population: 999999
aq zonetype: Non-agglomeration
minimum SPO: 2

Minimum requirement for pollutant 7 for pop between 499999 and 999999 when assessment is - zone type is noagg
type: Concept
notation: 121
definition: Minimum requirement for pollutant 7 for pop between 499999 and 999999 when assessment is - zone type is noagg
status: valid
status modified: 2024-09-12
accepted date: 2024-09-12
in scheme: Criteria for determining the minimum number of sampling points for fixed measurement
related pollutant: Ozone (air)
minimum population: 499999
maximum population: 999999
aq zonetype: Agglomeration
minimum SPO: 2

Minimum requirement for pollutant 7 for pop between 999999 and 1499999 when assessment is - zone type is noagg
type: Concept
notation: 122
definition: Minimum requirement for pollutant 7 for pop between 999999 and 1499999 when assessment is - zone type is noagg
status: valid
status modified: 2024-09-12
accepted date: 2024-09-12
in scheme: Criteria for determining the minimum number of sampling points for fixed measurement
related pollutant: Ozone (air)
minimum population: 999999
maximum population: 1499999
aq zonetype: Non-agglomeration
minimum SPO: 3

Minimum requirement for pollutant 7 for pop between 999999 and 1999999 when assessment is - zone type is agg
type: Concept
notation: 123
definition: Minimum requirement for pollutant 7 for pop between 999999 and 1999999 when assessment is - zone type is agg
status: valid
status modified: 2024-09-12
accepted date: 2024-09-12
in scheme: Criteria for determining the minimum number of sampling points for fixed measurement
related pollutant: Ozone (air)
minimum population: 999999
maximum population: 1999999
aq zonetype: Agglomeration
minimum SPO: 3

Minimum requirement for pollutant 7 for pop between 1499999 and 1999999 when assessment is - zone type is noagg
type: Concept
notation: 124
definition: Minimum requirement for pollutant 7 for pop between 1499999 and 1999999 when assessment is - zone type is noagg
status: valid
status modified: 2024-09-12
accepted date: 2024-09-12
in scheme: Criteria for determining the minimum number of sampling points for fixed measurement
related pollutant: Ozone (air)
minimum population: 1499999
maximum population: 1999999
aq zonetype: Non-agglomeration
minimum SPO: 4

Minimum requirement for pollutant 7 for pop between 1999999 and 2749999 when assessment is - zone type is agg
type: Concept
notation: 125
definition: Minimum requirement for pollutant 7 for pop between 1999999 and 2749999 when assessment is - zone type is agg
status: valid
status modified: 2024-09-12
accepted date: 2024-09-12
in scheme: Criteria for determining the minimum number of sampling points for fixed measurement
related pollutant: Ozone (air)
minimum population: 1999999
maximum population: 2749999
aq zonetype: Agglomeration
minimum SPO: 4

Minimum requirement for pollutant 7 for pop between 1999999 and 2749999 when assessment is - zone type is noagg
type: Concept
notation: 126
definition: Minimum requirement for pollutant 7 for pop between 1999999 and 2749999 when assessment is - zone type is noagg
status: valid
status modified: 2024-09-12
accepted date: 2024-09-12
in scheme: Criteria for determining the minimum number of sampling points for fixed measurement
related pollutant: Ozone (air)
minimum population: 1999999
maximum population: 2749999
aq zonetype: Non-agglomeration
minimum SPO: 5

Minimum requirement for pollutant 7 for pop between (3+2)749999 and 2749999 when assessment is - zone type is agg
type: Concept
notation: 127
definition: Minimum requirement for pollutant 7 for pop between (3+2)749999 and 2749999 when assessment is - zone type is agg
status: valid
status modified: 2024-09-12
accepted date: 2024-09-12
in scheme: Criteria for determining the minimum number of sampling points for fixed measurement
related pollutant: Ozone (air)
minimum population: 2749999
maximum population: 5749999
aq zonetype: Agglomeration
minimum SPO: 5

Minimum requirement for pollutant 7 for pop between (3+2)749999 and 2749999 when assessment is - zone type is noagg
type: Concept
notation: 128
definition: Minimum requirement for pollutant 7 for pop between (3+2)749999 and 2749999 when assessment is - zone type is noagg
status: valid
status modified: 2024-09-12
accepted date: 2024-09-12
in scheme: Criteria for determining the minimum number of sampling points for fixed measurement
related pollutant: Ozone (air)
minimum population: 2749999
maximum population: 5749999
aq zonetype: Non-agglomeration
minimum SPO: 6

Minimum requirement for pollutant 7 for pop between (3+4)749999 and 5749999 when assessment is - zone type is agg
type: Concept
notation: 129
definition: Minimum requirement for pollutant 7 for pop between (3+4)749999 and 5749999 when assessment is - zone type is agg
status: valid
status modified: 2024-09-12
accepted date: 2024-09-12
in scheme: Criteria for determining the minimum number of sampling points for fixed measurement
related pollutant: Ozone (air)
minimum population: 5749999
maximum population: 7749999
aq zonetype: Agglomeration
minimum SPO: 6

Minimum requirement for pollutant 7 for pop between (3+4)749999 and 5749999 when assessment is - zone type is noagg
type: Concept
notation: 130
definition: Minimum requirement for pollutant 7 for pop between (3+4)749999 and 5749999 when assessment is - zone type is noagg
status: valid
status modified: 2024-09-12
accepted date: 2024-09-12
in scheme: Criteria for determining the minimum number of sampling points for fixed measurement
related pollutant: Ozone (air)
minimum population: 5749999
maximum population: 7749999
aq zonetype: Non-agglomeration
minimum SPO: 7

Minimum requirement for pollutant 7 for pop between (3+6)749999 and 7749999 when assessment is - zone type is agg
type: Concept
notation: 131
definition: Minimum requirement for pollutant 7 for pop between (3+6)749999 and 7749999 when assessment is - zone type is agg
status: valid
status modified: 2024-09-12
accepted date: 2024-09-12
in scheme: Criteria for determining the minimum number of sampling points for fixed measurement
related pollutant: Ozone (air)
minimum population: 7749999
maximum population: 9749999
aq zonetype: Agglomeration
minimum SPO: 7

Minimum requirement for pollutant 7 for pop between (3+6)749999 and 7749999 when assessment is - zone type is noagg
type: Concept
notation: 132
definition: Minimum requirement for pollutant 7 for pop between (3+6)749999 and 7749999 when assessment is - zone type is noagg
status: valid
status modified: 2024-09-12
accepted date: 2024-09-12
in scheme: Criteria for determining the minimum number of sampling points for fixed measurement
related pollutant: Ozone (air)
minimum population: 7749999
maximum population: 9749999
aq zonetype: Non-agglomeration
minimum SPO: 8

Minimum requirement for pollutant 7 for pop between (3+8)749999 and 9749999 when assessment is - zone type is agg
type: Concept
notation: 133
definition: Minimum requirement for pollutant 7 for pop between (3+8)749999 and 9749999 when assessment is - zone type is agg
status: valid
status modified: 2024-09-12
accepted date: 2024-09-12
in scheme: Criteria for determining the minimum number of sampling points for fixed measurement
related pollutant: Ozone (air)
minimum population: 9749999
maximum population: 11749999
aq zonetype: Agglomeration
minimum SPO: 8

Minimum requirement for pollutant 7 for pop between (3+8)749999 and 9749999 when assessment is - zone type is noagg
type: Concept
notation: 134
definition: Minimum requirement for pollutant 7 for pop between (3+8)749999 and 9749999 when assessment is - zone type is noagg
status: valid
status modified: 2024-09-12
accepted date: 2024-09-12
in scheme: Criteria for determining the minimum number of sampling points for fixed measurement
related pollutant: Ozone (air)
minimum population: 9749999
maximum population: 11749999
aq zonetype: Non-agglomeration
minimum SPO: 9

Minimum requirement for pollutant 7 for pop between (3+10)749999 and 11749999 when assessment is - zone type is agg
type: Concept
notation: 135
definition: Minimum requirement for pollutant 7 for pop between (3+10)749999 and 11749999 when assessment is - zone type is agg
status: valid
status modified: 2024-09-12
accepted date: 2024-09-12
in scheme: Criteria for determining the minimum number of sampling points for fixed measurement
related pollutant: Ozone (air)
assessment threshold: Above the long-term objective
minimum population: 11749999
maximum population: 13749999
aq zonetype: Agglomeration
minimum SPO: 9

Minimum requirement for pollutant 7 for pop between 9749999 and 11749999 when assessment is - zone type is noagg
type: Concept
notation: 136
definition: Minimum requirement for pollutant 7 for pop between 9749999 and 11749999 when assessment is - zone type is noagg
status: valid
status modified: 2024-09-12
accepted date: 2024-09-12
in scheme: Criteria for determining the minimum number of sampling points for fixed measurement
related pollutant: Ozone (air)
assessment threshold: Above the long-term objective
minimum population: 11749999
maximum population: 13749999
aq zonetype: Non-agglomeration
minimum SPO: 10

Minimum requirement for pollutant 8 for pop between 0 and 999999 when assessment is LAT-UAT - zone type is not considered
type: Concept
notation: 137
definition: Minimum requirement for pollutant 8 for pop between 0 and 999999 when assessment is LAT-UAT - zone type is not considered
status: valid
status modified: 2024-09-12
accepted date: 2024-09-12
in scheme: Criteria for determining the minimum number of sampling points for fixed measurement
related pollutant: Nitrogen dioxide (air)
assessment threshold: Between Lower and Upper Assessment Threshold (LAT-UAT)
minimum population: 0
maximum population: 999999
minimum SPO: 1

Minimum requirement for pollutant 8 for pop between 1000000 and 1999999 when assessment is LAT-UAT - zone type is not considered
type: Concept
notation: 138
definition: Minimum requirement for pollutant 8 for pop between 1000000 and 1999999 when assessment is LAT-UAT - zone type is not considered
status: valid
status modified: 2024-09-12
accepted date: 2024-09-12
in scheme: Criteria for determining the minimum number of sampling points for fixed measurement
related pollutant: Nitrogen dioxide (air)
assessment threshold: Between Lower and Upper Assessment Threshold (LAT-UAT)
minimum population: 1000000
maximum population: 1999999
minimum SPO: 2

Minimum requirement for pollutant 8 for pop between 2000000 and 4749999 when assessment is LAT-UAT - zone type is not considered
type: Concept
notation: 139
definition: Minimum requirement for pollutant 8 for pop between 2000000 and 4749999 when assessment is LAT-UAT - zone type is not considered
status: valid
status modified: 2024-09-12
accepted date: 2024-09-12
in scheme: Criteria for determining the minimum number of sampling points for fixed measurement
related pollutant: Nitrogen dioxide (air)
assessment threshold: Between Lower and Upper Assessment Threshold (LAT-UAT)
minimum population: 2000000
maximum population: 4749999
minimum SPO: 3

Minimum requirement for pollutant 8 for pop between 4750000 and 1000000000 when assessment is LAT-UAT - zone type is not considered
type: Concept
notation: 140
definition: Minimum requirement for pollutant 8 for pop between 4750000 and 1000000000 when assessment is LAT-UAT - zone type is not considered
status: valid
status modified: 2024-09-12
accepted date: 2024-09-12
in scheme: Criteria for determining the minimum number of sampling points for fixed measurement
related pollutant: Nitrogen dioxide (air)
assessment threshold: Between Lower and Upper Assessment Threshold (LAT-UAT)
minimum population: 4750000
maximum population: 1000000000
minimum SPO: 4

Minimum requirement for pollutant 8 for pop between 0 and 249999 when assessment is aboveUAT - zone type is not considered
type: Concept
notation: 141
definition: Minimum requirement for pollutant 8 for pop between 0 and 249999 when assessment is aboveUAT - zone type is not considered
status: valid
status modified: 2024-09-12
accepted date: 2024-09-12
in scheme: Criteria for determining the minimum number of sampling points for fixed measurement
related pollutant: Nitrogen dioxide (air)
assessment threshold: Above Upper Assessment Threshold (>UAT)
minimum population: 0
maximum population: 249999
minimum SPO: 1

Minimum requirement for pollutant 8 for pop between 250000 and 749999 when assessment is aboveUAT - zone type is not considered
type: Concept
notation: 142
definition: Minimum requirement for pollutant 8 for pop between 250000 and 749999 when assessment is aboveUAT - zone type is not considered
status: valid
status modified: 2024-09-12
accepted date: 2024-09-12
in scheme: Criteria for determining the minimum number of sampling points for fixed measurement
related pollutant: Nitrogen dioxide (air)
assessment threshold: Above Upper Assessment Threshold (>UAT)
minimum population: 250000
maximum population: 749999
minimum SPO: 2

Minimum requirement for pollutant 8 for pop between 750000 and 999999 when assessment is aboveUAT - zone type is not considered
type: Concept
notation: 143
definition: Minimum requirement for pollutant 8 for pop between 750000 and 999999 when assessment is aboveUAT - zone type is not considered
status: valid
status modified: 2024-09-12
accepted date: 2024-09-12
in scheme: Criteria for determining the minimum number of sampling points for fixed measurement
related pollutant: Nitrogen dioxide (air)
assessment threshold: Above Upper Assessment Threshold (>UAT)
minimum population: 750000
maximum population: 999999
minimum SPO: 3

Minimum requirement for pollutant 8 for pop between 1000000 and 1499999 when assessment is aboveUAT - zone type is not considered
type: Concept
notation: 144
definition: Minimum requirement for pollutant 8 for pop between 1000000 and 1499999 when assessment is aboveUAT - zone type is not considered
status: valid
status modified: 2024-09-12
accepted date: 2024-09-12
in scheme: Criteria for determining the minimum number of sampling points for fixed measurement
related pollutant: Nitrogen dioxide (air)
assessment threshold: Above Upper Assessment Threshold (>UAT)
minimum population: 1000000
maximum population: 1499999
minimum SPO: 4

Minimum requirement for pollutant 8 for pop between 1500000 and 1999999 when assessment is aboveUAT - zone type is not considered
type: Concept
notation: 145
definition: Minimum requirement for pollutant 8 for pop between 1500000 and 1999999 when assessment is aboveUAT - zone type is not considered
status: valid
status modified: 2024-09-12
accepted date: 2024-09-12
in scheme: Criteria for determining the minimum number of sampling points for fixed measurement
related pollutant: Nitrogen dioxide (air)
assessment threshold: Above Upper Assessment Threshold (>UAT)
minimum population: 1500000
maximum population: 1999999
minimum SPO: 5

Minimum requirement for pollutant 8 for pop between 2000000 and 2749999 when assessment is aboveUAT - zone type is not considered
type: Concept
notation: 146
definition: Minimum requirement for pollutant 8 for pop between 2000000 and 2749999 when assessment is aboveUAT - zone type is not considered
status: valid
status modified: 2024-09-12
accepted date: 2024-09-12
in scheme: Criteria for determining the minimum number of sampling points for fixed measurement
related pollutant: Nitrogen dioxide (air)
assessment threshold: Above Upper Assessment Threshold (>UAT)
minimum population: 2000000
maximum population: 2749999
minimum SPO: 6

Minimum requirement for pollutant 8 for pop between 2750000 and 3749999 when assessment is aboveUAT - zone type is not considered
type: Concept
notation: 147
definition: Minimum requirement for pollutant 8 for pop between 2750000 and 3749999 when assessment is aboveUAT - zone type is not considered
status: valid
status modified: 2024-09-12
accepted date: 2024-09-12
in scheme: Criteria for determining the minimum number of sampling points for fixed measurement
related pollutant: Nitrogen dioxide (air)
assessment threshold: Above Upper Assessment Threshold (>UAT)
minimum population: 2750000
maximum population: 3749999
minimum SPO: 7

Minimum requirement for pollutant 8 for pop between 3750000 and 4749999 when assessment is aboveUAT - zone type is not considered
type: Concept
notation: 148
definition: Minimum requirement for pollutant 8 for pop between 3750000 and 4749999 when assessment is aboveUAT - zone type is not considered
status: valid
status modified: 2024-09-12
accepted date: 2024-09-12
in scheme: Criteria for determining the minimum number of sampling points for fixed measurement
related pollutant: Nitrogen dioxide (air)
assessment threshold: Above Upper Assessment Threshold (>UAT)
minimum population: 3750000
maximum population: 4749999
minimum SPO: 8

Minimum requirement for pollutant 8 for pop between 4750000 and 5999999 when assessment is aboveUAT - zone type is not considered
type: Concept
notation: 149
definition: Minimum requirement for pollutant 8 for pop between 4750000 and 5999999 when assessment is aboveUAT - zone type is not considered
status: valid
status modified: 2024-09-12
accepted date: 2024-09-12
in scheme: Criteria for determining the minimum number of sampling points for fixed measurement
related pollutant: Nitrogen dioxide (air)
assessment threshold: Above Upper Assessment Threshold (>UAT)
minimum population: 4750000
maximum population: 5999999
minimum SPO: 9

Minimum requirement for pollutant 8 for pop between 6000000 and 1000000000 when assessment is aboveUAT - zone type is not considered
type: Concept
notation: 150
definition: Minimum requirement for pollutant 8 for pop between 6000000 and 1000000000 when assessment is aboveUAT - zone type is not considered
status: valid
status modified: 2024-09-12
accepted date: 2024-09-12
in scheme: Criteria for determining the minimum number of sampling points for fixed measurement
related pollutant: Nitrogen dioxide (air)
assessment threshold: Above Upper Assessment Threshold (>UAT)
minimum population: 6000000
maximum population: 1000000000
minimum SPO: 10

Minimum requirement for pollutant 9 for pop between 0 and 999999 when assessment is LAT-UAT - zone type is not considered
type: Concept
notation: 151
definition: Minimum requirement for pollutant 9 for pop between 0 and 999999 when assessment is LAT-UAT - zone type is not considered
status: valid
status modified: 2024-09-12
accepted date: 2024-09-12
in scheme: Criteria for determining the minimum number of sampling points for fixed measurement
related pollutant: Nitrogen oxides (air)
assessment threshold: Between Lower and Upper Assessment Threshold (LAT-UAT)
minimum population: 0
maximum population: 999999
minimum SPO: 1

Minimum requirement for pollutant 9 for pop between 1000000 and 1999999 when assessment is LAT-UAT - zone type is not considered
type: Concept
notation: 152
definition: Minimum requirement for pollutant 9 for pop between 1000000 and 1999999 when assessment is LAT-UAT - zone type is not considered
status: valid
status modified: 2024-09-12
accepted date: 2024-09-12
in scheme: Criteria for determining the minimum number of sampling points for fixed measurement
related pollutant: Nitrogen oxides (air)
assessment threshold: Between Lower and Upper Assessment Threshold (LAT-UAT)
minimum population: 1000000
maximum population: 1999999
minimum SPO: 2

Minimum requirement for pollutant 9 for pop between 2000000 and 4749999 when assessment is LAT-UAT - zone type is not considered
type: Concept
notation: 153
definition: Minimum requirement for pollutant 9 for pop between 2000000 and 4749999 when assessment is LAT-UAT - zone type is not considered
status: valid
status modified: 2024-09-12
accepted date: 2024-09-12
in scheme: Criteria for determining the minimum number of sampling points for fixed measurement
related pollutant: Nitrogen oxides (air)
assessment threshold: Between Lower and Upper Assessment Threshold (LAT-UAT)
minimum population: 2000000
maximum population: 4749999
minimum SPO: 3

Minimum requirement for pollutant 9 for pop between 4750000 and 1000000000 when assessment is LAT-UAT - zone type is not considered
type: Concept
notation: 154
definition: Minimum requirement for pollutant 9 for pop between 4750000 and 1000000000 when assessment is LAT-UAT - zone type is not considered
status: valid
status modified: 2024-09-12
accepted date: 2024-09-12
in scheme: Criteria for determining the minimum number of sampling points for fixed measurement
related pollutant: Nitrogen oxides (air)
assessment threshold: Between Lower and Upper Assessment Threshold (LAT-UAT)
minimum population: 4750000
maximum population: 1000000000
minimum SPO: 4

Minimum requirement for pollutant 9 for pop between 0 and 249999 when assessment is aboveUAT - zone type is not considered
type: Concept
notation: 155
definition: Minimum requirement for pollutant 9 for pop between 0 and 249999 when assessment is aboveUAT - zone type is not considered
status: valid
status modified: 2024-09-12
accepted date: 2024-09-12
in scheme: Criteria for determining the minimum number of sampling points for fixed measurement
related pollutant: Nitrogen oxides (air)
assessment threshold: Above Upper Assessment Threshold (>UAT)
minimum population: 0
maximum population: 249999
minimum SPO: 1

Minimum requirement for pollutant 9 for pop between 250000 and 749999 when assessment is aboveUAT - zone type is not considered
type: Concept
notation: 156
definition: Minimum requirement for pollutant 9 for pop between 250000 and 749999 when assessment is aboveUAT - zone type is not considered
status: valid
status modified: 2024-09-12
accepted date: 2024-09-12
in scheme: Criteria for determining the minimum number of sampling points for fixed measurement
related pollutant: Nitrogen oxides (air)
assessment threshold: Above Upper Assessment Threshold (>UAT)
minimum population: 250000
maximum population: 749999
minimum SPO: 2

Minimum requirement for pollutant 9 for pop between 750000 and 999999 when assessment is aboveUAT - zone type is not considered
type: Concept
notation: 157
definition: Minimum requirement for pollutant 9 for pop between 750000 and 999999 when assessment is aboveUAT - zone type is not considered
status: valid
status modified: 2024-09-12
accepted date: 2024-09-12
in scheme: Criteria for determining the minimum number of sampling points for fixed measurement
related pollutant: Nitrogen oxides (air)
assessment threshold: Above Upper Assessment Threshold (>UAT)
minimum population: 750000
maximum population: 999999
minimum SPO: 3

Minimum requirement for pollutant 9 for pop between 1000000 and 1499999 when assessment is aboveUAT - zone type is not considered
type: Concept
notation: 158
definition: Minimum requirement for pollutant 9 for pop between 1000000 and 1499999 when assessment is aboveUAT - zone type is not considered
status: valid
status modified: 2024-09-12
accepted date: 2024-09-12
in scheme: Criteria for determining the minimum number of sampling points for fixed measurement
related pollutant: Nitrogen oxides (air)
assessment threshold: Above Upper Assessment Threshold (>UAT)
minimum population: 1000000
maximum population: 1499999
minimum SPO: 4

Minimum requirement for pollutant 9 for pop between 1500000 and 1999999 when assessment is aboveUAT - zone type is not considered
type: Concept
notation: 159
definition: Minimum requirement for pollutant 9 for pop between 1500000 and 1999999 when assessment is aboveUAT - zone type is not considered
status: valid
status modified: 2024-09-12
accepted date: 2024-09-12
in scheme: Criteria for determining the minimum number of sampling points for fixed measurement
related pollutant: Nitrogen oxides (air)
assessment threshold: Above Upper Assessment Threshold (>UAT)
minimum population: 1500000
maximum population: 1999999
minimum SPO: 5

Minimum requirement for pollutant 9 for pop between 2000000 and 2749999 when assessment is aboveUAT - zone type is not considered
type: Concept
notation: 160
definition: Minimum requirement for pollutant 9 for pop between 2000000 and 2749999 when assessment is aboveUAT - zone type is not considered
status: valid
status modified: 2024-09-12
accepted date: 2024-09-12
in scheme: Criteria for determining the minimum number of sampling points for fixed measurement
related pollutant: Nitrogen oxides (air)
assessment threshold: Above Upper Assessment Threshold (>UAT)
minimum population: 2000000
maximum population: 2749999
minimum SPO: 6

Minimum requirement for pollutant 9 for pop between 2750000 and 3749999 when assessment is aboveUAT - zone type is not considered
type: Concept
notation: 161
definition: Minimum requirement for pollutant 9 for pop between 2750000 and 3749999 when assessment is aboveUAT - zone type is not considered
status: valid
status modified: 2024-09-12
accepted date: 2024-09-12
in scheme: Criteria for determining the minimum number of sampling points for fixed measurement
related pollutant: Nitrogen oxides (air)
assessment threshold: Above Upper Assessment Threshold (>UAT)
minimum population: 2750000
maximum population: 3749999
minimum SPO: 7

Minimum requirement for pollutant 9 for pop between 3750000 and 4749999 when assessment is aboveUAT - zone type is not considered
type: Concept
notation: 162
definition: Minimum requirement for pollutant 9 for pop between 3750000 and 4749999 when assessment is aboveUAT - zone type is not considered
status: valid
status modified: 2024-09-12
accepted date: 2024-09-12
in scheme: Criteria for determining the minimum number of sampling points for fixed measurement
related pollutant: Nitrogen oxides (air)
assessment threshold: Above Upper Assessment Threshold (>UAT)
minimum population: 3750000
maximum population: 4749999
minimum SPO: 8

Minimum requirement for pollutant 7 for pop between (3+12)749999 and 11749999 when assessment is - zone type is noagg
type: Concept
notation: 163
definition: Minimum requirement for pollutant 7 for pop between (3+12)749999 and 11749999 when assessment is - zone type is noagg
status: valid
status modified: 2024-09-12
accepted date: 2024-09-12
in scheme: Criteria for determining the minimum number of sampling points for fixed measurement
related pollutant: Ozone (air)
assessment threshold: Above the long-term objective
minimum population: 13749999
maximum population: 15749999
aq zonetype: Non-agglomeration
minimum SPO: 11

Minimum requirement for pollutant 7 for pop between (3+12)749999 and 11749999 when assessment is - zone type is agg
type: Concept
notation: 164
definition: Minimum requirement for pollutant 7 for pop between (3+12)749999 and 11749999 when assessment is - zone type is agg
status: valid
status modified: 2024-09-12
accepted date: 2024-09-12
in scheme: Criteria for determining the minimum number of sampling points for fixed measurement
related pollutant: Ozone (air)
assessment threshold: Above the long-term objective
minimum population: 13749999
maximum population: 15749999
aq zonetype: Agglomeration
minimum SPO: 10

AQD - Area Classification
type: ConceptScheme
notation: areaclassification
is part of: Air Quality Directive e-Reporting
registration status: Public draft
user modified: targajau
date modified: 2016-03-14 15:58:14.0
vocabulary type: Common
is numeric concept identifiers: false
is notations equal identifiers: false

Rural
type: Concept
notation: rural
definition: All areas, that do not fulfil the criteria for urban or suburban areas, are defined as "rural" areas. There are three subdivisions in this category to indicate the distance to the nearest built-up urban area:
status: valid
status modified: 2013-03-22
accepted date: 2013-03-22
in scheme: AQD - Area Classification
narrower: Rural-Regional

Rural-Near_city
type: Concept
notation: rural-nearcity
definition: area within 10 km from the border of an urban or suburban area.
status: valid
status modified: 2013-03-22
accepted date: 2013-03-22
in scheme: AQD - Area Classification

Rural-Regional
type: Concept
notation: rural-regional
definition: 10-50 km from major sources/source areas.
status: valid
status modified: 2013-03-22
accepted date: 2013-03-22
in scheme: AQD - Area Classification
broader: Rural

Rural-Remote
type: Concept
notation: rural-remote
definition: > 50 km from major sources/source areas.
status: valid
status modified: 2013-03-22
accepted date: 2013-03-22
in scheme: AQD - Area Classification

Suburban
type: Concept
notation: suburban
definition: Largely built-up urban area. ‘Largely built-up’ means contiguous settlement of detached buildings of any size with a building density less than for ‘continuously built-up’ area. The built-up area is mixed with non-urbanised areas (e.g. agricultural, lakes, woods). It must also be noted that ‘suburban’ as defined here has a different meaning than in every day English i.e. ‘an outlying part of a city or town’ suggesting that a suburban area is always associated to an urban area. In our context, a suburban area can be suburban on its own without any urban part.
status: valid
status modified: 2013-03-22
accepted date: 2013-03-22
in scheme: AQD - Area Classification

Urban
type: Concept
notation: urban
definition: Continuously built-up urban area meaning complete (or at least highly predominant) building-up of the street front side by buildings with at least two floors or large detached buildings with at least two floors. With the exception of city parks, the built-up area is not mixed with non-urbanised areas.
status: valid
status modified: 2013-03-22
accepted date: 2013-03-22
in scheme: AQD - Area Classification

Criteria for determining the minimum number of sampling points for fixed measurement for ozone when supplementary methods like modelling is used (according to Article 10)
type: ConceptScheme
notation: art10_O3_Model_minimum_spo
is part of: Air Quality Directive e-Reporting
registration status: Public draft
user modified: targajau
date modified: 2024-04-23 08:10:01.0
vocabulary type: Common
is numeric concept identifiers: true
is notations equal identifiers: true

Min requirement O3 with sup. area 0 to 50k and Pop 0 to 2 million
type: Concept
notation: 1
definition: Min requirement O3 with sup. area 0 to 50k and Pop 0 to 2 million
status: valid
status modified: 2024-04-17
accepted date: 2024-04-17
in scheme: Criteria for determining the minimum number of sampling points for fixed measurement for ozone when supplementary methods like modelling is used (according to Article 10)
related pollutant: Ozone (air)
minimum population: 0
maximum population: 2000000
minimum SPO: 1
minimum area: 0
maximum area: 50000

Min requirement O3 with sup. area 0 to 50000 and Pop 18000001 to 20000000.
type: Concept
notation: 10
definition: Min requirement O3 with sup. area 0 to 50000 and Pop 18000001 to 20000000.
status: valid
status modified: 2024-04-17
accepted date: 2024-04-17
in scheme: Criteria for determining the minimum number of sampling points for fixed measurement for ozone when supplementary methods like modelling is used (according to Article 10)
related pollutant: Ozone (air)
minimum population: 18000001
maximum population: 20000000
minimum SPO: 10
minimum area: 0
maximum area: 50000

Min requirement O3 with sup. area 450001 to 500000 and Pop 0 to 2000000.
type: Concept
notation: 100
definition: Min requirement O3 with sup. area 450001 to 500000 and Pop 0 to 2000000.
status: valid
status modified: 2024-04-17
accepted date: 2024-04-17
in scheme: Criteria for determining the minimum number of sampling points for fixed measurement for ozone when supplementary methods like modelling is used (according to Article 10)
related pollutant: Ozone (air)
minimum population: 0
maximum population: 2000000
minimum SPO: 10
minimum area: 450001
maximum area: 500000

Min requirement O3 with sup. area 450001 to 500000 and Pop 2000001 to 4000000.
type: Concept
notation: 101
definition: Min requirement O3 with sup. area 450001 to 500000 and Pop 2000001 to 4000000.
status: valid
status modified: 2024-04-17
accepted date: 2024-04-17
in scheme: Criteria for determining the minimum number of sampling points for fixed measurement for ozone when supplementary methods like modelling is used (according to Article 10)
related pollutant: Ozone (air)
minimum population: 2000001
maximum population: 4000000
minimum SPO: 10
minimum area: 450001
maximum area: 500000

Min requirement O3 with sup. area 450001 to 500000 and Pop 4000001 to 6000000.
type: Concept
notation: 102
definition: Min requirement O3 with sup. area 450001 to 500000 and Pop 4000001 to 6000000.
status: valid
status modified: 2024-04-17
accepted date: 2024-04-17
in scheme: Criteria for determining the minimum number of sampling points for fixed measurement for ozone when supplementary methods like modelling is used (according to Article 10)
related pollutant: Ozone (air)
minimum population: 4000001
maximum population: 6000000
minimum SPO: 10
minimum area: 450001
maximum area: 500000

Min requirement O3 with sup. area 450001 to 500000 and Pop 6000001 to 8000000.
type: Concept
notation: 103
definition: Min requirement O3 with sup. area 450001 to 500000 and Pop 6000001 to 8000000.
status: valid
status modified: 2024-04-17
accepted date: 2024-04-17
in scheme: Criteria for determining the minimum number of sampling points for fixed measurement for ozone when supplementary methods like modelling is used (according to Article 10)
related pollutant: Ozone (air)
minimum population: 6000001
maximum population: 8000000
minimum SPO: 10
minimum area: 450001
maximum area: 500000

Min requirement O3 with sup. area 450001 to 500000 and Pop 8000001 to 10000000.
type: Concept
notation: 104
definition: Min requirement O3 with sup. area 450001 to 500000 and Pop 8000001 to 10000000.
status: valid
status modified: 2024-04-17
accepted date: 2024-04-17
in scheme: Criteria for determining the minimum number of sampling points for fixed measurement for ozone when supplementary methods like modelling is used (according to Article 10)
related pollutant: Ozone (air)
minimum population: 8000001
maximum population: 10000000
minimum SPO: 10
minimum area: 450001
maximum area: 500000

Min requirement O3 with sup. area 450001 to 500000 and Pop 10000001 to 12000000.
type: Concept
notation: 105
definition: Min requirement O3 with sup. area 450001 to 500000 and Pop 10000001 to 12000000.
status: valid
status modified: 2024-04-17
accepted date: 2024-04-17
in scheme: Criteria for determining the minimum number of sampling points for fixed measurement for ozone when supplementary methods like modelling is used (according to Article 10)
related pollutant: Ozone (air)
minimum population: 10000001
maximum population: 12000000
minimum SPO: 10
minimum area: 450001
maximum area: 500000

Min requirement O3 with sup. area 450001 to 500000 and Pop 12000001 to 14000000.
type: Concept
notation: 106
definition: Min requirement O3 with sup. area 450001 to 500000 and Pop 12000001 to 14000000.
status: valid
status modified: 2024-04-17
accepted date: 2024-04-17
in scheme: Criteria for determining the minimum number of sampling points for fixed measurement for ozone when supplementary methods like modelling is used (according to Article 10)
related pollutant: Ozone (air)
minimum population: 12000001
maximum population: 14000000
minimum SPO: 10
minimum area: 450001
maximum area: 500000

Min requirement O3 with sup. area 450001 to 500000 and Pop 14000001 to 16000000.
type: Concept
notation: 107
definition: Min requirement O3 with sup. area 450001 to 500000 and Pop 14000001 to 16000000.
status: valid
status modified: 2024-04-17
accepted date: 2024-04-17
in scheme: Criteria for determining the minimum number of sampling points for fixed measurement for ozone when supplementary methods like modelling is used (according to Article 10)
related pollutant: Ozone (air)
minimum population: 14000001
maximum population: 16000000
minimum SPO: 10
minimum area: 450001
maximum area: 500000

Min requirement O3 with sup. area 450001 to 500000 and Pop 16000001 to 18000000.
type: Concept
notation: 108
definition: Min requirement O3 with sup. area 450001 to 500000 and Pop 16000001 to 18000000.
status: valid
status modified: 2024-04-17
accepted date: 2024-04-17
in scheme: Criteria for determining the minimum number of sampling points for fixed measurement for ozone when supplementary methods like modelling is used (according to Article 10)
related pollutant: Ozone (air)
minimum population: 16000001
maximum population: 18000000
minimum SPO: 10
minimum area: 450001
maximum area: 500000

Min requirement O3 with sup. area 450001 to 500000 and Pop 18000001 to 20000000.
type: Concept
notation: 109
definition: Min requirement O3 with sup. area 450001 to 500000 and Pop 18000001 to 20000000.
status: valid
status modified: 2024-04-17
accepted date: 2024-04-17
in scheme: Criteria for determining the minimum number of sampling points for fixed measurement for ozone when supplementary methods like modelling is used (according to Article 10)
related pollutant: Ozone (air)
minimum population: 18000001
maximum population: 20000000
minimum SPO: 10
minimum area: 450001
maximum area: 500000

Min requirement O3 with sup. area 0 to 50000 and Pop 20000001 to 22000000.
type: Concept
notation: 11
definition: Min requirement O3 with sup. area 0 to 50000 and Pop 20000001 to 22000000.
status: valid
status modified: 2024-04-17
accepted date: 2024-04-17
in scheme: Criteria for determining the minimum number of sampling points for fixed measurement for ozone when supplementary methods like modelling is used (according to Article 10)
related pollutant: Ozone (air)
minimum population: 20000001
maximum population: 22000000
minimum SPO: 11
minimum area: 0
maximum area: 50000

Min requirement O3 with sup. area 450001 to 500000 and Pop 20000001 to 22000000.
type: Concept
notation: 110
definition: Min requirement O3 with sup. area 450001 to 500000 and Pop 20000001 to 22000000.
status: valid
status modified: 2024-04-17
accepted date: 2024-04-17
in scheme: Criteria for determining the minimum number of sampling points for fixed measurement for ozone when supplementary methods like modelling is used (according to Article 10)
related pollutant: Ozone (air)
minimum population: 20000001
maximum population: 22000000
minimum SPO: 11
minimum area: 450001
maximum area: 500000

Min requirement O3 with sup. area 500001 to 550000 and Pop 0 to 2000000.
type: Concept
notation: 111
definition: Min requirement O3 with sup. area 500001 to 550000 and Pop 0 to 2000000.
status: valid
status modified: 2024-04-17
accepted date: 2024-04-17
in scheme: Criteria for determining the minimum number of sampling points for fixed measurement for ozone when supplementary methods like modelling is used (according to Article 10)
related pollutant: Ozone (air)
minimum population: 0
maximum population: 2000000
minimum SPO: 11
minimum area: 500001
maximum area: 550000

Min requirement O3 with sup. area 500001 to 550000 and Pop 2000001 to 4000000.
type: Concept
notation: 112
definition: Min requirement O3 with sup. area 500001 to 550000 and Pop 2000001 to 4000000.
status: valid
status modified: 2024-04-17
accepted date: 2024-04-17
in scheme: Criteria for determining the minimum number of sampling points for fixed measurement for ozone when supplementary methods like modelling is used (according to Article 10)
related pollutant: Ozone (air)
minimum population: 2000001
maximum population: 4000000
minimum SPO: 11
minimum area: 500001
maximum area: 550000

Min requirement O3 with sup. area 500001 to 550000 and Pop 4000001 to 6000000.
type: Concept
notation: 113
definition: Min requirement O3 with sup. area 500001 to 550000 and Pop 4000001 to 6000000.
status: valid
status modified: 2024-04-17
accepted date: 2024-04-17
in scheme: Criteria for determining the minimum number of sampling points for fixed measurement for ozone when supplementary methods like modelling is used (according to Article 10)
related pollutant: Ozone (air)
minimum population: 4000001
maximum population: 6000000
minimum SPO: 11
minimum area: 500001
maximum area: 550000

Min requirement O3 with sup. area 500001 to 550000 and Pop 6000001 to 8000000.
type: Concept
notation: 114
definition: Min requirement O3 with sup. area 500001 to 550000 and Pop 6000001 to 8000000.
status: valid
status modified: 2024-04-17
accepted date: 2024-04-17
in scheme: Criteria for determining the minimum number of sampling points for fixed measurement for ozone when supplementary methods like modelling is used (according to Article 10)
related pollutant: Ozone (air)
minimum population: 6000001
maximum population: 8000000
minimum SPO: 11
minimum area: 500001
maximum area: 550000

Min requirement O3 with sup. area 500001 to 550000 and Pop 8000001 to 10000000.
type: Concept
notation: 115
definition: Min requirement O3 with sup. area 500001 to 550000 and Pop 8000001 to 10000000.
status: valid
status modified: 2024-04-17
accepted date: 2024-04-17
in scheme: Criteria for determining the minimum number of sampling points for fixed measurement for ozone when supplementary methods like modelling is used (according to Article 10)
related pollutant: Ozone (air)
minimum population: 8000001
maximum population: 10000000
minimum SPO: 11
minimum area: 500001
maximum area: 550000

Min requirement O3 with sup. area 500001 to 550000 and Pop 10000001 to 12000000.
type: Concept
notation: 116
definition: Min requirement O3 with sup. area 500001 to 550000 and Pop 10000001 to 12000000.
status: valid
status modified: 2024-04-17
accepted date: 2024-04-17
in scheme: Criteria for determining the minimum number of sampling points for fixed measurement for ozone when supplementary methods like modelling is used (according to Article 10)
related pollutant: Ozone (air)
minimum population: 10000001
maximum population: 12000000
minimum SPO: 11
minimum area: 500001
maximum area: 550000

Min requirement O3 with sup. area 500001 to 550000 and Pop 12000001 to 14000000.
type: Concept
notation: 117
definition: Min requirement O3 with sup. area 500001 to 550000 and Pop 12000001 to 14000000.
status: valid
status modified: 2024-04-17
accepted date: 2024-04-17
in scheme: Criteria for determining the minimum number of sampling points for fixed measurement for ozone when supplementary methods like modelling is used (according to Article 10)
related pollutant: Ozone (air)
minimum population: 12000001
maximum population: 14000000
minimum SPO: 11
minimum area: 500001
maximum area: 550000

Min requirement O3 with sup. area 500001 to 550000 and Pop 14000001 to 16000000.
type: Concept
notation: 118
definition: Min requirement O3 with sup. area 500001 to 550000 and Pop 14000001 to 16000000.
status: valid
status modified: 2024-04-17
accepted date: 2024-04-17
in scheme: Criteria for determining the minimum number of sampling points for fixed measurement for ozone when supplementary methods like modelling is used (according to Article 10)
related pollutant: Ozone (air)
minimum population: 14000001
maximum population: 16000000
minimum SPO: 11
minimum area: 500001
maximum area: 550000

Min requirement O3 with sup. area 500001 to 550000 and Pop 16000001 to 18000000.
type: Concept
notation: 119
definition: Min requirement O3 with sup. area 500001 to 550000 and Pop 16000001 to 18000000.
status: valid
status modified: 2024-04-17
accepted date: 2024-04-17
in scheme: Criteria for determining the minimum number of sampling points for fixed measurement for ozone when supplementary methods like modelling is used (according to Article 10)
related pollutant: Ozone (air)
minimum population: 16000001
maximum population: 18000000
minimum SPO: 11
minimum area: 500001
maximum area: 550000

Min requirement O3 with sup. area 50001 to 100000 and Pop 0 to 2000000.
type: Concept
notation: 12
definition: Min requirement O3 with sup. area 50001 to 100000 and Pop 0 to 2000000.
status: valid
status modified: 2024-04-17
accepted date: 2024-04-17
in scheme: Criteria for determining the minimum number of sampling points for fixed measurement for ozone when supplementary methods like modelling is used (according to Article 10)
related pollutant: Ozone (air)
minimum population: 0
maximum population: 2000000
minimum SPO: 2
minimum area: 50001
maximum area: 100000

Min requirement O3 with sup. area 500001 to 550000 and Pop 18000001 to 20000000.
type: Concept
notation: 120
definition: Min requirement O3 with sup. area 500001 to 550000 and Pop 18000001 to 20000000.
status: valid
status modified: 2024-04-17
accepted date: 2024-04-17
in scheme: Criteria for determining the minimum number of sampling points for fixed measurement for ozone when supplementary methods like modelling is used (according to Article 10)
related pollutant: Ozone (air)
minimum population: 18000001
maximum population: 20000000
minimum SPO: 11
minimum area: 500001
maximum area: 550000

Min requirement O3 with sup. area 500001 to 550000 and Pop 20000001 to 22000000.
type: Concept
notation: 121
definition: Min requirement O3 with sup. area 500001 to 550000 and Pop 20000001 to 22000000.
status: valid
status modified: 2024-04-17
accepted date: 2024-04-17
in scheme: Criteria for determining the minimum number of sampling points for fixed measurement for ozone when supplementary methods like modelling is used (according to Article 10)
related pollutant: Ozone (air)
minimum population: 20000001
maximum population: 22000000
minimum SPO: 11
minimum area: 500001
maximum area: 550000

Min requirement O3 with sup. area 550001 to 600000 and Pop 0 to 22000000.
type: Concept
notation: 122
definition: Min requirement O3 with sup. area 550001 to 600000 and Pop 0 to 22000000.
status: valid
status modified: 2024-04-17
accepted date: 2024-04-17
in scheme: Criteria for determining the minimum number of sampling points for fixed measurement for ozone when supplementary methods like modelling is used (according to Article 10)
related pollutant: Ozone (air)
minimum population: 0
maximum population: 22000000
minimum SPO: 12
minimum area: 550001
maximum area: 600000

Min requirement O3 with sup. area 600001 to 650000 and Pop 0 to 22000000.
type: Concept
notation: 123
definition: Min requirement O3 with sup. area 600001 to 650000 and Pop 0 to 22000000.
status: valid
status modified: 2024-04-17
accepted date: 2024-04-17
in scheme: Criteria for determining the minimum number of sampling points for fixed measurement for ozone when supplementary methods like modelling is used (according to Article 10)
related pollutant: Ozone (air)
minimum population: 0
maximum population: 22000000
minimum SPO: 13
minimum area: 600001
maximum area: 650000

Min requirement O3 with sup. area 650001 to 700000 and Pop 0 to 22000000.
type: Concept
notation: 124
definition: Min requirement O3 with sup. area 650001 to 700000 and Pop 0 to 22000000.
status: valid
status modified: 2024-04-17
accepted date: 2024-04-17
in scheme: Criteria for determining the minimum number of sampling points for fixed measurement for ozone when supplementary methods like modelling is used (according to Article 10)
related pollutant: Ozone (air)
minimum population: 0
maximum population: 22000000
minimum SPO: 14
minimum area: 650001
maximum area: 700000

Min requirement O3 with sup. area 700001 to 750000 and Pop 0 to 22000000.
type: Concept
notation: 125
definition: Min requirement O3 with sup. area 700001 to 750000 and Pop 0 to 22000000.
status: valid
status modified: 2024-04-17
accepted date: 2024-04-17
in scheme: Criteria for determining the minimum number of sampling points for fixed measurement for ozone when supplementary methods like modelling is used (according to Article 10)
related pollutant: Ozone (air)
minimum population: 0
maximum population: 22000000
minimum SPO: 15
minimum area: 700001
maximum area: 750000

Min requirement O3 with sup. area 750001 to 800000 and Pop 0 to 22000000.
type: Concept
notation: 126
definition: Min requirement O3 with sup. area 750001 to 800000 and Pop 0 to 22000000.
status: valid
status modified: 2024-04-17
accepted date: 2024-04-17
in scheme: Criteria for determining the minimum number of sampling points for fixed measurement for ozone when supplementary methods like modelling is used (according to Article 10)
related pollutant: Ozone (air)
minimum population: 0
maximum population: 22000000
minimum SPO: 16
minimum area: 750001
maximum area: 800000

Min requirement O3 with sup. area 800001 to 850000 and Pop 0 to 22000000.
type: Concept
notation: 127
definition: Min requirement O3 with sup. area 800001 to 850000 and Pop 0 to 22000000.
status: valid
status modified: 2024-04-17
accepted date: 2024-04-17
in scheme: Criteria for determining the minimum number of sampling points for fixed measurement for ozone when supplementary methods like modelling is used (according to Article 10)
related pollutant: Ozone (air)
minimum population: 0
maximum population: 22000000
minimum SPO: 17
minimum area: 800001
maximum area: 850000

Min requirement O3 with sup. area 850001 to 900000 and Pop 0 to 22000000.
type: Concept
notation: 128
definition: Min requirement O3 with sup. area 850001 to 900000 and Pop 0 to 22000000.
status: valid
status modified: 2024-04-17
accepted date: 2024-04-17
in scheme: Criteria for determining the minimum number of sampling points for fixed measurement for ozone when supplementary methods like modelling is used (according to Article 10)
related pollutant: Ozone (air)
minimum population: 0
maximum population: 22000000
minimum SPO: 18
minimum area: 850001
maximum area: 900000

Min requirement O3 with sup. area 900001 to 950000 and Pop 0 to 22000000.
type: Concept
notation: 129
definition: Min requirement O3 with sup. area 900001 to 950000 and Pop 0 to 22000000.
status: valid
status modified: 2024-04-17
accepted date: 2024-04-17
in scheme: Criteria for determining the minimum number of sampling points for fixed measurement for ozone when supplementary methods like modelling is used (according to Article 10)
related pollutant: Ozone (air)
minimum population: 0
maximum population: 22000000
minimum SPO: 19
minimum area: 900001
maximum area: 950000

Min requirement O3 with sup. area 50001 to 100000 and Pop 2000001 to 4000000.
type: Concept
notation: 13
definition: Min requirement O3 with sup. area 50001 to 100000 and Pop 2000001 to 4000000.
status: valid
status modified: 2024-04-17
accepted date: 2024-04-17
in scheme: Criteria for determining the minimum number of sampling points for fixed measurement for ozone when supplementary methods like modelling is used (according to Article 10)
related pollutant: Ozone (air)
minimum population: 2000001
maximum population: 4000000
minimum SPO: 2
minimum area: 50001
maximum area: 100000

Min requirement O3 with sup. area 950001 to 1000000 and Pop 0 to 22000000.
type: Concept
notation: 130
definition: Min requirement O3 with sup. area 950001 to 1000000 and Pop 0 to 22000000.
status: valid
status modified: 2024-04-17
accepted date: 2024-04-17
in scheme: Criteria for determining the minimum number of sampling points for fixed measurement for ozone when supplementary methods like modelling is used (according to Article 10)
related pollutant: Ozone (air)
minimum population: 0
maximum population: 22000000
minimum SPO: 20
minimum area: 950001
maximum area: 1000000

Min requirement O3 with sup. area 1000001 to 1050000 and Pop 0 to 22000000.
type: Concept
notation: 131
definition: Min requirement O3 with sup. area 1000001 to 1050000 and Pop 0 to 22000000.
status: valid
status modified: 2024-04-17
accepted date: 2024-04-17
in scheme: Criteria for determining the minimum number of sampling points for fixed measurement for ozone when supplementary methods like modelling is used (according to Article 10)
related pollutant: Ozone (air)
minimum population: 0
maximum population: 22000000
minimum SPO: 21
minimum area: 1000001
maximum area: 1050000

Min requirement O3 with sup. area 1050001 to 1100000 and Pop 0 to 22000000.
type: Concept
notation: 132
definition: Min requirement O3 with sup. area 1050001 to 1100000 and Pop 0 to 22000000.
status: valid
status modified: 2024-04-17
accepted date: 2024-04-17
in scheme: Criteria for determining the minimum number of sampling points for fixed measurement for ozone when supplementary methods like modelling is used (according to Article 10)
related pollutant: Ozone (air)
minimum population: 0
maximum population: 22000000
minimum SPO: 22
minimum area: 1050001
maximum area: 1100000

Min requirement O3 with sup. area 1100001 to 1150000 and Pop 0 to 22000000.
type: Concept
notation: 133
definition: Min requirement O3 with sup. area 1100001 to 1150000 and Pop 0 to 22000000.
status: valid
status modified: 2024-04-17
accepted date: 2024-04-17
in scheme: Criteria for determining the minimum number of sampling points for fixed measurement for ozone when supplementary methods like modelling is used (according to Article 10)
related pollutant: Ozone (air)
minimum population: 0
maximum population: 22000000
minimum SPO: 23
minimum area: 1100001
maximum area: 1150000

Min requirement O3 with sup. area 1150001 to 1200000 and Pop 0 to 22000000.
type: Concept
notation: 134
definition: Min requirement O3 with sup. area 1150001 to 1200000 and Pop 0 to 22000000.
status: valid
status modified: 2024-04-17
accepted date: 2024-04-17
in scheme: Criteria for determining the minimum number of sampling points for fixed measurement for ozone when supplementary methods like modelling is used (according to Article 10)
related pollutant: Ozone (air)
minimum population: 0
maximum population: 22000000
minimum SPO: 24
minimum area: 1150001
maximum area: 1200000

Min requirement O3 with sup. area 1200001 to 1250000 and Pop 0 to 22000000.
type: Concept
notation: 135
definition: Min requirement O3 with sup. area 1200001 to 1250000 and Pop 0 to 22000000.
status: valid
status modified: 2024-04-17
accepted date: 2024-04-17
in scheme: Criteria for determining the minimum number of sampling points for fixed measurement for ozone when supplementary methods like modelling is used (according to Article 10)
related pollutant: Ozone (air)
minimum population: 0
maximum population: 22000000
minimum SPO: 25
minimum area: 1200001
maximum area: 1250000

Min requirement O3 with sup. area 1250001 to 1300000 and Pop 0 to 22000000.
type: Concept
notation: 136
definition: Min requirement O3 with sup. area 1250001 to 1300000 and Pop 0 to 22000000.
status: valid
status modified: 2024-04-17
accepted date: 2024-04-17
in scheme: Criteria for determining the minimum number of sampling points for fixed measurement for ozone when supplementary methods like modelling is used (according to Article 10)
related pollutant: Ozone (air)
minimum population: 0
maximum population: 22000000
minimum SPO: 26
minimum area: 1250001
maximum area: 1300000

Min requirement O3 with sup. area 1300001 to 1350000 and Pop 0 to 22000000.
type: Concept
notation: 137
definition: Min requirement O3 with sup. area 1300001 to 1350000 and Pop 0 to 22000000.
status: valid
status modified: 2024-04-17
accepted date: 2024-04-17
in scheme: Criteria for determining the minimum number of sampling points for fixed measurement for ozone when supplementary methods like modelling is used (according to Article 10)
related pollutant: Ozone (air)
minimum population: 0
maximum population: 22000000
minimum SPO: 27
minimum area: 1300001
maximum area: 1350000

Min requirement O3 with sup. area 1350001 to 1400000 and Pop 0 to 22000000.
type: Concept
notation: 138
definition: Min requirement O3 with sup. area 1350001 to 1400000 and Pop 0 to 22000000.
status: valid
status modified: 2024-04-17
accepted date: 2024-04-17
in scheme: Criteria for determining the minimum number of sampling points for fixed measurement for ozone when supplementary methods like modelling is used (according to Article 10)
related pollutant: Ozone (air)
minimum population: 0
maximum population: 22000000
minimum SPO: 28
minimum area: 1350001
maximum area: 1400000

Min requirement O3 with sup. area 1400001 to 1450000 and Pop 0 to 22000000.
type: Concept
notation: 139
definition: Min requirement O3 with sup. area 1400001 to 1450000 and Pop 0 to 22000000.
status: valid
status modified: 2024-04-17
accepted date: 2024-04-17
in scheme: Criteria for determining the minimum number of sampling points for fixed measurement for ozone when supplementary methods like modelling is used (according to Article 10)
related pollutant: Ozone (air)
minimum population: 0
maximum population: 22000000
minimum SPO: 29
minimum area: 1400001
maximum area: 1450000

Min requirement O3 with sup. area 50001 to 100000 and Pop 4000001 to 6000000.
type: Concept
notation: 14
definition: Min requirement O3 with sup. area 50001 to 100000 and Pop 4000001 to 6000000.
status: valid
status modified: 2024-04-17
accepted date: 2024-04-17
in scheme: Criteria for determining the minimum number of sampling points for fixed measurement for ozone when supplementary methods like modelling is used (according to Article 10)
related pollutant: Ozone (air)
minimum population: 4000001
maximum population: 6000000
minimum SPO: 3
minimum area: 50001
maximum area: 100000

Min requirement O3 with sup. area 1450001 to 1500000 and Pop 0 to 22000000.
type: Concept
notation: 140
definition: Min requirement O3 with sup. area 1450001 to 1500000 and Pop 0 to 22000000.
status: valid
status modified: 2024-04-17
accepted date: 2024-04-17
in scheme: Criteria for determining the minimum number of sampling points for fixed measurement for ozone when supplementary methods like modelling is used (according to Article 10)
related pollutant: Ozone (air)
minimum population: 0
maximum population: 22000000
minimum SPO: 30
minimum area: 1450001
maximum area: 1500000

Min requirement O3 with sup. area 1500001 to 1550000 and Pop 0 to 22000000.
type: Concept
notation: 141
definition: Min requirement O3 with sup. area 1500001 to 1550000 and Pop 0 to 22000000.
status: valid
status modified: 2024-04-17
accepted date: 2024-04-17
in scheme: Criteria for determining the minimum number of sampling points for fixed measurement for ozone when supplementary methods like modelling is used (according to Article 10)
related pollutant: Ozone (air)
minimum population: 0
maximum population: 22000000
minimum SPO: 31
minimum area: 1500001
maximum area: 1550000

Min requirement O3 with sup. area 1550001 to 1600000 and Pop 0 to 22000000.
type: Concept
notation: 142
definition: Min requirement O3 with sup. area 1550001 to 1600000 and Pop 0 to 22000000.
status: valid
status modified: 2024-04-17
accepted date: 2024-04-17
in scheme: Criteria for determining the minimum number of sampling points for fixed measurement for ozone when supplementary methods like modelling is used (according to Article 10)
related pollutant: Ozone (air)
minimum population: 0
maximum population: 22000000
minimum SPO: 32
minimum area: 1550001
maximum area: 1600000

Min requirement O3 with sup. area 1600001 to 1650000 and Pop 0 to 22000000.
type: Concept
notation: 143
definition: Min requirement O3 with sup. area 1600001 to 1650000 and Pop 0 to 22000000.
status: valid
status modified: 2024-04-17
accepted date: 2024-04-17
in scheme: Criteria for determining the minimum number of sampling points for fixed measurement for ozone when supplementary methods like modelling is used (according to Article 10)
related pollutant: Ozone (air)
minimum population: 0
maximum population: 22000000
minimum SPO: 33
minimum area: 1600001
maximum area: 1650000

Min requirement O3 with sup. area 1650001 to 1700000 and Pop 0 to 22000000.
type: Concept
notation: 144
definition: Min requirement O3 with sup. area 1650001 to 1700000 and Pop 0 to 22000000.
status: valid
status modified: 2024-04-17
accepted date: 2024-04-17
in scheme: Criteria for determining the minimum number of sampling points for fixed measurement for ozone when supplementary methods like modelling is used (according to Article 10)
related pollutant: Ozone (air)
minimum population: 0
maximum population: 22000000
minimum SPO: 34
minimum area: 1650001
maximum area: 1700000

Min requirement O3 with sup. area 1700001 to 1750000 and Pop 0 to 22000000.
type: Concept
notation: 145
definition: Min requirement O3 with sup. area 1700001 to 1750000 and Pop 0 to 22000000.
status: valid
status modified: 2024-04-17
accepted date: 2024-04-17
in scheme: Criteria for determining the minimum number of sampling points for fixed measurement for ozone when supplementary methods like modelling is used (according to Article 10)
related pollutant: Ozone (air)
minimum population: 0
maximum population: 22000000
minimum SPO: 35
minimum area: 1700001
maximum area: 1750000

Min requirement O3 with sup. area 1750001 to 1800000 and Pop 0 to 22000000.
type: Concept
notation: 146
definition: Min requirement O3 with sup. area 1750001 to 1800000 and Pop 0 to 22000000.
status: valid
status modified: 2024-04-17
accepted date: 2024-04-17
in scheme: Criteria for determining the minimum number of sampling points for fixed measurement for ozone when supplementary methods like modelling is used (according to Article 10)
related pollutant: Ozone (air)
minimum population: 0
maximum population: 22000000
minimum SPO: 36
minimum area: 1750001
maximum area: 1800000

Min requirement O3 with sup. area 1800001 to 1850000 and Pop 0 to 22000000.
type: Concept
notation: 147
definition: Min requirement O3 with sup. area 1800001 to 1850000 and Pop 0 to 22000000.
status: valid
status modified: 2024-04-17
accepted date: 2024-04-17
in scheme: Criteria for determining the minimum number of sampling points for fixed measurement for ozone when supplementary methods like modelling is used (according to Article 10)
related pollutant: Ozone (air)
minimum population: 0
maximum population: 22000000
minimum SPO: 37
minimum area: 1800001
maximum area: 1850000

Min requirement O3 with sup. area 1850001 to 1900000 and Pop 0 to 22000000.
type: Concept
notation: 148
definition: Min requirement O3 with sup. area 1850001 to 1900000 and Pop 0 to 22000000.
status: valid
status modified: 2024-04-17
accepted date: 2024-04-17
in scheme: Criteria for determining the minimum number of sampling points for fixed measurement for ozone when supplementary methods like modelling is used (according to Article 10)
related pollutant: Ozone (air)
minimum population: 0
maximum population: 22000000
minimum SPO: 38
minimum area: 1850001
maximum area: 1900000

Min requirement O3 with sup. area 1900001 to 1950000 and Pop 0 to 22000000.
type: Concept
notation: 149
definition: Min requirement O3 with sup. area 1900001 to 1950000 and Pop 0 to 22000000.
status: valid
status modified: 2024-04-17
accepted date: 2024-04-17
in scheme: Criteria for determining the minimum number of sampling points for fixed measurement for ozone when supplementary methods like modelling is used (according to Article 10)
related pollutant: Ozone (air)
minimum population: 0
maximum population: 22000000
minimum SPO: 39
minimum area: 1900001
maximum area: 1950000

Min requirement O3 with sup. area 50001 to 100000 and Pop 6000001 to 8000000.
type: Concept
notation: 15
definition: Min requirement O3 with sup. area 50001 to 100000 and Pop 6000001 to 8000000.
status: valid
status modified: 2024-04-17
accepted date: 2024-04-17
in scheme: Criteria for determining the minimum number of sampling points for fixed measurement for ozone when supplementary methods like modelling is used (according to Article 10)
related pollutant: Ozone (air)
minimum population: 6000001
maximum population: 8000000
minimum SPO: 4
minimum area: 50001
maximum area: 100000

Min requirement O3 with sup. area 1950001 to 2000000 and Pop 0 to 22000000.
type: Concept
notation: 150
definition: Min requirement O3 with sup. area 1950001 to 2000000 and Pop 0 to 22000000.
status: valid
status modified: 2024-04-17
accepted date: 2024-04-17
in scheme: Criteria for determining the minimum number of sampling points for fixed measurement for ozone when supplementary methods like modelling is used (according to Article 10)
related pollutant: Ozone (air)
minimum population: 0
maximum population: 22000000
minimum SPO: 40
minimum area: 1950001
maximum area: 2000000

Min requirement O3 with sup. area 50001 to 100000 and Pop 8000001 to 10000000.
type: Concept
notation: 16
definition: Min requirement O3 with sup. area 50001 to 100000 and Pop 8000001 to 10000000.
status: valid
status modified: 2024-04-17
accepted date: 2024-04-17
in scheme: Criteria for determining the minimum number of sampling points for fixed measurement for ozone when supplementary methods like modelling is used (according to Article 10)
related pollutant: Ozone (air)
minimum population: 8000001
maximum population: 10000000
minimum SPO: 5
minimum area: 50001
maximum area: 100000

Min requirement O3 with sup. area 50001 to 100000 and Pop 10000001 to 12000000.
type: Concept
notation: 17
definition: Min requirement O3 with sup. area 50001 to 100000 and Pop 10000001 to 12000000.
status: valid
status modified: 2024-04-17
accepted date: 2024-04-17
in scheme: Criteria for determining the minimum number of sampling points for fixed measurement for ozone when supplementary methods like modelling is used (according to Article 10)
related pollutant: Ozone (air)
minimum population: 10000001
maximum population: 12000000
minimum SPO: 6
minimum area: 50001
maximum area: 100000

Min requirement O3 with sup. area 50001 to 100000 and Pop 12000001 to 14000000.
type: Concept
notation: 18
definition: Min requirement O3 with sup. area 50001 to 100000 and Pop 12000001 to 14000000.
status: valid
status modified: 2024-04-17
accepted date: 2024-04-17
in scheme: Criteria for determining the minimum number of sampling points for fixed measurement for ozone when supplementary methods like modelling is used (according to Article 10)
related pollutant: Ozone (air)
minimum population: 12000001
maximum population: 14000000
minimum SPO: 7
minimum area: 50001
maximum area: 100000

Min requirement O3 with sup. area 50001 to 100000 and Pop 14000001 to 16000000.
type: Concept
notation: 19
definition: Min requirement O3 with sup. area 50001 to 100000 and Pop 14000001 to 16000000.
status: valid
status modified: 2024-04-17
accepted date: 2024-04-17
in scheme: Criteria for determining the minimum number of sampling points for fixed measurement for ozone when supplementary methods like modelling is used (according to Article 10)
related pollutant: Ozone (air)
minimum population: 14000001
maximum population: 16000000
minimum SPO: 8
minimum area: 50001
maximum area: 100000

Min requirement O3 with sup. area 0 to 50000 and Pop 2000001 to 4000000.
type: Concept
notation: 2
definition: Min requirement O3 with sup. area 0 to 50000 and Pop 2000001 to 4000000.
status: valid
status modified: 2024-04-17
accepted date: 2024-04-17
in scheme: Criteria for determining the minimum number of sampling points for fixed measurement for ozone when supplementary methods like modelling is used (according to Article 10)
related pollutant: Ozone (air)
minimum population: 2000001
maximum population: 4000000
minimum SPO: 2
minimum area: 0
maximum area: 50000

Min requirement O3 with sup. area 50001 to 100000 and Pop 16000001 to 18000000.
type: Concept
notation: 20
definition: Min requirement O3 with sup. area 50001 to 100000 and Pop 16000001 to 18000000.
status: valid
status modified: 2024-04-17
accepted date: 2024-04-17
in scheme: Criteria for determining the minimum number of sampling points for fixed measurement for ozone when supplementary methods like modelling is used (according to Article 10)
related pollutant: Ozone (air)
minimum population: 16000001
maximum population: 18000000
minimum SPO: 9
minimum area: 50001
maximum area: 100000

Min requirement O3 with sup. area 50001 to 100000 and Pop 18000001 to 20000000.
type: Concept
notation: 21
definition: Min requirement O3 with sup. area 50001 to 100000 and Pop 18000001 to 20000000.
status: valid
status modified: 2024-04-17
accepted date: 2024-04-17
in scheme: Criteria for determining the minimum number of sampling points for fixed measurement for ozone when supplementary methods like modelling is used (according to Article 10)
related pollutant: Ozone (air)
minimum population: 18000001
maximum population: 20000000
minimum SPO: 10
minimum area: 50001
maximum area: 100000

Min requirement O3 with sup. area 50001 to 100000 and Pop 20000001 to 22000000.
type: Concept
notation: 22
definition: Min requirement O3 with sup. area 50001 to 100000 and Pop 20000001 to 22000000.
status: valid
status modified: 2024-04-17
accepted date: 2024-04-17
in scheme: Criteria for determining the minimum number of sampling points for fixed measurement for ozone when supplementary methods like modelling is used (according to Article 10)
related pollutant: Ozone (air)
minimum population: 20000001
maximum population: 22000000
minimum SPO: 11
minimum area: 50001
maximum area: 100000

Min requirement O3 with sup. area 100001 to 150000 and Pop 0 to 2000000.
type: Concept
notation: 23
definition: Min requirement O3 with sup. area 100001 to 150000 and Pop 0 to 2000000.
status: valid
status modified: 2024-04-17
accepted date: 2024-04-17
in scheme: Criteria for determining the minimum number of sampling points for fixed measurement for ozone when supplementary methods like modelling is used (according to Article 10)
related pollutant: Ozone (air)
minimum population: 0
maximum population: 2000000
minimum SPO: 3
minimum area: 100001
maximum area: 150000

Min requirement O3 with sup. area 100001 to 150000 and Pop 2000001 to 4000000.
type: Concept
notation: 24
definition: Min requirement O3 with sup. area 100001 to 150000 and Pop 2000001 to 4000000.
status: valid
status modified: 2024-04-17
accepted date: 2024-04-17
in scheme: Criteria for determining the minimum number of sampling points for fixed measurement for ozone when supplementary methods like modelling is used (according to Article 10)
related pollutant: Ozone (air)
minimum population: 2000001
maximum population: 4000000
minimum SPO: 3
minimum area: 100001
maximum area: 150000

Min requirement O3 with sup. area 100001 to 150000 and Pop 4000001 to 6000000.
type: Concept
notation: 25
definition: Min requirement O3 with sup. area 100001 to 150000 and Pop 4000001 to 6000000.
status: valid
status modified: 2024-04-17
accepted date: 2024-04-17
in scheme: Criteria for determining the minimum number of sampling points for fixed measurement for ozone when supplementary methods like modelling is used (according to Article 10)
related pollutant: Ozone (air)
minimum population: 4000001
maximum population: 6000000
minimum SPO: 3
minimum area: 100001
maximum area: 150000

Min requirement O3 with sup. area 100001 to 150000 and Pop 6000001 to 8000000.
type: Concept
notation: 26
definition: Min requirement O3 with sup. area 100001 to 150000 and Pop 6000001 to 8000000.
status: valid
status modified: 2024-04-17
accepted date: 2024-04-17
in scheme: Criteria for determining the minimum number of sampling points for fixed measurement for ozone when supplementary methods like modelling is used (according to Article 10)
related pollutant: Ozone (air)
minimum population: 6000001
maximum population: 8000000
minimum SPO: 4
minimum area: 100001
maximum area: 150000

Min requirement O3 with sup. area 100001 to 150000 and Pop 8000001 to 10000000.
type: Concept
notation: 27
definition: Min requirement O3 with sup. area 100001 to 150000 and Pop 8000001 to 10000000.
status: valid
status modified: 2024-04-17
accepted date: 2024-04-17
in scheme: Criteria for determining the minimum number of sampling points for fixed measurement for ozone when supplementary methods like modelling is used (according to Article 10)
related pollutant: Ozone (air)
minimum population: 8000001
maximum population: 10000000
minimum SPO: 5
minimum area: 100001
maximum area: 150000

Min requirement O3 with sup. area 100001 to 150000 and Pop 10000001 to 12000000.
type: Concept
notation: 28
definition: Min requirement O3 with sup. area 100001 to 150000 and Pop 10000001 to 12000000.
status: valid
status modified: 2024-04-17
accepted date: 2024-04-17
in scheme: Criteria for determining the minimum number of sampling points for fixed measurement for ozone when supplementary methods like modelling is used (according to Article 10)
related pollutant: Ozone (air)
minimum population: 10000001
maximum population: 12000000
minimum SPO: 6
minimum area: 100001
maximum area: 150000

Min requirement O3 with sup. area 100001 to 150000 and Pop 12000001 to 14000000.
type: Concept
notation: 29
definition: Min requirement O3 with sup. area 100001 to 150000 and Pop 12000001 to 14000000.
status: valid
status modified: 2024-04-17
accepted date: 2024-04-17
in scheme: Criteria for determining the minimum number of sampling points for fixed measurement for ozone when supplementary methods like modelling is used (according to Article 10)
related pollutant: Ozone (air)
minimum population: 12000001
maximum population: 14000000
minimum SPO: 7
minimum area: 100001
maximum area: 150000

Min requirement O3 with sup. area 0 to 50000 and Pop 4000001 to 6000000.
type: Concept
notation: 3
definition: Min requirement O3 with sup. area 0 to 50000 and Pop 4000001 to 6000000.
status: valid
status modified: 2024-04-17
accepted date: 2024-04-17
in scheme: Criteria for determining the minimum number of sampling points for fixed measurement for ozone when supplementary methods like modelling is used (according to Article 10)
related pollutant: Ozone (air)
minimum population: 4000001
maximum population: 6000000
minimum SPO: 3
minimum area: 0
maximum area: 50000

Min requirement O3 with sup. area 100001 to 150000 and Pop 14000001 to 16000000.
type: Concept
notation: 30
definition: Min requirement O3 with sup. area 100001 to 150000 and Pop 14000001 to 16000000.
status: valid
status modified: 2024-04-17
accepted date: 2024-04-17
in scheme: Criteria for determining the minimum number of sampling points for fixed measurement for ozone when supplementary methods like modelling is used (according to Article 10)
related pollutant: Ozone (air)
minimum population: 14000001
maximum population: 16000000
minimum SPO: 8
minimum area: 100001
maximum area: 150000

Min requirement O3 with sup. area 100001 to 150000 and Pop 16000001 to 18000000.
type: Concept
notation: 31
definition: Min requirement O3 with sup. area 100001 to 150000 and Pop 16000001 to 18000000.
status: valid
status modified: 2024-04-17
accepted date: 2024-04-17
in scheme: Criteria for determining the minimum number of sampling points for fixed measurement for ozone when supplementary methods like modelling is used (according to Article 10)
related pollutant: Ozone (air)
minimum population: 16000001
maximum population: 18000000
minimum SPO: 9
minimum area: 100001
maximum area: 150000

Min requirement O3 with sup. area 100001 to 150000 and Pop 18000001 to 20000000.
type: Concept
notation: 32
definition: Min requirement O3 with sup. area 100001 to 150000 and Pop 18000001 to 20000000.
status: valid
status modified: 2024-04-17
accepted date: 2024-04-17
in scheme: Criteria for determining the minimum number of sampling points for fixed measurement for ozone when supplementary methods like modelling is used (according to Article 10)
related pollutant: Ozone (air)
minimum population: 18000001
maximum population: 20000000
minimum SPO: 10
minimum area: 100001
maximum area: 150000

Min requirement O3 with sup. area 100001 to 150000 and Pop 20000001 to 22000000.
type: Concept
notation: 33
definition: Min requirement O3 with sup. area 100001 to 150000 and Pop 20000001 to 22000000.
status: valid
status modified: 2024-04-17
accepted date: 2024-04-17
in scheme: Criteria for determining the minimum number of sampling points for fixed measurement for ozone when supplementary methods like modelling is used (according to Article 10)
related pollutant: Ozone (air)
minimum population: 20000001
maximum population: 22000000
minimum SPO: 11
minimum area: 100001
maximum area: 150000

Min requirement O3 with sup. area 150001 to 200000 and Pop 0 to 2000000.
type: Concept
notation: 34
definition: Min requirement O3 with sup. area 150001 to 200000 and Pop 0 to 2000000.
status: valid
status modified: 2024-04-17
accepted date: 2024-04-17
in scheme: Criteria for determining the minimum number of sampling points for fixed measurement for ozone when supplementary methods like modelling is used (according to Article 10)
related pollutant: Ozone (air)
minimum population: 0
maximum population: 2000000
minimum SPO: 4
minimum area: 150001
maximum area: 200000

Min requirement O3 with sup. area 150001 to 200000 and Pop 2000001 to 4000000.
type: Concept
notation: 35
definition: Min requirement O3 with sup. area 150001 to 200000 and Pop 2000001 to 4000000.
status: valid
status modified: 2024-04-17
accepted date: 2024-04-17
in scheme: Criteria for determining the minimum number of sampling points for fixed measurement for ozone when supplementary methods like modelling is used (according to Article 10)
related pollutant: Ozone (air)
minimum population: 2000001
maximum population: 4000000
minimum SPO: 4
minimum area: 150001
maximum area: 200000

Min requirement O3 with sup. area 150001 to 200000 and Pop 4000001 to 6000000.
type: Concept
notation: 36
definition: Min requirement O3 with sup. area 150001 to 200000 and Pop 4000001 to 6000000.
status: valid
status modified: 2024-04-17
accepted date: 2024-04-17
in scheme: Criteria for determining the minimum number of sampling points for fixed measurement for ozone when supplementary methods like modelling is used (according to Article 10)
related pollutant: Ozone (air)
minimum population: 4000001
maximum population: 6000000
minimum SPO: 4
minimum area: 150001
maximum area: 200000

Min requirement O3 with sup. area 150001 to 200000 and Pop 6000001 to 8000000.
type: Concept
notation: 37
definition: Min requirement O3 with sup. area 150001 to 200000 and Pop 6000001 to 8000000.
status: valid
status modified: 2024-04-17
accepted date: 2024-04-17
in scheme: Criteria for determining the minimum number of sampling points for fixed measurement for ozone when supplementary methods like modelling is used (according to Article 10)
related pollutant: Ozone (air)
minimum population: 6000001
maximum population: 8000000
minimum SPO: 4
minimum area: 150001
maximum area: 200000

Min requirement O3 with sup. area 150001 to 200000 and Pop 8000001 to 10000000.
type: Concept
notation: 38
definition: Min requirement O3 with sup. area 150001 to 200000 and Pop 8000001 to 10000000.
status: valid
status modified: 2024-04-17
accepted date: 2024-04-17
in scheme: Criteria for determining the minimum number of sampling points for fixed measurement for ozone when supplementary methods like modelling is used (according to Article 10)
related pollutant: Ozone (air)
minimum population: 8000001
maximum population: 10000000
minimum SPO: 5
minimum area: 150001
maximum area: 200000

Min requirement O3 with sup. area 150001 to 200000 and Pop 10000001 to 12000000.
type: Concept
notation: 39
definition: Min requirement O3 with sup. area 150001 to 200000 and Pop 10000001 to 12000000.
status: valid
status modified: 2024-04-17
accepted date: 2024-04-17
in scheme: Criteria for determining the minimum number of sampling points for fixed measurement for ozone when supplementary methods like modelling is used (according to Article 10)
related pollutant: Ozone (air)
minimum population: 10000001
maximum population: 12000000
minimum SPO: 6
minimum area: 150001
maximum area: 200000

Min requirement O3 with sup. area 0 to 50000 and Pop 6000001 to 8000000.
type: Concept
notation: 4
definition: Min requirement O3 with sup. area 0 to 50000 and Pop 6000001 to 8000000.
status: valid
status modified: 2024-04-17
accepted date: 2024-04-17
in scheme: Criteria for determining the minimum number of sampling points for fixed measurement for ozone when supplementary methods like modelling is used (according to Article 10)
related pollutant: Ozone (air)
minimum population: 6000001
maximum population: 8000000
minimum SPO: 4
minimum area: 0
maximum area: 50000

Min requirement O3 with sup. area 150001 to 200000 and Pop 12000001 to 14000000.
type: Concept
notation: 40
definition: Min requirement O3 with sup. area 150001 to 200000 and Pop 12000001 to 14000000.
status: valid
status modified: 2024-04-17
accepted date: 2024-04-17
in scheme: Criteria for determining the minimum number of sampling points for fixed measurement for ozone when supplementary methods like modelling is used (according to Article 10)
related pollutant: Ozone (air)
minimum population: 12000001
maximum population: 14000000
minimum SPO: 7
minimum area: 150001
maximum area: 200000

Min requirement O3 with sup. area 150001 to 200000 and Pop 14000001 to 16000000.
type: Concept
notation: 41
definition: Min requirement O3 with sup. area 150001 to 200000 and Pop 14000001 to 16000000.
status: valid
status modified: 2024-04-17
accepted date: 2024-04-17
in scheme: Criteria for determining the minimum number of sampling points for fixed measurement for ozone when supplementary methods like modelling is used (according to Article 10)
related pollutant: Ozone (air)
minimum population: 14000001
maximum population: 16000000
minimum SPO: 8
minimum area: 150001
maximum area: 200000

Min requirement O3 with sup. area 150001 to 200000 and Pop 16000001 to 18000000.
type: Concept
notation: 42
definition: Min requirement O3 with sup. area 150001 to 200000 and Pop 16000001 to 18000000.
status: valid
status modified: 2024-04-17
accepted date: 2024-04-17
in scheme: Criteria for determining the minimum number of sampling points for fixed measurement for ozone when supplementary methods like modelling is used (according to Article 10)
related pollutant: Ozone (air)
minimum population: 16000001
maximum population: 18000000
minimum SPO: 9
minimum area: 150001
maximum area: 200000

Min requirement O3 with sup. area 150001 to 200000 and Pop 18000001 to 20000000.
type: Concept
notation: 43
definition: Min requirement O3 with sup. area 150001 to 200000 and Pop 18000001 to 20000000.
status: valid
status modified: 2024-04-17
accepted date: 2024-04-17
in scheme: Criteria for determining the minimum number of sampling points for fixed measurement for ozone when supplementary methods like modelling is used (according to Article 10)
related pollutant: Ozone (air)
minimum population: 18000001
maximum population: 20000000
minimum SPO: 10
minimum area: 150001
maximum area: 200000

Min requirement O3 with sup. area 150001 to 200000 and Pop 20000001 to 22000000.
type: Concept
notation: 44
definition: Min requirement O3 with sup. area 150001 to 200000 and Pop 20000001 to 22000000.
status: valid
status modified: 2024-04-17
accepted date: 2024-04-17
in scheme: Criteria for determining the minimum number of sampling points for fixed measurement for ozone when supplementary methods like modelling is used (according to Article 10)
related pollutant: Ozone (air)
minimum population: 20000001
maximum population: 22000000
minimum SPO: 11
minimum area: 150001
maximum area: 200000

Min requirement O3 with sup. area 200001 to 250000 and Pop 0 to 2000000.
type: Concept
notation: 45
definition: Min requirement O3 with sup. area 200001 to 250000 and Pop 0 to 2000000.
status: valid
status modified: 2024-04-17
accepted date: 2024-04-17
in scheme: Criteria for determining the minimum number of sampling points for fixed measurement for ozone when supplementary methods like modelling is used (according to Article 10)
related pollutant: Ozone (air)
minimum population: 0
maximum population: 2000000
minimum SPO: 5
minimum area: 200001
maximum area: 250000

Min requirement O3 with sup. area 200001 to 250000 and Pop 2000001 to 4000000.
type: Concept
notation: 46
definition: Min requirement O3 with sup. area 200001 to 250000 and Pop 2000001 to 4000000.
status: valid
status modified: 2024-04-17
accepted date: 2024-04-17
in scheme: Criteria for determining the minimum number of sampling points for fixed measurement for ozone when supplementary methods like modelling is used (according to Article 10)
related pollutant: Ozone (air)
minimum population: 2000001
maximum population: 4000000
minimum SPO: 5
minimum area: 200001
maximum area: 250000

Min requirement O3 with sup. area 200001 to 250000 and Pop 4000001 to 6000000.
type: Concept
notation: 47
definition: Min requirement O3 with sup. area 200001 to 250000 and Pop 4000001 to 6000000.
status: valid
status modified: 2024-04-17
accepted date: 2024-04-17
in scheme: Criteria for determining the minimum number of sampling points for fixed measurement for ozone when supplementary methods like modelling is used (according to Article 10)
related pollutant: Ozone (air)
minimum population: 4000001
maximum population: 6000000
minimum SPO: 5
minimum area: 200001
maximum area: 250000

Min requirement O3 with sup. area 200001 to 250000 and Pop 6000001 to 8000000.
type: Concept
notation: 48
definition: Min requirement O3 with sup. area 200001 to 250000 and Pop 6000001 to 8000000.
status: valid
status modified: 2024-04-17
accepted date: 2024-04-17
in scheme: Criteria for determining the minimum number of sampling points for fixed measurement for ozone when supplementary methods like modelling is used (according to Article 10)
related pollutant: Ozone (air)
minimum population: 6000001
maximum population: 8000000
minimum SPO: 5
minimum area: 200001
maximum area: 250000

Min requirement O3 with sup. area 200001 to 250000 and Pop 8000001 to 10000000.
type: Concept
notation: 49
definition: Min requirement O3 with sup. area 200001 to 250000 and Pop 8000001 to 10000000.
status: valid
status modified: 2024-04-17
accepted date: 2024-04-17
in scheme: Criteria for determining the minimum number of sampling points for fixed measurement for ozone when supplementary methods like modelling is used (according to Article 10)
related pollutant: Ozone (air)
minimum population: 8000001
maximum population: 10000000
minimum SPO: 5
minimum area: 200001
maximum area: 250000

Min requirement O3 with sup. area 0 to 50000 and Pop 8000001 to 10000000.
type: Concept
notation: 5
definition: Min requirement O3 with sup. area 0 to 50000 and Pop 8000001 to 10000000.
status: valid
status modified: 2024-04-17
accepted date: 2024-04-17
in scheme: Criteria for determining the minimum number of sampling points for fixed measurement for ozone when supplementary methods like modelling is used (according to Article 10)
related pollutant: Ozone (air)
minimum population: 8000001
maximum population: 10000000
minimum SPO: 5
minimum area: 0
maximum area: 50000

Min requirement O3 with sup. area 200001 to 250000 and Pop 10000001 to 12000000.
type: Concept
notation: 50
definition: Min requirement O3 with sup. area 200001 to 250000 and Pop 10000001 to 12000000.
status: valid
status modified: 2024-04-17
accepted date: 2024-04-17
in scheme: Criteria for determining the minimum number of sampling points for fixed measurement for ozone when supplementary methods like modelling is used (according to Article 10)
related pollutant: Ozone (air)
minimum population: 10000001
maximum population: 12000000
minimum SPO: 6
minimum area: 200001
maximum area: 250000

Min requirement O3 with sup. area 200001 to 250000 and Pop 12000001 to 14000000.
type: Concept
notation: 51
definition: Min requirement O3 with sup. area 200001 to 250000 and Pop 12000001 to 14000000.
status: valid
status modified: 2024-04-17
accepted date: 2024-04-17
in scheme: Criteria for determining the minimum number of sampling points for fixed measurement for ozone when supplementary methods like modelling is used (according to Article 10)
related pollutant: Ozone (air)
minimum population: 12000001
maximum population: 14000000
minimum SPO: 7
minimum area: 200001
maximum area: 250000

Min requirement O3 with sup. area 200001 to 250000 and Pop 14000001 to 16000000.
type: Concept
notation: 52
definition: Min requirement O3 with sup. area 200001 to 250000 and Pop 14000001 to 16000000.
status: valid
status modified: 2024-04-17
accepted date: 2024-04-17
in scheme: Criteria for determining the minimum number of sampling points for fixed measurement for ozone when supplementary methods like modelling is used (according to Article 10)
related pollutant: Ozone (air)
minimum population: 14000001
maximum population: 16000000
minimum SPO: 8
minimum area: 200001
maximum area: 250000

Min requirement O3 with sup. area 200001 to 250000 and Pop 16000001 to 18000000.
type: Concept
notation: 53
definition: Min requirement O3 with sup. area 200001 to 250000 and Pop 16000001 to 18000000.
status: valid
status modified: 2024-04-17
accepted date: 2024-04-17
in scheme: Criteria for determining the minimum number of sampling points for fixed measurement for ozone when supplementary methods like modelling is used (according to Article 10)
related pollutant: Ozone (air)
minimum population: 16000001
maximum population: 18000000
minimum SPO: 9
minimum area: 200001
maximum area: 250000

Min requirement O3 with sup. area 200001 to 250000 and Pop 18000001 to 20000000.
type: Concept
notation: 54
definition: Min requirement O3 with sup. area 200001 to 250000 and Pop 18000001 to 20000000.
status: valid
status modified: 2024-04-17
accepted date: 2024-04-17
in scheme: Criteria for determining the minimum number of sampling points for fixed measurement for ozone when supplementary methods like modelling is used (according to Article 10)
related pollutant: Ozone (air)
minimum population: 18000001
maximum population: 20000000
minimum SPO: 10
minimum area: 200001
maximum area: 250000

Min requirement O3 with sup. area 200001 to 250000 and Pop 20000001 to 22000000.
type: Concept
notation: 55
definition: Min requirement O3 with sup. area 200001 to 250000 and Pop 20000001 to 22000000.
status: valid
status modified: 2024-04-17
accepted date: 2024-04-17
in scheme: Criteria for determining the minimum number of sampling points for fixed measurement for ozone when supplementary methods like modelling is used (according to Article 10)
related pollutant: Ozone (air)
minimum population: 20000001
maximum population: 22000000
minimum SPO: 11
minimum area: 200001
maximum area: 250000

Min requirement O3 with sup. area 250001 to 300000 and Pop 0 to 2000000.
type: Concept
notation: 56
definition: Min requirement O3 with sup. area 250001 to 300000 and Pop 0 to 2000000.
status: valid
status modified: 2024-04-17
accepted date: 2024-04-17
in scheme: Criteria for determining the minimum number of sampling points for fixed measurement for ozone when supplementary methods like modelling is used (according to Article 10)
related pollutant: Ozone (air)
minimum population: 0
maximum population: 2000000
minimum SPO: 6
minimum area: 250001
maximum area: 300000

Min requirement O3 with sup. area 250001 to 300000 and Pop 2000001 to 4000000.
type: Concept
notation: 57
definition: Min requirement O3 with sup. area 250001 to 300000 and Pop 2000001 to 4000000.
status: valid
status modified: 2024-04-17
accepted date: 2024-04-17
in scheme: Criteria for determining the minimum number of sampling points for fixed measurement for ozone when supplementary methods like modelling is used (according to Article 10)
related pollutant: Ozone (air)
minimum population: 2000001
maximum population: 4000000
minimum SPO: 6
minimum area: 250001
maximum area: 300000

Min requirement O3 with sup. area 250001 to 300000 and Pop 4000001 to 6000000.
type: Concept
notation: 58
definition: Min requirement O3 with sup. area 250001 to 300000 and Pop 4000001 to 6000000.
status: valid
status modified: 2024-04-17
accepted date: 2024-04-17
in scheme: Criteria for determining the minimum number of sampling points for fixed measurement for ozone when supplementary methods like modelling is used (according to Article 10)
related pollutant: Ozone (air)
minimum population: 4000001
maximum population: 6000000
minimum SPO: 6
minimum area: 250001
maximum area: 300000

Min requirement O3 with sup. area 250001 to 300000 and Pop 6000001 to 8000000.
type: Concept
notation: 59
definition: Min requirement O3 with sup. area 250001 to 300000 and Pop 6000001 to 8000000.
status: valid
status modified: 2024-04-17
accepted date: 2024-04-17
in scheme: Criteria for determining the minimum number of sampling points for fixed measurement for ozone when supplementary methods like modelling is used (according to Article 10)
related pollutant: Ozone (air)
minimum population: 6000001
maximum population: 8000000
minimum SPO: 6
minimum area: 250001
maximum area: 300000

Min requirement O3 with sup. area 0 to 50000 and Pop 10000001 to 12000000.
type: Concept
notation: 6
definition: Min requirement O3 with sup. area 0 to 50000 and Pop 10000001 to 12000000.
status: valid
status modified: 2024-04-17
accepted date: 2024-04-17
in scheme: Criteria for determining the minimum number of sampling points for fixed measurement for ozone when supplementary methods like modelling is used (according to Article 10)
related pollutant: Ozone (air)
minimum population: 10000001
maximum population: 12000000
minimum SPO: 6
minimum area: 0
maximum area: 50000

Min requirement O3 with sup. area 250001 to 300000 and Pop 8000001 to 10000000.
type: Concept
notation: 60
definition: Min requirement O3 with sup. area 250001 to 300000 and Pop 8000001 to 10000000.
status: valid
status modified: 2024-04-17
accepted date: 2024-04-17
in scheme: Criteria for determining the minimum number of sampling points for fixed measurement for ozone when supplementary methods like modelling is used (according to Article 10)
related pollutant: Ozone (air)
minimum population: 8000001
maximum population: 10000000
minimum SPO: 6
minimum area: 250001
maximum area: 300000

Min requirement O3 with sup. area 250001 to 300000 and Pop 10000001 to 12000000.
type: Concept
notation: 61
definition: Min requirement O3 with sup. area 250001 to 300000 and Pop 10000001 to 12000000.
status: valid
status modified: 2024-04-17
accepted date: 2024-04-17
in scheme: Criteria for determining the minimum number of sampling points for fixed measurement for ozone when supplementary methods like modelling is used (according to Article 10)
related pollutant: Ozone (air)
minimum population: 10000001
maximum population: 12000000
minimum SPO: 6
minimum area: 250001
maximum area: 300000

Min requirement O3 with sup. area 250001 to 300000 and Pop 12000001 to 14000000.
type: Concept
notation: 62
definition: Min requirement O3 with sup. area 250001 to 300000 and Pop 12000001 to 14000000.
status: valid
status modified: 2024-04-17
accepted date: 2024-04-17
in scheme: Criteria for determining the minimum number of sampling points for fixed measurement for ozone when supplementary methods like modelling is used (according to Article 10)
related pollutant: Ozone (air)
minimum population: 12000001
maximum population: 14000000
minimum SPO: 7
minimum area: 250001
maximum area: 300000

Min requirement O3 with sup. area 250001 to 300000 and Pop 14000001 to 16000000.
type: Concept
notation: 63
definition: Min requirement O3 with sup. area 250001 to 300000 and Pop 14000001 to 16000000.
status: valid
status modified: 2024-04-17
accepted date: 2024-04-17
in scheme: Criteria for determining the minimum number of sampling points for fixed measurement for ozone when supplementary methods like modelling is used (according to Article 10)
related pollutant: Ozone (air)
minimum population: 14000001
maximum population: 16000000
minimum SPO: 8
minimum area: 250001
maximum area: 300000

Min requirement O3 with sup. area 250001 to 300000 and Pop 16000001 to 18000000.
type: Concept
notation: 64
definition: Min requirement O3 with sup. area 250001 to 300000 and Pop 16000001 to 18000000.
status: valid
status modified: 2024-04-17
accepted date: 2024-04-17
in scheme: Criteria for determining the minimum number of sampling points for fixed measurement for ozone when supplementary methods like modelling is used (according to Article 10)
related pollutant: Ozone (air)
minimum population: 16000001
maximum population: 18000000
minimum SPO: 9
minimum area: 250001
maximum area: 300000

Min requirement O3 with sup. area 250001 to 300000 and Pop 18000001 to 20000000.
type: Concept
notation: 65
definition: Min requirement O3 with sup. area 250001 to 300000 and Pop 18000001 to 20000000.
status: valid
status modified: 2024-04-17
accepted date: 2024-04-17
in scheme: Criteria for determining the minimum number of sampling points for fixed measurement for ozone when supplementary methods like modelling is used (according to Article 10)
related pollutant: Ozone (air)
minimum population: 18000001
maximum population: 20000000
minimum SPO: 10
minimum area: 250001
maximum area: 300000

Min requirement O3 with sup. area 250001 to 300000 and Pop 20000001 to 22000000.
type: Concept
notation: 66
definition: Min requirement O3 with sup. area 250001 to 300000 and Pop 20000001 to 22000000.
status: valid
status modified: 2024-04-17
accepted date: 2024-04-17
in scheme: Criteria for determining the minimum number of sampling points for fixed measurement for ozone when supplementary methods like modelling is used (according to Article 10)
related pollutant: Ozone (air)
minimum population: 20000001
maximum population: 22000000
minimum SPO: 11
minimum area: 250001
maximum area: 300000

Min requirement O3 with sup. area 300001 to 350000 and Pop 0 to 2000000.
type: Concept
notation: 67
definition: Min requirement O3 with sup. area 300001 to 350000 and Pop 0 to 2000000.
status: valid
status modified: 2024-04-17
accepted date: 2024-04-17
in scheme: Criteria for determining the minimum number of sampling points for fixed measurement for ozone when supplementary methods like modelling is used (according to Article 10)
related pollutant: Ozone (air)
minimum population: 0
maximum population: 2000000
minimum SPO: 7
minimum area: 300001
maximum area: 350000

Min requirement O3 with sup. area 300001 to 350000 and Pop 2000001 to 4000000.
type: Concept
notation: 68
definition: Min requirement O3 with sup. area 300001 to 350000 and Pop 2000001 to 4000000.
status: valid
status modified: 2024-04-17
accepted date: 2024-04-17
in scheme: Criteria for determining the minimum number of sampling points for fixed measurement for ozone when supplementary methods like modelling is used (according to Article 10)
related pollutant: Ozone (air)
minimum population: 2000001
maximum population: 4000000
minimum SPO: 7
minimum area: 300001
maximum area: 350000

Min requirement O3 with sup. area 300001 to 350000 and Pop 4000001 to 6000000.
type: Concept
notation: 69
definition: Min requirement O3 with sup. area 300001 to 350000 and Pop 4000001 to 6000000.
status: valid
status modified: 2024-04-17
accepted date: 2024-04-17
in scheme: Criteria for determining the minimum number of sampling points for fixed measurement for ozone when supplementary methods like modelling is used (according to Article 10)
related pollutant: Ozone (air)
minimum population: 4000001
maximum population: 6000000
minimum SPO: 7
minimum area: 300001
maximum area: 350000

Min requirement O3 with sup. area 0 to 50000 and Pop 12000001 to 14000000.
type: Concept
notation: 7
definition: Min requirement O3 with sup. area 0 to 50000 and Pop 12000001 to 14000000.
status: valid
status modified: 2024-04-17
accepted date: 2024-04-17
in scheme: Criteria for determining the minimum number of sampling points for fixed measurement for ozone when supplementary methods like modelling is used (according to Article 10)
related pollutant: Ozone (air)
minimum population: 12000001
maximum population: 14000000
minimum SPO: 7
minimum area: 0
maximum area: 50000

Min requirement O3 with sup. area 300001 to 350000 and Pop 6000001 to 8000000.
type: Concept
notation: 70
definition: Min requirement O3 with sup. area 300001 to 350000 and Pop 6000001 to 8000000.
status: valid
status modified: 2024-04-17
accepted date: 2024-04-17
in scheme: Criteria for determining the minimum number of sampling points for fixed measurement for ozone when supplementary methods like modelling is used (according to Article 10)
related pollutant: Ozone (air)
minimum population: 6000001
maximum population: 8000000
minimum SPO: 7
minimum area: 300001
maximum area: 350000

Min requirement O3 with sup. area 300001 to 350000 and Pop 8000001 to 10000000.
type: Concept
notation: 71
definition: Min requirement O3 with sup. area 300001 to 350000 and Pop 8000001 to 10000000.
status: valid
status modified: 2024-04-17
accepted date: 2024-04-17
in scheme: Criteria for determining the minimum number of sampling points for fixed measurement for ozone when supplementary methods like modelling is used (according to Article 10)
related pollutant: Ozone (air)
minimum population: 8000001
maximum population: 10000000
minimum SPO: 7
minimum area: 300001
maximum area: 350000

Min requirement O3 with sup. area 300001 to 350000 and Pop 10000001 to 12000000.
type: Concept
notation: 72
definition: Min requirement O3 with sup. area 300001 to 350000 and Pop 10000001 to 12000000.
status: valid
status modified: 2024-04-17
accepted date: 2024-04-17
in scheme: Criteria for determining the minimum number of sampling points for fixed measurement for ozone when supplementary methods like modelling is used (according to Article 10)
related pollutant: Ozone (air)
minimum population: 10000001
maximum population: 12000000
minimum SPO: 7
minimum area: 300001
maximum area: 350000

Min requirement O3 with sup. area 300001 to 350000 and Pop 12000001 to 14000000.
type: Concept
notation: 73
definition: Min requirement O3 with sup. area 300001 to 350000 and Pop 12000001 to 14000000.
status: valid
status modified: 2024-04-17
accepted date: 2024-04-17
in scheme: Criteria for determining the minimum number of sampling points for fixed measurement for ozone when supplementary methods like modelling is used (according to Article 10)
related pollutant: Ozone (air)
minimum population: 12000001
maximum population: 14000000
minimum SPO: 7
minimum area: 300001
maximum area: 350000

Min requirement O3 with sup. area 300001 to 350000 and Pop 14000001 to 16000000.
type: Concept
notation: 74
definition: Min requirement O3 with sup. area 300001 to 350000 and Pop 14000001 to 16000000.
status: valid
status modified: 2024-04-17
accepted date: 2024-04-17
in scheme: Criteria for determining the minimum number of sampling points for fixed measurement for ozone when supplementary methods like modelling is used (according to Article 10)
related pollutant: Ozone (air)
minimum population: 14000001
maximum population: 16000000
minimum SPO: 8
minimum area: 300001
maximum area: 350000

Min requirement O3 with sup. area 300001 to 350000 and Pop 16000001 to 18000000.
type: Concept
notation: 75
definition: Min requirement O3 with sup. area 300001 to 350000 and Pop 16000001 to 18000000.
status: valid
status modified: 2024-04-17
accepted date: 2024-04-17
in scheme: Criteria for determining the minimum number of sampling points for fixed measurement for ozone when supplementary methods like modelling is used (according to Article 10)
related pollutant: Ozone (air)
minimum population: 16000001
maximum population: 18000000
minimum SPO: 9
minimum area: 300001
maximum area: 350000

Min requirement O3 with sup. area 300001 to 350000 and Pop 18000001 to 20000000.
type: Concept
notation: 76
definition: Min requirement O3 with sup. area 300001 to 350000 and Pop 18000001 to 20000000.
status: valid
status modified: 2024-04-17
accepted date: 2024-04-17
in scheme: Criteria for determining the minimum number of sampling points for fixed measurement for ozone when supplementary methods like modelling is used (according to Article 10)
related pollutant: Ozone (air)
minimum population: 18000001
maximum population: 20000000
minimum SPO: 10
minimum area: 300001
maximum area: 350000

Min requirement O3 with sup. area 300001 to 350000 and Pop 20000001 to 22000000.
type: Concept
notation: 77
definition: Min requirement O3 with sup. area 300001 to 350000 and Pop 20000001 to 22000000.
status: valid
status modified: 2024-04-17
accepted date: 2024-04-17
in scheme: Criteria for determining the minimum number of sampling points for fixed measurement for ozone when supplementary methods like modelling is used (according to Article 10)
related pollutant: Ozone (air)
minimum population: 20000001
maximum population: 22000000
minimum SPO: 11
minimum area: 300001
maximum area: 350000

Min requirement O3 with sup. area 350001 to 400000 and Pop 0 to 2000000.
type: Concept
notation: 78
definition: Min requirement O3 with sup. area 350001 to 400000 and Pop 0 to 2000000.
status: valid
status modified: 2024-04-17
accepted date: 2024-04-17
in scheme: Criteria for determining the minimum number of sampling points for fixed measurement for ozone when supplementary methods like modelling is used (according to Article 10)
related pollutant: Ozone (air)
minimum population: 0
maximum population: 2000000
minimum SPO: 8
minimum area: 350001
maximum area: 400000

Min requirement O3 with sup. area 350001 to 400000 and Pop 2000001 to 4000000.
type: Concept
notation: 79
definition: Min requirement O3 with sup. area 350001 to 400000 and Pop 2000001 to 4000000.
status: valid
status modified: 2024-04-17
accepted date: 2024-04-17
in scheme: Criteria for determining the minimum number of sampling points for fixed measurement for ozone when supplementary methods like modelling is used (according to Article 10)
related pollutant: Ozone (air)
minimum population: 2000001
maximum population: 4000000
minimum SPO: 8
minimum area: 350001
maximum area: 400000

Min requirement O3 with sup. area 0 to 50000 and Pop 14000001 to 16000000.
type: Concept
notation: 8
definition: Min requirement O3 with sup. area 0 to 50000 and Pop 14000001 to 16000000.
status: valid
status modified: 2024-04-17
accepted date: 2024-04-17
in scheme: Criteria for determining the minimum number of sampling points for fixed measurement for ozone when supplementary methods like modelling is used (according to Article 10)
related pollutant: Ozone (air)
minimum population: 14000001
maximum population: 16000000
minimum SPO: 8
minimum area: 0
maximum area: 50000

Min requirement O3 with sup. area 350001 to 400000 and Pop 4000001 to 6000000.
type: Concept
notation: 80
definition: Min requirement O3 with sup. area 350001 to 400000 and Pop 4000001 to 6000000.
status: valid
status modified: 2024-04-17
accepted date: 2024-04-17
in scheme: Criteria for determining the minimum number of sampling points for fixed measurement for ozone when supplementary methods like modelling is used (according to Article 10)
related pollutant: Ozone (air)
minimum population: 4000001
maximum population: 6000000
minimum SPO: 8
minimum area: 350001
maximum area: 400000

Min requirement O3 with sup. area 350001 to 400000 and Pop 6000001 to 8000000.
type: Concept
notation: 81
definition: Min requirement O3 with sup. area 350001 to 400000 and Pop 6000001 to 8000000.
status: valid
status modified: 2024-04-17
accepted date: 2024-04-17
in scheme: Criteria for determining the minimum number of sampling points for fixed measurement for ozone when supplementary methods like modelling is used (according to Article 10)
related pollutant: Ozone (air)
minimum population: 6000001
maximum population: 8000000
minimum SPO: 8
minimum area: 350001
maximum area: 400000

Min requirement O3 with sup. area 350001 to 400000 and Pop 8000001 to 10000000.
type: Concept
notation: 82
definition: Min requirement O3 with sup. area 350001 to 400000 and Pop 8000001 to 10000000.
status: valid
status modified: 2024-04-17
accepted date: 2024-04-17
in scheme: Criteria for determining the minimum number of sampling points for fixed measurement for ozone when supplementary methods like modelling is used (according to Article 10)
related pollutant: Ozone (air)
minimum population: 8000001
maximum population: 10000000
minimum SPO: 8
minimum area: 350001
maximum area: 400000

Min requirement O3 with sup. area 350001 to 400000 and Pop 10000001 to 12000000.
type: Concept
notation: 83
definition: Min requirement O3 with sup. area 350001 to 400000 and Pop 10000001 to 12000000.
status: valid
status modified: 2024-04-17
accepted date: 2024-04-17
in scheme: Criteria for determining the minimum number of sampling points for fixed measurement for ozone when supplementary methods like modelling is used (according to Article 10)
related pollutant: Ozone (air)
minimum population: 10000001
maximum population: 12000000
minimum SPO: 8
minimum area: 350001
maximum area: 400000

Min requirement O3 with sup. area 350001 to 400000 and Pop 12000001 to 14000000.
type: Concept
notation: 84
definition: Min requirement O3 with sup. area 350001 to 400000 and Pop 12000001 to 14000000.
status: valid
status modified: 2024-04-17
accepted date: 2024-04-17
in scheme: Criteria for determining the minimum number of sampling points for fixed measurement for ozone when supplementary methods like modelling is used (according to Article 10)
related pollutant: Ozone (air)
minimum population: 12000001
maximum population: 14000000
minimum SPO: 8
minimum area: 350001
maximum area: 400000

Min requirement O3 with sup. area 350001 to 400000 and Pop 14000001 to 16000000.
type: Concept
notation: 85
definition: Min requirement O3 with sup. area 350001 to 400000 and Pop 14000001 to 16000000.
status: valid
status modified: 2024-04-17
accepted date: 2024-04-17
in scheme: Criteria for determining the minimum number of sampling points for fixed measurement for ozone when supplementary methods like modelling is used (according to Article 10)
related pollutant: Ozone (air)
minimum population: 14000001
maximum population: 16000000
minimum SPO: 8
minimum area: 350001
maximum area: 400000

Min requirement O3 with sup. area 350001 to 400000 and Pop 16000001 to 18000000.
type: Concept
notation: 86
definition: Min requirement O3 with sup. area 350001 to 400000 and Pop 16000001 to 18000000.
status: valid
status modified: 2024-04-17
accepted date: 2024-04-17
in scheme: Criteria for determining the minimum number of sampling points for fixed measurement for ozone when supplementary methods like modelling is used (according to Article 10)
related pollutant: Ozone (air)
minimum population: 16000001
maximum population: 18000000
minimum SPO: 9
minimum area: 350001
maximum area: 400000

Min requirement O3 with sup. area 350001 to 400000 and Pop 18000001 to 20000000.
type: Concept
notation: 87
definition: Min requirement O3 with sup. area 350001 to 400000 and Pop 18000001 to 20000000.
status: valid
status modified: 2024-04-17
accepted date: 2024-04-17
in scheme: Criteria for determining the minimum number of sampling points for fixed measurement for ozone when supplementary methods like modelling is used (according to Article 10)
related pollutant: Ozone (air)
minimum population: 18000001
maximum population: 20000000
minimum SPO: 10
minimum area: 350001
maximum area: 400000

Min requirement O3 with sup. area 350001 to 400000 and Pop 20000001 to 22000000.
type: Concept
notation: 88
definition: Min requirement O3 with sup. area 350001 to 400000 and Pop 20000001 to 22000000.
status: valid
status modified: 2024-04-17
accepted date: 2024-04-17
in scheme: Criteria for determining the minimum number of sampling points for fixed measurement for ozone when supplementary methods like modelling is used (according to Article 10)
related pollutant: Ozone (air)
minimum population: 20000001
maximum population: 22000000
minimum SPO: 11
minimum area: 350001
maximum area: 400000

Min requirement O3 with sup. area 400001 to 450000 and Pop 0 to 2000000.
type: Concept
notation: 89
definition: Min requirement O3 with sup. area 400001 to 450000 and Pop 0 to 2000000.
status: valid
status modified: 2024-04-17
accepted date: 2024-04-17
in scheme: Criteria for determining the minimum number of sampling points for fixed measurement for ozone when supplementary methods like modelling is used (according to Article 10)
related pollutant: Ozone (air)
minimum population: 0
maximum population: 2000000
minimum SPO: 9
minimum area: 400001
maximum area: 450000

Min requirement O3 with sup. area 0 to 50000 and Pop 16000001 to 18000000.
type: Concept
notation: 9
definition: Min requirement O3 with sup. area 0 to 50000 and Pop 16000001 to 18000000.
status: valid
status modified: 2024-04-17
accepted date: 2024-04-17
in scheme: Criteria for determining the minimum number of sampling points for fixed measurement for ozone when supplementary methods like modelling is used (according to Article 10)
related pollutant: Ozone (air)
minimum population: 16000001
maximum population: 18000000
minimum SPO: 9
minimum area: 0
maximum area: 50000

Min requirement O3 with sup. area 400001 to 450000 and Pop 2000001 to 4000000.
type: Concept
notation: 90
definition: Min requirement O3 with sup. area 400001 to 450000 and Pop 2000001 to 4000000.
status: valid
status modified: 2024-04-17
accepted date: 2024-04-17
in scheme: Criteria for determining the minimum number of sampling points for fixed measurement for ozone when supplementary methods like modelling is used (according to Article 10)
related pollutant: Ozone (air)
minimum population: 2000001
maximum population: 4000000
minimum SPO: 9
minimum area: 400001
maximum area: 450000

Min requirement O3 with sup. area 400001 to 450000 and Pop 4000001 to 6000000.
type: Concept
notation: 91
definition: Min requirement O3 with sup. area 400001 to 450000 and Pop 4000001 to 6000000.
status: valid
status modified: 2024-04-17
accepted date: 2024-04-17
in scheme: Criteria for determining the minimum number of sampling points for fixed measurement for ozone when supplementary methods like modelling is used (according to Article 10)
related pollutant: Ozone (air)
minimum population: 4000001
maximum population: 6000000
minimum SPO: 9
minimum area: 400001
maximum area: 450000

Min requirement O3 with sup. area 400001 to 450000 and Pop 6000001 to 8000000.
type: Concept
notation: 92
definition: Min requirement O3 with sup. area 400001 to 450000 and Pop 6000001 to 8000000.
status: valid
status modified: 2024-04-17
accepted date: 2024-04-17
in scheme: Criteria for determining the minimum number of sampling points for fixed measurement for ozone when supplementary methods like modelling is used (according to Article 10)
related pollutant: Ozone (air)
minimum population: 6000001
maximum population: 8000000
minimum SPO: 9
minimum area: 400001
maximum area: 450000

Min requirement O3 with sup. area 400001 to 450000 and Pop 8000001 to 10000000.
type: Concept
notation: 93
definition: Min requirement O3 with sup. area 400001 to 450000 and Pop 8000001 to 10000000.
status: valid
status modified: 2024-04-17
accepted date: 2024-04-17
in scheme: Criteria for determining the minimum number of sampling points for fixed measurement for ozone when supplementary methods like modelling is used (according to Article 10)
related pollutant: Ozone (air)
minimum population: 8000001
maximum population: 10000000
minimum SPO: 9
minimum area: 400001
maximum area: 450000

Min requirement O3 with sup. area 400001 to 450000 and Pop 10000001 to 12000000.
type: Concept
notation: 94
definition: Min requirement O3 with sup. area 400001 to 450000 and Pop 10000001 to 12000000.
status: valid
status modified: 2024-04-17
accepted date: 2024-04-17
in scheme: Criteria for determining the minimum number of sampling points for fixed measurement for ozone when supplementary methods like modelling is used (according to Article 10)
related pollutant: Ozone (air)
minimum population: 10000001
maximum population: 12000000
minimum SPO: 9
minimum area: 400001
maximum area: 450000

Min requirement O3 with sup. area 400001 to 450000 and Pop 12000001 to 14000000.
type: Concept
notation: 95
definition: Min requirement O3 with sup. area 400001 to 450000 and Pop 12000001 to 14000000.
status: valid
status modified: 2024-04-17
accepted date: 2024-04-17
in scheme: Criteria for determining the minimum number of sampling points for fixed measurement for ozone when supplementary methods like modelling is used (according to Article 10)
related pollutant: Ozone (air)
minimum population: 12000001
maximum population: 14000000
minimum SPO: 9
minimum area: 400001
maximum area: 450000

Min requirement O3 with sup. area 400001 to 450000 and Pop 14000001 to 16000000.
type: Concept
notation: 96
definition: Min requirement O3 with sup. area 400001 to 450000 and Pop 14000001 to 16000000.
status: valid
status modified: 2024-04-17
accepted date: 2024-04-17
in scheme: Criteria for determining the minimum number of sampling points for fixed measurement for ozone when supplementary methods like modelling is used (according to Article 10)
related pollutant: Ozone (air)
minimum population: 14000001
maximum population: 16000000
minimum SPO: 9
minimum area: 400001
maximum area: 450000

Min requirement O3 with sup. area 400001 to 450000 and Pop 16000001 to 18000000.
type: Concept
notation: 97
definition: Min requirement O3 with sup. area 400001 to 450000 and Pop 16000001 to 18000000.
status: valid
status modified: 2024-04-17
accepted date: 2024-04-17
in scheme: Criteria for determining the minimum number of sampling points for fixed measurement for ozone when supplementary methods like modelling is used (according to Article 10)
related pollutant: Ozone (air)
minimum population: 16000001
maximum population: 18000000
minimum SPO: 9
minimum area: 400001
maximum area: 450000

Min requirement O3 with sup. area 400001 to 450000 and Pop 18000001 to 20000000.
type: Concept
notation: 98
definition: Min requirement O3 with sup. area 400001 to 450000 and Pop 18000001 to 20000000.
status: valid
status modified: 2024-04-17
accepted date: 2024-04-17
in scheme: Criteria for determining the minimum number of sampling points for fixed measurement for ozone when supplementary methods like modelling is used (according to Article 10)
related pollutant: Ozone (air)
minimum population: 18000001
maximum population: 20000000
minimum SPO: 10
minimum area: 400001
maximum area: 450000

Min requirement O3 with sup. area 400001 to 450000 and Pop 20000001 to 22000000.
type: Concept
notation: 99
definition: Min requirement O3 with sup. area 400001 to 450000 and Pop 20000001 to 22000000.
status: valid
status modified: 2024-04-17
accepted date: 2024-04-17
in scheme: Criteria for determining the minimum number of sampling points for fixed measurement for ozone when supplementary methods like modelling is used (according to Article 10)
related pollutant: Ozone (air)
minimum population: 20000001
maximum population: 22000000
minimum SPO: 11
minimum area: 400001
maximum area: 450000

AQD - Assessment Threshold Exceedance
type: ConceptScheme
notation: assessmentthresholdexceedance
is part of: Air Quality Directive e-Reporting
registration status: Released
user modified: roug
date modified: 2016-05-26 08:47:34.0
vocabulary type: Common
is numeric concept identifiers: false
is notations equal identifiers: false

Between Lower and Upper Assessment Threshold (LAT-UAT)
type: Concept
notation: LAT-UAT
definition: Between the upper and lower threshold (LAT-UAT), on 3 or more occasions during the 5 previous years.
status: valid
status modified: 2013-03-22
accepted date: 2013-03-22
in scheme: AQD - Assessment Threshold Exceedance

Not Applicable
type: Concept
notation: NA
status: valid
status modified: 2013-03-22
accepted date: 2013-03-22
in scheme: AQD - Assessment Threshold Exceedance

Above the long-term objective
type: Concept
notation: aboveLTO
definition: Above the long-term objective for ozone (>LTO) on 1 or more occasions during the 5 previous years.
status: valid
status modified: 2013-06-06
accepted date: 2013-06-06
in scheme: AQD - Assessment Threshold Exceedance

Above Upper Assessment Threshold (>UAT)
type: Concept
notation: aboveUAT
definition: Above the Upper Assessment Threshold (>UAT), on 3 or more occasions during the 5 previous years.
status: valid
status modified: 2013-03-22
accepted date: 2013-03-22
in scheme: AQD - Assessment Threshold Exceedance

Below Lower Assessment Threshold (<LAT)
type: Concept
notation: belowLAT
definition: Below the Lower Assessment Threshold (<LAT), on 3 or more occasions during the 5 previous years.
status: valid
status modified: 2013-03-22
accepted date: 2013-03-22
in scheme: AQD - Assessment Threshold Exceedance

Below the long-term objective
type: Concept
notation: belowLTO
definition: Below the long-term objective for ozone (<LTO) during any of the 5 previous years.
status: valid
status modified: 2013-06-06
accepted date: 2013-06-06
in scheme: AQD - Assessment Threshold Exceedance

AQD - Assessment Types
type: ConceptScheme
notation: assessmenttype
is part of: Air Quality Directive e-Reporting
registration status: Public draft
user modified: targajau
date modified: 2017-09-14 10:14:14.0
vocabulary type: Common
is numeric concept identifiers: false
is notations equal identifiers: false

Fixed measurement
type: Concept
notation: fixed
definition: ‘fixed measurements’ shall mean measurements taken at fixed sites, either continuously or by random sampling, to determine the levels in accordance with the relevant data quality objectives; Legal reference: Decision 2011/850/EU - ANNEX II - (D) Information on the assessment methods , (ii) "Fixed measurement Information" describes the information to be made available by the Member States (mandatory or voluntary).
status: valid
status modified: 2013-03-22
accepted date: 2013-03-22
in scheme: AQD - Assessment Types

Indicative measurement
type: Concept
notation: indicative
definition: ‘indicative measurements’ shall mean measurements which meet data quality objectives that are less strict than those required for fixed measurements; Legal reference: Decision 2011/850/EU, Article 9, paragraph 4 and Annex II D (iii)
status: valid
status modified: 2013-03-22
accepted date: 2013-03-22
in scheme: AQD - Assessment Types

Modelling
type: Concept
notation: model
definition: Legal reference : Decision 2011/850/EU, Article 9, paragraph 5 and Annex II D (iv)
status: valid
status modified: 2013-03-22
accepted date: 2013-03-22
in scheme: AQD - Assessment Types

Objective estimation
type: Concept
notation: objective
definition: Legal reference: Decision 2011/850/EU, Article 9, paragraph 6 and Annex II D (v) “Objective estimation techniques” will be interpreted as mathematical methods to calculate concentrations from values measured at other locations and/or times, based on scientific knowledge of the concentration distribution. One example is linear interpolation based on a justified assumption that the concentration pattern is sufficiently smooth. Another example is a dispersion model that has been adjusted to reproduce concentrations measured within its domain. More information is available at: http://ec.europa.eu/environment/air/pdf/guidanceunderairquality.pdf
status: valid
status modified: 2013-03-22
accepted date: 2013-03-22
in scheme: AQD - Assessment Types

Other measurement
type: Concept
notation: other
definition: “other measurement” shall mean measurements that do not meet the Air Quality Directives’ requirements for fixed or indicative measurements, but can be provided on the basis of exchange of information. For example, measurements from short measurement campaigns or measurements with lower quality.
status: valid
status modified: 2017-03-02
in scheme: AQD - Assessment Types

Fixed random measurements
type: Concept
notation: fixedrandom
definition: Member States may apply random measurements instead of continuous measurements for benzene, lead and particulate matter if they can demonstrate to the Commission that the uncertainty, including the uncertainty due to random sampling, meets the quality objective of 25 % and the time coverage is still larger than the minimum time coverage for indicative measurements. Random sampling must be evenly distributed over the year in order to avoid skewing of results. The uncertainty due to random sampling may be determined by the procedure laid down in ISO 11222 (2002) ‘Air Quality — Determination of the Uncertainty of the Time Average of Air Quality Measurements’. If random measurements are used to assess the requirements of the PM10 limit value, the 90,4 percentile (to be lower than or equal to 50 μg/m3) should be evaluated instead of the number of exceedances, which is highly influenced by data coverage.
status: valid
status modified: 2017-09-14
in scheme: AQD - Assessment Types

Authority instances
type: ConceptScheme
notation: authorityinstance
is part of: Air Quality Directive e-Reporting
registration status: Public draft
user modified: targajau
date modified: 2025-04-04 15:32:46.0
vocabulary type: Common
is numeric concept identifiers: false
is notations equal identifiers: false

Network
type: Concept
notation: network
definition: Network
status: valid
status modified: 2025-04-04
accepted date: 2025-04-04
in scheme: Authority instances

nuts0
type: Concept
notation: nuts0
definition: nuts0
status: valid
status modified: 2025-04-04
accepted date: 2025-04-04
in scheme: Authority instances

nuts1
type: Concept
notation: nuts1
definition: nuts1
status: valid
status modified: 2025-04-04
accepted date: 2025-04-04
in scheme: Authority instances

nuts2
type: Concept
notation: nuts2
definition: nuts2
status: valid
status modified: 2025-04-04
accepted date: 2025-04-04
in scheme: Authority instances

nuts3
type: Concept
notation: nuts3
definition: nuts3
status: valid
status modified: 2025-04-04
accepted date: 2025-04-04
in scheme: Authority instances

Zone
type: Concept
notation: zone
definition: Zone
status: valid
status modified: 2025-04-04
accepted date: 2025-04-04
in scheme: Authority instances

Code list that corresponds to the context of the authority’s role
type: ConceptScheme
notation: authorityobject
is part of: Air Quality Directive e-Reporting
registration status: Public draft
user modified: targajau
date modified: 2025-07-15 07:39:47.0
vocabulary type: Common
is numeric concept identifiers: false
is notations equal identifiers: true

Reporting AQ data and assessments to EEA
type: Concept
notation: 1
definition: AQ e-Reporting authority's role: reporting data and assessments to EEA
status: valid
status modified: 2025-07-07
accepted date: 2025-07-07
in scheme: Code list that corresponds to the context of the authority’s role

Establishment of air quality plans and air quality roadmaps
type: Concept
notation: h
definition: AQ e-Reporting authority's role: establishment of air quality plans. According to article 5, (h) establishment of air quality plans and air quality roadmaps;
status: valid
status modified: 2025-07-08
accepted date: 2025-07-07
in scheme: Code list that corresponds to the context of the authority’s role

Establishment of action plans
type: Concept
notation: i
definition: AQ e-Reporting authority's role: establishment of action plans. According to Article 5, (i) establishment of short-term action plans;
status: valid
status modified: 2025-07-08
accepted date: 2025-07-07
in scheme: Code list that corresponds to the context of the authority’s role

Air quality index and public information
type: Concept
notation: j
definition: AQ e-Reporting authority's role: air quality index and public information. According to Article 5, (j) provision and maintenance of an air quality index and other relevant public information as specified in Annex X.
status: valid
status modified: 2025-07-08
accepted date: 2025-07-07
in scheme: Code list that corresponds to the context of the authority’s role

Reporting AQ plans, roadmaps and short-term action plans to EEA
type: Concept
notation: 2
definition: AQ e-Reporting authority's role: reporting AQ plans, roadmaps and short-term action plans to EEA
status: valid
status modified: 2025-07-08
accepted date: 2025-07-07
in scheme: Code list that corresponds to the context of the authority’s role

Assessment of air quality
type: Concept
notation: a
definition: AQ e-Reporting authority's role: assessment of air quality. According to Article 5, (a) assessment of ambient air quality, including ensuring an adequate functioning and maintenance of the monitoring network;
status: valid
status modified: 2025-07-08
accepted date: 2025-07-07
in scheme: Code list that corresponds to the context of the authority’s role

Approval of measurement system
type: Concept
notation: b
definition: AQ e-Reporting authority's role: approval of measurement system. According to Article 5, (b) approval of measurement systems (methods, equipment, networks and laboratories);
status: valid
status modified: 2025-07-08
accepted date: 2025-07-07
in scheme: Code list that corresponds to the context of the authority’s role

Accuracy of measurements
type: Concept
notation: c
definition: AQ e-Reporting authority's role: accuracy of measurements. According to Article 5, (c) ensuring the accuracy of measurements and the transfer and sharing of measurement data;
status: valid
status modified: 2025-07-08
accepted date: 2025-07-07
in scheme: Code list that corresponds to the context of the authority’s role

Accuracy of modelling applications
type: Concept
notation: d
definition: AQ e-Reporting authority's role: accuracy of modelling applications. According to Article 5, (d) promoting the accuracy of modelling applications;
status: valid
status modified: 2025-07-08
accepted date: 2025-07-07
in scheme: Code list that corresponds to the context of the authority’s role

Analysis of assessment methods
type: Concept
notation: e
definition: AQ e-Reporting authority's role: analysis of assessment methods. According to Article 5, (e) analysis of assessment methods;
status: valid
status modified: 2025-07-08
accepted date: 2025-07-07
in scheme: Code list that corresponds to the context of the authority’s role

Coordinator for EU quality assurance programmes
type: Concept
notation: f
definition: AQ e-Reporting authority's role: coordinator for EU quality assurance programmes. According to article 5, (f) coordination on their territory if Union-wide quality assurance programmes are being organised by the Commission;
status: valid
status modified: 2025-07-08
accepted date: 2025-07-07
in scheme: Code list that corresponds to the context of the authority’s role

Cooperation with other MS/Commission (icl. transboundary)
type: Concept
notation: g
definition: AQ e-Reporting authority's role: cooperation with other MS/Commission (icl. transboundary). According to article 5, (g) cooperation with the other Member States and the Commission, including on transboundary air pollution;
status: valid
status modified: 2025-07-08
accepted date: 2025-07-07
in scheme: Code list that corresponds to the context of the authority’s role

Indication whether the authority is "active" or "inactive”
type: ConceptScheme
notation: authoritystatus
is part of: Air Quality Directive e-Reporting
registration status: Public draft
user modified: targajau
date modified: 2025-04-04 15:32:01.0
vocabulary type: Common
is numeric concept identifiers: false
is notations equal identifiers: false

Active authority
type: Concept
notation: active
definition: Active authority
status: valid
status modified: 2025-04-04
accepted date: 2025-04-04
in scheme: Indication whether the authority is "active" or "inactive”

Inactive authority
type: Concept
notation: inactive
definition: Inactive authority
status: valid
status modified: 2025-04-04
accepted date: 2025-04-04
in scheme: Indication whether the authority is "active" or "inactive”

AQD - Quality control and assurance on CDR
type: ConceptScheme
notation: cdrqaqc
is part of: Air Quality Directive e-Reporting
registration status: Public draft
user modified: targajau
date modified: 2025-09-26 15:22:51.0
vocabulary type: Common
working user: targajau
is numeric concept identifiers: false
is notations equal identifiers: true

XML must include Reporting Header
type: Concept
notation: 1
definition: aqd:AQD_ReportingHeader element must be present.
status: valid
status modified: 2023-05-04
accepted date: 2023-05-04
in scheme: AQD - Quality control and assurance on CDR
hidden label: XML must include Reporting Header
editorial note: [Crucial]: Yes - System requirement - Integrated into one qa check
error type: BLOCKER

Reporting period must be reported and the envelop starting year must match the specific year within Reporing Header in the XML
type: Concept
notation: 2
definition: aqd:AQD_ReportingHeader/aqd:reportingPeriod must be reported in all XMLs. The (start) year value must be equal to the year specified in (aqd:AQD_ReportingHeader) in the XML file and it must be between 2014 - 2015.
status: valid
status modified: 2023-05-04
accepted date: 2023-05-04
in scheme: AQD - Quality control and assurance on CDR
hidden label: Reporting period must be reported and the envelop starting year must match the specific year within Reporing Header in the XML
editorial note: Updated to check aqd:reportingPeriod
error type: BLOCKER

The following elements must be included within Reporting Header (inspire Id, reporting authority and change element)
type: Concept
notation: 3
definition: aqd:AQD_ReportingHeader must include aqd:inspireId, aqd:reportingAuthority, aqd:change elements
status: valid
status modified: 2023-05-04
accepted date: 2023-05-04
in scheme: AQD - Quality control and assurance on CDR
hidden label: The following elements must be included within Reporting Header (inspire Id, reporting authority and change element)
editorial note: [Crucial]: Yes - System requirement - Integrated into one qa check
error type: BLOCKER

For aqd:AQD_ReportingHeader, if aqd:change='true', the following information must also be provided: aqd:AQD_ReportingHeader/aqd:changeDescription and aqd:AQD_ReportingHeader/aqd:content
type: Concept
notation: 4
definition: For aqd:AQD_ReportingHeader, if aqd:change='true', the following information must also be provided: aqd:AQD_ReportingHeader/aqd:changeDescription and aqd:AQD_ReportingHeader/aqd:content
status: valid
status modified: 2023-05-04
accepted date: 2023-05-04
in scheme: AQD - Quality control and assurance on CDR
hidden label: For aqd:AQD_ReportingHeader, if aqd:change='true', the following information must also be provided: aqd:AQD_ReportingHeader/aqd:changeDescription and aqd:AQD_ReportingHeader/aqd:content
editorial note: [Crucial]: Yes - System requirement - Integrated into one qa check
error type: BLOCKER

For aqd:AQD_ReportingHeader, if aqd:change='false', element aqd:content IS NOT expected.
type: Concept
notation: 5
definition: For aqd:AQD_ReportingHeader, if aqd:change='false', element aqd:content IS NOT expected.
status: valid
status modified: 2023-05-04
accepted date: 2023-05-04
in scheme: AQD - Quality control and assurance on CDR
hidden label: For aqd:AQD_ReportingHeader, if aqd:change='false', element aqd:content IS NOT expected.
editorial note: [Crucial]: Yes - System requirement - Integrated into one qa check
error type: BLOCKER

At least one file in the folder must be an XML with correct extension (*.xml)
type: Concept
notation: 6
definition: At least one file in the folder must be an XML with correct extension (*.xml)
status: valid
status modified: 2023-05-04
accepted date: 2023-05-04
in scheme: AQD - Quality control and assurance on CDR
error type: BLOCKER

Checks if this delivery is new or an update (on same reporting year)
type: Concept
notation: B0
definition: Check if delivery if this is a new delivery or updated delivery (via reporting year)
status: valid
status modified: 2023-05-04
accepted date: 2023-05-04
in scheme: AQD - Quality control and assurance on CDR
hidden label: Checks if this delivery is new or an update (on same reporting year)
editorial note: [Crucial]: Yes - Information
error type: WARNING

Number of zones reported
type: Concept
notation: B01
definition: Compile & feedback upon the total number of AQ zone feature types included in the delivery
status: valid
status modified: 2023-05-04
accepted date: 2023-05-04
in scheme: AQD - Quality control and assurance on CDR
hidden label: Number of zones reported
editorial note: [Crucial]: Yes - Information
error type: INFO

Number of new zones compared to previous report. Blocker will be returned if XML is a new delivery and localId are all new compared to previous deliveries
type: Concept
notation: B02
definition: Compile & feedback upon the total number of new records for AQ zones included in the delivery against previous delivery
status: valid
status modified: 2023-05-04
accepted date: 2023-05-04
in scheme: AQD - Quality control and assurance on CDR
hidden label: Number of new zones compared to previous report. Blocker will be returned if XML is a new delivery and localId are all new compared to previous deliveries
editorial note: [Crucial]: Yes - Information - Update to check if all localId are new
error type: BLOCKER

Number of existing zones compared to previous report. Blocker will be returned if XML is an update delivery and localId are all new compared to previous deliveries
type: Concept
notation: B03
definition: Compile & feedback upon the total number of existing records for AQ zones included in the delivery against previous delivery
status: valid
status modified: 2023-05-04
accepted date: 2023-05-04
in scheme: AQD - Quality control and assurance on CDR
hidden label: Number of existing zones compared to previous report. Blocker will be returned if XML is an update delivery and localId are all new compared to previous deliveries
editorial note: [Crucial]: Yes - System requirement - Update to check if all localId are new
error type: BLOCKER

List reported zones
type: Concept
notation: B04
definition: Compile & feedback upon all reported zones. Feedback report shall include the gml:id attribute, am:inspireId, am:name/gn:GeographicalName/gn:spelling/gn:text & aqd:zoneCode elements as available.
status: valid
status modified: 2023-05-04
accepted date: 2023-05-04
in scheme: AQD - Quality control and assurance on CDR
hidden label: List reported zones
editorial note: [Crucial]: Yes - Information
error type: INFO

reserved
type: Concept
notation: B05
definition: Compile & feedback upon the total number of modification to existing for AQ zone feature types included in the delivery, including ./aqd:predecessor information Report if the object xlinked via aqd:predecessor is not found within the current or previous deliveries (aqd:AQD_Zone)
status: reserved
status modified: 2023-05-04
accepted date: 2023-05-04
in scheme: AQD - Quality control and assurance on CDR
hidden label: reserved
editorial note: Not implemented -IPR requirement (Annex II-B-8)

New zones/agglomerations for the protection of Health must link to predecessor.
type: Concept
notation: B05a
definition: New zones/agglomerations compared to previous deliveries for the protection of Health must link to predecessor (aqd:predecessor). .
status: valid
status modified: 2023-05-04
accepted date: 2023-05-04
in scheme: AQD - Quality control and assurance on CDR
error type: BLOCKER

New zones/agglomerations for the protection of vegetation should link to predecessor.
type: Concept
notation: B05b
definition: New zones/agglomerations compared to previous deliveries for the protection of Vegetation should link to predecessor (aqd:predecessor).
status: valid
status modified: 2023-05-04
accepted date: 2023-05-04
in scheme: AQD - Quality control and assurance on CDR
error type: ERROR

Number of zones that provides coordinates inside the xml via geometry element
type: Concept
notation: B06a
definition: The number of zones designated with coordinates via the ./am:geometry element
status: valid
status modified: 2023-05-04
accepted date: 2023-05-04
in scheme: AQD - Quality control and assurance on CDR
hidden label: Number of zones that provides coordinates inside the xml via geometry element
editorial note: [Crucial]: Yes - Information
error type: INFO

Number of zones that provides coordinates via Local Administrative Units (LAU) element and external shapefile link
type: Concept
notation: B06b
definition: The number of zones designated with coordinates via the ./aqd:LAU element and the ./aqd:shapefileLink element
status: valid
status modified: 2023-05-04
accepted date: 2023-05-04
in scheme: AQD - Quality control and assurance on CDR
hidden label: Number of zones that provides coordinates via Local Administrative Units (LAU) element and external shapefile link
editorial note: [Crucial]: Yes - Information
error type: INFO

Number of unique combinations of zone types, pollutants and protection target
type: Concept
notation: B07
definition: List of unique combinations of aqd:aqdZoneType, aqd:pollutantCode and aqd:protectionTarget
status: valid
status modified: 2023-05-04
accepted date: 2023-05-04
in scheme: AQD - Quality control and assurance on CDR
hidden label: Number of unique combinations of zone types, pollutants and protection target
editorial note: [Crucial]: - Information
error type: INFO

Check and count expected combinations of Pollutant and ProtectionTarget
type: Concept
notation: B08
definition: Check and count expected combinations of Pollutant and ProtectionTarget: Sulphur dioxide (1) + health - Sulphur dioxide (1) + vegetation - Ozone (7) + health - Ozone (7) + vegetation - Nitrogen dioxide (8) + health - Nitrogen oxides (9) + vegetation - Particulate matter < 10 µm (5) + health - Particulate matter < 2.5 µm (6001) + health - Carbon monoxide (10) + health - Benzene (20) + health - Lead in PM10 (5012) + health - Arsenic in PM10 (5018) + health - Cadmium in PM10 (5014) + health -Nickel in PM10 (5015) + health - Benzo(a)pyrene in PM10 (5029) + health
status: valid
status modified: 2023-05-04
accepted date: 2023-05-04
in scheme: AQD - Quality control and assurance on CDR
hidden label: Check and count expected combinations of Pollutant and ProtectionTarget
editorial note: [Crucial]: Yes - SYSTEM & INSPIRE requirement
error type: BLOCKER

Internal XML and INSPIRE identifiers must be unique (gml:id, base:localId)
type: Concept
notation: B09
definition: All gml:id attributes, am:inspireId and aqd:inspireId elements shall have unique content
status: valid
status modified: 2023-05-04
accepted date: 2023-05-04
in scheme: AQD - Quality control and assurance on CDR
hidden label: Internal XML and INSPIRE identifiers must be unique (gml:id, base:localId)
editorial note: [Crucial]: Yes - SYSTEM & INSPIRE requirement
error type: BLOCKER

List unique namespaces used and count number of elements
type: Concept
notation: B10
definition: ./am:inspireId/base:Identifier/base:namespace List base:namespace and count the number of base:localId assigned to each base:namespace.
status: valid
status modified: 2023-05-04
accepted date: 2023-05-04
in scheme: AQD - Quality control and assurance on CDR
hidden label: List unique namespaces used and count number of elements
editorial note: [Crucial]: Yes - INSPIRE requirement
error type: INFO

Check namespace is registered
type: Concept
notation: B10.1
definition: Check that namespace is registered in vocabulary (http://dd.eionet.europa.eu/vocabulary/aq/namespace/view)
status: valid
status modified: 2023-05-04
accepted date: 2023-05-04
in scheme: AQD - Quality control and assurance on CDR
hidden label: Unregistered country namespaace has been used
editorial note: [Crucial]: Yes - System requirement
error type: BLOCKER

The sum of the population of different zones for expected combinations of Pollutant and ProtectionTarget must be within +/-5%
type: Concept
notation: B11
definition: The sum of the population reported via aqd:residentPopulation of different zones for expected combinations of Pollutant and ProtectionTarget must be within +/-5% (according to http://dd.eionet.europa.eu/vocabulary/aq/namespace/view)
status: valid
status modified: 2023-05-04
accepted date: 2023-05-04
in scheme: AQD - Quality control and assurance on CDR
error type: BLOCKER

The sum of the population of different zones for expected combinations of Pollutant and ProtectionTarget must not differ substantially between themselves
type: Concept
notation: B11b
definition: The sum of the population reported via aqd:population of different zones for expected combinations of Pollutant and ProtectionTarget can not be greater than 1% of the total Population or 50,000 inhabitants (whichever is lower)
status: valid
status modified: 2023-05-04
accepted date: 2023-05-04
in scheme: AQD - Quality control and assurance on CDR
error type: ERROR

The sum of the area (km2) of different zones for expected combinations of Pollutant and ProtectionTarget must be within +/-0.5%
type: Concept
notation: B12
definition: The sum of the area (km2) reported via aqd:area of different zones for expected combinations of Pollutant and ProtectionTarget must be within +/-0.5% (according to http://dd.eionet.europa.eu/vocabulary/aq/namespace/view)
status: valid
status modified: 2023-05-04
accepted date: 2023-05-04
in scheme: AQD - Quality control and assurance on CDR
hidden label: reserved
editorial note: Not implemented
error type: BLOCKER

The sum of the areas of different zones for expected combinations of Pollutant and ProtectionTarget must not differ substantially between themselves
type: Concept
notation: B12b
definition: The sum of the area (km2) reported via aqd:area of different zones for expected combinations of Pollutant and ProtectionTarget can not be greater than must be within 1% of SurfaceArea or 50 km2 (whichever is lower)
status: valid
status modified: 2023-05-04
accepted date: 2023-05-04
in scheme: AQD - Quality control and assurance on CDR
error type: ERROR

Compare area declared for each zone compared to previous (based on localId)
type: Concept
notation: B12c
definition: Compare area declared for each zone compared to previous (based on localId)
status: valid
status modified: 2023-07-14
accepted date: 2023-07-14
in scheme: AQD - Quality control and assurance on CDR
error type: ERROR

The geographical language code must correspond to either the ISO 639-3 or ISO 639-5.
type: Concept
notation: B13
definition: /aqd:AQD_Zone/am:name/gn:GeographicalName/gn:language value shall be the language of the name, given as a three letters code, in accordance with either ISO 639-3 or ISO 639-5.
status: valid
status modified: 2023-05-04
accepted date: 2023-05-04
in scheme: AQD - Quality control and assurance on CDR
hidden label: The geographical language code must correspond to either the ISO 639-3 or ISO 639-5.
editorial note: [Crucial]: Yes - INSPIRE requirement
error type: SKIPPED

Check the sum of area and population for Health protection combinations against vocabulary.
type: Concept
notation: B14
definition: Check and make the sum of area (aqd:area) and population (aqd:residentPopulation) expected combinations of Pollutant and ProtectionTarget: Sulphur dioxide (1) + health - Ozone (7) + health - Nitrogen dioxide (8) + health - Particulate matter < 10 µm (5) + health - Particulate matter < 2.5 µm (6001) + health - Carbon monoxide (10) + health - Benzene (20) + health - Lead in PM10 (5012) + health - Arsenic in PM10 (5018) + health - Cadmium in PM10 (5014) + health -Nickel in PM10 (5015) + health - Benzo(a)pyrene in PM10 (5029) + health
status: valid
status modified: 2023-05-04
accepted date: 2023-05-04
in scheme: AQD - Quality control and assurance on CDR
error type: WARNING

Check the sum of area and population for all Health protection combinations are within 5% of the mode of the sums.
type: Concept
notation: B15
definition: The sum of area and population for all Health protection combinations should be within 5% of the mode of the sums for the same combination
status: valid
status modified: 2023-05-04
accepted date: 2023-05-04
in scheme: AQD - Quality control and assurance on CDR
error type: WARNING

Check results on B14 and B15. Any combination with a warning in both B14 and B15 will result in Error.
type: Concept
notation: B16
definition: Check results on B14 and B15. Any combination with a warning in both B14 and B15 will result in Error.
status: valid
status modified: 2023-05-04
accepted date: 2023-05-04
in scheme: AQD - Quality control and assurance on CDR
error type: ERROR

Compare the list of zone-pollutant-protectionTarget combination with previous delivery
type: Concept
notation: B17
definition: QC rule B17 checks if the combinations of aqd:AQD_Zone - aqd:pollutantCode - aqd:protectionTarget from the current XML are present in the latest delivery of the previous year; it lists all aqd:AQD_Zone - aqd:pollutantCode - aqd:protectionTarget combinations which are different from the previous year submission of data flow B.
status: experimental
status modified: 2023-07-14
accepted date: 2023-07-14
in scheme: AQD - Quality control and assurance on CDR
hidden label: reserved
editorial note: reserved
error type: WARNING

The geographical language text must be a string
type: Concept
notation: B18
definition: ./am:name/gn:GeographicalName/gn:spelling/gn:SpellingOfName/gn:text shall return a string
status: valid
status modified: 2023-05-04
accepted date: 2023-05-04
in scheme: AQD - Quality control and assurance on CDR
hidden label: The geographical language text must be a string
editorial note: [Crucial]: Yes - IPR requirement (Annex II-B-4)
error type: BLOCKER

reserved
type: Concept
notation: B19
definition: ./am:name/gn:GeographicalName/gn:spelling/gn:SpellingOfName/gn:script attribute xsi:nil="true" nilReason="unknown"
status: reserved
status modified: 2023-05-04
accepted date: 2023-05-04
in scheme: AQD - Quality control and assurance on CDR
hidden label: reserved
editorial note: Not implemented -INSPIRE requirement

The coordinate reference system for the zones must be defined with a correct uniform resource name
type: Concept
notation: B20
definition: /am:geometry/gml:Polygon, ./am:geometry/gml:Point, ./am:geometry/gml:MultiPoint, ./am:geometry/gml:MultiSurface, ./am:geometry/gml:Grid, ./am:geometry/gml:RectifiedGrid the srsName attribute shall be a recognisable URN. The following 3 srsNames are expected urn:ogc:def:crs:EPSG::3035 or urn:ogc:def:crs:EPSG::4258 or urn:ogc:def:crs:EPSG::4326
status: valid
status modified: 2023-05-04
accepted date: 2023-05-04
in scheme: AQD - Quality control and assurance on CDR
hidden label: Coordinate system for Zones needs revision
editorial note: [Crucial]: Yes - IPR requimrent (Annex II-B-6)
error type: BLOCKER

The dimension attribute must be given the value "2"
type: Concept
notation: B21
definition: /am:geometry/gml:Polygon, ./am:geometry/gml:Point, ./am:geometry/gml:MultiPoint, ./am:geometry/gml:MultiSurface, ./am:geometry/gml:Grid, ./am:geometry/gml:RectifiedGrid, ./am:geometry/gml:Polygon/gml:exterior/gml:LinearRing/gml:posList the srsDimension attribute shall resolve to "2" to allow the x & y-coordinate of the feature of interest
status: valid
status modified: 2023-05-04
accepted date: 2023-05-04
in scheme: AQD - Quality control and assurance on CDR
hidden label: Geometry information needs revising as errors were detected which will prevent processing it.
editorial note: [Crucial]: Yes - IPR requimrent (Annex II-B-6)
error type: ERROR

The count attribute must be equal to the Y and X coordinate doublets
type: Concept
notation: B22
definition: ./am:geometry /gml:Polygon/gml:exterior/gml:LinearRing/gml:posList the count attribute shall resolve to the sum of y & x-coordinate doublets.
status: valid
status modified: 2023-05-04
accepted date: 2023-05-04
in scheme: AQD - Quality control and assurance on CDR
hidden label: Coordinate provided for Zones needs revision as not provided a Y and X coordinate doublets
editorial note: [Crucial]: Yes - IPR requirement (Annex II-B-6) & system requirement (can not process if not correct)
error type: BLOCKER

The coordinates must be ordered as latitude (y-axis), longtitude (x-axis). Please note that if warning, GEOMETRY checks might fail.
type: Concept
notation: B23
definition: Check that the coordinates lists in ./am:geometry /gml:Polygon/gml:exterior/gml:LinearRing/gml:posList ar presented in lat / long (y-axis / x-axis) notation.
status: valid
status modified: 2023-05-04
accepted date: 2023-05-04
in scheme: AQD - Quality control and assurance on CDR
hidden label: The coordinates must be ordered as latitude (y-axis), longtitude (x-axis)
editorial note: [Crucial]: Yes - IPR requimrent (Annex II-B-6) - Exception with France
error type: WARNING

Zone type must conform to http://inspire.ec.europa.eu/codelist/ZoneTypeCode/airQualityManagementZone
type: Concept
notation: B24
definition: ./am:zoneType value shall resolve to http://inspire.ec.europa.eu/codelist/ZoneTypeCode/airQualityManagementZone (working URL)
status: valid
status modified: 2023-05-04
accepted date: 2023-05-04
in scheme: AQD - Quality control and assurance on CDR
hidden label: Codelist for am:zoneType requires revision: INSPIRE codelist is required
editorial note: [Crucial]: - INSPIRE requirement
error type: ERROR

Start time must be less than end time and must be provided
type: Concept
notation: B25
definition: ./am:designationPeriod/gml:TimePeriod/gml:beginPosition shall be less than ./am:designationPeri/gml:TimePeriod/gml:endPosition. (start time must be provided)
status: valid
status modified: 2023-05-04
accepted date: 2023-05-04
in scheme: AQD - Quality control and assurance on CDR
hidden label: Zone's Start time must be less than end time
editorial note: [Crucial]: Yes - IPR requimrent (Annex II-B-7)
error type: BLOCKER

The begin date of a zone should be the same as previous delivery (inc. updates for the same year)
type: Concept
notation: B26
definition: ./am:designationPeriod/gml:TimePeriod/gml:beginPosition shall NOT be different from previous delivery
status: experimental
status modified: 2023-07-14
accepted date: 2023-07-14
in scheme: AQD - Quality control and assurance on CDR
hidden label: The begin date of a zone should be the same as previous delivery (inc. updates for the same year)
error type: ERROR

The zone's end date should not differ from previous delivery (if already closed)
type: Concept
notation: B27
definition: ./am:designationPeri/gml:TimePeriod/gml:endPosition shall not be different from previous delivery (exception from NULL to a value) - If in previous delivery the zone was already closed, it can not be re-opened - If previous delivery has an end date, in new delivery, it can not change
status: experimental
status modified: 2023-07-14
accepted date: 2023-07-14
in scheme: AQD - Quality control and assurance on CDR
hidden label: The zone's end date should not differ from previous delivery (if already closed)

End date must be greater than start date, if end date exists
type: Concept
notation: B28
definition: ./am:beginLifespanVersion shall be a valid historical date for the start of the version of the zone in extended ISO format. If an am:endLifespanVersion exists its value shall be greater than the am:beginLifespanVersion
status: valid
status modified: 2023-05-04
accepted date: 2023-05-04
in scheme: AQD - Quality control and assurance on CDR
hidden label: Zone's End date must be greater than start date, if end date exists
editorial note: [Crucial]: Yes - INSPIRE requirement
error type: BLOCKER

Start date shall be less, or equal to
type: Concept
notation: B29
definition: ./am:beginLifespanVersion shall be LESS THAN OR EQUAL TO ./am:designationPeriod/gml:TimePeriod/gml:endPosition ./am:beginLifespanVersion shall be GREATER THAN OR EQUAL TO ./am:designationPeriod/gml:TimePeriod/gml:beginPosition
status: reserved
status modified: 2023-05-04
accepted date: 2023-05-04
in scheme: AQD - Quality control and assurance on CDR
hidden label: Start date shall be less, or equal to
editorial note: Not implemented -

Enviromental Domain must conform to http://inspire.ec.europa.eu/codelist/MediaValue/[code]
type: Concept
notation: B30
definition: ./am:environmentalDomain shall be a citation via href xlink attribute of http://inspire.ec.europa.eu/codelist/MediaValue/[code] (currently resolves to 404 error)
status: valid
status modified: 2023-05-04
accepted date: 2023-05-04
in scheme: AQD - Quality control and assurance on CDR
hidden label: Codelist for am:environmentalDomain requires revision: INSPIRE codelist is required
editorial note: [Crucial]: N/A - INSPIRE requirement
error type: ERROR

Legislation citation name must be “2011/850/EC”
type: Concept
notation: B31
definition: ./am:legalBasis/base2:LegislationCitation/base2:name value shall be “2011/850/EC”
status: valid
status modified: 2023-05-04
accepted date: 2023-05-04
in scheme: AQD - Quality control and assurance on CDR
hidden label: Legislation citation name must be “2011/850/EC”
editorial note: [Crucial]: N/A - INSPIRE requirement
error type: WARNING

Legislation citation date must be “2011-12-12”
type: Concept
notation: B32
definition: ./am:legalBasis/base2:LegislationCitation/base2:date value shall be “2011/12/12”
status: valid
status modified: 2023-05-04
accepted date: 2023-05-04
in scheme: AQD - Quality control and assurance on CDR
hidden label: Legislation citation date must be “2011-12-12”
editorial note: [Crucial]: N/A - INSPIRE requirement
error type: WARNING

Legislation citation line must be “http://rod.eionet.europa.eu/instruments/650”
type: Concept
notation: B33
definition: ./am:legalBasis/base2:LegislationCitation/base2:link value shall be “http://rod.eionet.europa.eu/instruments/650”
status: valid
status modified: 2023-05-04
accepted date: 2023-05-04
in scheme: AQD - Quality control and assurance on CDR
hidden label: Legislation citation line must be “http://rod.eionet.europa.eu/instruments/650”
editorial note: [Crucial]: N/A - INSPIRE requirement
error type: WARNING

Base level must conform to http://inspire.ec.europa.eu/codelist/LegislationLevelValue/[code]
type: Concept
notation: B34
definition: ./am:legalBasis/base2:LegislationCitation/base2:level shall be a citation via href xlink attribute of http://inspire.ec.europa.eu/codelist/LegislationLevelValue/[code]
status: valid
status modified: 2023-05-04
accepted date: 2023-05-04
in scheme: AQD - Quality control and assurance on CDR
hidden label: Codelist for …base2:level requires revision: INSPIRE codelist is required
editorial note: [Crucial]: Yes - INSPIRE requirement
error type: ERROR

Zone code must be unique. The value may e equal the LocalId
type: Concept
notation: B35
definition: ./aqd:zoneCode shall be a unique code for the zone within the ./am:inspireId/base:Identifier/base:namespace. ./aqd:zoneCode . The value may equal the value at ./am:inspireId/base:Identifier/base:localId
status: valid
status modified: 2023-05-04
accepted date: 2023-05-04
in scheme: AQD - Quality control and assurance on CDR
hidden label: Zone code must be unique. The value may e equal the LocalId
editorial note: [Crucial]: Yes - IPR requimrent (Annex II-B-3)
error type: BLOCKER

Population must be a value higher than zero
type: Concept
notation: B36
definition: ./aqd:residentPopulation shall be an integer value GREATER THAN 0 (zero)
status: valid
status modified: 2023-05-04
accepted date: 2023-05-04
in scheme: AQD - Quality control and assurance on CDR
hidden label: Population must be a value higher than zero
editorial note: [Crucial]: Yes - IPR requimrent (Annex II-B-9)
error type: BLOCKER

Year in which the resident population was estimated must have the format yyyy
type: Concept
notation: B37
definition: ./aqd:residentPopulationYear/gml:TimeInstant/gml:timePosition shall cite the year in which the resident population was estimated in yyyy format
status: valid
status modified: 2023-05-04
accepted date: 2023-05-04
in scheme: AQD - Quality control and assurance on CDR
hidden label: The year in which resident population was provided is in the wrong format
editorial note: [Crucial]: Yes - IPR requimrent (Annex II-B-10)
error type: ERROR

The Area value must be a decimal number, greater than zero.
type: Concept
notation: B38
definition: ./aqd:area the value will be a decimal number GREATER THAN 0 (zero)
status: valid
status modified: 2023-05-04
accepted date: 2023-05-04
in scheme: AQD - Quality control and assurance on CDR
hidden label: The Area value must be a decimal number, greater than zero.
editorial note: [Crucial]: Yes - NOT required
error type: BLOCKER

Check for correct Pollutant/ProtectionTarget combination
type: Concept
notation: B39a
definition: The allowed content combination within ./aqd:pollutants/aqd:Pollutant/aqd:pollutantCode AND ./aqd:pollutants/aqd:Pollutant/aqd:protectionTarget shall be constrained to Sulphur dioxide (air) + health (http://dd.eionet.europa.eu/vocabulary/aq/pollutant/1 + http://dd.eionet.europa.eu/vocabulary/aq/protectiontarget/H) - Sulphur dioxide (air) + vegetation (http://dd.eionet.europa.eu/vocabulary/aq/pollutant/1 + http://dd.eionet.europa.eu/vocabulary/aq/protectiontarget/V) - Ozone (air) + health (http://dd.eionet.europa.eu/vocabulary/aq/pollutant/7 + http://dd.eionet.europa.eu/vocabulary/aq/protectiontarget/H) - Ozone (air) + vegetation (http://dd.eionet.europa.eu/vocabulary/aq/pollutant/7 + http://dd.eionet.europa.eu/vocabulary/aq/protectiontarget/V) - Nitrogen dioxide (air) + health (http://dd.eionet.europa.eu/vocabulary/aq/pollutant/8 + http://dd.eionet.europa.eu/vocabulary/aq/protectiontarget/H) - Nitrogen oxides (air) + eco (http://dd.eionet.europa.eu/vocabulary/aq/pollutant/9 + http://dd.eionet.europa.eu/vocabulary/aq/protectiontarget/V) - Particulate matter < 10 µm (aerosol) + health (http://dd.eionet.europa.eu/vocabulary/aq/pollutant/5 + http://dd.eionet.europa.eu/vocabulary/aq/protectiontarget/H) - Particulate matter < 2.5 µm (aerosol) + health (http://dd.eionet.europa.eu/vocabulary/aq/pollutant/6001 + http://dd.eionet.europa.eu/vocabulary/aq/protectiontarget/H) - Carbon monoxide (air) + health (http://dd.eionet.europa.eu/vocabulary/aq/pollutant/10 + http://dd.eionet.europa.eu/vocabulary/aq/protectiontarget/H) - Benzene (air) + health (http://dd.eionet.europa.eu/vocabulary/aq/pollutant/20 + http://dd.eionet.europa.eu/vocabulary/aq/protectiontarget/H) - Lead in PM10 (aerosol) + health (http://dd.eionet.europa.eu/vocabulary/aq/pollutant/5012 + http://dd.eionet.europa.eu/vocabulary/aq/protectiontarget/H) - Arsenic in PM10 (aerosol) + health (http://dd.eionet.europa.eu/vocabulary/aq/pollutant/5018 + http://dd.eionet.europa.eu/vocabulary/aq/protectiontarget/H) - Cadmium…
status: valid
status modified: 2023-05-04
accepted date: 2023-05-04
in scheme: AQD - Quality control and assurance on CDR
hidden label: Check for correct Pollutant/ProtectionTarget combination
editorial note: [Crucial]: Yes - Air quality requirement
error type: ERROR

Check if at least one of the expected Pollutant/ProtectionTarget combination(s) is provided in the delivery
type: Concept
notation: B39b
definition: Count number of occurrences across XML and list it as below (it can not be 0): Sulphur dioxide (1) + health & Sulphur dioxide (1) + vegetation & Ozone (7) + health & Ozone (7) + vegetation & Nitrogen dioxide (8) + health & Nitrogen oxides (9) + vegetation & Particulate matter < 10 µm (5) + health & Particulate matter < 2.5 µm (6001) + health & Carbon monoxide (10) + health & Benzene (20) + health Lead in PM10 (5012) + health & Arsenic in PM10 (5018) + health & Cadmium in PM10 (5014) + health & Nickel in PM10 (5015) + health & Benzo(a)pyrene in PM10 (5029) + health & One exception: Nitrogen oxides (9) + vegetation can be 0 for Gibraltar
status: valid
status modified: 2023-05-04
accepted date: 2023-05-04
in scheme: AQD - Quality control and assurance on CDR
hidden label: Missing expected combinations of Pollutant and ProtectionTarget
editorial note: [Crucial]: Yes -
error type: BLOCKER

Check and list if any individual zone with any duplicated Pollutant/ProtectionTarget combination
type: Concept
notation: B39c
definition: Check if any combination in B39a is repeated within individual AQD:Zone . An error is returned if repeated.
status: valid
status modified: 2023-05-04
accepted date: 2023-05-04
in scheme: AQD - Quality control and assurance on CDR
hidden label: Pollutant/ProtectionTarget combination is repeated withing same zone. Please amend
editorial note: [Crucial]: Yes - System requirement
error type: BLOCKER

ExtensionExemption accepted prior to 2015 deliveries
type: Concept
notation: B40
definition: IF aqd:reportingPeriod included in the ReportingHeader is equal or greater than year 2015, ./aqd:timeExtensionExemption must resolve to http://dd.eionet.europa.eu/vocabulary/aq/timeextensiontypes/none Only 1 entry is allowed. Else ./aqd:timeExtensionExemption attribute must resolve to one of concept within http://dd.eionet.europa.eu/vocabulary/aq/timeextensiontypes/… Multiple entries are allowed.
status: valid
status modified: 2023-05-04
accepted date: 2023-05-04
in scheme: AQD - Quality control and assurance on CDR
hidden label: Time extensions are NOT expected in zones after 2015.
editorial note: [Crucial]: Yes - IPR requimrent (Annex II-B-13)
error type: ERROR

Where AQTimeExemption is either NO2-1h, or NO2-annual, then NO2 and Protection Target Health must be present
type: Concept
notation: B41
definition: Where ./aqd:timeExtensionExemption resolves to http://dd.eionet.europa.eu/vocabulary/aq/timeextensiontypes/NO2 1h OR http://dd.eionet.europa.eu/vocabulary/aq/timeextensiontypes/NO2 annual at least one combination within ./aqd:pollutants which includes ./aqd:pollutants/aqd:Pollutant/aqd:pollutantCode AND ./aqd:pollutants/aqd:Pollutant/aqd:protectionTarget shall be constrained to Nitro gen dioxide Nitrogen dioxide (air) + health http://dd.eionet.europa.eu/vocabulary/aq/pollutant/8 http://dd.eionet.europa.eu/vocabulary/aq/protectiontarget/H
status: valid
status modified: 2023-05-04
accepted date: 2023-05-04
in scheme: AQD - Quality control and assurance on CDR
hidden label: Where AQTimeExemption is either NO2-1h, or NO2-annual, then NO2 and Protection Target Health must be present
editorial note: [Crucial]: Yes - Content check according to Article 22 of Directive 2008/50/EC
error type: BLOCKER

Where AQTimeExemption is either PM10-24h, or PM10-annual, then PM10 and Protection Target Health must be present.
type: Concept
notation: B42
definition: Where ./aqd:timeExtensionExemption resolves to http://dd.eionet.europa.eu/vocabulary/aq/timeextensiontypes/PM10-24h OR http://dd.eionet.europa.eu/vocabulary/aq/timeextensiontypes/PM10-annual at least one combination within ./aqd:pollutants which includes ./aqd:pollutants/aqd:Pollutant/aqd:pollutantCode AND ./aqd:pollutants/aqd:Pollutant/aqd:protectionTarget shall be constrained to Particulate matter < 10 μm (aerosol) + health http://dd.eionet.europa.eu/vocabulary/aq/pollutant/5 http://dd.eionet.europa.eu/vocabulary/aq/protectiontarget/H
status: valid
status modified: 2023-05-04
accepted date: 2023-05-04
in scheme: AQD - Quality control and assurance on CDR
hidden label: Where AQTimeExemption is either PM10-24h, or PM10-annual, then PM10 and Protection Target Health must be present.
editorial note: [Crucial]: Yes - Content check according to Article 22 of Directive 2008/50/EC
error type: BLOCKER

Where AQTimeExemption is C6H6-annual, then C6H6 and Protection Target Health must be present.
type: Concept
notation: B43
definition: Where ./aqd:timeExtensionExemption resolves to http://dd.eionet.europa.eu/vocabulary/aq/timeextensiontypes/C6H6-annual at least one combination within ./aqd:pollutants which includes ./aqd:pollutants/aqd:Pollutant/aqd:pollutantCode AND ./aqd:pollutants/aqd:Pollutant/aqd:protectionTarget shall be constrained to Benzene (air) + healt http://dd.eionet.europa.eu/vocabulary/aq/pollutant/20 http://dd.eionet.europa.eu/vocabulary/aq/protectiontarget/H
status: valid
status modified: 2023-05-04
accepted date: 2023-05-04
in scheme: AQD - Quality control and assurance on CDR
hidden label: Where AQTimeExemption is C6H6-annual, then C6H6 and Protection Target Health must be present.
editorial note: [Crucial]: Yes - Content check according to Article 22 of Directive 2008/50/EC
error type: BLOCKER

Geometry should not be a hyperlink. If provided via shapefile, element aqd:shapefileLink need to be used
type: Concept
notation: B45
definition: ./am:geometry shall not be a href xlink. If geometry is provided via shapefile, please use element aqd:shapefileLink
status: valid
status modified: 2023-05-04
accepted date: 2023-05-04
in scheme: AQD - Quality control and assurance on CDR
hidden label: Link to shapefiles use incorrect element. Please use aqd:shapefileLink
editorial note: [Crucial]: - SYSTEM & INSPIRE requirement
error type: ERROR

Where a link is provided, it should refer to an existing and valid shape file in the same folder in the CDR as the XML is uploaded
type: Concept
notation: B46
definition: Where ./aqd:shapefileLink has been used this should return a link to a valid and existing link in cdr (e.g. http://cdr.eionet.europa.eu/es/eu/aqd/b/envurng9g/ES_Zones_2014.shp)
status: valid
status modified: 2023-05-04
accepted date: 2023-05-04
in scheme: AQD - Quality control and assurance on CDR
hidden label: Shapefile have not been reported correctly in the expected CDR envelope. Please revise
editorial note: [Crucial]: Skipped - Not implemented - This is required for correctly processing geometries
error type: BLOCKER

Zone type must be either Agglomeration or Non-agglomeration
type: Concept
notation: B47
definition: ./aqd:aqdZoneType attribute must resolve to one of concept within http://dd.eionet.europa.eu/vocabulary/aq/zonetype/[concept] Currently, these are: http://dd.eionet.europa.eu/vocabulary/aq/zonetype/noagg or http://dd.eionet.europa.eu/vocabulary/aq/zonetype/agg
status: valid
status modified: 2023-05-04
accepted date: 2023-05-04
in scheme: AQD - Quality control and assurance on CDR
hidden label: Zone type must be either Agglomeration or Non-agglomeration
editorial note: [Crucial]: Yes - AQ requirement
error type: BLOCKER

Designation Period DATE must be provided in extended ISO format
type: Concept
notation: B48
definition: When am:designationPeriod/am:designationPeriod/gml:beginPosition & am:designationPeriod/am:designationPeriod/gml:endPosition ARE populated, the DATE must be in extended ISO format
status: valid
status modified: 2023-05-04
accepted date: 2023-05-04
in scheme: AQD - Quality control and assurance on CDR
error type: BLOCKER

reserved
type: Concept
notation: B44
definition: Where ./aqd:LAU has been used the list of the administrative these shall be checked to ensure they relate to the MS. This must be provided if /aqd:shapefileLink is not provided or am:geometry does not contain geometry. The value shall be a valid code from the following codelist: http://dd.eionet.europa.eu/vocabulary/common/nuts/ http://dd.eionet.europa.eu/vocabulary/lau1/ http://dd.eionet.europa.eu/vocabulary/lau2/ NUTS, LAU1 or LAU2 codes must belong to the country reporting data. Country ISO code at cdr.eionet.europa.eu/ZZ/eu/aqd/b/…. shall be the same as the codelist: http://dd.eionet.europa.eu/vocabulary/common/nuts/ZZ[concept] http://dd.eionet.europa.eu/vocabulary/lau1/zz/[concept] http://dd.eionet.europa.eu/vocabulary/lau2/zz/[concept] (exception of gb which has lau and nut codeas as uk)
status: reserved
status modified: 2023-05-04
accepted date: 2023-05-04
in scheme: AQD - Quality control and assurance on CDR
hidden label: reserved
editorial note: [Crucial]: Skipped - Not implemented

Cross checks with other data-flows
type: Concept
notation: BCrossCheck
definition: Cross checks with other data-flows
status: valid
status modified: 2023-05-04
accepted date: 2023-05-04
in scheme: AQD - Quality control and assurance on CDR
error type: WARNING

Checks if this delivery is new or an update (on same reporting year)
type: Concept
notation: C0
definition: Check if delivery if this is a new delivery or updated delivery (via reporting year)
status: valid
status modified: 2023-05-04
accepted date: 2023-05-04
in scheme: AQD - Quality control and assurance on CDR
hidden label: Checks if this delivery is new or an update (on same reporting year)
editorial note: [Crucial]: Yes - Information
error type: WARNING

Number of Assessment Regimes reported
type: Concept
notation: C01
definition: Compile & feedback upon the total number of AQ Assessment Regime feature types included in the delivery
status: valid
status modified: 2023-05-04
accepted date: 2023-05-04
in scheme: AQD - Quality control and assurance on CDR
hidden label: Number of Assessment Regimes reported
editorial note: [Crucial]: Yes - Information
error type: BLOCKER

Number of new Assessment Regimes compared to previous report. ERROR will be returned if XML is a new delivery and localId are not new compared to previous deliveries
type: Concept
notation: C02
definition: Compile & feedback upon the total number of new records for AQ Assessment Regime feature types included in the delivery. ERROR will be returned if XML is a new delivery and localId are not new compared to previous deliveries.
status: valid
status modified: 2023-05-04
accepted date: 2023-05-04
in scheme: AQD - Quality control and assurance on CDR
hidden label: Number of new Assessment Regimes compared to previous report. ERROR will be returned if XML is a new delivery and localId are not new compared to previous deliveries
editorial note: [Crucial]: Error, new delivery but re-using localId from previous -
error type: BLOCKER

Number of existing Assessment Regimes compared to previous report. ERROR will be returned if XML is an update and ALL localId (100%) are NEW to previous delivery (for the same YEAR).
type: Concept
notation: C03
definition: Compile & feedback upon the total number of modifications to previously reported AQ Assessment Regime feature types included in the delivery ERROR will be returned if XML is an update and ALL localId (100%) are different to previous delivery (for the same YEAR).
status: valid
status modified: 2023-05-04
accepted date: 2023-05-04
in scheme: AQD - Quality control and assurance on CDR
hidden label: Number of existing Assessment Regimes compared to previous report. ERROR will be returned if XML is an update and ALL localId (100%) are NEW to previous delivery (for the same YEAR).
editorial note: Error, updated delivery but all localId are new
error type: BLOCKER

Number of Assessment Regimes in C should match Assessment Regimes in Preliminary C (for the same YEAR).
type: Concept
notation: C03a
definition: The assessment regimes previously declared in the preliminary Assessment Regime (forward looking) should match those declared under the current Assessment Regime (retrospective look)
status: valid
status modified: 2023-05-04
accepted date: 2023-05-04
in scheme: AQD - Quality control and assurance on CDR
error type: WARNING

Number of Assessment Methods used under Assessment Regimes should be the same as Preliminary Assessment Regime (for the same YEAR).
type: Concept
notation: C03b
definition: The assessment methods previously declared in the preliminary Assessment Regime (forward looking) should match those declared under the current Assessment Regime (retrospective look)
status: valid
status modified: 2023-05-04
accepted date: 2023-05-04
in scheme: AQD - Quality control and assurance on CDR
error type: WARNING

Check if, for matching methods, the AssessmentType has changed the assessmentTypes
type: Concept
notation: C03c
status: valid
status modified: 2023-05-04
accepted date: 2023-05-04
in scheme: AQD - Quality control and assurance on CDR
error type: WARNING

List new assessment methods in C compared to C preliminary
type: Concept
notation: C03d
status: valid
status modified: 2023-05-04
accepted date: 2023-05-04
in scheme: AQD - Quality control and assurance on CDR
error type: WARNING

gml:id must be unique within the XML document
type: Concept
notation: C04
definition: All gml:id attributes shall have unique content within the document or namespace
status: valid
status modified: 2023-05-04
accepted date: 2023-05-04
in scheme: AQD - Quality control and assurance on CDR
hidden label: gml:id must be unique within the XML document
editorial note: [Crucial]: Yes - XML requirement
error type: BLOCKER

Local Id shall be unique for the assessment regime.
type: Concept
notation: C05
definition: ./aqd:inspireId/base:Identifier/base:localId shall be an unique code for the assessment regime.
status: valid
status modified: 2023-05-04
accepted date: 2023-05-04
in scheme: AQD - Quality control and assurance on CDR
hidden label: Local Id shall be unique for the assessment regime.
editorial note: [Crucial]: Yes - INSPIRE/system requirement
error type: BLOCKER

List unique namespaces used and count number of elements
type: Concept
notation: C06
definition: ./aqd:inspireId/base:Identifier/base:namespace List base:namespace and count the number of base:localId assigned to each base:namespace.
status: valid
status modified: 2023-05-04
accepted date: 2023-05-04
in scheme: AQD - Quality control and assurance on CDR
hidden label: List unique namespaces used and count number of elements
editorial note: [Crucial]: Yes - INSPIRE/system requirement
error type: INFO

Check namespace is registered
type: Concept
notation: C06.1
definition: Check that namespace is registered in vocabulary (http://dd.eionet.europa.eu/vocabulary/aq/namespace/view)
status: valid
status modified: 2023-05-04
accepted date: 2023-05-04
in scheme: AQD - Quality control and assurance on CDR
hidden label: Check namespace is registered
editorial note: [Crucial]: Yes - System requirement
error type: BLOCKER

Each Assessment Regime shall have one Environmental Objective element
type: Concept
notation: C07
definition: Each of the number of /aqd:AQD_AssessmentRegime records shall contain 1 ./aqd:assessmentThreshold/aqd:AssessmentThreshold/aqd:environmental Objective records per /aqd:AQD_AssessmentRegime element
status: valid
status modified: 2023-05-04
accepted date: 2023-05-04
in scheme: AQD - Quality control and assurance on CDR
hidden label: Each Assessment Regime shall have one Environmental Objective element
editorial note: [Crucial]: Yes - IPR/system requirement - aqd:AQD_AssessmentRegime/aqd:assessmentThreshold [Cardinality 0..* to 0..1]
error type: BLOCKER

Assessment regimes must be reported all expected pollutants
type: Concept
notation: C08
definition: ./aqd:pollutant xlink:href attribute may resolve to one of http://dd.eionet.europa.eu/vocabulary/aq/pollutant/1 http://dd.eionet.europa.eu/vocabulary/aq/pollutant/7 http://dd.eionet.europa.eu/vocabulary/aq/pollutant/8 http://dd.eionet.europa.eu/vocabulary/aq/pollutant/9 http://dd.eionet.europa.eu/vocabulary/aq/pollutant/5 http://dd.eionet.europa.eu/vocabulary/aq/pollutant/6001 http://dd.eionet.europa.eu/vocabulary/aq/pollutant/10 http://dd.eionet.europa.eu/vocabulary/aq/pollutant/20 http://dd.eionet.europa.eu/vocabulary/aq/pollutant/5012 http://dd.eionet.europa.eu/vocabulary/aq/pollutant/5014 http://dd.eionet.europa.eu/vocabulary/aq/pollutant/5015 http://dd.eionet.europa.eu/vocabulary/aq/pollutant/5018 http://dd.eionet.europa.eu/vocabulary/aq/pollutant/5029
status: valid
status modified: 2023-05-04
accepted date: 2023-05-04
in scheme: AQD - Quality control and assurance on CDR
hidden label: Assessment regimes must be reported all expected pollutants
editorial note: [Crucial]: Yes - IPR requirement (Annex II-C-4)
error type: BLOCKER

Check valid combination of pollutant/EnvironmentalObjective (Objective/ProtectionTarget/ReportingMetric). Error if unexpected combination
type: Concept
notation: C10
definition: Check that EnvironmentalObjetive (ObjectiveType+ReportingMetric+ProtectionTarget) correspond to a valid combination in http://dd.eionet.europa.eu/vocabulary/aq/environmentalobjective/view
status: valid
status modified: 2023-05-04
accepted date: 2023-05-04
in scheme: AQD - Quality control and assurance on CDR
hidden label: Unexpected combinations found
editorial note: [Crucial]: Yes - IPR requirement (Annex II-C-4 + Annex II-C-5) -Updated in v5.0 to use EnvObjective vocabulary
error type: BLOCKER

Check discrepancies between the expected Assessment Regime combinations based on dataflow B - Zones (latest released same reporting years)
type: Concept
notation: C11
definition: The new check C11 will double check that data-flow C is complete according to all zones declared in data-flow B. The validation throws error when: a) The combination of elements Pollutant + Protection Target + ZoneId + Environmental objective from B is missing in C. b) The combination of elements Pollutant + Protection Target + ZoneId + Environmental objective from C is missing in B. c) The combination of elements Pollutant + Protection Target + ZoneId + Environmental objective is duplicated. Exception when objective type is "MO", "ECO", "ERT", "LVMOT", "LVmaxMOT", "INT" and "ALT"
status: valid
status modified: 2023-05-04
accepted date: 2023-05-04
in scheme: AQD - Quality control and assurance on CDR
hidden label: reserved
editorial note: Included in C10
error type: BLOCKER

Check the minimum number of fixed SPO required per each Zone+EnvironmentalObjective according to AQ Directive
type: Concept
notation: C12
definition: Evaluate the minimum number of fixed sampling points for all zones considering the population number reported in dataflow B and the classification of the zone for the particular Environmental Objective. Minimum according to anexV & IX. Numbers in EEA vocabulary: https://dd.eionet.europa.eu/vocabulary/aq/anexV_IX_minimum_spo/view & https://dd.eionet.europa.eu/vocabulary/aq/art10_O3_Model_minimum_spo/view
status: experimental
status modified: 2024-06-14
accepted date: 2024-06-14
in scheme: AQD - Quality control and assurance on CDR
error type: REGERROR

reserved
type: Concept
notation: C13
definition: reserved
status: deprecated
status modified: 2023-05-04
accepted date: 2023-05-04
in scheme: AQD - Quality control and assurance on CDR
hidden label: reserved
editorial note: Included in C10

reserved
type: Concept
notation: C14
definition: reserved
status: deprecated
status modified: 2023-05-04
accepted date: 2023-05-04
in scheme: AQD - Quality control and assurance on CDR
hidden label: reserved
editorial note: Included in C10

reserved
type: Concept
notation: C15
definition: reserved
status: deprecated
status modified: 2023-05-04
accepted date: 2023-05-04
in scheme: AQD - Quality control and assurance on CDR
hidden label: reserved
editorial note: Included in C10

reserved
type: Concept
notation: C16
definition: reserved
status: deprecated
status modified: 2023-05-04
accepted date: 2023-05-04
in scheme: AQD - Quality control and assurance on CDR
hidden label: reserved
editorial note: Included in C10

reserved
type: Concept
notation: C17
definition: reserved
status: deprecated
status modified: 2023-05-04
accepted date: 2023-05-04
in scheme: AQD - Quality control and assurance on CDR
hidden label: reserved
editorial note: Included in C10

reserved
type: Concept
notation: C18
definition: reserved
status: deprecated
status modified: 2023-05-04
accepted date: 2023-05-04
in scheme: AQD - Quality control and assurance on CDR
hidden label: reserved
editorial note: Included in C10

reserved
type: Concept
notation: C19
definition: reserved
status: deprecated
status modified: 2023-05-04
accepted date: 2023-05-04
in scheme: AQD - Quality control and assurance on CDR
hidden label: reserved
editorial note: Included in C10

Check and list any missing combination of pollutant/EnvironmentalObjective. Error if combination missing
type: Concept
notation: C20
definition: Provide any missing combination of Pollutant/EnvironmentalObjective according to vocabulary http://dd.eionet.europa.eu/vocabulary/aq/environmentalobjective/ (Exceptions: when ObjectiveType = .../MO + .../LVMOT + .../LVmaxMOT &those combinations when "Exceedance threshold" within the vocabulary is populated)
status: valid
status modified: 2023-05-04
accepted date: 2023-05-04
in scheme: AQD - Quality control and assurance on CDR
hidden label: Missing combination of pollutant/EnvironmentalObjective.
editorial note: [Crucial]: Yes - IPR requirement (Annex II-C-4 + Annex II-C-5) + correct content check vs AQD/IPR
error type: BLOCKER

Count number of Assessment Regimes for pollutants with Monitoring Objective according to Annex X (Directive 2008/50/EC)
type: Concept
notation: C09
definition: Count on unique pollutants when Assessment regime(s)'s aqd:objectiveType xlink:href attribute resolve to http://dd.eionet.europa.eu/vocabulary/aq/objectivetype/MO According to ANNEX X - MEASUREMENTS OF OZONE PRECURSOR SUBSTANCES (DIRECTIVE 2008/50/EC) Measurement of ozone precursor substances shall include at least nitrogen oxides (NO and NO2), and appropriate volatile organic compounds (VOC). A list of volatile organic compounds recommended for measurement is given below: 1-Butene Isoprene Ethyl benzene Ethane Trans-2-Butene n-Hexane m + p-Xylene Ethylene cis-2-Butene i-Hexane o-Xylene Acetylene 1,3-Butadiene n-Heptane 1,2,4-Trimethylebenzene Propane n-Pentane n-Octane 1,2,3-Trimethylebenzene Propene i-Pentane i-Octane 1,3,5-Trimethylebenzene n-Butane 1-Pentene Benzene Formaldehyde i-Butane 2-Pentene Toluene Total non-methane hydrocarbons
status: valid
status modified: 2023-05-04
accepted date: 2023-05-04
in scheme: AQD - Quality control and assurance on CDR
hidden label: Count number of Assessment Regimes for pollutants with Monitoring Objetive
editorial note: [Crucial]: N/A - IPR requirement (Annex II-C-4)
error type: ERROR

Check if combination of pollutant/EnvironmentalObjective for reporting PM2.5 National Exposure Reduction Target is included
type: Concept
notation: C20a
definition: Check if combination of pollutant/EnvironmentalObjective for reporting PM2.5 National Exposure Reduction Target is included
status: valid
status modified: 2023-05-04
accepted date: 2023-05-04
in scheme: AQD - Quality control and assurance on CDR
error type: WARNING

Check Assessment Threshold Classification according to the allowed combination
type: Concept
notation: C21
definition: Assess correctness of /aqd:assessmentThreshold/aqd:AssessmentThreshold/aqd:exceedanceAttainment depending on combination aqd:pollutant + aqd:objectiveType + aqd:reportingMetric + aqd:protectionTarget against vocabulary http://dd.eionet.europa.eu/vocabulary/aq/environmentalobjective/
status: valid
status modified: 2023-05-04
accepted date: 2023-05-04
in scheme: AQD - Quality control and assurance on CDR
hidden label: Assessment Threshold classification required ratification.
editorial note: [Crucial]: Yes - IPR requirement (Annex II-C-6) + correct content check vs AQD/IPR
error type: ERROR

Check modifications of Assessment Threshold Classification
type: Concept
notation: C22
definition: Modification of Assessment Threshold Classification must be accompanied by change of classification year.
status: valid
status modified: 2023-08-07
accepted date: 2023-08-07
in scheme: AQD - Quality control and assurance on CDR
hidden label: Modification of Assessment Threshold Classification must be accompanied by change of classification year.
error type: WARNING

The assessement type shall be either "Fixed Measurement," "modelling," "Indicative Measurement", "Objective Estimation", or "other"
type: Concept
notation: C23a
definition: ./aqd:assessmentMethods/aqd:AssessmentMethods/aqd:assessmentType xlink:href attribute shall resolve to one of http://dd.eionet.europa.eu/vocabulary/aq/assessmenttype/[concept]Current options in the codelist are:http://dd.eionet.europa.eu/vocabulary/aq/assessmenttype/fixed http://dd.eionet.europa.eu/vocabulary/aq/assessmenttype/model http://dd.eionet.europa.eu/vocabulary/aq/assessmenttype/indicative http://dd.eionet.europa.eu/vocabulary/aq/assessmenttype/objective http://dd.eionet.europa.eu/vocabulary/aq/assessmenttype/other
status: valid
status modified: 2023-05-04
accepted date: 2023-05-04
in scheme: AQD - Quality control and assurance on CDR
hidden label: The assessement type shall be either Fixed Measurement – Modelling – Objective Estimation or Indicative measurement
editorial note: [Crucial]: Yes - IPR requirement (Annex II-C-9)
error type: BLOCKER

A textual description of assessment type is expected
type: Concept
notation: C23b
definition: ./aqd:assessmentMethods/aqd:AssessmentMethods/aqd:assessmentTypeDescription resolve to a text description of Assessment Type
status: valid
status modified: 2023-05-04
accepted date: 2023-05-04
in scheme: AQD - Quality control and assurance on CDR
hidden label: A textual description of assessment type is expected
editorial note: [Crucial]: - IPR requirement (Annex II-C-9) https://taskman.eionet.europa.eu/issues/72746
error type: WARNING

When providing a link to model or objective estimation(s), a valid link must be provided
type: Concept
notation: C24
definition: The assessment methods referenced by ./aqd:assessmentMethods/aqd:AssessmentMethods/aqd:modelAssessmentMetadata xlink:href attribute shall resolve to a traversable link to an assessment method /aqd:AQD_Model reported under cdr.eionet.europa.eu/ZZ/eu/aqd/d/… (The href is made using “namespace”/”localId”)
status: valid
status modified: 2023-05-04
accepted date: 2023-05-04
in scheme: AQD - Quality control and assurance on CDR
hidden label: Invalid link to model or objetive estimation(s)
editorial note: [Crucial]: Yes (crosscheck) - IPR requirement (Annex II-C-11)
error type: BLOCKER

When providing a link to fix or indicative measurement(s), a valid link must be provided
type: Concept
notation: C25
definition: The assessment methods referenced by ./aqd:assessmentMethods/aqd:AssessmentMethods/aqd:samplingPointAssessmentMetadata xlink:href attribute shall resolve to a traversable link to an assessment method /aqd:AQD_SamplingPoint reported under cdr.eionet.europa.eu/ZZ/eu/aqd/d/… (The href is made using “namespace”/”localId”)
status: valid
status modified: 2023-05-04
accepted date: 2023-05-04
in scheme: AQD - Quality control and assurance on CDR
hidden label: Invalid link to samplingPoint(s)
editorial note: [Crucial]: Yes (crosscheck) - IPR requirement (Annex II-C-12)
error type: BLOCKER

Any assessment method used under Assessment must be operational within the Reporting Period
type: Concept
notation: C26
definition: The assessment methods referenced by ./aqd:assessmentMethods/aqd:AssessmentMethods/aqd:modelAssessmentMeta data or ./aqd:assessmentMethods/aqd:AssessmentMethods/aqd:samplingPointAssessmentMetadata xlink:href attribute shall contain one element /aqd:AQD_Model/ef:observingCapability/ef:ObservingCapability/ef:observingTime/gml:TimePeriod/gml:endPosition or /aqd:AQD_SamplingPoint/ef:observingCapability/ef:ObservingCapability/ef:observingTime/gml:TimePeriod/gml:endPosition that is operational within the aqd:reportingPeriod included in the ReportingHead
status: valid
status modified: 2023-05-04
accepted date: 2023-05-04
in scheme: AQD - Quality control and assurance on CDR
hidden label: Some assessment method seem to be closed while being declared in the Assessment Regime. Please revise.
editorial note: [Crucial]: Yes (crosscheck) - Crosscheck to ensure Method operational within Reporting Year
error type: ERROR

The number of zones must be the same as cited in the AssessmentRegime (for the same Reporting Year)
type: Concept
notation: C27
definition: The number of unique zones cited by /aqd:AQD_AssessmentRegime shall be EQUAL to the number of unique zones in ./aqd:AQD_Zone for the same ReportingYear
status: valid
status modified: 2023-05-04
accepted date: 2023-05-04
in scheme: AQD - Quality control and assurance on CDR
hidden label: A mismatch between zones linked in C and B has been identified. Please revise both deliveries
editorial note: Crosscheck to ensure Zone operational within Reporting Year
error type: ERROR

The zone linked to each Assessment Regime must be operational within the Reporting Period
type: Concept
notation: C28
definition: The lifecycle information of ./aqd:zone xlink:href shall be current,/aqd:AQD_Zone/am:designationPeriod/gml:TimePeriod/gml:endPosition shall be greater than the begin position of the aqd:reportingPeriod included in the ReportingHeader If endPosition is indeterminate (i.e.<gml:endPosition indeterminatePosition="unknown"/>) /aqd:AQD_Zone/am:designationPeriod/gml:TimePeriod/gml:beginPosition shall NOT be greater than the begin position of the aqd:reportingPeriod included in the ReportingHeader
status: valid
status modified: 2023-05-04
accepted date: 2023-05-04
in scheme: AQD - Quality control and assurance on CDR
hidden label: The zone linked to each Assessment Regime must be operational within the Reporting Period
editorial note: Crosscheck to ensure Zone operational within Reporting Year
error type: BLOCKER

The regime(s) for PM2.5 AEI (both ECO & ERT) MUST not link to any specific zone.
type: Concept
notation: C30
definition: The regime(s) for PM2.5 AEI (both ECO & ERT) MUST not link to any specific zone. Specific syntax in XML is: <aqd:zone nilReason="inapplicable"/>
status: experimental
status modified: 2023-05-04
accepted date: 2023-05-04
in scheme: AQD - Quality control and assurance on CDR
hidden label: reserved
error type: ERROR

If the Asseement Metadata lifecycle information is current, then the Operational Activity End Time shall be within ReportingPeriod
type: Concept
notation: C33
definition: The lifecycle information of ./aqd:assessmentMethods/aqd:AssessmentMethods/aqd:samplingPointAssessmentMetadata xlink:href shall be current, /AQD_SamplingPoint/ef:operationActivityPeriod/gml:endPosition shall be operational within the aqd:reportingPeriod included in the ReportingHeader
status: valid
status modified: 2023-05-04
accepted date: 2023-05-04
in scheme: AQD - Quality control and assurance on CDR
hidden label: If the Asseement Metadata lifecycle information is current, then the Operational Activity End Time shall be within ReportingPeriod
editorial note: [Crucial]: Yes - Crosscheck to ensure Method operational within Reporting Year - Important update, very similar to C26 (missing AQD_Model)
error type: WARNING

If a sampling point or a model is used in any Assessment Regime, it has to be described as TRUE for AQ Directive use
type: Concept
notation: C35
definition: /aqd:AQD_SamplingPoint/aqd:usedAQD or /aqd:AQD_Model/aqd:used shall EQUAL “true” for all ./aqd:assessmentMethods/aqd:AssessmentMethods/aqd:[samplingPoint or model]AssessmentMetadata xlink:href citations
status: valid
status modified: 2023-05-04
accepted date: 2023-05-04
in scheme: AQD - Quality control and assurance on CDR
hidden label: If a sampling point or a model is used in any Assessment Regime, it has to be described as TRUE for AQ Directive use
editorial note: [Crucial]: Yes - Cross-check coherence between C & D
error type: WARNING

Delivery should contain one and only one Assessment Regime for PM2.5 Exposure Concentration Obligation (ECO)
type: Concept
notation: C36
definition: There shall be only 1 record per MS where ./aqd:assessmentThreshold/aqd:AssessmentThreshold/aqd:environmental Objective/aqd:EnvironmentalObjective/aqd:objectiveType xlink:href attribute resolves to http://dd.eionet.europa.eu/vocabulary/aq/objectivetype/ECO
status: stable
status modified: 2023-05-04
accepted date: 2023-05-04
in scheme: AQD - Quality control and assurance on CDR
hidden label: reserved
editorial note: Not implemented
error type: ERROR

Delivery should contain one and only one Assessment Regime for PM2.5 Exposure Reduction Target (ERT)
type: Concept
notation: C37
definition: There shall be only 1 record per MS where ./aqd:assessmentThreshold/aqd:AssessmentThreshold/aqd:environmental Objective/aqd:EnvironmentalObjective/aqd:objectiveType xlink:href attribute resolves to http://dd.eionet.europa.eu/vocabulary/aq/objectivetype/ERT
status: valid
status modified: 2023-05-04
accepted date: 2023-05-04
in scheme: AQD - Quality control and assurance on CDR
hidden label: Assessment Regime for AEI is missing or multiple records have been provided (only 1 expected per country)
error type: ERROR

The cited stations under the Assessment Regime for the Average Exposure Indicator should be classified as Background.
type: Concept
notation: C38
definition: Where./aqd:assessmentThreshold/aqd:AssessmentThreshold/aqd:environmentalObjective/aqd:EnvironmentalObjective/aqd:reportingMetric xlink:href attribute resolves to http://dd.eionet.europa.eu/vocabulary/aq/reportingmetric/AEI the /aqd:AQD_SamplingPoint/aqd:relevantEmissions/aqd:RelevantEmissions/aqd:stationClassification xlink:href attribute shall resolve to http://dd.eionet.europa.eu/vocabulary/aq/stationclassification/background for all aqd:AQD_SamplingPoint linked via aqd:AQD_AssessmentRegime/aqd:assessmentMethods/aqd:AssessmentMethods /aqd:samplingPointAssessmentMetadata citations
status: valid
status modified: 2023-05-04
accepted date: 2023-05-04
in scheme: AQD - Quality control and assurance on CDR
hidden label: SamplingPoint(s) declared for assessing AEI are not background
editorial note: [Crucial]: Yes - INFORMATION, warnes if any AEI station is not background
error type: ERROR

Pollutant, Assessment Threshold and Environmental Objective shall equal one combination, except where Particulate Matter 2.5, which is not applicable.
type: Concept
notation: C29
definition: aqd:zone xlink:href attribute shall resolve to a traversable link to an AQ zone in /aqd:AQD_Zone reported under cdr.eionet.europa.eu/ZZ/eu/aqd/b/... The ./aqd:pollutant and ./aqd:assessmentThreshold/aqd:AssessmentThreshold/aqd:environmentalObjective/aqd:EnvironmentalObjective/aqd:protectionTarget within the Assessment Regime shall equal one combination /aqd:AQD_Zone/aqd:pollutants/aqd:Pollutant/aqd:pollutantCode and /aqd:AQD_Zone/aqd:pollutants/aqd:Pollutant/aqd:protectionTarget within the linked zone aqd:AQD_Zone/aqd:pollutantsException : Where ./aqd:pollutant resolves to http://dd.eionet.europa.eu/vocabulary/aq/pollutant/6001 ./aqd:zone xlink:href attribute MAY resolve to <aqd:zone nilReason='inapplicable'/>
status: valid
status modified: 2023-05-04
accepted date: 2023-05-04
in scheme: AQD - Quality control and assurance on CDR
hidden label: A mismatch between the pollutant declared in Assessment Regime and the zone pollutant has been identified. Please revise.
editorial note: [Crucial]: Yes (crosscheck) - Crosscheck to ensure Method operational within Reporting Year - Improved in cdr (swaped with C27)
error type: ERROR

COUNT number zone-pollutant-target comibantion to match those in dataset B for the same reporting Year
type: Concept
notation: C31
definition: COUNT number zone-pollutant-target comibantion to match those in dataset B for the same reporting Year ./aqd:assessmentThreshold/aqd:AssessmentThreshold/aqd:environmentalObjective/aqd:EnvironmentalObjective/aqd:protectionTarget + ./aqd:pollutant + /aqd:zone combinations shall reconcile to corresponding information within / aqd:AQD_Zone/aqd:pollutants/aqd:Pollutant/aqd:protectionTarget , /aqd:AQD_Zone/aqd:pollutants/aqd:Pollutant/aqd:pollutantCode + /aqd:AQD_Zone/am:inspireId/base:Identifier/base:localId : Sulphur dioxide (1) + health (B vs C) & Sulphur dioxide (1) + vegetation (B vs C) & Ozone (7) + health (B vs C) & Ozone (7) + vegetation (B vs C) & Nitrogen dioxide (8) + health (B vs C) & Nitrogen oxides (9) + vegetation (B vs C) & Particulate matter < 10 µm (5) + health (B vs C) & Particulate matter < 2.5 µm (6001) + health (B vs C) & Carbon monoxide (10) + health (B vs C) & Benzene (20) + health (B vs C) & Lead in PM10 (5012) + health (B vs C) & Arsenic in PM10 (5018) + health (B vs C) & Cadmium in PM10 (5014) + health (B vs C) & Nickel in PM10 (5015) + health (B vs C) & Benzo(a)pyrene in PM10 (5029) + health (B vs C)
status: valid
status modified: 2023-05-04
accepted date: 2023-05-04
in scheme: AQD - Quality control and assurance on CDR
hidden label: COUNT number zone-pollutant-target comibantion to match those in dataset B for the same reporting Year
editorial note: [Crucial]: Yes (crosscheck) - Updated in 4.0.2 if any C is greater than B = ERROR (RED) IF all B = C then OK if any C is smaller than B = WARNING
error type: ERROR

COUNT number zone-pollutant-target combination to match those in dataset C preliminary for the same reporting Year
type: Concept
notation: C31b
definition: COUNT number zone-pollutant-target comibantion to match those in dataset B for the same reporting Year ./aqd:assessmentThreshold/aqd:AssessmentThreshold/aqd:environmentalObjective/aqd:EnvironmentalObjective/aqd:protectionTarget + ./aqd:pollutant + /aqd:zone combinations shall reconcile to corresponding information within / aqd:AQD_Zone/aqd:pollutants/aqd:Pollutant/aqd:protectionTarget , /aqd:AQD_Zone/aqd:pollutants/aqd:Pollutant/aqd:pollutantCode + /aqd:AQD_Zone/am:inspireId/base:Identifier/base:localId : Sulphur dioxide (1) + health (C_pre vs C) & Sulphur dioxide (1) + vegetation (C_pre vs C) & Ozone (7) + health (C_pre vs C) & Ozone (7) + vegetation (C_pre vs C) & Nitrogen dioxide (8) + health (C_pre vs C) & Nitrogen oxides (9) + vegetation (C_pre vs C) & Particulate matter < 10 µm (5) + health (C_pre vs C) & Particulate matter < 2.5 µm (6001) + health (C_pre vs C) & Carbon monoxide (10) + health (C_pre vs C) & Benzene (20) + health (C_pre vs C) & Lead in PM10 (5012) + health (C_pre vs C) & Arsenic in PM10 (5018) + health (C_pre vs C) & Cadmium in PM10 (5014) + health (C_pre vs C) & Nickel in PM10 (5015) + health (B vs C) & Benzo(a)pyrene in PM10 (5029) + health (C_pre vs C)
status: valid
status modified: 2023-05-04
accepted date: 2023-05-04
in scheme: AQD - Quality control and assurance on CDR
error type: WARNING

Check Assessment Type of Asssessment Methods compared to assessmentType within Assessment Regime
type: Concept
notation: C32
definition: ./aqd:assessmentMethods/aqd:AssessmentMethods/aqd:assessmentType shall be compared with the /aqd:AQD_SamplingPoint/aqd:assessmentType for assessment method cited by ./aqd:assessmentMethods/aqd:AssessmentMethods/aqd:samplingPointAssessmentMetadata xlink:href attribute and/or /aqd:AQD_Model/aqd:assessmentType for assessment method cited by ./aqd:assessmentMethods/aqd:AssessmentMethods/aqd:samplingPointAssessmentMetadata xlink:href attribute. The following combinations are allowed: Within AssessmentRegime Within SamplingPoint/Model Status: fixed fixed OK & indicative indicative/fixed OK & model model OK & objective objective OK & fixed indicative/model/objective WRONG & indicative fixed/model/objective WRONG & model fixed/indicative/objective WRONG & objective fixed/indicative/model OK
status: valid
status modified: 2023-05-04
accepted date: 2023-05-04
in scheme: AQD - Quality control and assurance on CDR
hidden label: A mismatch has been detected between assessment types in Assessment Regime and assessment type in data flow D
editorial note: [Crucial]: Yes - Cross-check coherence between C & D
error type: ERROR

Evaluate the consistency of SamplingPoints used for the assessment of PM2.5 AEI (ECO) and AEI (ERT) in current delivery. They should be the same.
type: Concept
notation: C39
definition: Evaluate the consistency of SamplingPoints used for the assessment of PM2.5 AEI (ECO) and AEI (ERT) in current delivery. They should be the same.
status: experimental
status modified: 2023-05-04
accepted date: 2023-05-04
in scheme: AQD - Quality control and assurance on CDR
editorial note: Implemented
error type: BLOCKER

Evaluate the continuity of Stations used for the assessment of PM2.5 AEI ECO compared to latest delivery from previous year
type: Concept
notation: C39b
definition: Evaluate the continuity of Stations used for the assessment of PM2.5 AEI ECO compared to latest delivery from previous year
status: valid
status modified: 2023-05-04
accepted date: 2023-05-04
in scheme: AQD - Quality control and assurance on CDR
error type: WARNING

Evaluate the continuity of SamplingPoints used for the assessment of PM2.5 AEI ECO compared to latest delivery from previous year
type: Concept
notation: C39c
definition: Evaluate the continuity of SamplingPoints used for the assessment of PM2.5 AEI ECO compared to latest delivery from previous year
status: valid
status modified: 2023-05-04
accepted date: 2023-05-04
in scheme: AQD - Quality control and assurance on CDR
error type: WARNING

All Assessment Regimes should be linked to at least one Assessment Method (either SamplingPoint or Model/ObjectiveEstimation)
type: Concept
notation: C40
definition: The total number of /aqd:assessmentMethods/aqd:AssessmentMethods/aqd:samplingPointAssessmentMetadata and /aqd:assessmentMethods/aqd:AssessmentMethods/aqd:modelAssessmentMetadata citations within a MS (delivery) shall be GREATER THAN OR EQUAL to 1 where ./aqd:pollutant xlink:href attribute resolves to
status: valid
status modified: 2023-05-04
accepted date: 2023-05-04
in scheme: AQD - Quality control and assurance on CDR
hidden label: Assessment Regime(s) must link to at least one assessment method. Please revise
editorial note: [Crucial]: - IPR requirement (Annex II-C-11)
error type: ERROR

All Assessment Regimes must not be empty
type: Concept
notation: C40b
definition: Blocker will return if all Assessment Regimes are empty (i.e. not linked to an Assessment Method)
status: valid
status modified: 2023-05-04
accepted date: 2023-05-04
in scheme: AQD - Quality control and assurance on CDR
error type: BLOCKER

The year of the latest Classification report must be within the last 5 years according to AQ Directive
type: Concept
notation: C41
definition: gml:timePosition MUST be provided and must be equal or greater than (aqd:reportingPeriod – 5 yeasr ) included in the ReportingHeader
status: valid
status modified: 2023-05-04
accepted date: 2023-05-04
in scheme: AQD - Quality control and assurance on CDR
hidden label: Classification report needs updating, it is more than 5 years old.
editorial note: [Crucial]: - IPR requirement (Annex II-C-7)
error type: ERROR

A valid url should be provided linking to the latest Classification Report
type: Concept
notation: C42
definition: Free text shall be provided including at least 1 valid URL
status: valid
status modified: 2023-05-04
accepted date: 2023-05-04
in scheme: AQD - Quality control and assurance on CDR
hidden label: A valid url should be provided linking to the latest Classification Report
editorial note: [Crucial]: - IPR requirement (Annex II-C-8)
error type: WARNING

Alert & Information - At least one assessment regime for those Environmental Objectives with information and/or alert thresholds must be reported
type: Concept
notation: C46
definition: At least one assessment regime for the following Environmental Objectives must be reported: NO2-Health-Alert, SO2-Health-Alert, O3-Health-Information & O3-Health-Alert.
status: valid
status modified: 2023-05-04
accepted date: 2023-05-04
in scheme: AQD - Quality control and assurance on CDR
error type: BLOCKER

INF and ALT thresholds - COUNT number zone-pollutant-target combination to match those in dataset B for the same reporting Year
type: Concept
notation: C47
definition: COUNT number zone-pollutant-target comibantion to match those in dataset B for the same reporting Year ./aqd:assessmentThreshold/aqd:AssessmentThreshold/aqd:environmentalObjective/aqd:EnvironmentalObjective/aqd:protectionTarget + ./aqd:pollutant + /aqd:zone combinations shall reconcile to corresponding information within / aqd:AQD_Zone/aqd:pollutants/aqd:Pollutant/aqd:protectionTarget , /aqd:AQD_Zone/aqd:pollutants/aqd:Pollutant/aqd:pollutantCode + /aqd:AQD_Zone/am:inspireId/base:Identifier/base:localId : Sulphur dioxide (1) + health (B vs C) & Ozone (7) + health (B vs C) & Nitrogen dioxide (8) + health (B vs C)
status: valid
status modified: 2023-05-04
accepted date: 2023-05-04
in scheme: AQD - Quality control and assurance on CDR
error type: ERROR

INF and ALT thresholds - COUNT number zone-pollutant-target combination to match those in dataset C preliminary for the same reporting Year
type: Concept
notation: C47b
definition: COUNT number zone-pollutant-target comibantion to match those in dataset B for the same reporting Year ./aqd:assessmentThreshold/aqd:AssessmentThreshold/aqd:environmentalObjective/aqd:EnvironmentalObjective/aqd:protectionTarget + ./aqd:pollutant + /aqd:zone combinations shall reconcile to corresponding information within / aqd:AQD_Zone/aqd:pollutants/aqd:Pollutant/aqd:protectionTarget , /aqd:AQD_Zone/aqd:pollutants/aqd:Pollutant/aqd:pollutantCode + /aqd:AQD_Zone/am:inspireId/base:Identifier/base:localId : Sulphur dioxide (1) + health (Cprel vs C) & Ozone (7) + health (Cprel vs C) & Nitrogen dioxide (8) + health (Cprel vs C)
status: valid
status modified: 2023-05-04
accepted date: 2023-05-04
in scheme: AQD - Quality control and assurance on CDR
error type: WARNING

If classification is (LAT-UAT o aboveUAT or aboveLTO), there must be at least 1 assessmentMethod fixed
type: Concept
notation: C48
definition: At least 1 assessmentMethod must be set to fixed when aqd:exceedanceAttainment is LAT-UAT, aboveUAT, or aboveLTO.
status: valid
status modified: 2024-02-15
accepted date: 2024-02-15
in scheme: AQD - Quality control and assurance on CDR
error type: REGERROR

Assessment regime with exceedance in previous years should be classified as above UAT / LTO
type: Concept
notation: C49
definition: If an assessment regime has reported exceedances in the previous year, the latest classification must be aboveUAT or aboveLTO.
status: valid
status modified: 2024-02-15
accepted date: 2024-02-15
in scheme: AQD - Quality control and assurance on CDR
editorial note: Downgraded to warning
error type: WARNING

Cross checks with other data-flows
type: Concept
notation: CCrossCheck
definition: Cross checks with other data-flows
status: valid
status modified: 2023-05-04
accepted date: 2023-05-04
in scheme: AQD - Quality control and assurance on CDR
error type: WARNING

Testing REGERROR
type: Concept
notation: Ctest
status: valid
status modified: 2023-05-04
accepted date: 2023-05-04
in scheme: AQD - Quality control and assurance on CDR
error type: REGERROR

Checks if this delivery is new or an update (on same reporting year)
type: Concept
notation: D0
definition: Check if delivery if this is a new delivery or updated delivery (via reporting year)
status: valid
status modified: 2023-05-04
accepted date: 2023-05-04
in scheme: AQD - Quality control and assurance on CDR
hidden label: Checks if this delivery is new or an update (on same reporting year)
editorial note: [Crucial]: Yes - Information
error type: WARNING

Total number of individual element reported within this XML Document for assessment methods. Error wil be returned if any of the expected elements are missing.
type: Concept
notation: D01
definition: Compile & feedback upon the total number of each environmental monitoring feature types included in the delivery
status: valid
status modified: 2023-05-04
accepted date: 2023-05-04
in scheme: AQD - Quality control and assurance on CDR
hidden label: Total number of individual element reported within this XML Document for assessment methods. Error wil be returned if any of the expected elements are missing.
editorial note: [Crucial]: Yes - Information
error type: BLOCKER

Total number of new records for each feature type included in the delivery. Error will be returned if all LocalIds are new.
type: Concept
notation: D02
definition: Compile and feedback upon the total number of new records for each environmental monitoring feature types included in the delivery
status: valid
status modified: 2023-05-04
accepted date: 2023-05-04
in scheme: AQD - Quality control and assurance on CDR
hidden label: Total number of new records for each feature type included in the delivery. Error will be returned if all LocalIds are new.
editorial note: [Crucial]: Yes - System requirement
error type: BLOCKER

Total number of updated records for each feature type included in the delivery. Error will be returned if all LocalIds are new.
type: Concept
notation: D03
definition: Compile and feedback upon the total number of updated environmental monitoring feature types included in the delivery
status: valid
status modified: 2023-05-04
accepted date: 2023-05-04
in scheme: AQD - Quality control and assurance on CDR
hidden label: Total number of updated records for each feature type included in the delivery. Error will be returned if all LocalIds are new.
editorial note: [Crucial]: Yes - System requirement
error type: BLOCKER

Total number of updated records for each feature type included in the delivery. Blocker will be returned if D is not complete in relation to previous Delivery.
type: Concept
notation: D03b
definition: Compile and feedback upon the total number of updated environmental monitoring feature types included in the delivery. All feature types in the previous delivered must be included in this delivery to maintain historical information. If the update is genuine, please contact AQ IPR helpdesk.
status: valid
status modified: 2023-05-04
accepted date: 2023-05-04
in scheme: AQD - Quality control and assurance on CDR
error type: BLOCKER

Total number of updated records for each feature type included in the delivery. Blocker will be returned if D is not complete in relation to latest Delivery from previous year.
type: Concept
notation: D03c
definition: Compile and feedback upon the total number of updated environmental monitoring feature types included in the delivery. All feature types in the previous delivered (latest envelope from previous year) should be included in this delivery to maintain historical information. This is for information purposes.
status: valid
status modified: 2023-05-04
accepted date: 2023-05-04
in scheme: AQD - Quality control and assurance on CDR
error type: WARNING

Full list of reported Environmental Monitoring Features within this XML Document
type: Concept
notation: D04
definition: Compile & feedback a list of the unique identifier information for each new record or modification to an environmental monitoring feature type. Feedback report shall include the gml:id attribute, ef:inspireId, aqd:inspireId, ef:name and/or ompr:name elements as available.
status: valid
status modified: 2023-05-04
accepted date: 2023-05-04
in scheme: AQD - Quality control and assurance on CDR
hidden label: Full list of reported Environmental Monitoring Features within this XML Document
editorial note: [Crucial]: Yes -
error type: INFO

Id elements must have unique content
type: Concept
notation: D05
definition: All gml:id attributes, ef:inspireId and aqd:inspireId elements shall have unique content
status: valid
status modified: 2023-05-04
accepted date: 2023-05-04
in scheme: AQD - Quality control and assurance on CDR
hidden label: Id elements must have unique content
editorial note: [Crucial]: Yes - System & INSPIRE requirement
error type: BLOCKER

LocalId must be a unique code for the AQD_network (wtihin the unique namespace).
type: Concept
notation: D06
definition: aqd:AQD_Network/ef:inspireId/base:Identifier/base:localId shall be an unique code for AQD_network and unique within the namespace.
status: valid
status modified: 2023-05-04
accepted date: 2023-05-04
in scheme: AQD - Quality control and assurance on CDR
hidden label: LocalId must be a unique code for the AQD_network.
editorial note: [Crucial]: Yes - IPR requirement (Annex II-D-ii-3)
error type: BLOCKER

List unique namespaces used and count number of Networks used. Error will be returned if namespace is not unique.
type: Concept
notation: D07
definition: Count the number of unique AQD_Network (via localId) submitted within base:namespace. Blocker will be returned if base:namespace is not unique.
status: valid
status modified: 2023-05-04
accepted date: 2023-05-04
in scheme: AQD - Quality control and assurance on CDR
hidden label: List unique namespaces used and count number of Networks used.
editorial note: [Crucial]: Yes - INSPIRE requirement
error type: BLOCKER

Check namespace is registered
type: Concept
notation: D07.1
definition: Check that namespace is registered in vocabulary (http://dd.eionet.europa.eu/vocabulary/aq/namespace/view)
status: valid
status modified: 2023-05-04
accepted date: 2023-05-04
in scheme: AQD - Quality control and assurance on CDR
hidden label: Check namespace is registered
editorial note: [Crucial]: Yes - System requirement
error type: BLOCKER

Must conform to a recognised media value. These are: Air, Biota, Landscape, Sediment, Soil/Ground, Waste and Water.
type: Concept
notation: D08
definition: The content of aqd:AQD_Network/ef:mediaMonitored shall resolve to any concept inhttp://inspire.ec.europa.eu/codelist/MediaValue/
status: valid
status modified: 2023-05-04
accepted date: 2023-05-04
in scheme: AQD - Quality control and assurance on CDR
hidden label: Must conform to a recognised media value. These are: Air, Biota, Landscape, Sediment, Soil/Ground, Waste and Water.
editorial note: [Crucial]: -
error type: ERROR

Must conform to a recognised Organisation Level. These are: International, Local, LocalAuthority, Municipality, National and Regional.
type: Concept
notation: D09
definition: The content of aqd:AQD_Network/ef:organisationLevel shall resolve to any concept in http://dd.eionet.europa.eu/vocabulary/aq/organisationallevel/
status: valid
status modified: 2023-05-04
accepted date: 2023-05-04
in scheme: AQD - Quality control and assurance on CDR
hidden label: Must conform to a recognised Organisation Level. These are: International, Local, LocalAuthority, Municipality, National and Regional.
editorial note: [Crucial]: - INSPIRE requirement
error type: WARNING

If provide, must conform to a recognised network type in the vocabulary.
type: Concept
notation: D10
definition: The content of aqd:AQD_Network/aqd:networkType shall resolve to any concept in http://dd.eionet.europa.eu/vocabulary/aq/networktype/
status: valid
status modified: 2023-05-04
accepted date: 2023-05-04
in scheme: AQD - Quality control and assurance on CDR
hidden label: If provide, must conform to a recognised network type in the vocabulary.
error type: WARNING

Check closed SPOs do not have data for closed periods
type: Concept
notation: D100
definition: When a Sampling Point is closed, monitoring data for closed periods should not be in the system.
status: valid
status modified: 2024-01-09
accepted date: 2024-01-09
in scheme: AQD - Quality control and assurance on CDR
error type: ERROR

Start time must be before End time.
type: Concept
notation: D11
definition: aqd:AQD_Network/aqd:operationActivityPeriod/gml:TimePeriod/gml:beginPosition shall be less than gml:endPosition
status: valid
status modified: 2023-05-04
accepted date: 2023-05-04
in scheme: AQD - Quality control and assurance on CDR
hidden label: Network's Start time must be before End time.
editorial note: [Crucial]: Yes - IPR requirement (Annex II-D-ii-36)
error type: BLOCKER

Network name must be provided
type: Concept
notation: D12
definition: ./ef:name shall return a string
status: valid
status modified: 2023-05-04
accepted date: 2023-05-04
in scheme: AQD - Quality control and assurance on CDR
hidden label: Network name is required. Please revise.
editorial note: [Crucial]: Yes - IPR requirement (Annex II-D-ii-35)
error type: ERROR

Information on responsible authority for the network management must be provided
type: Concept
notation: D13
definition: Information on responsible authority for the network management must be provided
status: reserved
status modified: 2023-05-04
accepted date: 2023-05-04
in scheme: AQD - Quality control and assurance on CDR
hidden label: Information on responsible authority for the network management must be provided
editorial note: Not implemented - IPR requirement (Annex II-D-ii-36)

Must conform to a recognised Time Zone as vocabulary . These are UTC (+01 to +06) and (-01 to -06)
type: Concept
notation: D14
definition: The content of /aqd:AQD_Network/aqd:aggregationTimeZone attribute shall resolve to a valid code in http://dd.eionet.europa.eu/vocabulary/aq/timezone/
status: valid
status modified: 2023-05-04
accepted date: 2023-05-04
in scheme: AQD - Quality control and assurance on CDR
hidden label: Network's aggregation time zone is not correct
editorial note: [Crucial]: Yes -
error type: BLOCKER

Station ID must be a unique code.
type: Concept
notation: D15
definition: aqd:AQD_Station/ef:inspireId/base:Identifier/base:localId shall be an unique code within namespace
status: valid
status modified: 2023-05-04
accepted date: 2023-05-04
in scheme: AQD - Quality control and assurance on CDR
hidden label: LocalId(s) for stations are not unique
editorial note: [Crucial]: Yes - IPR requirement (Annex II-D-ii-1)
error type: BLOCKER

List unique namespaces used and count number of Stations used. Blocker will be returned if namespace is not unique.
type: Concept
notation: D16
definition: Count the number of unique AQD_Station (via localId) submitted within base:namespace. Blocker will be returned if base:namespace is not unique.
status: valid
status modified: 2023-05-04
accepted date: 2023-05-04
in scheme: AQD - Quality control and assurance on CDR
hidden label: Namespace are not unique
editorial note: [Crucial]: Yes -
error type: BLOCKER

Check namespace is registered
type: Concept
notation: D16.1
definition: Check that namespace is registered in vocabulary (http://dd.eionet.europa.eu/vocabulary/aq/namespace/view)
status: valid
status modified: 2023-05-04
accepted date: 2023-05-04
in scheme: AQD - Quality control and assurance on CDR
hidden label: Unregistered country namespaace has been used
editorial note: [Crucial]: Yes - System requirement
error type: BLOCKER

Station name must be provided
type: Concept
notation: D17
definition: ./ef:name shall return a string
status: valid
status modified: 2023-05-04
accepted date: 2023-05-04
in scheme: AQD - Quality control and assurance on CDR
hidden label: Station missing name
editorial note: [Crucial]: Yes - IPR requirement (Annex II-D-ii-6) - Error, the provision of Station name is MANDATORY.
error type: BLOCKER

Station must belong to a network
type: Concept
notation: D18
definition: ./ef:belongsTo shall resolve to a traversable local of global URI to ../AQD_Network
status: valid
status modified: 2023-05-04
accepted date: 2023-05-04
in scheme: AQD - Quality control and assurance on CDR
hidden label: Station(s) are not linked to network
editorial note: [Crucial]: - System requirement
error type: BLOCKER

Must conform to a recognised media value. These are: Air, Biota, Landscape, Sediment, Soil/Ground, Waste and Water.
type: Concept
notation: D19
definition: The content of /aqd:AQD_Station/ef:mediaMonitored shall resolve to any concept in http://inspire.ec.europa.eu/codelist/MediaValue/
status: valid
status modified: 2023-05-04
accepted date: 2023-05-04
in scheme: AQD - Quality control and assurance on CDR
hidden label: Codelist for am:environmentalDomain requires revision: INSPIRE codelist is required
editorial note: [Crucial]: -
error type: ERROR

Cross checks with other data-flows
type: Concept
notation: D1bCrossCheck
definition: Cross checks with other data-flows
status: valid
status modified: 2023-05-04
accepted date: 2023-05-04
in scheme: AQD - Quality control and assurance on CDR
error type: WARNING

The coordinate reference system for the stations must be defined with a correct uniform resource name
type: Concept
notation: D20
definition: The srsName attribute within ./ef:geometry/gml:Point shall be a recognisable URN. The following 3 srsNames are expected urn:ogc:def:crs:EPSG::3035 or urn:ogc:def:crs:EPSG::4258 or urn:ogc:def:crs:EPSG::4326
status: valid
status modified: 2023-05-04
accepted date: 2023-05-04
in scheme: AQD - Quality control and assurance on CDR
hidden label: Coordinate system for Station(s) needs revision
editorial note: [Crucial]: Yes - INSPIRE requiremnt
error type: BLOCKER

The location of the station must be correctly reported and within the countries' bounding box
type: Concept
notation: D21
definition: ./ef:geometry/gml:Point/gml:pos srsDimension attribute shall resolve to “2” to allow the coordinate of the station. ORDER of 2 coordinates MUST BE Latitude & Longitud when providing the accepted srsNames and found within the bounding box of the reporting country.
status: valid
status modified: 2023-05-04
accepted date: 2023-05-04
in scheme: AQD - Quality control and assurance on CDR
hidden label: Coordinate provided for Stations needs revision as not latitude/Longitude
editorial note: [Crucial]: Yes - IPR requirement (Annex II-D-ii-26) - Exception for FR
error type: BLOCKER

reserved
type: Concept
notation: D22
definition: ./ef:geometry/gml:Point shall resolve to within the geographic boundary or bounding box of the MS.
status: reserved
status modified: 2023-05-04
accepted date: 2023-05-04
in scheme: AQD - Quality control and assurance on CDR
hidden label: reserved
editorial note: Not implemented

Check if the operational period for the station is within the network it belongs to.
type: Concept
notation: D23
definition: List the total number aqd:AQD_Station invalid operational activity periods compared to aqd:AQD_Network
status: valid
status modified: 2023-05-04
accepted date: 2023-05-04
in scheme: AQD - Quality control and assurance on CDR
hidden label: Station has incorrect operation period
editorial note: [Crucial]: Yes - IPR requirement (Annex II-D-ii-7)
error type: WARNING

Total number of operational Stations
type: Concept
notation: D24
definition: List the total number of aqd:AQD_Station which are operational ./ef:operationActivityPeriod/ef:OperationActivityPeriod/ef:activityTime/gml:TimePeriod/gml:endPosition which are unclosed (null) or have an indeterminatePosition="unknown" attribute
status: valid
status modified: 2023-05-04
accepted date: 2023-05-04
in scheme: AQD - Quality control and assurance on CDR
hidden label: Total number of operational Stations
error type: WARNING

Station altitude must be provided in meters according to vocabulary and between -10 to 5700 meters
type: Concept
notation: D25
definition: Altitude <aqd:altitude uom="http://dd.eionet.europa.eu/vocabulary/uom/length/m"> must be provided as valid number between -10 to 5.700 and unit of measurement must match http://dd.eionet.europa.eu/vocabulary/uom/length/m. Example: <aqd:altitude uom="http://dd.eionet.europa.eu/vocabulary/uom/length/m">570</aqd:altitude>
status: valid
status modified: 2023-05-04
accepted date: 2023-05-04
in scheme: AQD - Quality control and assurance on CDR
editorial note: Re-introduced
error type: ERROR

Station code must be unique, starting with ISO2-country code
type: Concept
notation: D26
definition: AQD_Station/aqd:EUStationCode shall be an unique code for the station starting with ISO2-country code
status: valid
status modified: 2023-05-04
accepted date: 2023-05-04
in scheme: AQD - Quality control and assurance on CDR
hidden label: EUStationCode(s) are not unique
editorial note: [Crucial]: Yes, key - IPR requirement (Annex II-D-ii-2)
error type: BLOCKER

Station Meterological Parameters must conform to the standard "Climate and Forecast Standard" Subset of GRIB or the Meteo parameter list eionet data dictionary
type: Concept
notation: D27
definition: The content of aqd:AQD_Station/aqd:meteoParams shall resolve to any concept in http://vocab.nerc.ac.uk/collection/P07/current/, http://vocab.nerc.ac.uk/collection/I01/current/, http://dd.eionet.europa.eu/vocabulary/aq/meteoparameter/
status: valid
status modified: 2023-05-04
accepted date: 2023-05-04
in scheme: AQD - Quality control and assurance on CDR
hidden label: Station Meterological Parameters must conform to the standard "Climate and Forecast Standard" Subset of GRIB or the Meteo parameter list eionet data dictionary
editorial note: Not required - odd element if we really need to collect met data
error type: WARNING

Must conform to a recognised Station Classification from the eionet data dictionary. These are: Rural, Rural-Nearcity, Rural-Regional, Rural-Remote, Suburban, Urban
type: Concept
notation: D28
definition: The content of aqd:AQD_Station/aqd:areaClassification shall resolve to any concept in http://dd.eionet.europa.eu/vocabulary/aq/areaclassification/
status: valid
status modified: 2023-05-04
accepted date: 2023-05-04
in scheme: AQD - Quality control and assurance on CDR
hidden label: Codelist for station classification requires revision: EEA codelist is required
editorial note: [Crucial]: Yes - IPR requirement (Annex II-D-ii-28)
error type: BLOCKER

Must use a recognised Local description from the eionet data dictionary. These are: Canyon, Detached, Elevated and Open.
type: Concept
notation: D29
definition: The content of aqd:AQD_Station/aqd:dispersionLocal shall resolve to any concept in http://dd.eionet.europa.eu/vocabulary/aq/dispersionlocal/
status: valid
status modified: 2023-05-04
accepted date: 2023-05-04
in scheme: AQD - Quality control and assurance on CDR
hidden label: Codelist for local dispersion requires revision: EEA codelist is required
error type: ERROR

Must use a recognised Regional descriptor: Alpine, Base, Basin-Hilly, Coast-Mount, Coast-Plane, Hilly, Mount, Mount-Slope, Plane, Valley-Hilly and Valley-Mount.
type: Concept
notation: D30
definition: The content of aqd:AQD_Station/aqd:dispersionRegional shall resolve to any concept in http://dd.eionet.europa.eu/vocabulary/aq/dispersionregional/
status: valid
status modified: 2023-05-04
accepted date: 2023-05-04
in scheme: AQD - Quality control and assurance on CDR
hidden label: Codelist for regional dispersion requires revision: EEA codelist is required
error type: ERROR

Sampling Point local Id must be unique
type: Concept
notation: D31
definition: AQD_SamplingPoint/ef:inspireId/base:Identifier/base:localId not unique codes:
status: valid
status modified: 2023-05-04
accepted date: 2023-05-04
in scheme: AQD - Quality control and assurance on CDR
hidden label: LocalId(s) for samplingPoint(s) are not unique
editorial note: [Crucial]: Yes - IPR requirement (Annex II-D-ii-1)
error type: BLOCKER

List unique namespaces used and count number of SamplingPoint used.
type: Concept
notation: D32
definition: Count the number of unique AQD_SamplingPoint (via localId) submitted within base:namespace.
status: valid
status modified: 2023-05-04
accepted date: 2023-05-04
in scheme: AQD - Quality control and assurance on CDR
hidden label: Namespace are not unique
editorial note: [Crucial]: Yes - INSPIRE & system requirement
error type: BLOCKER

Check namespace is registered
type: Concept
notation: D32.1
definition: Check that namespace is registered in vocabulary (http://dd.eionet.europa.eu/vocabulary/aq/namespace/view)
status: valid
status modified: 2023-05-04
accepted date: 2023-05-04
in scheme: AQD - Quality control and assurance on CDR
hidden label: Unregistered country namespaace has been used
editorial note: [Crucial]: Yes - System requirement
error type: BLOCKER

Must conform to the code 'air' in the Media codelist in the Inspire registry
type: Concept
notation: D33
definition: The content of aqd:AQD_SamplingPoint/ef:mediaMonitored shall resolve to any concept inhttp://dd.eionet.europa.eu/vocabulary/inspire/MediaValue/
status: valid
status modified: 2023-05-04
accepted date: 2023-05-04
in scheme: AQD - Quality control and assurance on CDR
hidden label: Codelist for am:environmentalDomain requires revision: INSPIRE codelist is required
error type: ERROR

The coordinate reference system for the zones must be defined with a correct uniform resource name
type: Concept
notation: D34
definition: aqd:AQD_SamplingPoint/am:geometry/gml:Point the srsName attribute shall be a recognisable URN . The following 3 srsNames are expected urn:ogc:def:crs:EPSG::3035 or urn:ogc:def:crs:EPSG::4258 or urn:ogc:def:crs:EPSG::4326
status: valid
status modified: 2023-05-04
accepted date: 2023-05-04
in scheme: AQD - Quality control and assurance on CDR
hidden label: Coordinate system for SamplingPoints needs revision
editorial note: [Crucial]: Yes - Not required under IPR. However this is rather important
error type: BLOCKER

The Dimension attribute shall resolve to "2" and the order must be Latitude & Longitude
type: Concept
notation: D35
definition: The srsDimension attribute within ./ef:geometry/gml:Point/gml:pos shall resolve to “2” to allow the x.y-coordinate of the station ORDER of 2 coordinates MUST BE Latitude & Longitude when providing the accepted srsNames (see D34)
status: valid
status modified: 2023-05-04
accepted date: 2023-05-04
in scheme: AQD - Quality control and assurance on CDR
hidden label: Coordinate provided for SamplingPoints needs revision as not latitude/Longitude
editorial note: [Crucial]: Yes - Not required under IPR. However this is rather important
error type: BLOCKER

The sampling point location shall resolve within the approximate location of the AQD_Station
type: Concept
notation: D36
definition: ./ef:geometry/gml:Point/gml:pos shall resolve to within the approximate geographic location of the AQD_Station cited by .aqd:AQD_SamplingPoint ef:broader
status: valid
status modified: 2023-05-04
accepted date: 2023-05-04
in scheme: AQD - Quality control and assurance on CDR
hidden label: SamplingPoint coordinates seem to be too distant to the Station. Please revise
editorial note: [Crucial]: Yes - Quality check
error type: ERROR

Check if the operational period for the Sampling Points is invalid or overlaps
type: Concept
notation: D37
definition: .ef:observingCapability/ef:ObservingCapability/ef:observingTime/gml:TimePeriod/gml:beginPosition shall be equal to or less than ./ef:operationalActivityPeriod/ef:OperationalActivityPeriod/ef:activityTime/gml:TimePeriod /gml:endPosition gml:TimePeriod within the multiple ef:observingCapability MUST NOT overlap which each other
status: superseded
status modified: 2023-05-04
accepted date: 2023-05-04
in scheme: AQD - Quality control and assurance on CDR
hidden label: Operational times for SamplingPoins and Station need revising due to being invalid or overlap
editorial note: [Crucial]: Yes - Quality check. Moved to d37a and d37b
error type: BLOCKER

Check if any sampling point includes more than one Operational Activity Period.
type: Concept
notation: D37a
definition: Sampling point can only include one ./ef:operationalActivityPeriod/ef:OperationalActivityPeriod. Multiple entries will be return error/blocker.
status: valid
status modified: 2023-05-04
accepted date: 2023-05-04
in scheme: AQD - Quality control and assurance on CDR
error type: ERROR

Check if the time period of the Observing Capability(ies) operate within overall OperationalActivity of the Sampling Points, are invalid and do not overlap
type: Concept
notation: D37b
definition: .ef:observingCapability/ef:ObservingCapability/ef:observingTime/gml:TimePeriod/gml:beginPosition shall be equal to or less than ./ef:operationalActivityPeriod/ef:OperationalActivityPeriod/ef:activityTime/gml:TimePeriod /gml:endPosition gml:TimePeriod within the multiple ef:observingCapability MUST NOT overlap which each other. The check will result in a warning if initial gaps are detected pre-eReporting (before 2013/01/01) The check will be skipped if d37a is a blocker.
status: valid
status modified: 2023-05-04
accepted date: 2023-05-04
in scheme: AQD - Quality control and assurance on CDR
editorial note: Amended wording after improvements on d37a and d37b.
error type: ERROR

Check that a Sampling Point with only one Observing Capability has an OperationalActivityPeriod older than 12 years
type: Concept
notation: D37c
definition: A Sampling Point with only one Observing Capability is expected not to have OperationalActivityPeriod older than 12 years. In the live spam of a sampling points (with changes in equipment), multiple observing capabilities are expected.
status: valid
status modified: 2023-11-21
accepted date: 2023-11-21
in scheme: AQD - Quality control and assurance on CDR
error type: WARNING

Check if superseded SamplingPoint exists in previous deliveries.
type: Concept
notation: D38
definition: Check if there is element <ef:supersedes/> in the delivery. This element must link to an existing SamplingPoint
status: valid
status modified: 2023-05-04
accepted date: 2023-05-04
in scheme: AQD - Quality control and assurance on CDR
hidden label: reserved

Preventive check - Check if any SamplingPoint is being superseded or supersedes this delivery.
type: Concept
notation: D39
definition: Preventive check if any SamplingPoint has element <ef:supersedes/> and/or <ef:supersededBy/> in the delivery. This is to ensure that the element is not misused and will prevent errors in the database.
status: experimental
status modified: 2023-05-04
accepted date: 2023-05-04
in scheme: AQD - Quality control and assurance on CDR
error type: BLOCKER

Pollutant must be a registered under vocabulary and each SamplingPoint must be defined for a unique pollutant under all measurement configurations
type: Concept
notation: D40
definition: The content of ../ef:observedProperty shall resolve to a valid code within http://dd.eionet.europa.eu/vocabulary/aq/pollutant/ and within a unique SamplingPoint, multiple ef:observedProperty may be found. These MUST always resolve to the same code
status: valid
status modified: 2023-05-04
accepted date: 2023-05-04
in scheme: AQD - Quality control and assurance on CDR
hidden label: Codelist for all pollutants requires revision: EEA codelist is required
editorial note: [Crucial]: Yes - INSPIRE requirement
error type: BLOCKER

Links between SamplingPoint and Sample shall be traceable and valid
type: Concept
notation: D41
definition: Cross-check with AQD_Sample (./ef:observingCapability/ef:ObservingCapability/ef:featureOfInterest/@xlink shall resolve to a traversable local of global URI to an ../AQD_Sample)
status: valid
status modified: 2023-05-04
accepted date: 2023-05-04
in scheme: AQD - Quality control and assurance on CDR
hidden label: Incorrect link between SamplingPoint and Sample
editorial note: [Crucial]: YES, key check - System requirement
error type: BLOCKER

Links between SamplingPoint and SamplingPointProcess shall be traceable and valid
type: Concept
notation: D42
definition: Cross-check with AQD_SamplingPointProcess (./ef:observingCapability/ef:ObservingCapability/ef:procedure/@xlink shall resolve to a traversable local of global URI to ../AQD_SamplingPointProcess)
status: valid
status modified: 2023-05-04
accepted date: 2023-05-04
in scheme: AQD - Quality control and assurance on CDR
hidden label: Incorrect link between SamplingPoint and SamplingPointProcess
editorial note: [Crucial]: YES, key check - System requirement
error type: BLOCKER

Links between SamplingPoint and Station shall be traceable and valid
type: Concept
notation: D43
definition: Cross-check with AQD_Station (../ef:broader/@xlink shall resolve to a traversable local of global URI to ../AQD_Station)
status: valid
status modified: 2023-05-04
accepted date: 2023-05-04
in scheme: AQD - Quality control and assurance on CDR
hidden label: Incorrect link between SamplingPoint and Station
editorial note: [Crucial]: YES, key check - System requirement Works if all in one XML
error type: BLOCKER

Links between Station and Network shall be traceable and valid
type: Concept
notation: D44
definition: Cross-check with AQD_Network (aqd:AQD_SamplingPoint/ef:belongsTo shall resolve to a traversable local of global URI to ../AQD_Network)
status: valid
status modified: 2023-05-04
accepted date: 2023-05-04
in scheme: AQD - Quality control and assurance on CDR
hidden label: Incorrect link between Station and Network
editorial note: [Crucial]: YES, key check - System requirement
error type: BLOCKER

Links between SamplingPoint and Network shall be traceable and valid
type: Concept
notation: D44b
definition: Cross-check with AQD_Network (aqd:AQD_Station/ef:belongsTo shall resolve to a traversable local of global URI to ../AQD_Network)
status: retired
status modified: 2023-05-04
accepted date: 2023-05-04
in scheme: AQD - Quality control and assurance on CDR
hidden label: Incorrect link between SamplingPoint and Network
editorial note: removed

Invalid or overlapping operational activity periods
type: Concept
notation: D45
definition: Total number aqd:AQD_SamplingPoint/ef:operationActivityPeriod/ef:OperationActivityPeriod/ef:activityTime/gml:TimePeriod/ invalid operational activity periods
status: valid
status modified: 2023-05-04
accepted date: 2023-05-04
in scheme: AQD - Quality control and assurance on CDR
hidden label: Operational times for SamplingPoins need revising due to being invalid
editorial note: [Crucial]: Yes -
error type: ERROR

Number of operational sampling points:
type: Concept
notation: D46
definition: Total number of AQD_SamplingPoints which are operational
status: valid
status modified: 2023-05-04
accepted date: 2023-05-04
in scheme: AQD - Quality control and assurance on CDR
hidden label: Number of operational sampling points:
error type: INFO

reserved
type: Concept
notation: D47
definition: ./ef:operationActivityPeriod/ef:OperationActivityPeriod/ef:activityTime/gml:TimePeriod/gml:endPosition with valid content (historical content) shall indicate that the environmental monitoring feature type is no longer operational.
status: reserved
status modified: 2023-05-04
accepted date: 2023-05-04
in scheme: AQD - Quality control and assurance on CDR
editorial note: Not implemented

Check that Assessment Type conforms to: Fixed, Indicative, Model or Objective
type: Concept
notation: D48
definition: ./aqd:assessmentType shall resolve to http://dd.eionet.europa.eu/vocabulary/aq/assessmenttype/ via xlink:href
status: valid
status modified: 2023-05-04
accepted date: 2023-05-04
in scheme: AQD - Quality control and assurance on CDR
hidden label: Check that Assessment Type conforms to: Fixed, Indicative, Model or Objective
editorial note: Implemented via Check xlink references
error type: ERROR

Check that all elements under relevantEmissions conforms to registered vocabulary
type: Concept
notation: D49
definition: Check that all elements under./aqd:relevantEmissions shall resolve to http://dd.eionet.europa.eu/vocabulary/aq/ via xlink:href and http://dd.eionet.europa.eu/vocabulary/uom/ via uom. PLEASE NOTE the system expect the usage of FULL URL like: http://dd.eionet.europa.eu/vocabulary/uom/length/m http://dd.eionet.europa.eu/vocabulary/aq/emissionsource/2
status: experimental
status modified: 2023-05-04
accepted date: 2023-05-04
in scheme: AQD - Quality control and assurance on CDR
hidden label: Check that main emission source conforms to registered vocabulary
editorial note: Implemented via Check xlink references
error type: BLOCKER

Check that Classifications conforms to: Background, Industrial or Traffic
type: Concept
notation: D50
definition: Total number/aqd:stationClassification which resolve to http://dd.eionet.europa.eu/vocabulary/aq/stationclassification/ via xlink:href
status: valid
status modified: 2023-05-04
accepted date: 2023-05-04
in scheme: AQD - Quality control and assurance on CDR
hidden label: Codelist for samplingPoint classification requires revision: EEA codelist is required
editorial note: [Crucial]: Yes - IPR requirement (Annex II-D-ii-22)
error type: BLOCKER

Number of invalid 3 elements in Sampling Point and Environmental Objective combinations:
type: Concept
notation: D51
definition: Number of invalid 3 elements aqd:AQD_SamplingPoint/aqd:environmentalObjective/aqd:EnvironmentalObjective/ combinations:
status: valid
status modified: 2023-05-04
accepted date: 2023-05-04
in scheme: AQD - Quality control and assurance on CDR
hidden label: The Environmental Objective combination declared under SamplingPoint are invalid. Please revise.
editorial note: [Crucial]: - Not required under IPR
error type: ERROR

reserved
type: Concept
notation: D52
status: reserved
status modified: 2023-05-04
accepted date: 2023-05-04
in scheme: AQD - Quality control and assurance on CDR

Check if there are any invalid link from SamplingPoint to zone(s)
type: Concept
notation: D53
definition: Number of invalid aqd:AQD_SamplingPoint/aqd:zone xlinks:
status: valid
status modified: 2023-05-04
accepted date: 2023-05-04
in scheme: AQD - Quality control and assurance on CDR
hidden label: Incorrect link between SamplingPoint(s) and zone(s)
editorial note: [Crucial]: Yes - IPR requirement (Annex II-D-ii-22)
error type: INFO

Local Id for Sampling Point Process must be unique
type: Concept
notation: D54
definition: aqd:AQD_SamplingPointProcess/ompr:inspireId/base:Identifier/base:localId not unique codes:
status: valid
status modified: 2023-05-04
accepted date: 2023-05-04
in scheme: AQD - Quality control and assurance on CDR
hidden label: LocalId(s) for samplingPointProcess(es) are not unique
editorial note: [Crucial]: Yes -
error type: BLOCKER

List unique namespaces used and count number of SamplingPointProcess(es) used.
type: Concept
notation: D55
definition: Count the number of unique AQD_SamplingPointProcess (via localId) submitted within base:namespace
status: valid
status modified: 2023-05-04
accepted date: 2023-05-04
in scheme: AQD - Quality control and assurance on CDR
hidden label: Namespace are not unique
editorial note: [Crucial]: Yes -
error type: INFO

Check namespace is registered
type: Concept
notation: D55.1
definition: Check that namespace is registered in vocabulary (http://dd.eionet.europa.eu/vocabulary/aq/namespace/view)
status: valid
status modified: 2023-05-04
accepted date: 2023-05-04
in scheme: AQD - Quality control and assurance on CDR
hidden label: Unregistered country namespaace has been used
editorial note: [Crucial]: Yes - System requirement
error type: BLOCKER

Must conform to a recognised Measurement Type from the eionet data dictionary. These are: Active, Automatic, Passive, Remote and Unknown.
type: Concept
notation: D56
definition: ./aqd:measurementType shall resolve to http://dd.eionet.europa.eu/vocabulary/aq/measurementtype/[concept]
status: valid
status modified: 2023-05-04
accepted date: 2023-05-04
in scheme: AQD - Quality control and assurance on CDR
hidden label: Codelist for measurementType requires revision: EEA codelist is required
editorial note: [Crucial]: Yes - IPR requirement (Annex II-D-ii-8)
error type: BLOCKER

If Measurement Type is Automatic or Remote, Measurement Method must be provided. However, Sampling Method and Technique shall not be provided.
type: Concept
notation: D57
definition: If ./aqd:measurementType resolves to ./measurementtype/automatic or ./measurementtype/remote, aqd:measurementMethod & aqd:measurementEquipment MUST be included AND /aqd:samplingMethod and ./aqd:analyticalTechnique SHALL NOT BE PROVIDED
status: valid
status modified: 2024-02-27
accepted date: 2023-05-04
in scheme: AQD - Quality control and assurance on CDR
hidden label: Key information is missing for automatic/remote methods
editorial note: Content check requirement
error type: ERROR

If Measurement Type is Active or Passive then Sampling Method and Analytical Technique must be provided. Measurement method shall not be provided.
type: Concept
notation: D58
definition: If ./aqd:measurementType resolves to http://dd.eionet.europa.eu/vocabulary/aq/measurementtype/active or http://dd.eionet.europa.eu/vocabulary/aq/measurementtype/passive ./aqd:samplingMethod & ./aqd:analyticalTechnique shall be included AND ./aqd:measurementMethod SHALL NOT BE PROVIDED
status: valid
status modified: 2023-05-04
accepted date: 2023-05-04
in scheme: AQD - Quality control and assurance on CDR
hidden label: Key information is missing for active/passive methods
editorial note: Content check requirement
error type: ERROR

Analytical Technique must use any of the analytical technique recognised methods in the eionet data dictionary.
type: Concept
notation: D59
definition: The content of /aqd:AQD_SamplingPointProcess/aqd:analyticalTechnique shall resolve to any concept inhttp://dd.eionet.europa.eu/vocabulary/aq/analyticaltechnique/
status: valid
status modified: 2023-05-04
accepted date: 2023-05-04
in scheme: AQD - Quality control and assurance on CDR
hidden label: Codelist for analyticalTechnique requires revision: EEA codelist is required
editorial note: [Crucial]: Yes - IPR requirement (Annex II-D-ii-8+10)
error type: BLOCKER

When measurementMethod is provided, please use any of the measurement methods in the eionet data dictionary.
type: Concept
notation: D60a
definition: The content of aqd:measurementMethod MUST resolve to any concept in http://dd.eionet.europa.eu/vocabulary/aq/measurementmethod/
status: valid
status modified: 2023-05-04
accepted date: 2023-05-04
in scheme: AQD - Quality control and assurance on CDR
hidden label: Codelist for measurementType requires revision: EEA codelist is required
editorial note: [Crucial]: Yes - IPR requirement (Annex II-D-ii-8+10)
error type: BLOCKER

When Sampling Equipment is provided, please use any of the sampling equipment in the eionet data dictionary.
type: Concept
notation: D60b
definition: The content of aqd:AQD_SamplingPointProcess/aqd:samplingEquipment/aqd:SamplingEquipment/aqd:equipment MUST resolve to any concept in http://dd.eionet.europa.eu/vocabulary/aq/samplingequipment/
status: valid
status modified: 2023-05-04
accepted date: 2023-05-04
in scheme: AQD - Quality control and assurance on CDR
hidden label: Codelist for measurementType requires revision: EEA codelist is required
editorial note: [Crucial]: Yes - IPR requirement (Annex II-D-ii-8+10)
error type: BLOCKER

When Measurement Equipment is provided, please use any of the measurement equipment in the eionet data dictionary.
type: Concept
notation: D60c
definition: The content of aqd:measurementEquipment/aqd:MeasurementEquipment/aqd:equipment MUST resolve to any concept in http://dd.eionet.europa.eu/vocabulary/aq/measurementequipment/
status: valid
status modified: 2023-05-04
accepted date: 2023-05-04
in scheme: AQD - Quality control and assurance on CDR
error type: BLOCKER

When Sampling Method is provided, please use any of the sampling methods in the eionet data dictionary.
type: Concept
notation: D60d
definition: The content of aqd:samplingMethod MUST resolve to any concept in http://dd.eionet.europa.eu/vocabulary/aq/samplingmethod/
status: valid
status modified: 2023-05-04
accepted date: 2023-05-04
in scheme: AQD - Quality control and assurance on CDR
error type: BLOCKER

Please contact IPR helpdesk in order to add new vocabulary for either MeasurementMethods/MeasurementEquipment/SamplingMethod/SamplingEquipment/AnalyticalTecnique
type: Concept
notation: D61
definition: If /aqd:AQD_SamplingPointProcess/aqd:measurementMethod/aqd:MeasurementMethod/aqd:otherMeasurementMethod, /aqd:AQD_SamplingPointProcess/aqd:measurementEquipment/aqd:MeasurementEquipment/aqd:otherEquipment, /aqd:AQD_SamplingPointProcess/aqd:samplingMethod/aqd:SamplingMethod/aqd:otherSamplingMethod, /aqd:AQD_SamplingPointProcess/aqd:SamplingEquipment/aqd:SamplingEquipment/aqd:otherEquipment or /aqd:AQD_SamplingPointProcess/aqd:analyticalTechnique/aqd:AnalyticalTechnique/aqd:otherAnalyticalTechnique populated must give a warning to contact helpdesk to add new vocabulary
status: valid
status modified: 2023-05-04
accepted date: 2023-05-04
in scheme: AQD - Quality control and assurance on CDR
hidden label: Method(s) and equipment(s) have been provided using the element Other
hidden label: Method(s) and equipment(s) have been provided using the element
editorial note: [Crucial]: -
error type: BLOCKER

SamplingPointProcess parameters shall conform with registered vocabulary
type: Concept
notation: D62
definition: ./ompr:processParameter/ompr:ProcessParameter/ompr:name must correspond to a valid code under http://dd.eionet.europa.eu/vocabulary/aq/processparameter/
status: valid
status modified: 2023-05-04
accepted date: 2023-05-04
in scheme: AQD - Quality control and assurance on CDR
hidden label: Codelist for process parameter requires revision: EEA codelist is required
editorial note: [Crucial]: -
error type: ERROR

If Detection Limit is specified, then a link to a concentration value from the eionet data dictionary must be provided.
type: Concept
notation: D63
definition: Where ./aqd:detectionLimit is resolved uom link resolving to any concept in http://dd.eionet.europa.eu/vocabulary/uom/concentration/ shall be provided
status: valid
status modified: 2023-05-04
accepted date: 2023-05-04
in scheme: AQD - Quality control and assurance on CDR
hidden label: Codelist for Detection Limit unit requires revision: EEA codelist is required
editorial note: [Crucial]: Yes - IPR requirement (Annex II-D-ii-11)
error type: BLOCKER

Check that measurementMethod, aqd:samplingMethod & aqd:analyticalTechnique is persistent of the samplingPointProcess ID
type: Concept
notation: D64
definition: f ./aqd:measurementType resolves to ./measurementtype/automatic or ./measurementtype/remote, aqd:measurementMethod MUST be the same as provided in previous delivery If ./aqd:measurementType resolves to http://dd.eionet.europa.eu/vocabulary/aq/measurementtype/active or http://dd.eionet.europa.eu/vocabulary/aq/measurementtype/passive /aqd:samplingMethod & ./aqd:analyticalTechnique MUST be the same as provided in previous delivery
status: valid
status modified: 2023-11-21
accepted date: 2023-11-21
in scheme: AQD - Quality control and assurance on CDR
error type: BLOCKER

Check persistence of sampling point process
type: Concept
notation: D64a
definition: Check persistence of sampling point process reported for same samplingpoint/observingCapability
status: valid
status modified: 2023-12-05
accepted date: 2023-12-05
in scheme: AQD - Quality control and assurance on CDR

Check that measurement equipment is for the right pollutant.
type: Concept
notation: D64b
definition: Check that the measurement equipment (https://dd.eionet.europa.eu/vocabulary/aq/measurementequipment) used is correct for the pollutant measured. Please contact the helpdesk if EEA vocabulary needs updating.
status: valid
status modified: 2023-12-05
accepted date: 2023-12-05
in scheme: AQD - Quality control and assurance on CDR
error type: ERROR

Time unit for process duration and cadence shall conform with registered vocabulary
type: Concept
notation: D65
definition: ./aqd:unit shall resolve to http://dd.eionet.europa.eu/vocabulary/uom/time/
status: valid
status modified: 2023-05-04
accepted date: 2023-05-04
in scheme: AQD - Quality control and assurance on CDR
hidden label: Codelist for Time unit requires revision: EEA codelist is required
editorial note: [Crucial]: - IPR requirement (Annex II-D-ii-14+15)
error type: BLOCKER

reserved
type: Concept
notation: D66
definition: ./aqd:numUnits shall contain an integer value
status: reserved
status modified: 2023-05-04
accepted date: 2023-05-04
in scheme: AQD - Quality control and assurance on CDR
editorial note: Not implemented - IPR requirement (Annex II-D-ii-14+15)

Sampling Process (used for compliance) was reported without or incorrect information on Equivalence demonstration.
type: Concept
notation: D67a
definition: Where ../AQD_SamplingPoint/aqd:usedAQD is “true”, ./aqd:equivalenceDemonstration/aqd:EquivalenceDemonstration/aqd:equivalenceDemonstrated must resolve to http://dd.eionet.europa.eu/vocabulary/aq/equivalencedemonstrated/
status: valid
status modified: 2023-05-04
accepted date: 2023-05-04
in scheme: AQD - Quality control and assurance on CDR
hidden label: Information on reference/equivalence demonstration is required for SamplingPoints used for Assessement
editorial note: [Crucial]: Yes - IPR requirement (Annex II-D-ii-12)
error type: ERROR

Sampling Process was reported without or incorrect information on Equivalence demonstration.
type: Concept
notation: D67b
definition: ./aqd:equivalenceDemonstration/aqd:EquivalenceDemonstration/aqd:equivalenceDemonstrated should resolve to http://dd.eionet.europa.eu/vocabulary/aq/equivalencedemonstrated/ for all SamplingPointProcess
status: valid
status modified: 2023-05-04
accepted date: 2023-05-04
in scheme: AQD - Quality control and assurance on CDR
hidden label: Sampling Process was reported without or incorrect information on Equivalence demonstration.
editorial note: [Crucial]: Yes - IPR requirement (Annex II-D-ii-12)
error type: WARNING

Sampling Process was declared as an equivalent method but the Demonstration Report was not provided.
type: Concept
notation: D68
definition: SamplingPointProcess(es) declared as an equivalent method” i.e. http://dd.eionet.europa.eu/vocabulary/aq/equivalencedemonstrated/yes but /aqd:demonstrationReport not provided.
status: valid
status modified: 2023-05-04
accepted date: 2023-05-04
in scheme: AQD - Quality control and assurance on CDR
hidden label: Equivalent demonstration report is missing
editorial note: [Crucial]: Yes - IPR requirement (Annex II-D-ii-13)
error type: ERROR

Sampling Process is missing mandatory document on Traceability and Uncertainty Estimation or QA report
type: Concept
notation: D69
definition: SamplingPointProcess(es) is missing mandatory document on Traceability and Uncertainty Estimation via aqd:AQD_SamplingPointProcess/aqd:dataQuality/aqd:DataQuality/aqd:documentation OR ./aqd:qaReport
status: valid
status modified: 2023-05-04
accepted date: 2023-05-04
in scheme: AQD - Quality control and assurance on CDR
hidden label: Document on traceability and uncertatinity estimation or QA report missing
editorial note: [Crucial]: Yes - IPR requirement (Annex II-D-ii-43+44)
error type: ERROR

Check closed SamplingPoints versus the link between Assessment Regimes and measurement methods
type: Concept
notation: D70
definition: Check closed SamplingPoints versus the link between Assessment Regimes and measurement methods
status: valid
status modified: 2023-12-05
accepted date: 2023-12-05
in scheme: AQD - Quality control and assurance on CDR
hidden label: reserved
error type: ERROR

Local Id for Sample must be unique
type: Concept
notation: D71
definition: aqd:AQD_Sample/ompr:inspireId/base:Identifier/base:localId not unique codes:
status: valid
status modified: 2023-05-04
accepted date: 2023-05-04
in scheme: AQD - Quality control and assurance on CDR
hidden label: LocalId(s) for sample(s) are not unique
editorial note: [Crucial]: Yes - INSPIRE requirement
error type: BLOCKER

List unique namespaces used and count number of Sample(s) used.
type: Concept
notation: D72
definition: Count the number of unique AQD_Sample (via localId) submitted within base:namespace
status: valid
status modified: 2023-05-04
accepted date: 2023-05-04
in scheme: AQD - Quality control and assurance on CDR
hidden label: Namespace are not unique
editorial note: [Crucial]: Yes - INSPIRE requirement
error type: BLOCKER

Check namespace is registered
type: Concept
notation: D72.1
definition: Check that namespace is registered in vocabulary (http://dd.eionet.europa.eu/vocabulary/aq/namespace/view)
status: valid
status modified: 2023-05-04
accepted date: 2023-05-04
in scheme: AQD - Quality control and assurance on CDR
hidden label: Unregistered country namespaace has been used
editorial note: [Crucial]: Yes - INSPIRE requirement
error type: BLOCKER

The coordinate reference system for the zones must be defined with a correct uniform resource name
type: Concept
notation: D73
definition: ./sams:shape/gml:Point the srsName attribute shall be a recognisable URN . The following 3 srsNames are expected urn:ogc:def:crs:EPSG::3035 or urn:ogc:def:crs:EPSG::4258 or urn:ogc:def:crs:EPSG::4326
status: valid
status modified: 2023-05-04
accepted date: 2023-05-04
in scheme: AQD - Quality control and assurance on CDR
hidden label: Coordinate system for Sample needs revision
editorial note: [Crucial]: Yes - INSPIRE/System requirement
error type: BLOCKER

The srsDimension attribute must be '2'.
type: Concept
notation: D74
definition: ./sams:shape/gml:Point, the srsDimension attribute shall resolve to “2” to allow the coordinate of the feature of interest
status: valid
status modified: 2023-05-04
accepted date: 2023-05-04
in scheme: AQD - Quality control and assurance on CDR
hidden label: Coordinate provided for SamplingPoints needs revision as not latitude/Longitude
editorial note: [Crucial]: Yes -
error type: BLOCKER

The Sample should be located near the SamplingPoint
type: Concept
notation: D75
definition: ./sams:shape/gml:Point/gml:pos shall resolve to within the approximate geographic location of the sampling point referencing the ../AQD_Sample record via ../aqd:AQD_SamplingPoint/ef:observingCapability/ef:ObservingCapability/ef:featureOfInterest
status: valid
status modified: 2023-05-04
accepted date: 2023-05-04
in scheme: AQD - Quality control and assurance on CDR
hidden label: Same coordinates seem to be too distant to the SamplingPoint. Please revise
error type: ERROR

Distance to building should be provided if SamplingPoint is classified as Traffic
type: Concept
notation: D76
definition: ./aqd:builldingDistance shall contain a numerical value, WHERE ../aqd:AQD_SamplingPoint/aqd:relevantEmissions/aqd:RelevantEmissions/aqd:stationClassification = http://dd.eionet.europa.eu/vocabulary/aq/stationclassification/traffic AND ../aqd:AQD_SamplingPoint/ef:observingCapability/ef:ObservingCapability/ef:featureOfInterest is xlinked to this./aqd:AQD_Sample via /aqd:inspireId/base:Identifier/base:localId
status: valid
status modified: 2023-05-04
accepted date: 2023-05-04
in scheme: AQD - Quality control and assurance on CDR
hidden label: Traffic samplingPoint miss distance to building. Please revise Sample (inlet)
editorial note: [Crucial]: - IPR requirement (Annex II-D-ii-20)
error type: ERROR

Distance to kerbside should be provided if SamplingPoint is classified as Traffic
type: Concept
notation: D77
definition: ./aqd:kerbDistance shall contain a numerical value, WHERE ../aqd:AQD_SamplingPoint/aqd:relevantEmissions/aqd:RelevantEmissions/aqd:stationClassification is EQUAL to http://dd.eionet.europa.eu/vocabulary/aq/stationclassification/traffic AND ../aqd:AQD_SamplingPoint/ef:observingCapability/ef:ObservingCapability/ef:featureOfInterest is xlinked to this./aqd:AQD_Sample via /aqd:inspireId/base:Identifier/base:localId
status: valid
status modified: 2023-05-04
accepted date: 2023-05-04
in scheme: AQD - Quality control and assurance on CDR
hidden label: Traffic samplingPoint miss distance to kerbside Please revise Sample (inlet)
editorial note: [Crucial]: - IPR requirement (Annex II-D-ii-21)
error type: ERROR

Inlet Height must be in meters and between 0 to 30 meters. URL to uom must be full.
type: Concept
notation: D78
definition: ./aqd:inletHeight shall contain a numerical value between 0 to 30.0 and unit of measurement (uom) shall resolve to http://dd.eionet.europa.eu/vocabulary/uom/length/m
status: valid
status modified: 2023-05-04
accepted date: 2023-05-04
in scheme: AQD - Quality control and assurance on CDR
hidden label: Inlet height is expected to use EEA uom vocabulary
editorial note: [Crucial]: Yes - IPR requirement (Annex II-D-ii-19)
error type: ERROR

reserved
type: Concept
notation: D79
definition: sam:sampledFeature shall resolve to a traversable local of global URI to an ../AQD_RepresentativeArea or a nilReason must be provided like <sam:sampledFeature nilReason="unknown"/>
status: reserved
status modified: 2023-05-04
accepted date: 2023-05-04
in scheme: AQD - Quality control and assurance on CDR
hidden label: reserved
editorial note: Not implemented

reserved
type: Concept
notation: D80
definition: ./aqd:inspireId/base:Identifier/base:localId shall be an unique code for AQD_RepresentativeArea and unique within namespace
status: reserved
status modified: 2023-05-04
accepted date: 2023-05-04
in scheme: AQD - Quality control and assurance on CDR
hidden label: reserved
editorial note: Not implemented

List unique namespaces used and count number of Sample used.
type: Concept
notation: D81
definition: ./aqd:InspireId/base:Identifier/base:namespace shall be a unique namespace identifier for the data source (within an annual e-Reporting cycle). The namespace value will be owned by the data provider of the spatial object
status: valid
status modified: 2023-05-04
accepted date: 2023-05-04
in scheme: AQD - Quality control and assurance on CDR
hidden label: Namespace are not unique
editorial note: [Crucial]: - INSPIRE requirement
error type: BLOCKER

Check namespace is registered
type: Concept
notation: D81.1
definition: Check that namespace is registered in vocabulary (http://dd.eionet.europa.eu/vocabulary/aq/namespace/view)
status: valid
status modified: 2023-05-04
accepted date: 2023-05-04
in scheme: AQD - Quality control and assurance on CDR
hidden label: Unregistered country namespaace has been used
editorial note: [Crucial]: - INSPIRE requirement
error type: BLOCKER

reserved
type: Concept
notation: D82
definition: ./sam:sampledFeature shall resolve to http://sweet.jpl.nasa.gov/2.2/realm.owl#Atmosphere
status: reserved
status modified: 2023-05-04
accepted date: 2023-05-04
in scheme: AQD - Quality control and assurance on CDR
hidden label: reserved
editorial note: Not implemented

reserved
type: Concept
notation: D83
definition: The srsName attribute within ./sams:shape/gml:Point shall be a recognisable URN. The following 3 srsNames are expected urn:ogc:def:crs:EPSG::3035 or urn:ogc:def:crs:EPSG::4258 or urn:ogc:def:crs:EPSG::4326 Alternatives, like http://www.opengis.net/gml/srs/epsg.xml#4258 or EPSG:4258 should be flagged as error
status: reserved
status modified: 2023-05-04
accepted date: 2023-05-04
in scheme: AQD - Quality control and assurance on CDR
hidden label: reserved
editorial note: Not implemented

reserved
type: Concept
notation: D84
definition: ./sams:shape/gml:Polygon/gml:exterior/gml:LinearRing/gml:posList shall resolve to within the approximate geographic location of the sampling point referencing the
status: reserved
status modified: 2023-05-04
accepted date: 2023-05-04
in scheme: AQD - Quality control and assurance on CDR
hidden label: reserved
editorial note: Not implemented

reserved
type: Concept
notation: D85
definition: ./sams:shape/gml:Polygon/gml:exterior/gml:LinearRing/gml:posList srsDimension attribute shall resolve to “2” to allow the x &y-coordinate of the feature of interest. ORDER of 2 coordinates MUST BE Latitude & Longitud when providing the accepted srsNames (see D81)
status: reserved
status modified: 2023-05-04
accepted date: 2023-05-04
in scheme: AQD - Quality control and assurance on CDR
hidden label: reserved
editorial note: Not implemented

reserved
type: Concept
notation: D86
definition: ./sams:shape/gml:Polygon/gml:exterior/gml:LinearRing/gml:posList count attribute shall resolve to the sum of x-y coordinate doublets. ORDER of 2 coordinates doublets MUST BE Latitude & Longitud when providing the accepted srsNames (see D81)
status: reserved
status modified: 2023-05-04
accepted date: 2023-05-04
in scheme: AQD - Quality control and assurance on CDR
hidden label: reserved
editorial note: Not implemented

reserved
type: Concept
notation: D87
definition: ./sams:shape/gml:Polygon/gml:exterior/gml:LinearRing/gml:posList shall resolve to the approximate geographic location of the sampling point referencing the
status: reserved
status modified: 2023-05-04
accepted date: 2023-05-04
in scheme: AQD - Quality control and assurance on CDR
hidden label: reserved
editorial note: Not implemented

reserved
type: Concept
notation: D88
definition: reserved
status: reserved
status modified: 2023-05-04
accepted date: 2023-05-04
in scheme: AQD - Quality control and assurance on CDR
hidden label: reserved
editorial note: Not implemented

reserved
type: Concept
notation: D89
definition: reserved
status: reserved
status modified: 2023-05-04
accepted date: 2023-05-04
in scheme: AQD - Quality control and assurance on CDR
hidden label: reserved
editorial note: Not implemented

reserved
type: Concept
notation: D90
definition: reserved
status: reserved
status modified: 2023-05-04
accepted date: 2023-05-04
in scheme: AQD - Quality control and assurance on CDR
hidden label: reserved
editorial note: Not implemented

All reported Sample(s) shall be used within at least one SamplingPoint
type: Concept
notation: D91
definition: Each aqd:AQD_Sample reported within the XML shall be xlinked (at least once) via aqd:AQD_SamplingPoint/ef:observingCapability/ef:ObservingCapability/ef:featureOfInterest@xlink
status: valid
status modified: 2023-05-04
accepted date: 2023-05-04
in scheme: AQD - Quality control and assurance on CDR
hidden label: Sample(s) are included which are not part of any measurement configuration
editorial note: [Crucial]: Yes -
error type: ERROR

All reported SamplingPointProcess(es) shall be used wihtin at least one SamplingPoint
type: Concept
notation: D92
definition: Each aqd:AQD_SamplingPointProcess reported within the XML shall be xlinked (at least once) via /aqd:AQD_SamplingPoint/ef:observingCapability/ef:ObservingCapability/ef:procedure@xlink
status: valid
status modified: 2023-05-04
accepted date: 2023-05-04
in scheme: AQD - Quality control and assurance on CDR
hidden label: SamplingPointProcess(es) are included which are not part of any measurement configuration
editorial note: [Crucial]: Yes -
error type: ERROR

All reported Station(s) shall be used within at least one SamplingPoint
type: Concept
notation: D93
definition: Each aqd:AQD_Station reported within the XML shall be xlinked (at least once) via aqd:AQD_SamplingPoint/ef:broader@xlink
status: valid
status modified: 2023-05-04
accepted date: 2023-05-04
in scheme: AQD - Quality control and assurance on CDR
hidden label: Station(s) are included which are not part of any measurement configuration
editorial note: [Crucial]: Yes -
error type: ERROR

All reported Networks shall be used within at least one SamplingPoint or one Station
type: Concept
notation: D94
definition: Each aqd:AQD_Netwok reported within the XML shall be xlinked (at least once) via /aqd:AQD_SamplingPoint/ef:belongsTo@xlink or /aqd:AQD_Station/ef:belongsTo@xlink
status: valid
status modified: 2023-05-04
accepted date: 2023-05-04
in scheme: AQD - Quality control and assurance on CDR
hidden label: Network(s) are included which are not part of any measurement configuration
editorial note: [Crucial]: Yes -
error type: ERROR

Sampling point should belong to the same station as previous deliveries
type: Concept
notation: D96
status: valid
status modified: 2023-05-04
accepted date: 2023-05-04
in scheme: AQD - Quality control and assurance on CDR
error type: BLOCKER

Sampling points location is not expected to change compared to previous deliveries
type: Concept
notation: D97
definition: Sampling points location is not expected to change compared to previous deliveries (latest reported).
status: valid
status modified: 2023-05-04
accepted date: 2023-05-04
in scheme: AQD - Quality control and assurance on CDR
error type: BLOCKER

Sampling point classification (Traffic, background, industrial ...) is not expected to change compared to previous year submission.
type: Concept
notation: D98
definition: Sampling point aqd:stationClassification elements (Traffic, background, industrial ...) shall not be different from what was reported in previous year for the same sampling point.
status: valid
status modified: 2023-05-04
accepted date: 2023-05-04
in scheme: AQD - Quality control and assurance on CDR
error type: WARNING

Station area classification (Rural, sub-urban, urban...) is not expected to change compared to previous year submission.
type: Concept
notation: D99
definition: Station aqd:areaClassification elements shall not be different from what was reported in previous year for the same station
status: valid
status modified: 2023-05-04
accepted date: 2023-05-04
in scheme: AQD - Quality control and assurance on CDR
error type: WARNING

Cross checks with other data-flows
type: Concept
notation: DCrossCheck
definition: Cross checks with other data-flows
status: valid
status modified: 2023-05-04
accepted date: 2023-05-04
in scheme: AQD - Quality control and assurance on CDR
error type: WARNING

Testing REGERROR in D
type: Concept
notation: Dtest
definition: Testing REGERROR in D
status: valid
status modified: 2023-05-10
accepted date: 2023-05-10
in scheme: AQD - Quality control and assurance on CDR
error type: REGERROR

Checks if this delivery is new or an update (on same reporting year)
type: Concept
notation: E0
definition: Check if delivery if this is a new delivery or updated delivery (via reporting year)
status: valid
status modified: 2023-05-04
accepted date: 2023-05-04
in scheme: AQD - Quality control and assurance on CDR
hidden label: Checks if this delivery is new or an update (on same reporting year)
editorial note: [Crucial]: Yes -
error type: WARNING

Total number Observations within this XML Document
type: Concept
notation: E01a
definition: Compile & feedback upon the total number of observations included in the delivery
status: valid
status modified: 2023-05-04
accepted date: 2023-05-04
in scheme: AQD - Quality control and assurance on CDR
hidden label: Total number Observations within this XML Document
editorial note: [Crucial]: Yes -
error type: BLOCKER

GML identifier for om:OM_Observation attribute shall be unique code
type: Concept
notation: E01b
definition: /om:OM_Observation gml:id attribute shall be unique code for the group of observations enclosed by /OM_Observation within the delivery. Please note that the om:OM_Observation do not have INSPIRE ID like all other elments with namespace & localId
status: valid
status modified: 2023-05-04
accepted date: 2023-05-04
in scheme: AQD - Quality control and assurance on CDR
hidden label: GML identifier for om:OM_Observation attribute shall be unique code
editorial note: [Crucial]: -
error type: BLOCKER

Start time must be less than end time (phenomenonTime)
type: Concept
notation: E02
definition: ./om:phenomenonTime/gml:TimePeriod/gml:beginPosition shall be LESS THAN ./om:phenomenonTime/gml:TimePeriod/gml:endPosition.
status: valid
status modified: 2023-05-04
accepted date: 2023-05-04
in scheme: AQD - Quality control and assurance on CDR
hidden label: Start time must be less than end time (phenomenonTime)
editorial note: [Crucial]: -
error type: BLOCKER

The resultTime must be after the phenomenonTime
type: Concept
notation: E03
definition: ./om:resultTime/gml:TimeInstant/gml:timePosition shall be GREATER THAN ./om:phenomenonTime/gml:TimePeriod/gml:endPosition
status: valid
status modified: 2023-05-04
accepted date: 2023-05-04
in scheme: AQD - Quality control and assurance on CDR
hidden label: The resultTime must be after the phenomenonTime
editorial note: [Crucial]: -
error type: BLOCKER

Observation must link to a valid AQD_SamplingPointProcess in dataflow D (via om:procedure)
type: Concept
notation: E04
definition: All om:OM_Observation/ must provide a valid /om:procedure xlink (can not be empty) & ./om:procedure xlink:href attribute shall resolve to a traversable link process configuration in Data flow D: /aqd:AQD_SamplingPointProcess/ompr:inspireld/base:Identifier/base:localId
status: valid
status modified: 2023-05-04
accepted date: 2023-05-04
in scheme: AQD - Quality control and assurance on CDR
hidden label: Observation must link to a valid AQD_SamplingPointProcess in dataflow D (via om:procedure)
editorial note: [Crucial]: - IPR requirement (Annex II-E-7)
error type: BLOCKER

Observation must provide a link to SamplingPoint
type: Concept
notation: E05
definition: A valid delivery MUST provide an om:parameter with om:name xlink:href to http://dd.eionet.europa.eu/vocabulary/aq/processparameter/SamplingPoint
status: valid
status modified: 2023-05-04
accepted date: 2023-05-04
in scheme: AQD - Quality control and assurance on CDR
hidden label: Observation must provide a link to SamplingPoint
editorial note: [Crucial]: Yes - IPR requirement (Annex II-E-)
error type: BLOCKER

Observation must link to a valid AQD_SamplingPoint in dataflow D (via om:parameter/...)
type: Concept
notation: E06
definition: If ./om:parameter/om:NamedValue/om:name xlink:href resolves to http://dd.eionet.europa.eu/vocabulary/aq/processparameter/SamplingPoint /om:parameter/om:NamedValue/om:value xlink:href attribute shall resolve to a traversable link to a unique AQD_SamplingPoint (“namespace/localId” of the object)
status: valid
status modified: 2023-05-04
accepted date: 2023-05-04
in scheme: AQD - Quality control and assurance on CDR
hidden label: Observation must link to a valid AQD_SamplingPoint in dataflow D (via om:parameter/...)
editorial note: [Crucial]: Yes - IPR requirement (Annex II-E-7)
error type: BLOCKER

Observation should provide link to Assessment Type
type: Concept
notation: E07
definition: A valid delivery should provide an om:parameter with om:name xlink:href to http://dd.eionet.europa.eu/vocabulary/aq/processparameter/AssessmentType
status: valid
status modified: 2023-05-04
accepted date: 2023-05-04
in scheme: AQD - Quality control and assurance on CDR
hidden label: Observation should provide link to Assessment Type
editorial note: [Crucial]: Yes - IPR requirement (Annex II-E-6)
error type: ERROR

Observation must provide a correct link to AssessmentType vocabulary
type: Concept
notation: E08
definition: If ./om:parameter/om:NamedValue/om:name links to http://dd.eionet.europa.eu/vocabulary/aq/processparameter/AssessmentType /om:parameter/om:NamedValue/om:value xlink:href attribute shall resolve to valid code for http://dd.eionet.europa.eu/vocabulary/aq/assessmenttype/
status: valid
status modified: 2023-05-04
accepted date: 2023-05-04
in scheme: AQD - Quality control and assurance on CDR
hidden label: Observation must provide a correct link to AssessmentType vocabulary
editorial note: [Crucial]: -
error type: ERROR

All observation paramater should link to be registered under vocabulary
type: Concept
notation: E09
definition: OM observations shall contain several om:parameters to further define the observations. ./om:parameter/om:NamedValue/om:name xlink:href attribute shall resolve to a traversable link to http://dd.eionet.europa.eu/vocabulary/aq/processparameter/
status: valid
status modified: 2023-05-04
accepted date: 2023-05-04
in scheme: AQD - Quality control and assurance on CDR
hidden label: All observation paramater should link to be registered under vocabulary
editorial note: [Crucial]: -
error type: ERROR

Pollutant must be a registered under vocabulary
type: Concept
notation: E10
definition: ./om:parameter/om:NamedValue/om:name xlink:href attribute shall resolve to a traversable link to http://dd.eionet.europa.eu/vocabulary/aq/processparameter/
status: valid
status modified: 2023-05-04
accepted date: 2023-05-04
in scheme: AQD - Quality control and assurance on CDR
hidden label: Codelist for all pollutants requires revision: EEA codelist is required
editorial note: [Crucial]: Yes -
error type: BLOCKER

The pollutant for the observation must match the pollutant of the SamplingPoint
type: Concept
notation: E11
definition: The pollutant xlinked via /om:observedProperty must match the pollutant code declared via /aqd:AQD_SamplingPoint/ef:observingCapability/ef:ObservingCapability/ef:observedProperty (See E6 on linkages between the Observations & the SamplingPoint)
status: valid
status modified: 2023-05-04
accepted date: 2023-05-04
in scheme: AQD - Quality control and assurance on CDR
hidden label: Mismatch between pollutant reported under Obseration and pollutant declared at SamplingPoint level
editorial note: [Crucial]: Yes - IPR requirement (Annex II-E-7)
error type: BLOCKER

Observation must link to a valid AQD_Sample in dataflow D (via om:featureOfInterest)
type: Concept
notation: E12
definition: All om:OM_Observation/ must provide a valid /om:featureOfInterest xlink (can not be empty)& /om:featureOfInterest xlink:href attribute shall resolve to a traversable link to /aqd:AQD_Sample/ompr:inspireld/base:Identifier/base:localId
status: valid
status modified: 2023-05-04
accepted date: 2023-05-04
in scheme: AQD - Quality control and assurance on CDR
hidden label: Incorrect link between observation(s) and Sample(s)
editorial note: [Crucial]: - IPR requirement (Annex II-E-7)
error type: BLOCKER

reserved
type: Concept
notation: E13
definition: The temporal envelopes of ./om:phenomenonTime/gml:TimePeriod/gml:beginPosition shall reconcile with /aqd:AQD_SamplingPoint/ef:operationalActivityPeriod/ef:OperationalActivityPeriod associated with the citations via /om:parameter/om:value xlink:href attribute AND /aqd:AQD_SamplingPoint/ef:observingCapability/ef:ObservingCapability/ef:observingTime/gml:TimePeriod/ associated with /aqd:AQD_SamplingPoint/ef:observingCapability/ef:ObservingCapability/ef:procedure the citations via /om:procedure xlink:href attribute
status: reserved
status modified: 2023-05-04
accepted date: 2023-05-04
in scheme: AQD - Quality control and assurance on CDR
hidden label: reserved
editorial note: Not implemented

reserved
type: Concept
notation: E14
definition: ./om:result/swe:DataArray/swe:elementCount/swe:Count/swe:value shall resolve to the count of observations in /om:result/swe:DataArray/swe:values
status: reserved
status modified: 2023-05-04
accepted date: 2023-05-04
in scheme: AQD - Quality control and assurance on CDR
hidden label: reserved
editorial note: Not implemented

Check valid definition for startTime
type: Concept
notation: E15
definition: IF ./om:result/swe:DataArray/swe:elementType/swe:DataRecord/swe:field name="startTime" attribute THEN swe:Time definition=http://www.opengis.net/def/property/OGC/0/SamplingTime swe:uom xlink:href=http://www.opengis.net/def/uom/ISO-8601/0/Gregorian
status: valid
status modified: 2023-05-04
accepted date: 2023-05-04
in scheme: AQD - Quality control and assurance on CDR
hidden label: Codelist for startTime definition requires revision: EEA codelist is required
editorial note: [Crucial]: Yes - IPR requirement (Annex II-E-8)
error type: BLOCKER

Check valid definition for endTime
type: Concept
notation: E16
definition: IF ./om:result/swe:DataArray/swe:elementType/swe:DataRecord/swe:field name="endTime" attribute THEN swe:Time definition=http://www.opengis.net/def/property/OGC/0/SamplingTime swe:uom xlink:href=http://www.opengis.net/def/uom/ISO-8601/0/Gregorian
status: valid
status modified: 2023-05-04
accepted date: 2023-05-04
in scheme: AQD - Quality control and assurance on CDR
hidden label: Codelist for endTime definition requires revision: EEA codelist is required
editorial note: [Crucial]: Yes - IPR requirement (Annex II-E-8)
error type: BLOCKER

Check valid definition for observation validity
type: Concept
notation: E17
definition: IF ./om:result/swe:DataArray/swe:elementType/swe:DataRecord/swe:field name="validity" attribute THEN swe:Category definition is defined by http://dd.eionet.europa.eu/vocabulary/aq/observationvalidity
status: valid
status modified: 2023-05-04
accepted date: 2023-05-04
in scheme: AQD - Quality control and assurance on CDR
hidden label: Codelist for observation Validity requires revision: EEA codelist is required
editorial note: [Crucial]: Yes - IPR requirement (Annex II-E-12)
error type: BLOCKER

Check valid definition for observation verification
type: Concept
notation: E18
definition: IF ./om:result/swe:DataArray/swe:elementType/swe:DataRecord/swe:field name="verification" attribute THEN swe:Category definition is defined by http://dd.eionet.europa.eu/vocabulary/aq/observationverification
status: valid
status modified: 2023-05-04
accepted date: 2023-05-04
in scheme: AQD - Quality control and assurance on CDR
hidden label: Codelist for observation Verification requires revision: EEA codelist is required
editorial note: [Crucial]: Yes - IPR requirement (Annex II-E-13)
error type: BLOCKER

Check valid definition for the observation values (primaryObservation code & concentration)
type: Concept
notation: E19
definition: IF ./om:result/swe:DataArray/swe:elementType/swe:DataRecord/swe:field name="Value" attribute THEN swe:Quantity definition is defined by http://dd.eionet.europa.eu/vocabulary/aq/primaryObservation/[code] & the swe:uom resolves to an xlink to http://dd.eionet.europa.eu/vocabulary/uom/concentration/[code]
status: valid
status modified: 2023-05-04
accepted date: 2023-05-04
in scheme: AQD - Quality control and assurance on CDR
hidden label: Codelist for primaryObservations and/or concentration requires revision: EEA codelist is required
editorial note: [Crucial]: Yes - IPR requirement (Annex II-E-5)
error type: BLOCKER

Check primaryObservation definition for the observation values are defined as /hour /day or /var
type: Concept
notation: E19a
definition: IF ./om:result/swe:DataArray/swe:elementType/swe:DataRecord/swe:field name="Value" attribute THEN swe:Quantity definition is defined by http://dd.eionet.europa.eu/vocabulary/aq/primaryObservation/[code] & code should only be hour, day or var. Other definitions will be automatically converted to /var for aggregation purposes.
status: valid
status modified: 2023-05-04
accepted date: 2023-05-04
in scheme: AQD - Quality control and assurance on CDR
error type: WARNING

Check if data is provided using the recommended unit according to vocabulary. Important note: aggregates will not be calculated.
type: Concept
notation: E19b
definition: Check if the unit of measure reporting via (swe:uom) corresponds to the recommended unit of measure in vocabulary http://dd.eionet.europa.eu/vocabulary/uom/concentration/[code] depending on pollutant reported via /om:observedProperty . Important note: aggregates will not be calculated for those timeseries not using the recommended unit.
status: valid
status modified: 2023-05-04
accepted date: 2023-05-04
in scheme: AQD - Quality control and assurance on CDR
hidden label: Check if data is provided using the recommended unit according to vocabulary
editorial note: [Crucial]: -
error type: ERROR

Check if data is provided using the mandatory unit according to vocabulary
type: Concept
notation: E19c
definition: Check if the unit of measure reporting via (swe:uom) corresponds to the mandatory unit of measure in vocabulary http://dd.eionet.europa.eu/vocabulary/uom/concentration/[code] depending on pollutant reported via /om:observedProperty
status: valid
status modified: 2024-11-27
accepted date: 2023-05-04
in scheme: AQD - Quality control and assurance on CDR
editorial note: Turned to blocker
error type: BLOCKER

Check consistency of primaryObservatin (hour/day/var) with data already reported for same SamplingPoint
type: Concept
notation: E19d
definition: Check consistency of primaryObservatin (hour/day/var) with data already reported for same SamplingPoint
status: valid
status modified: 2024-01-30
accepted date: 2024-01-30
in scheme: AQD - Quality control and assurance on CDR
error type: BLOCKER

Check primaryObservation definition for the observation values (hour /day or /var) against Cadence/Duration reported in meta-data (D)
type: Concept
notation: E19e
definition: Check primaryObservation definition for the observation values (hour /day or /var) against Cadence/Duration reported in meta-data (D)
status: valid
status modified: 2024-01-30
accepted date: 2024-01-30
in scheme: AQD - Quality control and assurance on CDR
error type: WARNING

Cross checks with other data-flows
type: Concept
notation: E1aCrossCheck
definition: Cross checks with other data-flows
status: valid
status modified: 2023-05-04
accepted date: 2023-05-04
in scheme: AQD - Quality control and assurance on CDR
error type: WARNING

Cross checks with other data-flows
type: Concept
notation: E1bCrossCheck
definition: Cross checks with other data-flows
status: valid
status modified: 2023-05-04
accepted date: 2023-05-04
in scheme: AQD - Quality control and assurance on CDR
error type: WARNING

Check valid definition for the data coverage element (if provided)
type: Concept
notation: E20
definition: A fifth element might be included. IF ./om:result/swe:DataArray/swe:elementType/swe:DataRecord/swe:field name="DataCapture" attribute THEN swe:Category definition is defined by http://dd.eionet.europa.eu/vocabulary/aq/primaryObservation/dc & the swe:uom resolves to an xlink to http://dd.eionet.europa.eu/vocabulary/uom/statistics/percentage
status: valid
status modified: 2023-05-04
accepted date: 2023-05-04
in scheme: AQD - Quality control and assurance on CDR
hidden label: Codelist for data coverage definition requires revision: EEA codelist is required
editorial note: [Crucial]: Yes -
error type: BLOCKER

Check valid TextEncoding (decimalSeparator="." tokenSeparator=“”SEMICOLON”” blockSeparator="@@")
type: Concept
notation: E21
definition: /om:result/swe:DataArray/swe:encoding/swe:TextEncoding shall resolve to decimalSeparator="." tokenSeparator=“”SEMICOLON”” blockSeparator="@@"
status: valid
status modified: 2023-05-04
accepted date: 2023-05-04
in scheme: AQD - Quality control and assurance on CDR
hidden label: The primary data text encoding differs. Please revise if this causes a problem when processing data
editorial note: [Crucial]: - System requirement
error type: ERROR

The order of the fields within individual data blocks must correspond to the order described.
type: Concept
notation: E22
definition: The order of the fields within individual data blocks (swe:values) must correspond to the order described within the swe:DataRecord/swe:field(multiple).
status: valid
status modified: 2023-05-04
accepted date: 2023-05-04
in scheme: AQD - Quality control and assurance on CDR
hidden label: The order of the fields within individual data blocks must correspond to the order described.
editorial note: [Crucial]: Yes - System requirement (processing)
error type: BLOCKER

The count of values provided for observation should match the count declared and should not be 0.
type: Concept
notation: E23
definition: The count of elements under <swe:elementCount><swe:Count><swe:value> should match the count of data blocks under <swe:values> and must be greater than 0.
status: valid
status modified: 2023-05-04
accepted date: 2023-05-04
in scheme: AQD - Quality control and assurance on CDR
hidden label: The count of values provided for observation should match the count declared.
editorial note: [Crucial]: Yes - System requirement (processing)
error type: BLOCKER

The primaryObsevation value can not be empty (NULL)
type: Concept
notation: E23b
definition: The primaryObsevation value provided in the swe:array can not be empty (NULL). This is incorrect: 2019-01-01T00:00:00+01:00,2019-01-01T01:00:00+01:00,1,-1,@@
status: valid
status modified: 2023-05-04
accepted date: 2023-05-04
in scheme: AQD - Quality control and assurance on CDR
error type: BLOCKER

Difference between endTime & startTime must correspond to the definition under <swe:field name="Value"><swe:Quantity definition=>.
type: Concept
notation: E24
definition: Difference between endTime & startTime must correspond to the definition under <swe:field name="Value"><swe:Quantity definition=> .Difference between endTime & startTime must correspond to the definition: http://dd.eionet.europa.eu/vocabulary/aq/primaryObservation/hour must be 1 h or http://dd.eionet.europa.eu/vocabulary/aq/primaryObservation/day must be 24 hoursor http://dd.eionet.europa.eu/vocabulary/aq/primaryObservation/year must be 8760 hours or 8784 http://dd.eionet.europa.eu/vocabulary/aq/primaryObservation/var can be anything
status: valid
status modified: 2023-05-04
accepted date: 2023-05-04
in scheme: AQD - Quality control and assurance on CDR
hidden label: Difference between endTime & startTime must correspond to the definition under <swe:field name="Value"><swe:Quantity definition=>.
editorial note: [Crucial]: Yes - System requirement (processing)
error type: BLOCKER

All reported dates within the data array must be fully ISO
type: Concept
notation: E24b
definition: All reported dates within the data array must be fully ISO
status: valid
status modified: 2023-05-04
accepted date: 2023-05-04
in scheme: AQD - Quality control and assurance on CDR
error type: BLOCKER

The temporal envelopes of the swe:values (reported via starTime and EndTime) shall reconcile with ./om:phenomenonTime/gml:TimePeriod/gml:beginPosition
type: Concept
notation: E25
definition: The temporal envelopes of the swe:values (reported via starTime and EndTime) shall reconcile with ./om:phenomenonTime/gml:TimePeriod/gml:beginPosition
status: valid
status modified: 2023-05-04
accepted date: 2023-05-04
in scheme: AQD - Quality control and assurance on CDR
hidden label: The temporal envelopes of the swe:values (reported via starTime and EndTime) shall reconcile with ./om:phenomenonTime/gml:TimePeriod/gml:beginPosition
editorial note: [Crucial]: Yes -
error type: BLOCKER

The date-time of the primary data must be within the Reporting Year.
type: Concept
notation: E25b
definition: The /om:phenomenonTime/gml:TimePeriod/gml:beginPosition & gml:endPosition must correspond to the Reporting Year (For hourly and daily data, data must be within +/- 1 day. For var data, date-time must be within +/- 1 month)
status: valid
status modified: 2023-05-04
accepted date: 2023-05-04
in scheme: AQD - Quality control and assurance on CDR
hidden label: The date-time of the primary data must be within the Reporting Year
error type: BLOCKER

The combination of SamplingPoint, SamplingPointProcess, Sample and Pollutant must be valid compared to latest Assessment Methods (D) reported
type: Concept
notation: E26
definition: Check valid “constellation”: The combination of SamplingPoint, SamplingPointProcess, Sample and Pollutant must be valid compared to latest Assessment Methods (D) reported /om:parameter/om:NamedValue/om:value xlink:href attribute when /om:parameter/om:NamedValue/om:name xlink:href resolves to http://dd.eionet.europa.eu/vocabulary/aq/processparameter/SamplingPoint + /om:procedure xlink:href attribute + /om:featureOfInterest xlink:href attribute + om:observedProperty xlink:href attribute must be found in latest metadata (D) as /aqd:AQD_SamplingPoint/ef:inspireId/base:localId (note xlink above include “namespace”) + /aqd:AQD_SamplingPoint/ef:observingCapability/ef:ObservingCapability/ef:procedure + /aqd:AQD_SamplingPoint/ef:observingCapability/ef:ObservingCapability/ef:featureOfInterest + /aqd:AQD_SamplingPoint/ef:observingCapability/ef:ObservingCapability/ef:observedProperty
status: valid
status modified: 2023-05-04
accepted date: 2023-05-04
in scheme: AQD - Quality control and assurance on CDR
hidden label: Incorrect link between observation(s) and SamplingPoint/SamplingPointProcess/Sample/Pollutant
editorial note: [Crucial]: Yes - System requirement
error type: BLOCKER

The Assessment Methods must be operational for the reported primary data
type: Concept
notation: E26b
definition: The primary data reported within the XML file must correspond to a period when the assessment method is fully operational.
status: valid
status modified: 2023-05-04
accepted date: 2023-05-04
in scheme: AQD - Quality control and assurance on CDR
error type: WARNING

Check that all values (between @@) include as many fields as declared under swe:DataRecord
type: Concept
notation: E27
definition: Check that all values (between @@) include as many fields as declared under swe:DataRecord
status: valid
status modified: 2023-05-04
accepted date: 2023-05-04
in scheme: AQD - Quality control and assurance on CDR
hidden label: Incorrect number of values within data blocks (or incorrect format/codelist)
editorial note: [Crucial]: Yes - System requirement (processing)
error type: BLOCKER

The data array should not end with "@@". Please note that @@ is a block separator.
type: Concept
notation: E28
definition: The data array should not end with "@@". Please note that @@ is a block separator.
status: valid
status modified: 2023-05-04
accepted date: 2023-05-04
in scheme: AQD - Quality control and assurance on CDR
hidden label: Data array are not expected to end with @@""
hidden label: Data array are not expected to end with "@@"
editorial note: [Crucial]: Yes - System requirement (processing)
error type: WARNING

Check for unexpected spaces around all values (between comma separator) under swe:values
type: Concept
notation: E29
definition: Check for unexpected spaces around all values (between comma separator) under swe:values
status: valid
status modified: 2023-05-04
accepted date: 2023-05-04
in scheme: AQD - Quality control and assurance on CDR
hidden label: Unexpected spaces around data values are found. Please revise
editorial note: [Crucial]: Yes - System requirement (processing)
error type: BLOCKER

Check for possible outliers reported. List of valid values found outside the range according to http://dd.eionet.europa.eu/vocabulary/aq/primaryObservationRange/
type: Concept
notation: E30
definition: Check for possible outliers reported. List of valid values found outside the range according to http://dd.eionet.europa.eu/vocabulary/aq/primaryObservationRange/
status: valid
status modified: 2023-05-04
accepted date: 2023-05-04
in scheme: AQD - Quality control and assurance on CDR
hidden label: Please revise possible outliers on your primary validated data.
editorial note: [Crucial]: Yes - System requirement (processing) - ErrorType downgraded to Warning on 25.07.2017
error type: WARNING

Check for possible outliers reported taking into account both country specific and general ranges.
type: Concept
notation: E30a
definition: Check for possible outliers reported. List of valid values found outside the range according to http://dd.eionet.europa.eu/vocabulary/aq/primaryObservationRange/ and http://dd.eionet.europa.eu/vocabulary/aq/primaryObservationRangeCountry/
status: valid
status modified: 2023-05-04
accepted date: 2023-05-04
in scheme: AQD - Quality control and assurance on CDR
error type: WARNING

Check for possible outliers reported taking into account country specific ranges.
type: Concept
notation: E30b
definition: Check for possible outliers reported taking into account country specific ranges. List of valid values found outside the range according to http://dd.eionet.europa.eu/vocabulary/aq/primaryObservationRangeCountry/
status: valid
status modified: 2023-05-04
accepted date: 2023-05-04
in scheme: AQD - Quality control and assurance on CDR
error type: WARNING

Check for date overlaps between consecutive data blocks within swe:values
type: Concept
notation: E31
definition: Check for date overlaps between consecutive data blocks within swe:values
status: valid
status modified: 2023-05-04
accepted date: 2023-05-04
in scheme: AQD - Quality control and assurance on CDR
hidden label: Unexpected DATE overlaps are found in primary data. Please revise as this prevents correct harvesting.
editorial note: [Crucial]: - Information to data provider - Label corrected on 26.07.2017
error type: BLOCKER

Check that all data submitted via CDR has been fully verified (flag 1)
type: Concept
notation: E32
definition: Check that all data submitted via CDR has been fully verified. The verification flag must be 1 for all data.
status: valid
status modified: 2023-05-04
accepted date: 2023-05-04
in scheme: AQD - Quality control and assurance on CDR
hidden label: Please revise verification status of data submitted as data is not completely fully verified.
editorial note: [Crucial]: - Information to data provider
error type: ERROR

The average of valid data should not be 0 or negative
type: Concept
notation: E33
definition: The average of valid data within individual swe:array MUST be above 0 (Negative or 0 averages are not expected).
status: valid
status modified: 2023-05-04
accepted date: 2023-05-04
in scheme: AQD - Quality control and assurance on CDR
error type: ERROR

The average of valid data is expected to be within 70 - 130% when comparing with the previous year
type: Concept
notation: E34
definition: The average of valid data within each data:array is compared with the annual mean from previous year. In order to catch possible outliers, the data is expected to be within 70 - 130% when comparing with the previous year.
status: valid
status modified: 2023-05-04
accepted date: 2023-05-04
in scheme: AQD - Quality control and assurance on CDR
error type: WARNING

The average of valid data per timeseries reported.
type: Concept
notation: E34b
definition: The average of valid data per timeseries reported.
status: valid
status modified: 2023-05-04
accepted date: 2023-05-04
in scheme: AQD - Quality control and assurance on CDR
error type: INFO

Check if data's resultTime is newer than previously reported data for same SamplingPoint/Year
type: Concept
notation: E35
definition: Check if the om:resultTime within the XML is newer than previously reported data for same SamplingPoint and reporting period (om:phenomenonPeriod)
status: valid
status modified: 2023-05-04
accepted date: 2023-05-04
in scheme: AQD - Quality control and assurance on CDR
error type: BLOCKER

Check that reported data is evenly distributed over the year in order to avoid skewing of results.Evaluate the spread of data.
type: Concept
notation: E36
definition: Check that reported data is evenly distributed over the year in order to avoid skewing of results.
status: valid
status modified: 2024-02-15
accepted date: 2024-02-15
in scheme: AQD - Quality control and assurance on CDR
error type: ERROR

Checks if this delivery is new or an update (on same reporting year)
type: Concept
notation: Eb0
definition: Check if delivery if this is a new delivery or updated delivery (via reporting year)
status: valid
status modified: 2023-05-04
accepted date: 2023-05-04
in scheme: AQD - Quality control and assurance on CDR
hidden label: Checks if this delivery is new or an update (on same reporting year)
editorial note: [Crucial]: Yes -
error type: WARNING

Total number Observations within this XML Document
type: Concept
notation: Eb01
definition: Compile & feedback upon the total number of observations included in the delivery
status: valid
status modified: 2023-05-04
accepted date: 2023-05-04
in scheme: AQD - Quality control and assurance on CDR
hidden label: Total number Observations within this XML Document
editorial note: [Crucial]: Yes -
error type: BLOCKER

Start time must be less than end time (phenomenonTime)
type: Concept
notation: Eb02
definition: ./om:phenomenonTime/gml:TimePeriod/gml:beginPosition shall be LESS THAN ./om:phenomenonTime/gml:TimePeriod/gml:endPosition.
status: valid
status modified: 2023-05-04
accepted date: 2023-05-04
in scheme: AQD - Quality control and assurance on CDR
hidden label: Start time must be less than end time (phenomenonTime)
editorial note: [Crucial]: Yes - System requirement (processing)
error type: BLOCKER

The resultTime must be after the phenomenonTime
type: Concept
notation: Eb03
definition: ./om:resultTime/gml:TimeInstant/gml:timePosition shall be GREATER THAN ./om:phenomenonTime/gml:TimePeriod/gml:endPosition
status: valid
status modified: 2023-05-04
accepted date: 2023-05-04
in scheme: AQD - Quality control and assurance on CDR
hidden label: The resultTime must be after the phenomenonTime
editorial note: [Crucial]: Yes - System requirement (processing)
error type: BLOCKER

Observation must link to a valid AQD_ModelProcess in dataflow D (via om:procedure)
type: Concept
notation: Eb04
definition: All om:OM_Observation/ must provide a valid /om:procedure xlink (can not be empty) & ./om:procedure xlink:href attribute shall resolve to a traversable link process configuration in Data flow D1b: /aqd:AQD_ModelProcess/ompr:inspireld/base:Identifier/base:localId
status: valid
status modified: 2023-05-04
accepted date: 2023-05-04
in scheme: AQD - Quality control and assurance on CDR
hidden label: Observation must link to a valid AQD_ModelProcess in dataflow D (via om:procedure)
editorial note: [Crucial]: Yes - IPR requirement (Annex II-E-7)
error type: BLOCKER

Observation must provide a link to Model or Objective
type: Concept
notation: Eb05
definition: A valid delivery MUST provide an om:parameter/om:NamedValue/om:name xlink:href to either http://dd.eionet.europa.eu/vocabulary/aq/processparameter/model or http://dd.eionet.europa.eu/vocabulary/aq/processparameter/objective
status: valid
status modified: 2023-05-04
accepted date: 2023-05-04
in scheme: AQD - Quality control and assurance on CDR
hidden label: Observation must provide a link to Model or Objective
editorial note: [Crucial]: Yes - IPR requirement (Annex II-E-)
error type: BLOCKER

Observation must link to a valid AQD_Model in dataflow D (via om:parameter/...)
type: Concept
notation: Eb06
definition: If ./om:parameter/om:NamedValue/om:name xlink:href resolves to http://dd.eionet.europa.eu/vocabulary/aq/processparameter/model or .../objective /om:parameter/om:NamedValue/om:value xlink:href attribute shall resolve to a traversable link to a unique AQD_Model (“namespace/localId” of the object)
status: valid
status modified: 2023-05-04
accepted date: 2023-05-04
in scheme: AQD - Quality control and assurance on CDR
hidden label: Observation must link to a valid AQD_Model in dataflow D (via om:parameter/...)
editorial note: [Crucial]: Yes - IPR requirement (Annex II-E-7)
error type: BLOCKER

Observation should provide link to Assessment Type
type: Concept
notation: Eb07
definition: A valid delivery should provide an om:parameter with om:name xlink:href to http://dd.eionet.europa.eu/vocabulary/aq/processparameter/AssessmentType
status: valid
status modified: 2023-05-04
accepted date: 2023-05-04
in scheme: AQD - Quality control and assurance on CDR
hidden label: Observation should provide link to Assessment Type
editorial note: [Crucial]: Yes - IPR requirement (Annex II-E-6)
error type: ERROR

Assessment type declared in Observation for a given Model/Objective Estimation should correspond to assessment type declared for that Model/Objective Estimation in Assessment Regimes (data set C).
type: Concept
notation: Eb07a
definition: Value of AssessmentType parameter in Observation should correspond with declaration given in aqd:assessmentType as xlink:href to http://dd.eionet.europa.eu/vocabulary/aq/assessmenttype/ in Assessment Regimes.
status: valid
status modified: 2023-05-04
accepted date: 2023-05-04
in scheme: AQD - Quality control and assurance on CDR
error type: WARNING

Observation must provide a correct link to AssessmentType vocabulary
type: Concept
notation: Eb08
definition: If ./om:parameter/om:NamedValue/om:name links to http://dd.eionet.europa.eu/vocabulary/aq/processparameter/AssessmentType /om:parameter/om:NamedValue/om:value xlink:href attribute shall resolve to valid code for http://dd.eionet.europa.eu/vocabulary/aq/assessmenttype/
status: valid
status modified: 2023-05-04
accepted date: 2023-05-04
in scheme: AQD - Quality control and assurance on CDR
hidden label: Observation must provide a correct link to AssessmentType vocabulary
editorial note: [Crucial]: -
error type: ERROR

All the results paramater should link to be registered under vocabulary
type: Concept
notation: Eb09
definition: OM observations shall contain several om:parameters to further define the model/objective estimation results ./om:parameter/om:NamedValue/om:name xlink:href attribute shall resolve to a traversable link to http://dd.eionet.europa.eu/vocabulary/aq/processparameter/
status: valid
status modified: 2023-05-04
accepted date: 2023-05-04
in scheme: AQD - Quality control and assurance on CDR
hidden label: All the results paramater should link to be registered under vocabulary
editorial note: [Crucial]: -
error type: ERROR

Pollutant must be a registered under vocabulary
type: Concept
notation: Eb10
definition: . /om:observedProperty xlink:href attribute shall resolve to a traversable link to http://dd.eionet.europa.eu/vocabulary/aq/pollutant/
status: valid
status modified: 2023-05-04
accepted date: 2023-05-04
in scheme: AQD - Quality control and assurance on CDR
hidden label: Pollutant must be a registered under vocabulary
editorial note: [Crucial]: Yes -
error type: BLOCKER

The pollutant for the observation must match the pollutant of the Model
type: Concept
notation: Eb11
definition: The pollutant xlinked via /om:observedProperty must match the pollutant code declared via /aqd:AQD_Model/ef:observingCapability/ef:ObservingCapability/ef:observedProperty (See Eb6 on linkages between the Observations & the SamplingPoint)
status: valid
status modified: 2023-05-04
accepted date: 2023-05-04
in scheme: AQD - Quality control and assurance on CDR
hidden label: The pollutant for the observation must match the pollutant of the Model
editorial note: [Crucial]: Yes - IPR requirement (Annex II-E-7)
error type: BLOCKER

Observation must link to a valid AQD_modelArea in dataflow D1b (via om:featureOfInterest)
type: Concept
notation: Eb12
definition: All om:OM_Observation/ must provide a valid /om:featureOfInterest xlink (can not be empty)& /om:featureOfInterest xlink:href attribute shall resolve to a traversable link to /aqd:AQD_modelArea/ompr:inspireld/base:Identifier/base:localId
status: valid
status modified: 2023-05-04
accepted date: 2023-05-04
in scheme: AQD - Quality control and assurance on CDR
hidden label: Observation must link to a valid AQD_modelArea in dataflow D1b (via om:featureOfInterest)
editorial note: [Crucial]: Yes - IPR requirement (Annex II-E-7)
error type: BLOCKER

Results must provide result encoding (Inline or using external file)
type: Concept
notation: Eb13
definition: A valid delivery MUST provide an om:parameter/om:NamedValue/om:name xlink:href to http://dd.eionet.europa.eu/vocabulary/aq/processparameter/resultencoding & om:parameter/om:NamedValue/om:value xlink:href attribute shall resolve to valid code for http://dd.eionet.europa.eu/vocabulary/aq/ resultencoding/
status: valid
status modified: 2023-05-04
accepted date: 2023-05-04
in scheme: AQD - Quality control and assurance on CDR
hidden label: Results must provide result encoding (Inline or using external file)
editorial note: [Crucial]: Yes - System requirement (processing)
error type: BLOCKER

Results must provide result format (swe array, shape file, geo tiff or Ascii grid)
type: Concept
notation: Eb14
definition: A valid delivery MUST provide an om:parameter/om:NamedValue/om:name xlink:href to http://dd.eionet.europa.eu/vocabulary/aq/processparameter/resultformat & om:parameter/om:NamedValue/om:value xlink:href attribute attribute shall resolve to valid code for http://dd.eionet.europa.eu/vocabulary/aq/resultformat/
status: valid
status modified: 2023-05-04
accepted date: 2023-05-04
in scheme: AQD - Quality control and assurance on CDR
hidden label: Results must provide result format (swe array, shape file, geo tiff or Ascii grid)
editorial note: [Crucial]: YES - System requirement (processing)
error type: BLOCKER

Results must be provided using right combination between encoding & format and using the correct elements with XML
type: Concept
notation: Eb14b
definition: IF resultencoding = inline, resultformat can only be http://dd.eionet.europa.eu/vocabulary/aq/resultformat/swe-array & results reported under swe:array IF resultencoding = external resultformat can only be http://dd.eionet.europa.eu/vocabulary/aq/resultformat/ascii-grid , http://dd.eionet.europa.eu/vocabulary/aq/resultformat/esri-shp or http://dd.eionet.europa.eu/vocabulary/aq/resultformat/geotiff and results reported gml:File
status: valid
status modified: 2023-05-04
accepted date: 2023-05-04
in scheme: AQD - Quality control and assurance on CDR
hidden label: reserved
editorial note: [Crucial]: YES - System requirement (processing)
error type: BLOCKER

Check valid definition for startTime
type: Concept
notation: Eb15
definition: IF resultformat is http://dd.eionet.europa.eu/vocabulary/aq/resultformat/swe-array (Eb14) then ./om:result/swe:DataArray/swe:elementType/swe:DataRecord/swe:field name="startTime" attribute THEN swe:Time definition=http://www.opengis.net/def/property/OGC/0/SamplingTime swe:uom xlink:href=http://www.opengis.net/def/uom/ISO-8601/0/Gregorian
status: valid
status modified: 2023-05-04
accepted date: 2023-05-04
in scheme: AQD - Quality control and assurance on CDR
hidden label: Check valid definition for startTime
editorial note: [Crucial]: Yes - IPR requirement (Annex II-E-8)
error type: BLOCKER

Check valid definition for endTime
type: Concept
notation: Eb16
definition: IF resultformat is http://dd.eionet.europa.eu/vocabulary/aq/resultformat/swe-array (Eb14) then ./om:result/swe:DataArray/swe:elementType/swe:DataRecord/swe:field name="endTime" attribute THEN swe:Time definition=http://www.opengis.net/def/property/OGC/0/SamplingTime swe:uom xlink:href=http://www.opengis.net/def/uom/ISO-8601/0/Gregorian
status: valid
status modified: 2023-05-04
accepted date: 2023-05-04
in scheme: AQD - Quality control and assurance on CDR
hidden label: Check valid definition for endTime
editorial note: [Crucial]: Yes - IPR requirement (Annex II-E-8)
error type: BLOCKER

Check valid definition for observation validity
type: Concept
notation: Eb17
definition: IF resultformat is http://dd.eionet.europa.eu/vocabulary/aq/resultformat/swe-array (Eb14) then ./om:result/swe:DataArray/swe:elementType/swe:DataRecord/swe:field name="validity" attribute THEN swe:Category definition is defined by http://dd.eionet.europa.eu/vocabulary/aq/observationvalidity
status: valid
status modified: 2023-05-04
accepted date: 2023-05-04
in scheme: AQD - Quality control and assurance on CDR
hidden label: Check valid definition for observation validity
editorial note: [Crucial]: Yes - IPR requirement (Annex II-E-12)
error type: BLOCKER

Check valid definition for observation verification
type: Concept
notation: Eb18
definition: IF resultformat is http://dd.eionet.europa.eu/vocabulary/aq/resultformat/swe-array (Eb14) then ./om:result/swe:DataArray/swe:elementType/swe:DataRecord/swe:field name="verification" attribute THEN swe:Category definition is defined by http://dd.eionet.europa.eu/vocabulary/aq/observationverification
status: valid
status modified: 2023-05-04
accepted date: 2023-05-04
in scheme: AQD - Quality control and assurance on CDR
hidden label: Check valid definition for observation verification
editorial note: [Crucial]: Yes - IPR requirement (Annex II-E-13)
error type: BLOCKER

Check valid definition for the observation values (primaryObservation/aggregationProcess code & concentration)
type: Concept
notation: Eb19
definition: IF resultformat is http://dd.eionet.europa.eu/vocabulary/aq/resultformat/swe-array (Eb14) then ./om:result/swe:DataArray/swe:elementType/swe:DataRecord/swe:field name="Value" attribute THEN swe:Quantity definition is defined by http://dd.eionet.europa.eu/vocabulary/aq/primaryObservation/[code] or http://dd.eionet.europa.eu/vocabulary/aq/aggregationprocess/[code] & the swe:uom resolves to an xlink to http://dd.eionet.europa.eu/vocabulary/uom/concentration/[code]
status: valid
status modified: 2023-05-04
accepted date: 2023-05-04
in scheme: AQD - Quality control and assurance on CDR
hidden label: Check valid definition for the observation values (primaryObservation code & concentration)
editorial note: [Crucial]: Yes - IPR requirement (Annex II-E-5)
error type: BLOCKER

Check if data is provided using the recommended unit according to vocabulary
type: Concept
notation: Eb19b
definition: Check if the unit of measure reporting via (swe:uom) corresponds to the recommended unit of measure in vocabulary http://dd.eionet.europa.eu/vocabulary/uom/concentration/[code] depending on pollutant reported via /om:observedProperty
status: valid
status modified: 2023-05-04
accepted date: 2023-05-04
in scheme: AQD - Quality control and assurance on CDR
hidden label: Check if data is provided using the recommended unit according to vocabulary
editorial note: [Crucial]: Yes -
error type: WARNING

Check valid definition for the data coverage element (if provided)
type: Concept
notation: Eb20
definition: IF resultformat is http://dd.eionet.europa.eu/vocabulary/aq/resultformat/swe-array (Eb14) then a fifth element might be included. IF ./om:result/swe:DataArray/swe:elementType/swe:DataRecord/swe:field name="DataCapture" attribute THEN swe:Category definition is defined by http://dd.eionet.europa.eu/vocabulary/aq/primaryObservation/dc & the swe:uom resolves to an xlink to http://dd.eionet.europa.eu/vocabulary/uom/statistics/percentage
status: valid
status modified: 2023-05-04
accepted date: 2023-05-04
in scheme: AQD - Quality control and assurance on CDR
hidden label: Check valid definition for the data coverage element (if provided)
editorial note: [Crucial]: Yes -
error type: BLOCKER

Check valid TextEncoding (decimalSeparator="." tokenSeparator=“”SEMICOLON”” blockSeparator="@@")
type: Concept
notation: Eb21
definition: IF resultformat is http://dd.eionet.europa.eu/vocabulary/aq/resultformat/swe-array (Eb14) then /om:result/swe:DataArray/swe:encoding/swe:TextEncoding shall resolve to decimalSeparator="." tokenSeparator=“”SEMICOLON”” blockSeparator="@@"
status: valid
status modified: 2023-05-04
accepted date: 2023-05-04
in scheme: AQD - Quality control and assurance on CDR
hidden label: Check valid TextEncoding of data array
editorial note: [Crucial]: - System requirement
error type: ERROR

The order of the fields within individual data blocks must correspond to the order described.
type: Concept
notation: Eb22
definition: IF resultformat is http://dd.eionet.europa.eu/vocabulary/aq/resultformat/swe-array (Eb14) then the order of the fields within individual data blocks (swe:values) must correspond to the order described within the swe:DataRecord/swe:field(multiple).
status: valid
status modified: 2023-05-04
accepted date: 2023-05-04
in scheme: AQD - Quality control and assurance on CDR
hidden label: The order of the fields within individual data blocks must correspond to the order described.
editorial note: [Crucial]: Yes - System requirement (processing)
error type: BLOCKER

The count of values provided for observation should match the count declared.
type: Concept
notation: Eb23
definition: IF resultformat is http://dd.eionet.europa.eu/vocabulary/aq/resultformat/swe-array (Eb14) then the count of elements under <swe:elementCount><swe:Count><swe:value> should match the count of data blocks under <swe:values>.
status: valid
status modified: 2023-05-04
accepted date: 2023-05-04
in scheme: AQD - Quality control and assurance on CDR
hidden label: The count of values provided for observation should match the count declared.
editorial note: [Crucial]: Yes - System requirement (processing)
error type: BLOCKER

Difference between endTime & startTime must correspond to the definition under <swe:field name="Value"><swe:Quantity definition=>
type: Concept
notation: Eb24
definition: IF resultformat is http://dd.eionet.europa.eu/vocabulary/aq/resultformat/swe-array (Eb14) then difference between endTime & startTime must correspond to the definition under <swe:field name="Value"><swe:Quantity definition=> .Difference between endTime & startTime must correspond to the definition: http://dd.eionet.europa.eu/vocabulary/aq/primaryObservation/hour must be 1 h http://dd.eionet.europa.eu/vocabulary/aq/primaryObservation/day must be 24 hours http://dd.eionet.europa.eu/vocabulary/aq/primaryObservation/year must be 8760 hours or 8784 http://dd.eionet.europa.eu/vocabulary/aq/primaryObservation/var can be anything
status: valid
status modified: 2023-05-04
accepted date: 2023-05-04
in scheme: AQD - Quality control and assurance on CDR
hidden label: Difference between endTime & startTime must correspond to the definition under <swe:field name="Value"><swe:Quantity definition=>
editorial note: [Crucial]: Yes - System requirement (processing)
error type: BLOCKER

The temporal envelopes of the swe:values (reported via starTime and EndTime) shall reconcile with ./om:phenomenonTime/gml:TimePeriod/gml:beginPosition
type: Concept
notation: Eb25
definition: IF resultformat is http://dd.eionet.europa.eu/vocabulary/aq/resultformat/swe-array (Eb14) then the temporal envelopes of the swe:values (reported via starTime and EndTime) shall reconcile with ./om:phenomenonTime/gml:TimePeriod/gml:beginPosition
status: valid
status modified: 2023-05-04
accepted date: 2023-05-04
in scheme: AQD - Quality control and assurance on CDR
hidden label: The temporal envelopes of the swe:values (reported via starTime and EndTime) shall reconcile with ./om:phenomenonTime/gml:TimePeriod/gml:beginPosition
editorial note: [Crucial]: Yes -
error type: BLOCKER

The combination of Model, ModelProcess, ModelArea (optional) and Pollutant must be valid compared to Assessment Methods (D1b), yearly specific, reported
type: Concept
notation: Eb26
definition: Check valid “constellation”: The combination of Model – ModelProcess - (ModelArea) and Pollutant must be valid compared to latest Assessment Methods (D1b) reported /om:parameter/om:NamedValue/om:value xlink:href attribute when /om:parameter/om:NamedValue/om:name xlink:href resolves to http://dd.eionet.europa.eu/vocabulary/aq/processparameter/model or /objective + /om:procedure xlink:href attribute + /om:featureOfInterest xlink:href attribute (optional) + om:observedProperty xlink:href attribute must be found in metadata (D1b) year specific as /aqd:AQD_Model/ef:inspireId/base:localId (note xlink above include “namespace”) + /aqd:AQD_Model/ef:observingCapability/ef:ObservingCapability/ef:procedure + /aqd:AQD_Model/ef:observingCapability/ef:ObservingCapability/ef:featureOfInterest (optional) + /aqd:AQD_Model/ef:observingCapability/ef:ObservingCapability/ef:observedProperty
status: valid
status modified: 2023-05-04
accepted date: 2023-05-04
in scheme: AQD - Quality control and assurance on CDR
hidden label: The combination of Model, ModelProcess, ModelArea (optional) and Pollutant must be valid compared to Assessment Methods (D1b), yearly specific, reported
editorial note: [Crucial]: Yes - System requirement
error type: BLOCKER

Check that all values (between @@) include as many fields as declared under swe:DataRecord
type: Concept
notation: Eb27
definition: IF resultformat is http://dd.eionet.europa.eu/vocabulary/aq/resultformat/swe-array (Eb14) then check that all values (between @@) include as many fields as declared under swe:DataRecord
status: valid
status modified: 2023-05-04
accepted date: 2023-05-04
in scheme: AQD - Quality control and assurance on CDR
hidden label: Check that all values (between @@) include as many fields as declared under swe:DataRecord
editorial note: [Crucial]: Yes - System requirement (processing)
error type: BLOCKER

The data array should not end with "@@". Please note that @@ is a block separator.
type: Concept
notation: Eb28
definition: IF resultformat is http://dd.eionet.europa.eu/vocabulary/aq/resultformat/swe-array (Eb14) then the data array should not end with "@@". Please note that @@ is a block separator.
status: valid
status modified: 2023-05-04
accepted date: 2023-05-04
in scheme: AQD - Quality control and assurance on CDR
hidden label: The data array should not end with "@@". Please note that @@ is a block separator.
editorial note: [Crucial]: Yes - System requirement (processing)
error type: BLOCKER

Check for unexpected spaces around all values (between comma separator) under swe:values
type: Concept
notation: Eb29
definition: IF resultformat is http://dd.eionet.europa.eu/vocabulary/aq/resultformat/swe-array (Eb14) then check for unexpected spaces around all values (between comma separator) under swe:values
status: valid
status modified: 2023-05-04
accepted date: 2023-05-04
in scheme: AQD - Quality control and assurance on CDR
hidden label: Check for unexpected spaces around all values (between comma separator) under swe:values
editorial note: [Crucial]: Yes - System requirement (processing)
error type: BLOCKER

Empty
type: Concept
notation: Eb30
definition: Empty
status: reserved
status modified: 2023-05-04
accepted date: 2023-05-04
in scheme: AQD - Quality control and assurance on CDR
hidden label: Empty

Check for date overlaps between consecutive data blocks within swe:values
type: Concept
notation: Eb31
definition: IF resultformat is http://dd.eionet.europa.eu/vocabulary/aq/resultformat/swe-array (Eb14) then check for date overlaps between consecutive data blocks within swe:values
status: valid
status modified: 2023-05-04
accepted date: 2023-05-04
in scheme: AQD - Quality control and assurance on CDR
hidden label: Check for date overlaps between consecutive data blocks within swe:values
editorial note: [Crucial]: Yes - Information to data provider
error type: BLOCKER

Check that all data submitted via CDR has been fully verified (flag 1)
type: Concept
notation: Eb32
definition: IF resultformat is http://dd.eionet.europa.eu/vocabulary/aq/resultformat/swe-array (Eb14) then check that all data submitted via CDR has been fully verified. The verification flag must be 1 for all data.
status: valid
status modified: 2023-05-04
accepted date: 2023-05-04
in scheme: AQD - Quality control and assurance on CDR
hidden label: Check that all data submitted via CDR has been fully verified (flag 1)
editorial note: [Crucial]: Yes - Information to data provider
error type: ERROR

Empty
type: Concept
notation: Eb33
definition: Empty
status: reserved
status modified: 2023-05-04
accepted date: 2023-05-04
in scheme: AQD - Quality control and assurance on CDR
hidden label: Empty

Empty
type: Concept
notation: Eb34
definition: Empty
status: reserved
status modified: 2023-05-04
accepted date: 2023-05-04
in scheme: AQD - Quality control and assurance on CDR
hidden label: Empty

rangeParameters must be provided when reporting ascii grids - shape files or GeoTiff
type: Concept
notation: Eb35
definition: IF resultformat is ascii-grid esri-shp or geotiff (Eb14) then ./om:result/gml:File/gml:rangeParameters MUST be populated
status: valid
status modified: 2023-05-04
accepted date: 2023-05-04
in scheme: AQD - Quality control and assurance on CDR
hidden label: rangeParameters must be provided when reporting ascii grids - shape files or GeoTiff
editorial note: [Crucial]: Yes -
error type: BLOCKER

Aggregation process of the results must be provided and must match EEA vocabulary
type: Concept
notation: Eb36
definition: IF resultformat is ascii-grid esri-shp or geotiff (Eb14) then ./om:result/gml:File/gml:rangeParameters/swe:Quantity@Definition MUST match a code under http://dd.eionet.europa.eu/vocabulary/aq/aggregationprocess/
status: valid
status modified: 2023-05-04
accepted date: 2023-05-04
in scheme: AQD - Quality control and assurance on CDR
hidden label: Aggregation process of the results must be provided and must match EEA vocabulary
editorial note: [Crucial]: Yes -
error type: BLOCKER

A user-friendly label should be provided
type: Concept
notation: Eb37
definition: IF resultformat is ascii-grid esri-shp or geotiff (Eb14) then ./om:result/gml:File/gml:rangeParameters/swe:label should be populated
status: valid
status modified: 2023-05-04
accepted date: 2023-05-04
in scheme: AQD - Quality control and assurance on CDR
hidden label: A user-friendly label should be provided
editorial note: [Crucial]: Yes -
error type: WARNING

A clear description of the results provided MUST be provided
type: Concept
notation: Eb38
definition: IF resultformat is ascii-grid esri-shp or geotiff (Eb14) then ./om:result/gml:File/gml:rangeParameters/swe:description MUST be provided
status: valid
status modified: 2023-05-04
accepted date: 2023-05-04
in scheme: AQD - Quality control and assurance on CDR
hidden label: A clear description of the results provided MUST be provided
editorial note: [Crucial]: Yes -
error type: BLOCKER

Unit of the results must be provided and must match EEA vocabulary
type: Concept
notation: Eb39
definition: IF resultformat is ascii-grid esri-shp or geotiff (Eb14) then ./om:result/gml:File/gml:rangeParameters/swe:Quantity/swe:uom xlink MUST match a code under http://dd.eionet.europa.eu/vocabulary/uom/concentration/ or http://dd.eionet.europa.eu/vocabulary/uom/statistics/
status: valid
status modified: 2023-05-04
accepted date: 2023-05-04
in scheme: AQD - Quality control and assurance on CDR
hidden label: Unit of the results must be provided and must match EEA vocabulary
editorial note: [Crucial]: Yes -
error type: BLOCKER

Check if data is provided using the recommended unit according to vocabulary
type: Concept
notation: Eb40
definition: Check if the unit of measure reporting via (/om:result/gml:File/gml:rangeParameters/swe:uom) corresponds to the recommended unit of measure in vocabulary http://dd.eionet.europa.eu/vocabulary/uom/concentration/[code] depending on pollutant reported via /om:observedProperty
status: valid
status modified: 2023-05-04
accepted date: 2023-05-04
in scheme: AQD - Quality control and assurance on CDR
hidden label: Check if data is provided using the recommended unit according to vocabulary
editorial note: [Crucial]: Yes -
error type: WARNING

When reporting results using ASCII grid shape file or GeoTiff a reference must be provided to the result file
type: Concept
notation: Eb41
definition: IF resultformat is ascii-grid esri-shp or geotiff (Eb14) then ./om:result/gml:File/gml:fileReference MUST be provided
status: valid
status modified: 2023-05-04
accepted date: 2023-05-04
in scheme: AQD - Quality control and assurance on CDR
hidden label: When reporting results using ASCII grid, shape file or GeoTiff a reference must be provided to the result file
hidden label: When reporting results using ASCII grid shape file or GeoTiff a reference must be provided to the result file
editorial note: [Crucial]: Yes -
error type: BLOCKER

The result file (*.zip, *.shp ; *.tiff, *.asc) must follow this format: A valid cdr URL matching location of XML + File including extension + Variable using a # (e.g. #no2)
type: Concept
notation: Eb42
definition: ./om:result/gml:File/gml:fileReference MUST provide appropiate reference following this format: A valid cdr URL matching the cdr location where the XML files is located (e.g. http://cdr.eionet.europa.eu/es/eu/aqd/e1b/.../) + File including extension (e.g. model.zip) + Variable using a # (e.g. #no2). ONLY the following extensions are allowed: *.zip, *.shp ; *.tiff, *.asc
status: valid
status modified: 2023-05-04
accepted date: 2023-05-04
in scheme: AQD - Quality control and assurance on CDR
hidden label: The result file must follow this format: A valid cdr URL matching location of XML + File including extension + Variable using a # (e.g. #no2)
editorial note: [Crucial]: Yes -
error type: BLOCKER

When results are provided via an external file and the external file is ESRI shapefile, it must include the *.prj file
type: Concept
notation: Eb43
definition: IF resultencoding = external resultformat, AND resultformat = esri-shp, THEN the external results provided must include the correct projection file. [Example: if results provided via gml:fileReference (http://cdr.eionet.europa.eu/es/eu/aqd/e1b/envxta1qq/ES_CIEMAT_O3_V_TV_AOT40c-5yr_2018.shp), the same envelope must include file ES_CIEMAT_O3_V_TV_AOT40c-5yr_2018.prj]
status: valid
status modified: 2023-05-04
accepted date: 2023-05-04
in scheme: AQD - Quality control and assurance on CDR
error type: BLOCKER

Eb44
type: Concept
notation: Eb44
preferred label: When results are provided via an external file, the XML must include an om:parameter with the modelprojection via EEA vocabulary, using SRID number directly or one of the following references: http://dd.eionet.europa.eu/vocabulary/common/epsg/, https://spatialreference.org/ref/epsg/ or https://epsg.io/
definition: IF resultencoding = external resultformat, the XML must include an om:parameter with modelprojection <om:parameter> <om:NamedValue> <om:name xlink:href="https://dd.eionet.europa.eu/vocabulary/aq/modelparameter/projection"/> <om:value xlink:href="http://dd.eionet.europa.eu/vocabulary/common/epsg/4326"/> </om:NamedValue> </om:parameter> or <om:parameter> <om:NamedValue> <om:name xlink:href="http://dd.eionet.europa.eu/vocabulary/aq/modelparameter/projection"/> <om:value xlink:href="https://spatialreference.org/ref/epsg/4326/"/> </om:NamedValue> </om:parameter> or <om:parameter> <om:NamedValue> <om:name xlink:href="http://dd.eionet.europa.eu/vocabulary/aq/modelparameter/projection"/> <om:value xlink:href="https://epsg.io/4326"/> </om:NamedValue> </om:parameter> or <om:parameter> <om:NamedValue> <om:name xlink:href="http://dd.eionet.europa.eu/vocabulary/aq/modelparameter/projection"/> <om:value xlink:href="4326"/> </om:NamedValue> </om:parameter>
status: valid
status modified: 2023-05-04
accepted date: 2023-05-04
in scheme: AQD - Quality control and assurance on CDR
error type: BLOCKER

When results are provided via an external file, the XML must include an om:parameter including the modelresolution via EEA vocabulary
type: Concept
notation: Eb45
definition: IF resultencoding = external resultformat, the XML must include an om:parameter with modelresolution <om:parameter> <om:NamedValue> <om:name xlink:href="http://dd.eionet.europa.eu/vocabulary/aq/modelparameter/resolution"/> <om:value xlink:href="http://dd.eionet.europa.eu/vocabulary/aq/modelresolution/5kmx5km"/> </om:NamedValue> </om:parameter>
status: valid
status modified: 2023-05-04
accepted date: 2023-05-04
in scheme: AQD - Quality control and assurance on CDR

When results are provided via an external file (compressed in a zip file), the compressed file can only contain one external result (i.e only one shape file for each zip file)
type: Concept
notation: Eb46
definition: 1. scan envelope to find all files with *.zip extension, 2. within each zip file count number of files with extensions such as: *.shp or *.tiff or *.tif or *.asc, 3. return BLOCKER if the count > 1 (ie each zip file should not contain more than 1 *.shp files, neither e.g. *.shp and *.asc).
status: valid
status modified: 2023-05-04
accepted date: 2023-05-04
in scheme: AQD - Quality control and assurance on CDR
error type: BLOCKER

When results are provided via an external file, all reported files (*.zip, *.shp ; *.tiff, *.tif, *.asc) must be referenced via gml:fileReference
type: Concept
notation: Eb47
definition: All external files containing model results with allowed extensions (*.zip, *.shp ; *.tiff, *.tif, *.asc) must be referenced via gml:fileReference. Blocker will return if files are submitted which are not referenced in the XML.
status: valid
status modified: 2023-05-04
accepted date: 2023-05-04
in scheme: AQD - Quality control and assurance on CDR
error type: BLOCKER

When results are provided via an external file, definition of quantity must be provided and must match EEA vocabulary of aggregation processes.
type: Concept
notation: Eb48
definition: ./om:result/gml:File/gml:rangeParameters/swe:Quantity must refer to the correct vocabulary which is https://dd.eionet.europa.eu/vocabulary/aq/aggregationprocess, e.g.: <swe:Quantity definition ="http://dd.eionet.europa.eu/vocabulary/aq/aggregationprocess/P1Y">
status: valid
status modified: 2023-05-04
accepted date: 2023-05-04
in scheme: AQD - Quality control and assurance on CDR
error type: BLOCKER

Eb49
type: Concept
notation: Eb49
preferred label: When results are provided via an external file, the combinations of file#variable declared in XML must be unique, and the variables declared in XML after a # should be unique. QC should return WARNING if the variables are not unique. QC should return BLOCKER if the combinations of file#variable are not unique.
definition: /om:result/gml:File/gml:fileReference#variable MUST provide unique combinations; #variable should be unique: - if the variables declared in ./om:result/gml:File/gml:fileReference after a # are unique (WARNING), - if the combinations of file#variable declared in ./om:result/gml:File/gml:fileReference are unique (BLOCKER)
status: valid
status modified: 2023-05-04
accepted date: 2023-05-04
in scheme: AQD - Quality control and assurance on CDR
error type: BLOCKER

Each E1b observation must point to unique combination of formed by model + procedure + observedProperty + featureOfInterest + definition.
type: Concept
notation: Eb50a
definition: Each <gml:featureMember><om:OM_Observation>...</om:OM_Observation></gml:featureMember> must contain unique set of identifiers/items for <om:name xlink:href="http://dd.eionet.europa.eu/vocabulary/aq/processparameter/model"/><om:value/>,<om:procedure/>,<om:observedProperty/>, <om:featureOfInterest /> and <swe:Quantity definition="http://dd.eionet.europa.eu/vocabulary/aq/aggregationprocess/...">
status: valid
status modified: 2023-05-04
accepted date: 2023-05-04
in scheme: AQD - Quality control and assurance on CDR
error type: BLOCKER

Declaration of aggregation process in E1b must match with reporting metric in C.
type: Concept
notation: Eb52
definition: Declaration of aggregation process in E1b must match with aggregation process corresponding to reporting metric, objective, protection target and pollutant declared in C, for assessment regime where the model/objective estimation is used as assessment method.
status: valid
status modified: 2023-05-04
accepted date: 2023-05-04
in scheme: AQD - Quality control and assurance on CDR
error type: BLOCKER

Values provided within the data array must be interpretable and logically possible.
type: Concept
notation: Eb53
definition: Values provided within data array must be below 100000. They should be provided as number or as indication of a value below certain threshold, e.g.: < 10 or <= 10
status: valid
status modified: 2023-05-04
accepted date: 2023-05-04
in scheme: AQD - Quality control and assurance on CDR
error type: SKIPPED

Combination of pollutant and aggregation process must match the one allowed in https://dd.eionet.europa.eu/vocabulary/aq/aggregationprocess
type: Concept
notation: Eb54
definition: Combination of pollutant declared in <om:observedProperty.../> and aggregation process declared in <swe:Quantity definition=...> must match the one allowed in https://dd.eionet.europa.eu/vocabulary/aq/aggregationprocess (P1Y, P1M and P1D are exceptions matching all pollutants).
status: valid
status modified: 2023-05-04
accepted date: 2023-05-04
in scheme: AQD - Quality control and assurance on CDR
error type: BLOCKER

Attribute names specified in XML with url of external file must correspond univocally with the attribute names which can be found in dbf file of ESRI shapefile.
type: Concept
notation: Eb51
definition: If there is one, unique attribute name in dbf, which is exactly the same as the one in XML, the test is passed. If there is no attribute name in dbf which is exactly the same or at least starts with string of attribute name specified in XML, the test will return BLOCKER. If there is more than one attribute name in dbf, which is exactly the same as the one in XML, the test will fail with BLOCKER. If there is one, unique attribute name in dbf which starts with string of attribute name specified in XML, but has more characters, the test will return ERROR. If there is more than one attribute name in dbf which starts with string of attribute name specified in XML, but has more characters, the test will fail with BLOCKER.
status: valid
status modified: 2023-05-04
accepted date: 2023-05-04
in scheme: AQD - Quality control and assurance on CDR

Checks if this delivery is new or an update (on same reporting year)
type: Concept
notation: G0
definition: Check if delivery if this is a new delivery or updated delivery (via reporting year)
status: valid
status modified: 2023-05-04
accepted date: 2023-05-04
in scheme: AQD - Quality control and assurance on CDR
hidden label: Checks if this delivery is new or an update (on same reporting year)
editorial note: [Crucial]: -
error type: WARNING

Number of Attainments reported
type: Concept
notation: G01
definition: Compile & feedback upon the total number of attainment records included in the delivery
status: valid
status modified: 2023-05-04
accepted date: 2023-05-04
in scheme: AQD - Quality control and assurance on CDR
hidden label: Number of Attainments reported
editorial note: [Crucial]: Yes -
error type: BLOCKER

Number of new Attainments compared to previous report. ERROR will be returned if XML is a new delivery and localId are not new compared to previous deliveries
type: Concept
notation: G02
definition: Compile & feedback upon the total number of new attainment records included in the delivery. ERROR will be returned if XML is a new delivery and localId are not new compared to previous deliveries.
status: valid
status modified: 2023-05-04
accepted date: 2023-05-04
in scheme: AQD - Quality control and assurance on CDR
hidden label: Number of new Attainments compared to previous report. ERROR will be returned if XML is a new delivery and localId are not new compared to previous deliveries
editorial note: [Crucial]: Yes -
error type: BLOCKER

Number of existing Attainment compared to previous report. ERROR will be returned if XML is an update and ALL localId (100%) are different to previous delivery (for the same YEAR).
type: Concept
notation: G03
definition: Compile & feedback upon the total number of updated attainment records included in the delivery. ERROR will be returned if XML is an update and ALL localId (100%) are different to previous delivery (for the same YEAR).
status: valid
status modified: 2023-05-04
accepted date: 2023-05-04
in scheme: AQD - Quality control and assurance on CDR
hidden label: Number of existing Attainment compared to previous report. ERROR will be returned if XML is an update and ALL localId (100%) are different to previous delivery (for the same YEAR).
editorial note: [Crucial]: Yes -
error type: BLOCKER

List of unique identifier information for all attainment records. Blocker if no attainments
type: Concept
notation: G04
definition: Compile & feedback a list of the unique identifier information for all attainment records included in the delivery. Feedback report shall include the gml:id attribute ./aqd:inspireId ./aqd:pollutant ./aqd:environmentalObjective/aqd:EnvironmentalObjective/aqd:objectiveType ./aqd:environmentalObjective/aqd:EnvironmentalObjective/aqd:reportingMetric ./aqd:environmentalObjective/aqd:EnvironmentalObjective/aqd:protectionTarget ./aqd:zone /aqd:assessment elements as available.
status: valid
status modified: 2023-05-04
accepted date: 2023-05-04
in scheme: AQD - Quality control and assurance on CDR
hidden label: List of unique identifier information for all attainment records. Blocker if no attainments
editorial note: [Crucial]: Yes -
error type: BLOCKER

List number of final exceedances (TRUE)
type: Concept
notation: G05
definition: Compile & feedback a list of the exceedances situations when aqd:exceedanceDescriptionFinal/aqd:ExceedanceDescription/aqd:exceedance is TRUE
status: valid
status modified: 2023-05-04
accepted date: 2023-05-04
in scheme: AQD - Quality control and assurance on CDR
hidden label: List number of final exceedances (TRUE)
editorial note: [Crucial]: Yes -
error type: WARNING

Check and provide a list of those attainment records with a time extension
type: Concept
notation: G06
definition: Compile & feedback a list of attainment records that have been assessed against the objectiveType for zones with time extensions ./aqd:environmentalObjective/aqd:EnvironmentalObjective/aqd:objectiveType/@xlink:href – “LVmaxMOT” link via ./aqd:zone to /aqd:AQD_Zone record & present the /aqd:AQD_Zone/aqd:timeExtensionExemption info. Feedback report shall include ./aqd:inspireId, ./aqd:pollutant, ./aqd:environmentalObjective/aqd:EnvironmentalObjective/aqd:objectiveType, ./aqd:environmentalObjective/aqd:EnvironmentalObjective/aqd:reportingMetric, ./aqd:environmentalObjective/aqd:EnvironmentalObjective/aqd:protectionTarget, ./aqd:zone, ./aqd:pollutant, /aqd:AQD_Zone/aqd:timeExtensionExemption
status: valid
status modified: 2023-05-04
accepted date: 2023-05-04
in scheme: AQD - Quality control and assurance on CDR
hidden label: Check and provide a list of those attainment records with a time extension
editorial note: [Crucial]: Yes -
error type: BLOCKER

All gml ID attributes shall have unique code
type: Concept
notation: G07
definition: All gml:id attributes, ef:inspireId and aqd:inspireId elements shall have unique content
status: valid
status modified: 2023-05-04
accepted date: 2023-05-04
in scheme: AQD - Quality control and assurance on CDR
hidden label: All gml ID attributes shall have unique code
editorial note: [Crucial]: Yes -
error type: BLOCKER

Local Id must be unique for the attainment records
type: Concept
notation: G08
definition: ./aqd:inspireId/base:Identifier/base:localId must be unique code for the attainment records
status: valid
status modified: 2023-05-04
accepted date: 2023-05-04
in scheme: AQD - Quality control and assurance on CDR
hidden label: Local Id must be unique for the attainment records
editorial note: [Crucial]: Yes -
error type: BLOCKER

List unique namespaces used and count number of elements
type: Concept
notation: G09
definition: ./aqd:inspireId/base:Identifier/base:namespace List base:namespace and count the number of base:localId assigned to each base:namespace.
status: valid
status modified: 2023-05-04
accepted date: 2023-05-04
in scheme: AQD - Quality control and assurance on CDR
hidden label: List unique namespaces used and count number of elements
editorial note: [Crucial]: Yes -
error type: BLOCKER

Check namespace is registered
type: Concept
notation: G09.1
definition: Check that namespace is registered in vocabulary (http://dd.eionet.europa.eu/vocabulary/aq/namespace/view)
status: valid
status modified: 2023-05-04
accepted date: 2023-05-04
in scheme: AQD - Quality control and assurance on CDR
hidden label: Check namespace is registered
editorial note: [Crucial]: Yes - System requirement
error type: BLOCKER

The Attainment Pollutant must be one of the following: SO2, O3, NO2, NOX, PM10, PM2.5, CO, Pb in PM10, Cd in PM10, Ni in PM10, As in PM10, BaP in PM10
type: Concept
notation: G10
definition: The content of ./aqd:pollutant xlink:href attribute shall resolve to one of http://dd.eionet.europa.eu/vocabulary/aq/pollutant/1 http://dd.eionet.europa.eu/vocabulary/aq/pollutant/7 http://dd.eionet.europa.eu/vocabulary/aq/pollutant/8 http://dd.eionet.europa.eu/vocabulary/aq/pollutant/9 http://dd.eionet.europa.eu/vocabulary/aq/pollutant/5 http://dd.eionet.europa.eu/vocabulary/aq/pollutant/6001 http://dd.eionet.europa.eu/vocabulary/aq/pollutant/10 http://dd.eionet.europa.eu/vocabulary/aq/pollutant/20 http://dd.eionet.europa.eu/vocabulary/aq/pollutant/5012 http://dd.eionet.europa.eu/vocabulary/aq/pollutant/5014 http://dd.eionet.europa.eu/vocabulary/aq/pollutant/5015 http://dd.eionet.europa.eu/vocabulary/aq/pollutant/5018 http://dd.eionet.europa.eu/vocabulary/aq/pollutant/5029
status: valid
status modified: 2023-05-04
accepted date: 2023-05-04
in scheme: AQD - Quality control and assurance on CDR
hidden label: Attainment has been provided for an unexpected pollutant.
editorial note: [Crucial]: Yes - IPR requirement (Annex II-G-6)
error type: BLOCKER

INF and ALT thresholds - COUNT number zone-pollutant-target combination to match those in dataset B and dataset C for the same reporting Year
type: Concept
notation: G100
definition: COUNT number zone-pollutant-target combination to match those in dataset B and dataset C for the same reporting Year & compare it with Attainment. Sulphur dioxide (1) + health (B vs C) & Ozone (7) + health (B vs C) & Nitrogen dioxide (8) + health (B vs C)
status: valid
status modified: 2023-05-19
accepted date: 2023-05-19
in scheme: AQD - Quality control and assurance on CDR
error type: ERROR

Exceedance Description Base is only expected for the following pollutants: SO2, PM10, PM2.5, CO
type: Concept
notation: G11
definition: Element ./aqd:exceedanceDescriptionBase may only be used WHERE ./aqd:pollutant xlink:href attribute EQUALs http://dd.eionet.europa.eu/vocabulary/aq/pollutant/1 http://dd.eionet.europa.eu/vocabulary/aq/pollutant/5 http://dd.eionet.europa.eu/vocabulary/aq/pollutant/6001 http://dd.eionet.europa.eu/vocabulary/aq/pollutant/10
status: valid
status modified: 2023-05-04
accepted date: 2023-05-04
in scheme: AQD - Quality control and assurance on CDR
hidden label: Attainment has been provided with a base scenario for an unexpected pollutant
editorial note: [Crucial]: Yes - IPR requirement (Annex II-G-6)
error type: BLOCKER

Exceedance Description Adjustment is only expected for the following pollutants: SO2, PM10, PM2.5, CO
type: Concept
notation: G12
definition: Element ./aqd:exceedanceDescriptionAdjustment can only be used WHERE ./aqd:pollutant xlink:href attribute EQUALs http://dd.eionet.europa.eu/vocabulary/aq/pollutant/1 http://dd.eionet.europa.eu/vocabulary/aq/pollutant/5 http://dd.eionet.europa.eu/vocabulary/aq/pollutant/6001 http://dd.eionet.europa.eu/vocabulary/aq/pollutant/10
status: valid
status modified: 2023-05-04
accepted date: 2023-05-04
in scheme: AQD - Quality control and assurance on CDR
hidden label: Attainment has been provided with an adjustment for an unexpected pollutant
editorial note: [Crucial]: Yes - IPR requirement (Annex II-G-6)
error type: BLOCKER

Attainment should link to a valid assessment regime with matching Pollutant and Objetive Type
type: Concept
notation: G13
definition: ./aqd:assessment xlink:href attribute shall resolve to a valid assessment regime within / qd:AQD_AssessmentRegime AND /aqd:AQD_AssessmentRegime/aqd:pollutant, aqd:AQD_AssessmentRegime/aqd:assessmentThreshold/aqd:AssessmentThreshold/aqd:environmentalObjective/aqd:EnvironmentalObjective/aqd:objectiveType EQUAL to aqd:AQD_Attainment/aqd:pollutant aqd:AQD_Attainment/aqd:environmentalObjective/aqd:EnvironmentalObjective/aqd:objectiveType
status: valid
status modified: 2023-05-04
accepted date: 2023-05-04
in scheme: AQD - Quality control and assurance on CDR
hidden label: Incorrect link between Attainment and Assessment Regime (including match Pollutant & ObjectiveType)
editorial note: [Crucial]: Yes - IPR requirement (Annex II-G-7)
error type: BLOCKER

Attainment must link to a valid assessment regime with matching Pollutant and Protection Target
type: Concept
notation: G13b
definition: ./aqd:assessment xlink:href attribute shall resolve to a valid assessment regime within / qd:AQD_AssessmentRegime AND /aqd:AQD_AssessmentRegime/aqd:pollutant, aqd:AQD_AssessmentRegime/aqd:assessmentThreshold/aqd:AssessmentThreshold/aqd:environmentalObjective/aqd:EnvironmentalObjective/aqd:protectionTarget EQUAL to aqd:AQD_Attainment/aqd:pollutant aqd:AQD_Attainment/aqd:environmentalObjective/aqd:EnvironmentalObjective/aqd:protectionTarget
status: valid
status modified: 2023-05-04
accepted date: 2023-05-04
in scheme: AQD - Quality control and assurance on CDR
hidden label: Pollutant/ProtectionTarget mismatch between AssessmentRegime and Attainment. Please revise as this will cause problems when processing deliveries
editorial note: [Crucial]: Yes -
error type: BLOCKER

Attainment should link to a valid assessment regime with matching Pollutant/Objective Type/ReportingMetric/ProtectionTarget/
type: Concept
notation: G13c
definition: aqd:AQD_Attainment/aqd:pollutant aqd:AQD_Attainment/aqd:environmentalObjective/aqd:EnvironmentalObjective/aqd:objectiveType aqd:AQD_Attainment/aqd:environmentalObjective/aqd:EnvironmentalObjective/aqd:reportingMetric aqd:AQD_Attainment/aqd:environmentalObjective/aqd:EnvironmentalObjective/aqd:protectionTarget should correspond with aqd:AQD_AssessmentRegime/aqd:pollutant aqd:AQD_AssessmentRegime/aqd:assessmentThreshold/aqd:AssessmentThreshold/aqd:environmentalObjective/aqd:EnvironmentalObjective/aqd:objectiveType aqd:AQD_AssessmentRegime/aqd:assessmentThreshold/aqd:AssessmentThreshold/aqd:environmentalObjective/aqd:EnvironmentalObjective/aqd:reportingMetric aqd:AQD_AssessmentRegime/aqd:assessmentThreshold/aqd:AssessmentThreshold/aqd:environmentalObjective/aqd:EnvironmentalObjective/aqd:protectionTarget
status: valid
status modified: 2023-05-04
accepted date: 2023-05-04
in scheme: AQD - Quality control and assurance on CDR
hidden label: Environmental Objective mismatch between AssessmentRegime and Attainment. Please revise as this will cause problems when processing deliveries
editorial note: [Crucial]: Yes -
error type: BLOCKER

COUNT number zone-pollutant-target combination to match those in dataset B and dataset C for the same reporting Year
type: Concept
notation: G14
definition: COUNT number zone-pollutant-target combination to match those in dataset B and dataset C for the same reporting Year & compare it with Attainment. aqd:AQD_Attainment/aqd:pollutant xlink + aqd:AQD_Attainment/aqd:environmentalObjective/aqd:EnvironmentalObjective/aqd:protectionTarget + aqd:AQD_Attainment/aqd:zone .aqd:assessmentThreshold/aqd:AssessmentThreshold/aqd:environmentalObjective/aqd:EnvironmentalObjective/aqd:protectionTarget + ./aqd:pollutant + /aqd:zone combinations shall reconcile to corresponding information within /aqd:AQD_Zone/aqd:pollutants/aqd:Pollutant/aqd:protectionTarget , /aqd:AQD_Zone/aqd:pollutants/aqd:Pollutant/aqd:pollutantCode + /aqd:AQD_Zone/am:inspireId/base:Identifier/base:localId
status: valid
status modified: 2023-05-04
accepted date: 2023-05-04
in scheme: AQD - Quality control and assurance on CDR
hidden label: Mismatch in the count of unique zone-pollutant-protectionTarget combinations between Attainment, AssessmentRegime and Zones
editorial note: Changed to REGERROR following coordination meeting 12/02/2024
editorial note: [Crucial]: Yes (crosscheck) - Important content check
error type: REGERROR

All the /aqd:AQD_AssessmentRegime reported under latest dataflow C must be xlinked once at one Attainment (with exception of /MO)
type: Concept
notation: G14b
definition: For the same reporting year, all the /aqd:AQD_AssessmentRegime reported under dataflow C, must be xlinked once at /aqd:AQD_Attainment /aqd:assessment xlink:href attribute
status: valid
status modified: 2023-05-04
accepted date: 2023-05-04
in scheme: AQD - Quality control and assurance on CDR
hidden label: Assessment Regimes are missing in Attainment. Please revise
editorial note: [Crucial]: Yes -
error type: ERROR

Must be a valid AQ Zone.
type: Concept
notation: G15
definition: The subject of ./aqd:zone xlink:href attribute shall resolve to a valid AQ zone with /aqd:AQD_Zone
status: valid
status modified: 2023-05-04
accepted date: 2023-05-04
in scheme: AQD - Quality control and assurance on CDR
hidden label: Incorrect link between Attainment and Zone(s)
editorial note: [Crucial]: Yes - IPR requirement (Annex II-G-4)
error type: BLOCKER

The attainment(s) for PM2.5 AEI (both ECO & ERT) MUST not link to any specific zone.
type: Concept
notation: G16
definition: The attaniment(s) for PM2.5 AEI (both ECO & ERT) MUST not link to any specific zone. Specific syntax in XML is: <aqd:zone nilReason="inapplicable"/>
status: experimental
status modified: 2023-05-04
accepted date: 2023-05-04
in scheme: AQD - Quality control and assurance on CDR
editorial note: Not implemented
error type: ERROR

Linked zones must contain same pollutant as the Attainment
type: Concept
notation: G17
definition: The subject of the ./aqd: zone xlink:href attribute shall contain a /aqd:AQD_Zone/aqd:pollutant EQUAL to ./aqd:pollutan
status: valid
status modified: 2023-05-04
accepted date: 2023-05-04
in scheme: AQD - Quality control and assurance on CDR
hidden label: Mismtach between Attainment's pollutant and Zone's pollutant
editorial note: [Crucial]: Yes - Content check vs Zones
error type: BLOCKER

Any attainment for LVmaxMOT should link to a zone with a time extension
type: Concept
notation: G18
definition: The subject of the ./aqd: zone xlink:href attribute shall contain a /aqd:AQD_Zone/aqd:timeExtensionExemption shall NOT EQUAL http://dd.eionet.europa.eu/vocabulary/aq/timeextensiontypes/none WHERE ./aqd:exceedanceDescription_Final/aqd:ExceedanceDescription/aqd:environmentalObj ective/aqd:EnvironmentalObjective/aqd:objectiveType xlink:href attribute EQUALs http://dd.eionet.europa.eu/vocabulary/aq/objectivetype/LVmaxMOT
status: valid
status modified: 2023-05-04
accepted date: 2023-05-04
in scheme: AQD - Quality control and assurance on CDR
hidden label: Any attainment for LVmaxMOT should link to a zone with a time extension
editorial note: [Crucial]: Yes - Content check
error type: BLOCKER

Objective Type must use one of the following: TV LV CL LVMOT LVmaxMOT INT ALT LTO ECO
type: Concept
notation: G19
definition: ./aqd:environmentalObjective/aqd:EnvironmentalObjective/aqd:objectiveType xlink:href attribute shall resolve to one of http://dd.eionet.europa.eu/vocabulary/aq/objectivetype/LV http://dd.eionet.europa.eu/vocabulary/aq/objectivetype/TV http://dd.eionet.europa.eu/vocabulary/aq/objectivetype/LVMOT http://dd.eionet.europa.eu/vocabulary/aq/objectivetype/LVmaxMOT http://dd.eionet.europa.eu/vocabulary/aq/objectivetype/CL http://dd.eionet.europa.eu/vocabulary/aq/objectivetype/LTO http://dd.eionet.europa.eu/vocabulary/aq/objectivetype/ECO http://dd.eionet.europa.eu/vocabulary/aq/objectivetype/INT http://dd.eionet.europa.eu/vocabulary/aq/objectivetype/ALT
status: valid
status modified: 2023-05-04
accepted date: 2023-05-04
in scheme: AQD - Quality control and assurance on CDR
hidden label: Codelist for objective type requires revision (EEA codelist is required) or unexpected option
editorial note: [Crucial]: Yes - Content check
error type: BLOCKER

G20
type: Concept
notation: G20
preferred label: The Exceedence description must use an approved reporting metric, These are: Three consecutive hours in exceedance Annual mean / average , Winter Mean, Hours in exceedance in a calendar year, Days in exceedance in a calendar year, Days in exceedance averaged over 3 calendar years, Accumulated Ozone Exposure , Accumulated Ozone Exposure averaged over 5 years, Average Exposure Indicator
definition: The content of ./aqd:EnvironmentalObjective/aqd:reportingMetric shall resolve to a valid concept in http://dd.eionet.europa.eu/vocabulary/aq/reportingmetric/ that must be one of http://dd.eionet.europa.eu/vocabulary/aq/reportingmetric/3hAbove http://dd.eionet.europa.eu/vocabulary/aq/reportingmetric/aMean http://dd.eionet.europa.eu/vocabulary/aq/reportingmetric/wMean http://dd.eionet.europa.eu/vocabulary/aq/reportingmetric/hrsAbove http://dd.eionet.europa.eu/vocabulary/aq/reportingmetric/daysAbove http://dd.eionet.europa.eu/vocabulary/aq/reportingmetric/daysAbove-3yr http://dd.eionet.europa.eu/vocabulary/aq/reportingmetric/maxd8hrMean http://dd.eionet.europa.eu/vocabulary/aq/reportingmetric/AOT40c http://dd.eionet.europa.eu/vocabulary/aq/reportingmetric/AOT40c-5yr http://dd.eionet.europa.eu/vocabulary/aq/reportingmetric/AEI
status: valid
status modified: 2023-05-04
accepted date: 2023-05-04
in scheme: AQD - Quality control and assurance on CDR
hidden label: Codelist for reporting metric requires revision (EEA codelist is required) or unexpected option
editorial note: [Crucial]: Yes - Content check
error type: BLOCKER

The protection target must use the approved vocabulary
type: Concept
notation: G21
definition: If ./aqd:protectionTarget shall resolve to a register vocabulary under http://dd.eionet.europa.eu/vocabulary/aq/protectiontarget/[Code]
status: valid
status modified: 2023-05-04
accepted date: 2023-05-04
in scheme: AQD - Quality control and assurance on CDR
hidden label: Codelist for protection target requires revision (EEA codelist is required) or unexpected option
editorial note: [Crucial]: Yes - Content check
error type: BLOCKER

Check and list any invalid combination of pollutant & environmental objective
type: Concept
notation: G22
definition: Check that EnvironmentalObjetive (ObjectiveType+ReportingMetric+ProtectionTarget) correspond to a valid combination in http://dd.eionet.europa.eu/vocabulary/aq/environmentalobjective/view
status: valid
status modified: 2023-05-04
accepted date: 2023-05-04
in scheme: AQD - Quality control and assurance on CDR
hidden label: Invalid Environmental Objective combination found
editorial note: [Crucial]: Yes - Content check
error type: BLOCKER

reserved
type: Concept
notation: G23
definition: reserved
status: deprecated
status modified: 2023-05-04
accepted date: 2023-05-04
in scheme: AQD - Quality control and assurance on CDR
hidden label: reserved
editorial note: Included in G22

reserved
type: Concept
notation: G24
definition: reserved
status: deprecated
status modified: 2023-05-04
accepted date: 2023-05-04
in scheme: AQD - Quality control and assurance on CDR
hidden label: reserved
editorial note: Included in G22

reserved
type: Concept
notation: G25
definition: reserved
status: deprecated
status modified: 2023-05-04
accepted date: 2023-05-04
in scheme: AQD - Quality control and assurance on CDR
hidden label: reserved
editorial note: Included in G22

reserved
type: Concept
notation: G26
definition: reserved
status: deprecated
status modified: 2023-05-04
accepted date: 2023-05-04
in scheme: AQD - Quality control and assurance on CDR
hidden label: reserved
editorial note: Included in G22

reserved
type: Concept
notation: G27
definition: reserved
status: deprecated
status modified: 2023-05-04
accepted date: 2023-05-04
in scheme: AQD - Quality control and assurance on CDR
hidden label: reserved
editorial note: Included in G22

reserved
type: Concept
notation: G28
definition: reserved
status: deprecated
status modified: 2023-05-04
accepted date: 2023-05-04
in scheme: AQD - Quality control and assurance on CDR
hidden label: reserved
editorial note: Included in G22

reserved
type: Concept
notation: G29
definition: reserved
status: deprecated
status modified: 2023-05-04
accepted date: 2023-05-04
in scheme: AQD - Quality control and assurance on CDR
hidden label: reserved
editorial note: Included in G22

reserved
type: Concept
notation: G30
definition: reserved
status: deprecated
status modified: 2023-05-04
accepted date: 2023-05-04
in scheme: AQD - Quality control and assurance on CDR
hidden label: reserved
editorial note: Included in G22

reserved
type: Concept
notation: G31
definition: reserved
status: deprecated
status modified: 2023-05-04
accepted date: 2023-05-04
in scheme: AQD - Quality control and assurance on CDR
hidden label: reserved
editorial note: Included in G22

reserved
type: Concept
notation: G32
definition: reserved
status: deprecated
status modified: 2023-05-04
accepted date: 2023-05-04
in scheme: AQD - Quality control and assurance on CDR
hidden label: reserved
editorial note: Included in G22

reserved
type: Concept
notation: G33
definition: reserved
status: deprecated
status modified: 2023-05-04
accepted date: 2023-05-04
in scheme: AQD - Quality control and assurance on CDR
hidden label: reserved
editorial note: Included in G22

reserved
type: Concept
notation: G34
definition: All occurrences of the srsDimension attribute in ./aqd:exceedanceDescriptionBase/aqd:ExceedanceDescription/aqd:exceedanceArea/aqd:ExceedanceArea/aqd:spatialExtent shall EQUAL “2”
status: reserved
status modified: 2023-05-04
accepted date: 2023-05-04
in scheme: AQD - Quality control and assurance on CDR
editorial note: Not implemented

reserved
type: Concept
notation: G35
definition: All occurrences of the srsName attribute in ./aqd:exceedanceDescriptionBase/aqd:ExceedanceDescription/aqd:exceedanceArea/aqd:ExceedanceArea/aqd:spatialExtent shall resolve to a valid spatial reference system URN or URI
status: reserved
status modified: 2023-05-04
accepted date: 2023-05-04
in scheme: AQD - Quality control and assurance on CDR
editorial note: Not implemented

reserved
type: Concept
notation: G36
definition: /aqd:exceedanceDescriptionBase/aqd:ExceedanceDescription/aqd:exceedanceArea/aqd:ExceedanceArea/aqd:surfaceArea uom attribute shall resolve to http://dd.eionet.europa.eu/vocabulary/uom/area/km2
status: reserved
status modified: 2023-05-04
accepted date: 2023-05-04
in scheme: AQD - Quality control and assurance on CDR
editorial note: Not implemented

reserved
type: Concept
notation: G37
definition: /aqd:exceedanceDescriptionBase/aqd:ExceedanceDescription/aqd:exceedanceArea/aqd:ExceedanceArea/aqd:roadLength uom attribute shall be http://dd.eionet.europa.eu/vocabulary/uom/length/km
status: reserved
status modified: 2023-05-04
accepted date: 2023-05-04
in scheme: AQD - Quality control and assurance on CDR
editorial note: Not implemented

Classification type must be one of the following: rural rural-nearcity rural-regional rural-remote urban suburban
type: Concept
notation: G38
definition: The content of /aqd:exceedanceDescriptionBase/aqd:ExceedanceDescription/aqd:exceedanceArea/aqd:ExceedanceArea/aqd:areaClassification xlink:xref shall resolve to a areaClassification in http://dd.eionet.europa.eu/vocabulary/aq/areaclassification/ that must be one of Hide items http://dd.eionet.europa.eu/vocabulary/aq/areaclassification/rural http://dd.eionet.europa.eu/vocabulary/aq/areaclassification/rural-nearcity http://dd.eionet.europa.eu/vocabulary/aq/areaclassification/rural-regional http://dd.eionet.europa.eu/vocabulary/aq/areaclassification/rural-remote http://dd.eionet.europa.eu/vocabulary/aq/areaclassification/urban http://dd.eionet.europa.eu/vocabulary/aq/areaclassification/suburban
status: valid
status modified: 2023-05-04
accepted date: 2023-05-04
in scheme: AQD - Quality control and assurance on CDR
hidden label: Codelist for classificationType requires revision: EEA codelist is required
editorial note: [Crucial]: Yes - Content check
error type: BLOCKER

The exceeding AQ_Model shall resolve to a traversable local of global URL.
type: Concept
notation: G39
definition: ./aqd:exceedanceDescriptionBase/aqd:ExceedanceDescription/aqd:exceedanceArea/aqd:ExceedanceArea/aqd:modelUsed xlink:href attribute shall resolve to a model description in /aqd:AQD_Model
status: valid
status modified: 2023-05-04
accepted date: 2023-05-04
in scheme: AQD - Quality control and assurance on CDR
hidden label: Incorrect link between attainment(s) and model(s)
editorial note: [Crucial]: Yes - Content check
error type: BLOCKER

The exceeding AQ_Model must be included in the corresponding AssessmentRegime
type: Concept
notation: G40
definition: The subject of ./aqd:exceedanceDescriptionBase/aqd:ExceedanceDescription/aqd:exceedanceArea/ aqd:ExceedanceArea/aqd:modelUsed xlink:href attribute shall be found in /aqd:AQD_AssessmentRegime/aqd:assessmentMethods/aqd:AssessmentMethods/aqd:modelAssessmentMetadata xlink:href attribute for the AQD_AssessmentRegime record cited by ./aqd:assessment
status: valid
status modified: 2023-05-04
accepted date: 2023-05-04
in scheme: AQD - Quality control and assurance on CDR
hidden label: Model used under attainment not included in corresponding Assessment Regime
editorial note: [Crucial]: Yes - Content check
error type: BLOCKER

The exceeding SamplingPoint shall resolve to a traversable local of global URL.
type: Concept
notation: G41
definition: ./aqd:exceedanceDescriptionBase/aqd:ExceedanceDescription/aqd:exceedanceArea/aqd:ExceedanceArea/aqd:stationUsed xlink:href attribute shall resolve to a sampling point description in /aqd:AQD_SamplingPoint
status: valid
status modified: 2023-05-04
accepted date: 2023-05-04
in scheme: AQD - Quality control and assurance on CDR
hidden label: Incorrect link between attainment(s) and samplingpoint(s)
editorial note: [Crucial]: Yes - Content check
error type: BLOCKER

The exceeding SamplingPoint must be included in the corresponding AssessmentRegime
type: Concept
notation: G42
definition: The subject of ./aqd:exceedanceDescriptionBase/aqd:ExceedanceDescription/aqd:exceedanceArea/aqd:ExceedanceArea/aqd:stationlUsed xlink:href attribute shall be found in /aqd:AQD_AssessmentRegime/aqd:assessmentMethods/aqd:AssessmentMethods/aqd:samplingPointAssessmentMetadata xlink:href attribute for the AQD_AssessmentRegime record cited by ./aqd:assessment
status: valid
status modified: 2023-05-04
accepted date: 2023-05-04
in scheme: AQD - Quality control and assurance on CDR
hidden label: SamplingPoint used under attainment not included in corresponding Assessment Regime
editorial note: [Crucial]: Yes - Content check
error type: BLOCKER

reserved
type: Concept
notation: G43
definition: ./aqd:exceedanceDescriptionBase/aqd:ExceedanceDescription/aqd:exceedanceExposure/aqd:ExceedanceExposure/aqd:referenceYear/gml:TimeInstant/gml:timePosition shall specify a year in yyyy format.
status: reserved
status modified: 2023-05-04
accepted date: 2023-05-04
in scheme: AQD - Quality control and assurance on CDR
editorial note: Not implemented

Baseline exceedance must be TRUE or FALSE (if provided)
type: Concept
notation: G44
definition: ./aqd:exceedanceDescriptionBase/aqd:ExceedanceDescription/aqd:exceedance shall EQUAL “true” or “false”
status: valid
status modified: 2023-05-04
accepted date: 2023-05-04
in scheme: AQD - Quality control and assurance on CDR
hidden label: Baseline Exceedance invalid
editorial note: Improved in v5.0
error type: BLOCKER

If baseline exceedance is TRUE numericalExceedance or numberExceedances must be provided
type: Concept
notation: G45
definition: If ./aqd:exceedanceDescriptionBase/aqd:ExceedanceDescription/aqd:exceedance is TRUE EITHER ./aqd:exceedanceDescriptionBase/aqd:ExceedanceDescription/aqd:numericalExceedance OR ./aqd:exceedanceDescriptionBase/aqd:ExceedanceDescription/aqd:numberExceedances must be provided AS an integer number
status: valid
status modified: 2023-05-04
accepted date: 2023-05-04
in scheme: AQD - Quality control and assurance on CDR
hidden label: BaselineExceedance (TRUE) do not include numericalExceedance or numberExceedances.
editorial note: [Crucial]: Yes - IPR requirement (Annex II-G-8+9)
error type: BLOCKER

If baseline exceedance is FALSE the provision of numericalExceedance or numberExceedances is useful
type: Concept
notation: G46
definition: If ./aqd:exceedanceDescriptionBase/aqd:ExceedanceDescription/aqd:exceedance is FALSE EITHER ./aqd:exceedanceDescriptionBase/aqd:ExceedanceDescription/aqd:numericalExceedance OR ./aqd:exceedanceDescriptionBase/aqd:ExceedanceDescription/aqd:numberExceedances must be provided AS an integer number
status: valid
status modified: 2023-05-04
accepted date: 2023-05-04
in scheme: AQD - Quality control and assurance on CDR
hidden label: If baseline exceedance is FALSE the provision of numericalExceedance or numberExceedances is useful
editorial note: [Crucial]: Yes - IPR requirement (Annex II-G-8+9)
error type: BLOCKER

Deduction is not allowed when providing Baseline Exceedance
type: Concept
notation: G47
definition: ./aqd:exceedanceDescriptionBase/aqd:ExceedanceDescription/aqd:deductionAssessmentMethod/aqd:AdjustmentMethod/aqd:adjustmentType xlink:href attribute shall resolve to http://dd.eionet.europa.eu/vocabulary/aq/adjustmenttype/noneApplied
status: valid
status modified: 2023-05-04
accepted date: 2023-05-04
in scheme: AQD - Quality control and assurance on CDR
hidden label: Deduction is not allowed when providing Baseline Exceedance
editorial note: [Crucial]: Yes - Content check
error type: BLOCKER

When reporting aqd:exceedanceDescriptionBase, a correspoding aqd:exceedanceDescriptionAdjustment is expected
type: Concept
notation: G48
definition: When reporting aqd:exceedanceDescriptionBase, a correspoding aqd:exceedanceDescriptionAdjustment is expected
status: valid
status modified: 2024-08-29
accepted date: 2024-08-29
in scheme: AQD - Quality control and assurance on CDR
editorial note: Implemented
error type: BLOCKER

reserved
type: Concept
notation: G49
definition: All occurrences of the srsName attribute in ./aqd:exceedanceDescriptionAdjustment/aqd:ExceedanceDescription/aqd:exceedanceArea/aqd:ExceedanceArea/aqd:spatialExtent shall resolve to a valid spatial reference system URN or URI
status: reserved
status modified: 2023-05-04
accepted date: 2023-05-04
in scheme: AQD - Quality control and assurance on CDR
editorial note: Not implemented

reserved
type: Concept
notation: G50
definition: /aqd:exceedanceDescriptionAdjustment/aqd:ExceedanceDescription/aqd:exceedanceArea/aqd:ExceedanceArea/aqd:surfaceArea uom attribute shall resolve to http://dd.eionet.europa.eu/vocabulary/uom/area/km2
status: reserved
status modified: 2023-05-04
accepted date: 2023-05-04
in scheme: AQD - Quality control and assurance on CDR
editorial note: Not implemented

reserved
type: Concept
notation: G51
definition: /aqd:exceedanceDescriptionAdjustment/aqd:ExceedanceDescription/aqd:exceedanceArea/aqd:ExceedanceArea/aqd:roadLength uom attribute shall be http://dd.eionet.europa.eu/vocabulary/uom/length/km
status: reserved
status modified: 2023-05-04
accepted date: 2023-05-04
in scheme: AQD - Quality control and assurance on CDR
editorial note: Not implemented

The exceeding AQ_Model shall resolve to a traversable local of global URL.
type: Concept
notation: G53
definition: ./aqd:exceedanceDescriptionAdjustment/aqd:ExceedanceDescription/aqd:exceedanceArea/aqd:ExceedanceArea/aqd:modelUsed xlink:href attribute shall resolve to a model description in aqd:AQD_Model
status: valid
status modified: 2023-05-04
accepted date: 2023-05-04
in scheme: AQD - Quality control and assurance on CDR
hidden label: Incorrect link between attainment(s) and model(s)
editorial note: [Crucial]: Yes - Content check
error type: BLOCKER

The exceeding AQ_Model must be included in the corresponding AssessmentRegime
type: Concept
notation: G54
definition: The subject of ./aqd:exceedanceDescriptionAdjustment/aqd:ExceedanceDescription/aqd:exceedanceArea/aqd:ExceedanceArea/aqd:modelUsed xlink:href attribute shall be found in /aqd:AQD_AssessmentRegime/aqd:assessmentMethods/aqd:AssessmentMethods/aqd:modelAssessmentMetadata xlink:href attribute for the AQD_AssessmentRegime record cited by ./aqd:assessment
status: valid
status modified: 2023-05-04
accepted date: 2023-05-04
in scheme: AQD - Quality control and assurance on CDR
hidden label: Model used under attainment not included in corresponding Assessment Regime
editorial note: [Crucial]: Yes - Content check
error type: BLOCKER

The exceeding SamplingPoint shall resolve to a traversable local of global URL.
type: Concept
notation: G55
definition: ./aqd:exceedanceDescriptionAdjustment/aqd:ExceedanceDescription/aqd:exceedanceArea/aqd:ExceedanceArea/aqd:stationUsed xlink:href attribute shall resolve to a sampling point description in /aqd:AQD_SamplingPoint
status: valid
status modified: 2023-05-04
accepted date: 2023-05-04
in scheme: AQD - Quality control and assurance on CDR
hidden label: Incorrect link between attainment(s) and samplingpoint(s)
editorial note: [Crucial]: Yes - Content check
error type: BLOCKER

The exceeding SamplingPoint must be included in the corresponding AssessmentRegime
type: Concept
notation: G56
definition: The subject of ./aqd:exceedanceDescriptionAdjustment/aqd:ExceedanceDescription/aqd:exceedanceArea/aqd:ExceedanceArea/aqd:stationlUsed xlink:href attribute shall be found in /aqd:AQD_AssessmentRegime/aqd:assessmentMethods/aqd:AssessmentMethods/aqd:samplingPointAssessmentMetadata xlink:href attribute for the AQD_AssessmentRegime record cited by ./aqd:assessment
status: valid
status modified: 2023-05-04
accepted date: 2023-05-04
in scheme: AQD - Quality control and assurance on CDR
hidden label: SamplingPoint used under attainment not included in corresponding Assessment Regime
editorial note: [Crucial]: Yes - Content check
error type: BLOCKER

If provided unde Adjustment Exceedance, area classification must be one of the following: rural rural-nearcity rural-regional rural-remote urban suburban
type: Concept
notation: G52
definition: The content of /aqd:exceedanceDescriptionAdjustment/aqd:ExceedanceDescription/aqd:environmentalObjective/aqd:EnvironmentalObjective/aqd:areaClassification xlink:xref shall resolve to a areaClassification in http://dd.eionet.europa.eu/vocabulary/aq/areaclassification/ that must be one of Hide items http://dd.eionet.europa.eu/vocabulary/aq/areaclassification/rural http://dd.eionet.europa.eu/vocabulary/aq/areaclassification/rural-nearcity http://dd.eionet.europa.eu/vocabulary/aq/areaclassification/rural-regional http://dd.eionet.europa.eu/vocabulary/aq/areaclassification/rural-remote http://dd.eionet.europa.eu/vocabulary/aq/areaclassification/urban http://dd.eionet.europa.eu/vocabulary/aq/areaclassification/suburban
status: valid
status modified: 2023-05-04
accepted date: 2023-05-04
in scheme: AQD - Quality control and assurance on CDR
hidden label: Codelist for area classification requires revision: EEA codelist is required
editorial note: [Crucial]: Yes -
error type: ERROR

reserved
type: Concept
notation: G57
definition: ./aqd:exceedanceDescriptionAdjustment/aqd:ExceedanceDescription/aqd:exceedanceExposure/aqd:ExceedanceExposure/aqd:referenceYear/gml:TimeInstant/gml:timePosition shall specify a year in yyyy format.
status: reserved
status modified: 2023-05-04
accepted date: 2023-05-04
in scheme: AQD - Quality control and assurance on CDR
editorial note: Not implemented

Adjusment exceedance must be TRUE or FALSE
type: Concept
notation: G58
definition: ./aqd:exceedanceDescriptionAdjustment/aqd:ExceedanceDescription/aqd:exceedance shall EQUAL “true” or “false”
status: valid
status modified: 2023-05-04
accepted date: 2023-05-04
in scheme: AQD - Quality control and assurance on CDR
hidden label: Adjustment Exceedance invalid
editorial note: [Crucial]: Yes - IPR requirement (Annex II-G-10+11)
error type: BLOCKER

If adjustment exceedance is TRUE numericalExceedance or numberExceedances must be provided
type: Concept
notation: G59
definition: ./aqd:exceedanceDescriptionAdjustment/aqd:ExceedanceDescription/aqd:numericalExceedance shall be an integer number
status: valid
status modified: 2023-05-04
accepted date: 2023-05-04
in scheme: AQD - Quality control and assurance on CDR
hidden label: AdjustmentExceedance (TRUE) do not include numericalExceedance or numberExceedances.
editorial note: [Crucial]: Yes - IPR requirement (Annex II-G-10+11)
error type: BLOCKER

If adjustment exceedance is FALSE the provision of numericalExceedance or numberExceedances is useful
type: Concept
notation: G60
definition: ./aqd:exceedanceDescriptionAdjustment/aqd:ExceedanceDescription/aqd:numberExceedances shall be an integer number
status: valid
status modified: 2023-05-04
accepted date: 2023-05-04
in scheme: AQD - Quality control and assurance on CDR
hidden label: If adjustment exceedance is FALSE the provision of numericalExceedance or numberExceedances is useful
editorial note: [Crucial]: Yes - IPR requirement (Annex II-G-10+11)
error type: WARNING

The Adjustment Method type shall be 'Natural source correction' or 'Winter-sanding or -salting correction'
type: Concept
notation: G61
definition: The content of /aqd:exceedanceDescriptionAdjustment/aqd:ExceedanceDescription/aqd:deductionAssessmentMethod/aqd:AdjustmentMethod/aqd:adjustmentType xlink:xref shall resolve to a adjustmentType in http://dd.eionet.europa.eu/vocabulary/aq/adjustmenttype/ that must be one of Hide items http://dd.eionet.europa.eu/vocabulary/aq/adjustmenttype/nsCorrection http://dd.eionet.europa.eu/vocabulary/aq/adjustmenttype/wssCorrection
status: valid
status modified: 2023-05-04
accepted date: 2023-05-04
in scheme: AQD - Quality control and assurance on CDR
hidden label: Deduction is not allowed when providing Baseline Exceedance
editorial note: [Crucial]: Yes - Content check
error type: BLOCKER

The Adjustment Source Type must be one of the registered vocabulary.
type: Concept
notation: G62
definition: The content of /aqd:exceedanceDescriptionAdjustment/aqd:ExceedanceDescription/aqd:deductionAssessmentMethod/aqd:AdjustmentMethod/aqd:adjustmenSource xlink:xref shall resolve to a adjustmenSource in http://dd.eionet.europa.eu/vocabulary/aq/adjustmentsourcetype/ that must be one of Hide items http://dd.eionet.europa.eu/vocabulary/aq/adjustmentsourcetype/A1 http://dd.eionet.europa.eu/vocabulary/aq/adjustmentsourcetype/A2 http://dd.eionet.europa.eu/vocabulary/aq/adjustmentsourcetype/B http://dd.eionet.europa.eu/vocabulary/aq/adjustmentsourcetype/B1 http://dd.eionet.europa.eu/vocabulary/aq/adjustmentsourcetype/B2 http://dd.eionet.europa.eu/vocabulary/aq/adjustmentsourcetype/C1 http://dd.eionet.europa.eu/vocabulary/aq/adjustmentsourcetype/C2 http://dd.eionet.europa.eu/vocabulary/aq/adjustmentsourcetype/D1 http://dd.eionet.europa.eu/vocabulary/aq/adjustmentsourcetype/D2 http://dd.eionet.europa.eu/vocabulary/aq/adjustmentsourcetype/E1 http://dd.eionet.europa.eu/vocabulary/aq/adjustmentsourcetype/E2 http://dd.eionet.europa.eu/vocabulary/aq/adjustmentsourcetype/F1 http://dd.eionet.europa.eu/vocabulary/aq/adjustmentsourcetype/F2 http://dd.eionet.europa.eu/vocabulary/aq/adjustmentsourcetype/G1 http://dd.eionet.europa.eu/vocabulary/aq/adjustmentsourcetype/G2 http://dd.eionet.europa.eu/vocabulary/aq/adjustmentsourcetype/H
status: valid
status modified: 2023-05-04
accepted date: 2023-05-04
in scheme: AQD - Quality control and assurance on CDR
hidden label: Codelist for adjustement source type requires revision: EEA codelist is required
editorial note: [Crucial]: Yes - Content check
error type: BLOCKER

Assessment Type must be one of the following: fixed, model, indicative or objective estimation
type: Concept
notation: G63
definition: The content of ./aqd:exceedanceDescriptionAdjustment/aqd:ExceedanceDescription/ aqd:deductionAssessmentMethod/aqd:AdjustmentMethod/aqd:assessmentMethod/aqd:AssessmentMethods/aqd:assessmentType shall resolve to http://dd.eionet.europa.eu/vocabulary/aq/assessmenttype/ that must be one of Hide items http://dd.eionet.europa.eu/vocabulary/aq/assessmenttype/fixed http://dd.eionet.europa.eu/vocabulary/aq/assessmenttype/model http://dd.eionet.europa.eu/vocabulary/aq/assessmenttype/indicative http://dd.eionet.europa.eu/vocabulary/aq/assessmenttype/objective
status: valid
status modified: 2023-05-04
accepted date: 2023-05-04
in scheme: AQD - Quality control and assurance on CDR
hidden label: Codelist for assessment type requires revision: EEA codelist is required
editorial note: [Crucial]: Yes - Content check
error type: BLOCKER

If adjusting for NS/WSS correction, a correct link must be provided to the adjusment method (either Model or SamplingPoint)
type: Concept
notation: G64
definition: When adusting for NS/WSS correction, aqd:exceedanceDescriptionAdjustment must contain, at least, a link to the adjustment method used (via /aqd:exceedanceDescriptionAdjustment/aqd:ExceedanceDescription/aqd:deductionAssessmentMethod/aqd:AdjustmentMethod/aqd:assessmentMethod/aqd:AssessmentMethods/[aqd:modelAssessmentMetadata or samplingPointAssessmentMetadata] xlink:href
status: valid
status modified: 2023-05-04
accepted date: 2023-05-04
in scheme: AQD - Quality control and assurance on CDR
hidden label: Incorrect link between adjustment method and samplingpoint(s) and/or model(s)
editorial note: [Crucial]: Yes - Content check
error type: BLOCKER

If model(s) or samplingPoint(s) are used for adjusting for NS/WSS correction, a correct link must be provided
type: Concept
notation: G65
definition: The subject of ./aqd:exceedanceDescriptionAdjustment/aqd:ExceedanceDescription/aqd:deductionAssessmentMethod/aqd:AdjustmentMethod/aqd:assessmentMethod/aqd:AssessmentMethods/[aqd:modelAssessmentMetadata or aqd:samplingPointAssessmentMetadata] xlink:href attribute shall be reported in dataflow D
status: valid
status modified: 2023-05-04
accepted date: 2023-05-04
in scheme: AQD - Quality control and assurance on CDR
hidden label: If model(s) or samplingPoint(s) are used for adjusting for NS/WSS correction, a correct link must be provided
error type: Removed

If the adjustment method(s) are Model(s), these must be found with the corresponding Assessment Regime (link to the Attainment)
type: Concept
notation: G66
definition: The subject of ./aqd:exceedanceDescriptionAdjustment/aqd:ExceedanceDescription/aqd:deductionAssessmentMethod/aqd:AdjustmentMethod/aqd:assessmentMethod/aqd:AssessmentMethods/aqd:modelAssessmentMetadata xlink:href attribute shall be found in /aqd:AQD_AssessmentRegime/aqd:assessmentMethods/aqd:AssessmentMethods/aqd:modelAssessmentMetadata xlink:href attribute for the AQD_AssessmentRegime record cited by ./aqd:assessment
status: valid
status modified: 2023-05-04
accepted date: 2023-05-04
in scheme: AQD - Quality control and assurance on CDR
hidden label: Model(s) used for adjustment not included in corresponding Assessment Regime
editorial note: [Crucial]: Yes - Content check
error type: BLOCKER

If the adjustment method(s) are SamplingPoint(s), these must be found with the corresponding Assessment Regime (link to the Attainment)
type: Concept
notation: G67
definition: The subject of ./aqd:exceedanceDescriptionAdjustment/aqd:ExceedanceDescription/aqd:deductionAssessmentMethod/aqd:AdjustmentMethod/aqd:assessmentMethod/aqd:AssessmentMethods/aqd: samplingPointAssessmentMetadata xlink:href attribute shall be found in /aqd:AQD_AssessmentRegime/aqd:assessmentMethods/aqd:AssessmentMethods/aqd:samplingPointAssessmentMetadata xlink:href attribute for the AQD_AssessmentRegime record cited by ./aqd:assessment
status: valid
status modified: 2023-05-04
accepted date: 2023-05-04
in scheme: AQD - Quality control and assurance on CDR
hidden label: SamplingPoint(s) used for adjustment not included in corresponding Assessment Regime
editorial note: [Crucial]: Yes - Content check
error type: BLOCKER

When reporting aqd:exceedanceDescriptionAdjustment, a correspoding aqd:exceedanceDescriptionBase is expected
type: Concept
notation: G68
definition: When reporting aqd:exceedanceDescriptionAdjustment, a correspoding aqd:exceedanceDescriptionBase is expected
status: valid
status modified: 2024-08-29
accepted date: 2024-08-29
in scheme: AQD - Quality control and assurance on CDR
editorial note: Implemented
error type: BLOCKER

G69
type: Concept
notation: G69
preferred label: Ensure that documentation is provided for Adjustments of Natural Source and/or Winter Sanding. Under /aqd:AQD_Attainment/aqd:exceedanceDescriptionAdjustment/aqd:ExceedanceDescription/aqd:comment the full name of a pdf document attached to the G envelope must be provided
definition: Ensure that documentation is provided for Adjustments of Natural Source and/or Winter Sanding. Under /aqd:AQD_Attainment/aqd:exceedanceDescriptionAdjustment/aqd:ExceedanceDescription/aqd:comment the full name of a pdf document attached to the G envelope must be provided (example: <aqd:comment>Spanish_adjustment_natural_contribution_2022.pdf</aqd:comment>
status: valid
status modified: 2024-07-11
accepted date: 2024-07-11
in scheme: AQD - Quality control and assurance on CDR
editorial note: Not implemented
error type: BLOCKER

Exceedence area uom attribute must be in Square kilometers.
type: Concept
notation: G70
definition: /aqd:exceedanceDescriptionFinal/aqd:ExceedanceDescription/aqd:exceedanceArea/aqd:ExceedanceArea/aqd:surfaceArea uom attribute shall resolve to http://dd.eionet.europa.eu/vocabulary/uom/area/km2
status: valid
status modified: 2023-05-04
accepted date: 2023-05-04
in scheme: AQD - Quality control and assurance on CDR
hidden label: Codelist for exceedance area requires revision: EEA codelist is required
editorial note: [Crucial]: Yes - System check
error type: BLOCKER

Road Length attribute must be in kilometers.
type: Concept
notation: G71
definition: /aqd:exceedanceDescriptionFinal/aqd:ExceedanceDescription/aqd:exceedanceArea/aqd:ExceedanceArea/aqd:roadLength uom attribute shall be http://dd.eionet.europa.eu/vocabulary/uom/length/km
status: valid
status modified: 2023-05-04
accepted date: 2023-05-04
in scheme: AQD - Quality control and assurance on CDR
hidden label: Codelist for road length requires revision: EEA codelist is required
editorial note: [Crucial]: Yes - System check
error type: BLOCKER

Area Classification must be one of the following: rural rural-nearcity rural-regional rural-remote urban suburban
type: Concept
notation: G72
definition: The content of /aqd:exceedanceDescriptionFinal/aqd:ExceedanceDescription/aqd:exceedanceArea/aqd:ExceedanceArea/aqd:areaClassification xlink:xref shall resolve to a areaClassification in http://dd.eionet.europa.eu/vocabulary/aq/areaclassification/ that must be one of Hide items http://dd.eionet.europa.eu/vocabulary/aq/areaclassification/rural http://dd.eionet.europa.eu/vocabulary/aq/areaclassification/rural-nearcity http://dd.eionet.europa.eu/vocabulary/aq/areaclassification/rural-regional http://dd.eionet.europa.eu/vocabulary/aq/areaclassification/rural-remote http://dd.eionet.europa.eu/vocabulary/aq/areaclassification/urban http://dd.eionet.europa.eu/vocabulary/aq/areaclassification/suburban
status: valid
status modified: 2023-05-04
accepted date: 2023-05-04
in scheme: AQD - Quality control and assurance on CDR
hidden label: Codelist for area classification requires revision: EEA codelist is required
editorial note: [Crucial]: Yes - Content check
error type: BLOCKER

The exceeding AQ_Model shall resolve to a traversable local of global URL.
type: Concept
notation: G73
definition: ./aqd:exceedanceDescriptionFinal/aqd:ExceedanceDescription/aqd:exceedanceArea/aqd:ExceedanceArea/aqd:modelUsed xlink:href attribute shall resolve to a model description in /aqd:AQD_Model
status: valid
status modified: 2023-05-04
accepted date: 2023-05-04
in scheme: AQD - Quality control and assurance on CDR
hidden label: Incorrect link between attainment(s) and model(s)
editorial note: [Crucial]: Yes - Content check
error type: BLOCKER

The exceeding AQ_Model must be included in the corresponding AssessmentRegime
type: Concept
notation: G74
definition: The subject of ./aqd:exceedanceDescriptionFinal/aqd:ExceedanceDescription/aqd:exceedanceArea/aqd:ExceedanceArea/aqd:modelUsed xlink:href attribute shall be found in /aqd:AQD_AssessmentRegime/aqd:assessmentMethods/aqd:AssessmentMethods/aqd:modelAssessmentMetadata xlink:href attribute for the AQD_AssessmentRegime record cited by ./aqd:assessment
status: valid
status modified: 2023-05-04
accepted date: 2023-05-04
in scheme: AQD - Quality control and assurance on CDR
hidden label: Model used under attainment not included in corresponding Assessment Regime
editorial note: [Crucial]: Yes - Content check
error type: BLOCKER

The exceeding SamplingPoint shall resolve to a traversable local of global URL.
type: Concept
notation: G75
definition: ./aqd:exceedanceDescriptionFinal/aqd:ExceedanceDescription/aqd:exceedanceArea/aqd:ExceedanceArea/aqd:stationUsed xlink:href attribute shall resolve to a sampling point description in /aqd:AQD_SamplingPoint
status: valid
status modified: 2023-05-04
accepted date: 2023-05-04
in scheme: AQD - Quality control and assurance on CDR
hidden label: Incorrect link between attainment(s) and samplingpoint(s)
editorial note: [Crucial]: Yes - Content check
error type: BLOCKER

The exceeding SamplingPoint must be included in the corresponding AssessmentRegime
type: Concept
notation: G76
definition: The subject of ./aqd:exceedanceDescriptionFinal/aqd:ExceedanceDescription/aqd:exceedanceArea/aqd:ExceedanceArea/aqd:stationlUsed xlink:href attribute shall be found in /aqd:AQD_AssessmentRegime/aqd:assessmentMethods/aqd:AssessmentMethods/aqd:samplingPointAssessmentMetadata xlink:href attribute for the AQD_AssessmentRegime record cited by ./aqd:assessment
status: valid
status modified: 2023-05-04
accepted date: 2023-05-04
in scheme: AQD - Quality control and assurance on CDR
hidden label: SamplingPoint used under attainment not included in corresponding Assessment Regime
editorial note: [Crucial]: Yes - Content check
error type: BLOCKER

reserved
type: Concept
notation: G77
definition: ./aqd:exceedanceDescriptionFinal/aqd:ExceedanceDescription/aqd:exceedanceExposure/aqd:ExceedanceExposure/aqd:referenceYear/gml:TimeInstant/gml:timePosition shall specify a year in yyyy format.
status: reserved
status modified: 2023-05-04
accepted date: 2023-05-04
in scheme: AQD - Quality control and assurance on CDR
editorial note: Not implemented

Final Exceedance must be TRUE or FALSE
type: Concept
notation: G78
definition: ./aqd:exceedanceDescriptionFinal/aqd:ExceedanceDescription/aqd:exceedance shall EQUAL “true” or “false”
status: valid
status modified: 2023-05-04
accepted date: 2023-05-04
in scheme: AQD - Quality control and assurance on CDR
hidden label: Final Exceedance invalid
editorial note: [Crucial]: Yes - IPR requirement (Annex II-G-13)
error type: BLOCKER

If Final exceedance is TRUE numericalExceedance or numberExceedances must be provided
type: Concept
notation: G79
definition: ./aqd:exceedanceDescriptionFinal/aqd:ExceedanceDescription/aqd:numericalExceedance shall be an integer number
status: valid
status modified: 2023-05-04
accepted date: 2023-05-04
in scheme: AQD - Quality control and assurance on CDR
hidden label: Final exceedance (TRUE) do not include numericalExceedance or numberExceedances.
editorial note: [Crucial]: Yes - IPR requirement (Annex II-G-13
error type: BLOCKER

If Final exceedance is FALSE the provision of numericalExceedance or numberExceedances is useful
type: Concept
notation: G80
definition: ./aqd:exceedanceDescriptionFinal/aqd:ExceedanceDescription/aqd:numberExceedances shall be an integer number
status: valid
status modified: 2023-05-04
accepted date: 2023-05-04
in scheme: AQD - Quality control and assurance on CDR
hidden label: Attainment(s) with NO exceedance do not include numericalExceedance or numberExceedances. This information is very useful, please provide.
editorial note: [Crucial]: Yes - IPR requirement (Annex II-G-13
error type: ERROR

aqd:exceedanceDescriptionFinal/aqd:ExceedanceDescription/aqd:deductionAssessmentMethod/aqd:AdjustmentMethod must be 'Fully corrected" when base/adjustment are provided.'
type: Concept
notation: G81
definition: ./aqd:exceedanceDescriptionFinal/aqd:ExceedanceDescription/aqd:deductionAssessmentMethod/aqd:AdjustmentMethod/aqd:adjustmentType xlink:href attribute shall resolve to http://dd.eionet.europa.eu/vocabulary/aq/adjustmenttype/fullyCorrected when the attainment includes aqd:exceedanceDescriptionBase & aqd:exceedanceDescriptionAdjustment
status: valid
status modified: 2023-05-04
accepted date: 2023-05-04
in scheme: AQD - Quality control and assurance on CDR
hidden label: Adjustment method (at Final exceedance) must be fully corrected
editorial note: [Crucial]: Yes - Content check
error type: BLOCKER

For each individual attainment, only 1 of the following elements is expected: numericalExceedance or numberExceedances (not BOTH)
type: Concept
notation: G82
definition: For each individual attainment, only 1 of the following elements is expected: numericalExceedance or numberExceedances (not BOTH)
status: experimental
status modified: 2023-05-04
accepted date: 2023-05-04
in scheme: AQD - Quality control and assurance on CDR
editorial note: Crucial for G
error type: ERROR

Evaluate that the exceedance is correctly reported according to the particular Environmental Objective (aqd:numericalExceedance vs aqd:numberExceedance)
type: Concept
notation: G83
definition: According to IPR decision, each Environmental Objective is defined by a particular reporting metric. Depending on the reporting metric, within Attainment declaration, a user will use either aqd:numericalExceedance for means, percentiles or AOT and aqd:numberExceedances for hoursAbove or daysAbove.
status: stable
status modified: 2023-05-04
accepted date: 2023-05-04
in scheme: AQD - Quality control and assurance on CDR
editorial note: Implemented
error type: BLOCKER

ExceedanceDescriptionBase, exceedanceDescriptionAdjustment and exceedanceDescriptionFinal should be consistent in terms of numericalExceedance or numberExceedance
type: Concept
notation: G83b
definition: Evaluate that the exceedanceDescriptionBase, exceedanceDescriptionAdjustment and exceedanceDescriptionFinal are consistently reported. aqd:numericalExceedance or aqd:numberExceedance consistent in the 3 elements.
status: valid
status modified: 2024-07-11
accepted date: 2024-07-11
in scheme: AQD - Quality control and assurance on CDR
error type: BLOCKER

Check if exceedance (TRUE/FALSE) correspond to the reported value aqd:numericalExceedance/aqd:numberExceedances/...
type: Concept
notation: G84
definition: Check if exceedance (TRUE/FALSE) correspond to the reported value aqd:numericalExceedance/aqd:numberExceedances/...
status: experimental
status modified: 2023-05-04
accepted date: 2023-05-04
in scheme: AQD - Quality control and assurance on CDR
editorial note: Not implemented
error type: ERROR

If exceedance is TRUE, a link to the exceeding SamplingPoint(s) and/or Model(s) must be provided [at least one]
type: Concept
notation: G85
definition: WHERE ./aqd:exceedanceDescriptionFinal/aqd:ExceedanceDescription/aqd:exceedance shall EQUAL “true” ./aqd:exceedanceDescriptionFinal/aqd:ExceedanceDescription/aqd:exceedanceArea/aqd:ExceedanceArea/aqd:stationUsed OR ./aqd:exceedanceDescriptionFinal/aqd:ExceedanceDescription/aqd:exceedanceArea/aqd:ExceedanceArea/aqd:modelUsed shall be populated
status: valid
status modified: 2023-05-04
accepted date: 2023-05-04
in scheme: AQD - Quality control and assurance on CDR
hidden label: Final exceedance (TRUE) do not include link to exceeding SamplingPoint(s) and/or Model(s)
error type: BLOCKER

If SamplingPoint(s) and/or Model(s) are provided, these must be valid
type: Concept
notation: G86
definition: If, aqd:stationUsed and/or aqd:modelUsed are populated, these must be valid elements stationUsed must link To SamplingPoint via namespace/localid modelUsed must link to AQD_Model via namespace/ localid
status: valid
status modified: 2023-05-04
accepted date: 2023-05-04
in scheme: AQD - Quality control and assurance on CDR
hidden label: Incorrect link between Attainment and exceeding SamplingPoin(s) and/or Model(s)
error type: BLOCKER

If exceedance is TRUE, information on population exposed must be provided
type: Concept
notation: G87
definition: WHERE ./aqd:exceedanceDescriptionFinal/aqd:ExceedanceDescription/aqd:exceedance shall EQUAL “true” /aqd:exceedanceDescriptionFinal/aqd:ExceedanceDescription/aqd:exceedanceExposure/aqd:ExceedanceExposure/aqd:populationExposed shall be populated
status: reserved
status modified: 2023-05-04
accepted date: 2023-05-04
in scheme: AQD - Quality control and assurance on CDR
hidden label: If exceedance is TRUE, information on population exposed must be provided
editorial note: Not implemented

If exceedance is TRUE, information on area exposed must be provided
type: Concept
notation: G88
definition: WHERE ./aqd:exceedanceDescriptionFinal/aqd:ExceedanceDescription/aqd:exceedance shall EQUAL “true”/aqd:exceedanceDescriptionFinal/aqd:ExceedanceDescription/aqd:exceedanceExposure/aqd:ExceedanceExposure/aqd:ecosystemAreaExposed shall be populated
status: reserved
status modified: 2023-05-04
accepted date: 2023-05-04
in scheme: AQD - Quality control and assurance on CDR
hidden label: If exceedance is TRUE, information on area exposed must be provided
editorial note: Not implemented

Primary validated data (both E1a and/or E1b) must be submitted for all declared methods under Assessment Regime before releasing the Attainment.
type: Concept
notation: G89
definition: Primary validated data (both E1a and/or E1b) must be submitted for all declared methods under Assessment Regime before releasing the Attainment.
status: valid
status modified: 2024-02-15
accepted date: 2023-05-04
in scheme: AQD - Quality control and assurance on CDR
error type: ERROR

Primary validated data (both E1a and/or E1b) must be submitted for all declared methods under Assessment Regime before releasing the Attainment
type: Concept
notation: G89a
definition: Primary validated data (both E1a and/or E1b) must be submitted for all declared methods under Assessment Regime before releasing the Attainment
status: valid
status modified: 2025-06-10
accepted date: 2025-06-10
in scheme: AQD - Quality control and assurance on CDR
error type: BLOCKER

Count the number of Sampling Points and Models in different dataflows such as E1a, E1b, C and G
type: Concept
notation: G89b
definition: Count the number of Sampling Points and Models in different dataflows such as E1a, E1b, C and G
status: valid
status modified: 2025-06-10
accepted date: 2025-06-10
in scheme: AQD - Quality control and assurance on CDR
error type: ERROR

Compare attainment results to previous year submission
type: Concept
notation: G91
definition: When G report is submitted, compare the compliance status of each Attainment compared to previous reported information (for previous year).
status: valid
status modified: 2023-05-04
accepted date: 2023-05-04
in scheme: AQD - Quality control and assurance on CDR
error type: WARNING

Compare attainment results compared to current year (if an update)
type: Concept
notation: G92
definition: When G report is updated, compare the compliance status of each Attainment compared to previous reported information (for same year).
status: valid
status modified: 2023-05-04
accepted date: 2023-05-04
in scheme: AQD - Quality control and assurance on CDR
error type: WARNING

For all attainments, numericalExceedance < -1 or numberExceedances < 0
type: Concept
notation: G93
definition: aqd:numericalExceedance must be greater or equal to -1 & aqd:numberExceedance must be greater or equal to 0
status: valid
status modified: 2023-10-09
accepted date: 2023-10-09
in scheme: AQD - Quality control and assurance on CDR
error type: BLOCKER

G95
type: Concept
notation: G95
preferred label: An attainment for PM2.5 Exposure concentration obligationMUST be provided, it is has to be unique and the exceedance value reported via a unique element numericalExceedance. The reported AEI CANNOT be 0.
definition: In order to ensure correct reporting of the AEI compliance, the unique attainment for PM2.5 Average Exposure Indicator must provide a unique element numericalExceedance. This will be the calculated AEI and CANNOT be 0.
status: valid
status modified: 2023-05-04
accepted date: 2023-05-04
in scheme: AQD - Quality control and assurance on CDR
error type: BLOCKER

An attainment for PM2.5 Exposure Reduction Target SHOULD be provided, it is has to be unique and the exceedance value reported via a unique element numericalExceedance. The reported AEI CANNOT be 0.
type: Concept
notation: G96
definition: In order to ensure correct reporting of the ERT compliance, the unique attainment for PM2.5 Average Exposure Indicator must provide a unique element numericalExceedance. This will be the calculated AEI and CANNOT be 0.
status: valid
status modified: 2023-05-04
accepted date: 2023-05-04
in scheme: AQD - Quality control and assurance on CDR
error type: ERROR

Check PM2.5 Compliance against National Exposure Reduction Target
type: Concept
notation: G97
definition: Check PM2.5 Compliance against National Exposure Reduction Target
status: valid
status modified: 2023-05-04
accepted date: 2023-05-04
in scheme: AQD - Quality control and assurance on CDR
error type: ERROR

Check if at least one of the following combinations is reported (O3-INT, O3-ALT, NO2-ALT & SO2-ALT)
type: Concept
notation: G99
definition: Check if at least there is on Attainment for the following combinations in the XML (O3-INT, O3-ALT, NO2-ALT & SO2-ALT)
status: valid
status modified: 2023-05-19
accepted date: 2023-05-19
in scheme: AQD - Quality control and assurance on CDR
error type: BLOCKER

Cross checks with other data-flows
type: Concept
notation: GCrossCheck
definition: Cross checks with other data-flows
status: valid
status modified: 2023-05-04
accepted date: 2023-05-04
in scheme: AQD - Quality control and assurance on CDR
error type: WARNING

Check if delivery if this is a new delivery or updated delivery (via reporting year)
type: Concept
notation: H0
definition: Checks if this delivery is new or an update (on same reporting year)
status: valid
status modified: 2023-05-04
accepted date: 2023-05-04
in scheme: AQD - Quality control and assurance on CDR
hidden label: Check if delivery if this is a new delivery or updated delivery (via reporting year)
error type: WARNING

Compile & feedback upon the total number of plans records included in the delivery
type: Concept
notation: H01
definition: Number of AQ Plans reported
status: valid
status modified: 2023-05-04
accepted date: 2023-05-04
in scheme: AQD - Quality control and assurance on CDR
hidden label: Compile & feedback upon the total number of plans records included in the delivery
error type: BLOCKER

Compile & feedback upon the total number of new plans records included in the delivery (compared to any delivery for the same reporting year)
type: Concept
notation: H02
definition: Number of new Plans compared to previous report(s).
status: valid
status modified: 2023-05-04
accepted date: 2023-05-04
in scheme: AQD - Quality control and assurance on CDR
hidden label: Compile & feedback upon the total number of new plans records included in the delivery (compared to any delivery for the same reporting year)
error type: WARNING

H03
type: Concept
notation: H03
preferred label: Compile & feedback upon the total number of updated plans records included in the delivery. BLOCKER will be returned if XML is an update and ALL localId (100%) are different to previous delivery (for the same YEAR).
definition: Number of existing Plans compared to previous report (same reporting year). BLOCKER will be returned if XML is an update and ALL localId (100%) are different to previous delivery (for the same YEAR).
status: valid
status modified: 2023-05-04
accepted date: 2023-05-04
in scheme: AQD - Quality control and assurance on CDR
hidden label: Compile & feedback upon the total number of updated plans records included in the delivery. BLOCKER will be returned if XML is an update and ALL localId (100%) are different to previous delivery (for the same YEAR).
error type: ERROR

List of unique identifier information for all Plan records. Error will be returned if no Plans are reported.
type: Concept
notation: H04
definition: Compile & feedback a list of the unique identifier information for all Plans records included in the delivery. Feedback report shall include the gml:id attribute- ./aqd:inspireId- ./aqd:pollutant - ./aqd:protectionTarget - /gml:FeatureCollection/gml:featureMember/aqd:AQD_Plan/aqd:firstExceedanceYear -
status: valid
status modified: 2023-05-04
accepted date: 2023-05-04
in scheme: AQD - Quality control and assurance on CDR
hidden label: List of unique identifier information for all Plan records. Error will be returned if no Plans are reported.
error type: INFO

Your plan should be for an expected pollutant and correctly use one of pollutants listed at http://dd.eionet.europa.eu/vocabulary/aq/pollutant/
type: Concept
notation: H05
definition: aqd:AQD_Plan/aqd:pollutants/aqd:Pollutant/aqd:pollutantCode xlink:href attribute shall resolve to one of http://dd.eionet.europa.eu/vocabulary/aq/pollutant/
status: valid
status modified: 2023-05-04
accepted date: 2023-05-04
in scheme: AQD - Quality control and assurance on CDR
hidden label: Your plan should use one of pollutants listed at http://dd.eionet.europa.eu/vocabulary/aq/pollutant/
error type: WARNING

Reserved
type: Concept
notation: H06
definition: Reserved
status: valid
status modified: 2023-05-04
accepted date: 2023-05-04
in scheme: AQD - Quality control and assurance on CDR
hidden label: Reserved
error type: reserved

All gml ID attributes shall have unique code.
type: Concept
notation: H07
definition: All gml:id attributes - ef:inspireId and aqd:inspireId elements shall have unique content
status: valid
status modified: 2023-05-04
accepted date: 2023-05-04
in scheme: AQD - Quality control and assurance on CDR
hidden label: All gml ID attributes shall have unique code.
error type: WARNING

Local Id of the Plans must be unique.
type: Concept
notation: H08
definition: ./aqd:inspireId/base:Identifier/base:localId must be unique code for the Plans records
status: valid
status modified: 2023-05-04
accepted date: 2023-05-04
in scheme: AQD - Quality control and assurance on CDR
hidden label: Local Id of the Plans must be unique.
error type: BLOCKER

List unique namespaces used and count number of elements.
type: Concept
notation: H09
definition: ./aqd:inspireId/base:Identifier/base:namespace List base:namespace and count the number of base:localId assigned to each base:namespace.
status: valid
status modified: 2023-05-04
accepted date: 2023-05-04
in scheme: AQD - Quality control and assurance on CDR
hidden label: List unique namespaces used and count number of elements.
error type: INFO

Check if namespace is registered in vocabulary (http://dd.eionet.europa.eu/vocabulary/aq/namespace/view)
type: Concept
notation: H10
definition: Check if namespace is registered in vocabulary (http://dd.eionet.europa.eu/vocabulary/aq/namespace/view)
status: valid
status modified: 2023-05-04
accepted date: 2023-05-04
in scheme: AQD - Quality control and assurance on CDR
hidden label: Check if namespace is registered in vocabulary (http://dd.eionet.europa.eu/vocabulary/aq/namespace/view)
error type: BLOCKER

AQ Plan must link to a valid exceedance situation (G)
type: Concept
notation: H11
definition: If aqd:AQD_ReportingHeader/aqd:reportingPeriod => 2013 aqd:AQD_Plan/aqd:exceedanceSituation@xlink:href attribute shall resolve to at least one exceedance situation in dataset G via namespace/localId.
status: valid
status modified: 2023-05-04
accepted date: 2023-05-04
in scheme: AQD - Quality control and assurance on CDR
hidden label: AQ must link to a valid exceedande situation (G) if reporting period equal or greater than 2013.
error type: BLOCKER

aqd:comment should be provided if reporting period before than 2013 and a valid exceedande situation is not provided.
type: Concept
notation: H12
definition: If aqd:reportingPeriod < 2013 and aqd:AQD_Plan/aqd:exceedanceSituation is empty aqd:comment must be populated
status: valid
status modified: 2023-05-04
accepted date: 2023-05-04
in scheme: AQD - Quality control and assurance on CDR
hidden label: aqd:comment should be provided if reporting period before than 2013 and a valid exceedande situation is not provided.
error type: WARNING

Reserved
type: Concept
notation: H13
definition: Reserved
status: valid
status modified: 2023-05-04
accepted date: 2023-05-04
in scheme: AQD - Quality control and assurance on CDR
hidden label: Reserved
error type: reserved

We recommend you start you codes with the 2-digit country code according to ISO 3166-1.
type: Concept
notation: H14
definition: aqd:AQD_Plan/aqd:code should begin with with the 2-digit country code according to ISO 3166-1.
status: invalid
status modified: 2023-05-04
accepted date: 2023-05-04
in scheme: AQD - Quality control and assurance on CDR
hidden label: We recommend you start you codes with the 2-digit country code according to ISO 3166-1.
error type: WARNING

aqd:code must be populated & unique within the XML
type: Concept
notation: H15
definition: aqd:code can not be EMPTY & the code provided must be unique within the XML delivered
status: valid
status modified: 2023-05-04
accepted date: 2023-05-04
in scheme: AQD - Quality control and assurance on CDR
hidden label: Reserved
error type: ERROR

You must provide the name of the organisation responsible for the Plan.
type: Concept
notation: H16
definition: aqd:AQD_Plan/aqd:competentAuthority/base2:RelatedParty/base2:organisationName/gco:CharacterString shall not be NULL or voided
status: valid
status modified: 2023-05-04
accepted date: 2023-05-04
in scheme: AQD - Quality control and assurance on CDR
hidden label: You must provide the name of the organisation responsible for the Plan.
error type: BLOCKER

You should provide a contact point within the organisation responsible for the plan. This should be a generic contact point.
type: Concept
notation: H17
definition: aqd:AQD_Plan/aqd:competentAuthority/base2:RelatedParty/base2:individualName/gco:CharacterString shall not be NULL or voided
status: valid
status modified: 2023-05-04
accepted date: 2023-05-04
in scheme: AQD - Quality control and assurance on CDR
hidden label: You should provide a contact point within the organisation responsible for the plan. This should be a generic contact point.
error type: WARNING

You should provide an email address for the contact point within the organisation responsible for the plan (This should be a generic email address).
type: Concept
notation: H18
definition: aqd:AQD_Plan/aqd:competentAuthority/base2:RelatedParty/base2:contact/base2:Contact/base2:electronicMailAddress shall not be NULL or voided
status: valid
status modified: 2023-05-04
accepted date: 2023-05-04
in scheme: AQD - Quality control and assurance on CDR
hidden label: You should provide an email address for the contact point within the organisation responsible for the plan (This should be a generic email address).
error type: WARNING

Your reference year must be in yyyy format.
type: Concept
notation: H19
definition: aqd:AQD_Plan/aqd:firstExceedanceYear/gml:TimeInstant/gml:timePosition shall not be voided - NULL or an empty tag & shall contain content in yyyy format
status: valid
status modified: 2023-05-04
accepted date: 2023-05-04
in scheme: AQD - Quality control and assurance on CDR
hidden label: Your reference year must be in yyyy format.
error type: BLOCKER

Your plan status should use one of those listed at http://dd.eionet.europa.eu/vocabulary/aq/statusaqplan/
type: Concept
notation: H20
definition: aqd:AQD_Plan/aqd:status xlink:href attribute shall resolve to one of http://dd.eionet.europa.eu/vocabulary/aq/statusaqplan/
status: valid
status modified: 2023-05-04
accepted date: 2023-05-04
in scheme: AQD - Quality control and assurance on CDR
hidden label: Your plan status should use one of those listed at http://dd.eionet.europa.eu/vocabulary/aq/statusaqplan/
error type: BLOCKER

Your plan should use one of pollutants listed at http://dd.eionet.europa.eu/vocabulary/aq/pollutant/
type: Concept
notation: H21
definition: aqd:AQD_Plan/aqd:pollutants/aqd:Pollutant/aqd:pollutantCode xlink:href attribute shall resolve to one of http://dd.eionet.europa.eu/vocabulary/aq/pollutant/
status: valid
status modified: 2023-05-04
accepted date: 2023-05-04
in scheme: AQD - Quality control and assurance on CDR
hidden label: Your plan should use one of pollutants listed at http://dd.eionet.europa.eu/vocabulary/aq/pollutant/
error type: SKIPPED

Your plan should use one of protection targets listed at http://dd.eionet.europa.eu/vocabulary/aq/protectiontarget/
type: Concept
notation: H22
definition: aqd:AQD_Plan/aqd:pollutants/aqd:Pollutant/aqd:protectionTarget xlink:href attribute shall resolve to one of http://dd.eionet.europa.eu/vocabulary/aq/protectiontarget/
status: valid
status modified: 2023-05-04
accepted date: 2023-05-04
in scheme: AQD - Quality control and assurance on CDR
hidden label: Your plan should use one of protection targets listed at http://dd.eionet.europa.eu/vocabulary/aq/protectiontarget/
error type: BLOCKER

Check and count expected combinations of Pollutant and ProtectionTarget.
type: Concept
notation: H23
definition: Check and count expected combinations of Pollutant and ProtectionTarget at /gml:FeatureCollection/gml:featureMember/aqd:AQD_Plan/aqd:pollutants/aqd:Pollutant Sulphur dioxide (1) + health Sulphur dioxide (1) + vegetation Ozone (7) + health Ozone (7) + vegetation Nitrogen dioxide (8) + health Nitrogen oxides (9) + vegetation Particulate matter < 10 µm (5) + health Particulate matter < 2.5 µm (6001) + health Carbon monoxide (10) + health Benzene (20) + health Lead in PM10 (5012) + health Arsenic in PM10 (5018) + health Cadmium in PM10 (5014) + health Nickel in PM10 (5015) + health Benzo(a)pyrene in PM10 (5029) + health
status: valid
status modified: 2023-05-04
accepted date: 2023-05-04
in scheme: AQD - Quality control and assurance on CDR
hidden label: Check and count expected combinations of Pollutant and ProtectionTarget.
error type: BLOCKER

AQ plan pollutant's should match those in the exceedance situation (G).
type: Concept
notation: H24
definition: aqd:AQD_Plan/aqd:pollutants/aqd:Pollutant/aqd:pollutantCode xlink:href attribute (may be multiple) shall be the same as those in the referenced data flow G xlinked via aqd:AQD_Plan/aqd:exceedanceSituation@xlink:href attribute (maybe multiple)
status: valid
status modified: 2023-05-04
accepted date: 2023-05-04
in scheme: AQD - Quality control and assurance on CDR
hidden label: AQ plan pollutant's should match those in the exceedance situation (G).
error type: WARNING

Your reference year must be in yyyy-mm-dd format.
type: Concept
notation: H25
definition: aqd:AQD_Plan/aqd:adoptionDate/gml:TimeInstant/gml:timePosition MUST be populated and its content in yyyy-mm-dd format if /gml:FeatureCollection/gml:featureMember/aqd:AQD_Plan/aqd:status xlink:href attribute not equal http://dd.eionet.europa.eu/vocabulary/aq/statusaqplan/preparation - http://dd.eionet.europa.eu/vocabulary/aq/statusaqplan/adoption-process or http://dd.eionet.europa.eu/vocabulary/aq/statusaqplan/under-revision
status: valid
status modified: 2023-05-04
accepted date: 2023-05-04
in scheme: AQD - Quality control and assurance on CDR
hidden label: Your reference year must be in yyyy-mm-dd format.
error type: BLOCKER

Plan adoption date should not be populated if plan is in preparation, under revision or in adoption process.
type: Concept
notation: H26
definition: if /gml:FeatureCollection/gml:featureMember/aqd:AQD_Plan/aqd:status xlink:href attribute equal http://dd.eionet.europa.eu/vocabulary/aq/statusaqplan/preparation - http://dd.eionet.europa.eu/vocabulary/aq/statusaqplan/adoption-process or http://dd.eionet.europa.eu/vocabulary/aq/statusaqplan/under-revision aqd:AQD_Plan/aqd:adoptionDate/gml:TimeInstant/gml:timePosition should not be populated
status: valid
status modified: 2023-05-04
accepted date: 2023-05-04
in scheme: AQD - Quality control and assurance on CDR
hidden label: Plan adoption date should not be populated if plan is in preparation, under revision or in adoption process.
error type: ERROR

You should report a short textual description of timetable for the implementation of the air quality plan.
type: Concept
notation: H27
definition: aqd:AQD_Plan/aqd:timeTable shal contain a text string
status: valid
status modified: 2023-05-04
accepted date: 2023-05-04
in scheme: AQD - Quality control and assurance on CDR
hidden label: You should report a short textual description of timetable for the implementation of the air quality plan.
error type: ERROR

You should report a URL to document or web resource describing the last version of full air quality plan.
type: Concept
notation: H28
definition: aqd:AQD_Plan/aqd:referenceImplementation shall contain a URL to document or web resource describing the latest version of full air quality plan. This MUST be valid.
status: valid
status modified: 2023-05-04
accepted date: 2023-05-04
in scheme: AQD - Quality control and assurance on CDR
hidden label: You should report a URL to document or web resource describing the last version of full air quality plan.
error type: ERROR

You should report a URL to a document or web resource where information about the implementation of the air quality plan can be found.
type: Concept
notation: H29
definition: aqd:AQD_Plan/aqd:referenceImplementation must contain a URL to a document or web resource where information about the implementation of the air quality plan can be found.
status: valid
status modified: 2023-05-04
accepted date: 2023-05-04
in scheme: AQD - Quality control and assurance on CDR
hidden label: You should report a URL to a document or web resource where information about the implementation of the air quality plan can be found.
error type: ERROR

Brief textual description of the published AQ Plan should be provided. Include the ISBN number (If available)
type: Concept
notation: H30
definition: aqd:AQD_Plan/aqd:publication/aqd:Publication/aqd:description must contain a text string describing the publication
status: valid
status modified: 2023-05-04
accepted date: 2023-05-04
in scheme: AQD - Quality control and assurance on CDR
hidden label: Brief textual description of the published AQ Plan should be provided. Include the ISBN number (If available)
error type: WARNING

You should provide title as written in the published AQ Plan.
type: Concept
notation: H31
definition: aqd:AQD_Plan/aqd:publication/aqd:Publication/aqd:title must contain the title of the publication
status: valid
status modified: 2023-05-04
accepted date: 2023-05-04
in scheme: AQD - Quality control and assurance on CDR
hidden label: You should provide title as written in the published AQ Plan.
error type: ERROR

Author information for the AQ Plan report - multiple entries can be provided as a comma separate list.
type: Concept
notation: H32
definition: aqd:AQD_Plan/aqd:publication/aqd:Publication/aqd:author must contain the author(s) of the publication
status: valid
status modified: 2023-05-04
accepted date: 2023-05-04
in scheme: AQD - Quality control and assurance on CDR
hidden label: Author(s) should be provided as text (Please provide in one field separated by commas if there are multiple authors).
error type: WARNING

The publication date of the AQ Plan should be provided in yyyy or yyyy-mm-dd format
type: Concept
notation: H33
definition: aqd:AQD_Plan/aqd:publication/aqd:Publication/aqd:publicationDate/gml:TimeInstant/gml:timePosition must contaong the date of publication in yyyy-mm-dd format
status: valid
status modified: 2023-05-04
accepted date: 2023-05-04
in scheme: AQD - Quality control and assurance on CDR
hidden label: The publication date of the AQ Plan should be provided in yyyy or yyyy-mm-dd format
error type: BLOCKER

Publisher should be provided as a text (Publishing institution - academic jourmal – etc.)
type: Concept
notation: H34
definition: aqd:AQD_Plan/aqd:publication/aqd:Publication/aqd:publisher must container a text string describing the publisher
status: valid
status modified: 2023-05-04
accepted date: 2023-05-04
in scheme: AQD - Quality control and assurance on CDR
hidden label: Publisher should be provided as a text (Publishing institution - academic jourmal – etc.)
error type: WARNING

Provided url to the published AQ Plan should be valid.
type: Concept
notation: H35
definition: aqd:AQD_Plan/aqd:publication/aqd:Publication/aqd:webLink must contain a URL to document or web resource describing the last version of full air quality plan
status: valid
status modified: 2023-05-04
accepted date: 2023-05-04
in scheme: AQD - Quality control and assurance on CDR
hidden label: Provided url to the published AQ Plan should be valid.
error type: ERROR

Check if the delivery is a new or an update delivery (based on reporting year)
type: Concept
notation: I0
definition: Check if the delivery is a new or an update delivery. If the system already includes a submission for the same data flow I for the same year, this will be considered as an update.
status: valid
status modified: 2023-05-04
accepted date: 2023-05-04
in scheme: AQD - Quality control and assurance on CDR
hidden label: Check if delivery if this is a new delivery or updated delivery (via reporting year)
error type: WARNING

Number of source apportionment records in this delivery
type: Concept
notation: I1
definition: Compile & feedback upon the total number of Source Apportionments included in the delivery
status: valid
status modified: 2023-05-04
accepted date: 2023-05-04
in scheme: AQD - Quality control and assurance on CDR
hidden label: Compile & feedback upon the total number of Source Apportionments included in the delivery
error type: BLOCKER

Check if namespace is registered in vocabulary (http://dd.eionet.europa.eu/vocabulary/aq/namespace/view)
type: Concept
notation: I10
definition: Check if namespace is registered in vocabulary (http://dd.eionet.europa.eu/vocabulary/aq/namespace/view)
status: valid
status modified: 2023-05-04
accepted date: 2023-05-04
in scheme: AQD - Quality control and assurance on CDR
hidden label: Check if namespace is registered in vocabulary (http://dd.eionet.europa.eu/vocabulary/aq/namespace/view)
error type: BLOCKER

You must provide a reference to a plan document from data flow H via its namespace & localId. The plan document must have the same reporting year as the source apportionment document.
type: Concept
notation: I11
definition: aqd:AQD_SourceApportionment/aqd:usedInPlan shall reference an existing H document for the same reporting year same year via namespace/localId
status: valid
status modified: 2023-05-04
accepted date: 2023-05-04
in scheme: AQD - Quality control and assurance on CDR
hidden label: You must provide a reference to a plan document from data flow H via its namespace & localId. The plan document must have the same reporting year as the source apportionment document.
error type: BLOCKER

You must provide a reference to an exceedance situation from data flow G. The exceedance situation must have the same reporting year as the source apportionment and refer to the same pollutant.
type: Concept
notation: I12
definition: aqd:AQD_SourceApportionment/aqd:parentExceedanceSituation shall reference an existing exceedance situation delivered within a data flow G and the reporting year of G & I shall be the same year via namespace/localId.
status: valid
status modified: 2023-05-04
accepted date: 2023-05-04
in scheme: AQD - Quality control and assurance on CDR
hidden label: You must provide a reference to an exceedance situation from data flow G. The exceedance situation must have the same reporting year as the source apportionment and refer to the same pollutant.
error type: BLOCKER

The exceedanceSituation linked (G) in this Source Apportionment (I) must be listed in the linked AQ Plan (H) for the same Source Apportionment (I)
type: Concept
notation: I12a
definition: HINT: Please ensure that the exceedanceSituation listed in the Source Apportionment listed (if there is an error), is also listed in the released AQ Plan (H) which the Source Apportionment also links too.
status: valid
status modified: 2023-05-04
accepted date: 2023-05-04
in scheme: AQD - Quality control and assurance on CDR
error type: BLOCKER

Reference year must be a calendar year in yyyy format.
type: Concept
notation: I13
definition: aqd:AQD_SourceApportionment/aqd:referenceYear/gml:TimeInstant/gml:timePosition shall be a calendar year in yyyy format
status: valid
status modified: 2023-05-04
accepted date: 2023-05-04
in scheme: AQD - Quality control and assurance on CDR
hidden label: Reference year must be a calendar year in yyyy format.
error type: BLOCKER

Source apportionments values should be provided as a number.
type: Concept
notation: I15
definition: Across all the delivery: check that the element aqd:QuantityCommented/aqd:quantity is number greater or equal to zero (>= 0) if attribute xsi:nil="false" (example: <aqd:quantity uom="http://dd.eionet.europa.eu/vocabulary/uom/concentration/ug.m-3" xsi:nil="false">4.03038</aqd:quantity>)
status: valid
status modified: 2023-05-04
accepted date: 2023-05-04
in scheme: AQD - Quality control and assurance on CDR
hidden label: Source apportionments should be provided as an integer.
error type: WARNING

If quantification is either "unpopulated" or "unknown" or "withheld" the element should be empty.
type: Concept
notation: I16
definition: Across all the delivery: check that the element aqd:QuantityCommented/aqd:quantity is empty if attribute xsi:nil="unpopulated" or "unknown" or "withheld" (example: <aqd:quantity uom="Unknown" nilReason="Unpopulated" xsi:nil="true"/>)
status: valid
status modified: 2023-05-04
accepted date: 2023-05-04
in scheme: AQD - Quality control and assurance on CDR
hidden label: If quantification is either "unpopulated" or "unknown" or "withheld" the element should be empty.
error type: BLOCKER

If the quantification is voided an explanation is required in aqd:comment.
type: Concept
notation: I17
definition: Across all the delivery: If aqd:QuantityCommented/aqd:quantity attribute xsi:nil="true" aqd:QuantityCommented/aqd:comment must be populated
status: valid
status modified: 2023-05-04
accepted date: 2023-05-04
in scheme: AQD - Quality control and assurance on CDR
hidden label: If the quantification is voided an explanation is required in aqd:comment.
error type: WARNING

The unit of measurement of the Source Apportioment must match recommended unit for the pollutant.
type: Concept
notation: I18
definition: Across all the delivery: check that the unit attribute (.../aqd:QuantityCommented/aqd:quantity@uom) corresponds to the recommended unit (via vocabulary) of the pollutant found at aqd:AQD_Attainment/aqd:pollutant xlink:href attribute for the AQD_Attainment record cited by ./aqd:parentExceedanceSituation
status: valid
status modified: 2023-05-04
accepted date: 2023-05-04
in scheme: AQD - Quality control and assurance on CDR
hidden label: The unit of measurement of the Source Apportioment must match recommended unit for the pollutant.
error type: WARNING

The total regional background source contribution must be equal to the sum of its components.
type: Concept
notation: I19
definition: aqd:AQD_SourceApportionment/aqd:regionalBackground/aqd:RegionalBackground/aqd:total/aqd:QuantityCommented/aqd:quantity must equal to the sum of aqd:regionalBackground/aqd:RegionalBackground/aqd:fromWithinMS/aqd:QuantityCommented/aqd:quantity + aqd:regionalBackground/aqd:RegionalBackground/aqd:transboundary/aqd:QuantityCommented/aqd:quantity + aqd:regionalBackground/aqd:RegionalBackground/aqd:natural /aqd:QuantityCommented/aqd:quantity + aqd:regionalBackground/aqd:RegionalBackground/aqd:other/aqd:QuantityCommented/aqd:quantity
status: valid
status modified: 2023-05-04
accepted date: 2023-05-04
in scheme: AQD - Quality control and assurance on CDR
hidden label: The total regional background source contribution must be equal to the sum of its components.
error type: WARNING

Number of NEW source apportionment records in this delivery.
type: Concept
notation: I2
definition: Compile & feedback upon the total number of new Source Apportionments records included in the delivery. ERROR will be returned if XML is a new delivery and localId are not new compared to previous deliveries.
status: valid
status modified: 2023-05-04
accepted date: 2023-05-04
in scheme: AQD - Quality control and assurance on CDR
hidden label: Number of new Source Apportionments compared to previous report. ERROR will be returned if XML is a new delivery and localId are not new compared to previous deliveries.
error type: WARNING

The total urban background source contribution must be equal to the sum of its components.
type: Concept
notation: I20
definition: aqd:AQD_SourceApportionment/aqd:urbanBackground/aqd:UrbanBackground/aqd:total/aqd:QuantityCommented/aqd:quantity must equal the sum of aqd:urbanBackground/aqd:UrbanBackground/aqd:traffic/aqd:QuantityCommented/aqd:quantity + aqd:urbanBackground/aqd:UrbanBackground/aqd:heatAndPowerProduction/aqd:QuantityCommented/aqd:quantity + aqd:urbanBackground/aqd:UrbanBackground/aqd:agriculture/aqd:QuantityCommented/aqd:quantity + aqd:urbanBackground/aqd:UrbanBackground/aqd:commercialAndResidential/aqd:QuantityCommented/aqd:quantity + aqd:urbanBackground/aqd:UrbanBackground/aqd:shipping/aqd:QuantityCommented/aqd:quantity + aqd:urbanBackground/aqd:UrbanBackground/aqd:offRoadMobileMachinery/aqd:QuantityCommented/aqd:quantity + aqd:urbanBackground/aqd:UrbanBackground/aqd:natural/aqd:QuantityCommented/aqd:quantity + aqd:urbanBackground/aqd:UrbanBackground/aqd:transboundary/aqd:QuantityCommented/aqd:quantity + aqd:urbanBackground/aqd:UrbanBackground/aqd:other/aqd:QuantityCommented/aqd:quantity
status: valid
status modified: 2023-05-04
accepted date: 2023-05-04
in scheme: AQD - Quality control and assurance on CDR
hidden label: The total urban background source contribution must be equal to the sum of its components.
error type: WARNING

The total local increment source contribution must be equal to the sum of its components.
type: Concept
notation: I21
definition: aqd:AQD_SourceApportionment/aqd:localIncrement/aqd:LocalIncrement/aqd:total/aqd:QuantityCommented/aqd:quantity must equal to the sum of aqd:localIncrement/aqd:LocalIncrement/aqd:traffic/aqd:QuantityCommented/aqd:quantity + aqd:localIncrement/aqd:LocalIncrement/aqd:heatAndPowerProduction/aqd:QuantityCommented/aqd:quantity + aqd:localIncrement/aqd:LocalIncrement/aqd:agriculture/aqd:QuantityCommented/aqd:quantity + aqd:localIncrement/aqd:LocalIncrement/aqd:commercialAndResidential/aqd:QuantityCommented/aqd:quantity + aqd:localIncrement/aqd:LocalIncrement/aqd:shipping/aqd:QuantityCommented/aqd:quantity + aqd:localIncrement/aqd:LocalIncrement/aqd:offRoadMobileMachinery/aqd:QuantityCommented/aqd:quantity + aqd:localIncrement/aqd:LocalIncrement/aqd:natural/aqd:QuantityCommented/aqd:quantity + aqd:localIncrement/aqd:LocalIncrement/aqd:transboundary/aqd:QuantityCommented/aqd:quantity + aqd:localIncrement/aqd:LocalIncrement/aqd:other/aqd:QuantityCommented/aqd:quantity
status: valid
status modified: 2023-05-04
accepted date: 2023-05-04
in scheme: AQD - Quality control and assurance on CDR
hidden label: The total local increment source contribution must be equal to the sum of its components.
error type: WARNING

The macro exceedance situation relevant to the source apportionment must be populated.
type: Concept
notation: I22
definition: aqd:AQD_SourceApportionment/aqd:macroExceedanceSituation must be presented and must not be an empty tag
status: valid
status modified: 2023-05-04
accepted date: 2023-05-04
in scheme: AQD - Quality control and assurance on CDR
hidden label: The macro exceedance situation relevant to the source apportionment must be populated.
error type: BLOCKER

numericalExceedance or numberExceedances must be provided
type: Concept
notation: I23
definition: Either aqd:AQD_SourceApportionment/aqd:macroExceedanceSituation/aqd:numericalExceedance OR aqd:AQD_SourceApportionment/aqd:macroExceedanceSituation/aqd:numberExceedances must be provided (just one or the other) AS an integer or floating point numeric > 0 (no more that 2 decimal places expected)
status: valid
status modified: 2023-05-04
accepted date: 2023-05-04
in scheme: AQD - Quality control and assurance on CDR
hidden label: numericalExceedance or numberExceedances must be provided
error type: ERROR

Area Classification is mandatory and must conform to vocabulary.
type: Concept
notation: I24
definition: The content of /aqd:macroExceedanceSituation/aqd:ExceedanceDescription/aqd:exceedanceArea/aqd:ExceedanceArea/aqd:areaClassification xlink:xref must be provided and must resolve to a areaClassification in http://dd.eionet.europa.eu/vocabulary/aq/areaclassification/
status: valid
status modified: 2023-05-04
accepted date: 2023-05-04
in scheme: AQD - Quality control and assurance on CDR
hidden label: Area Classification is mandatory and must conform to vocabulary.
error type: BLOCKER

Area classification should match classification declared in the corresponding Attainment.
type: Concept
notation: I25
definition: aqd:AQD_SourceApportionment/aqd:macroExceedanceSituation/aqd:ExceedanceDescription/aqd:exceedanceArea/aqd:ExceedanceArea/aqd:areaClassification xlink:href attribute shall match those /aqd:AQD_Attainment/aqd:exceedanceDescriptionFinal/aqd:ExceedanceDescription/aqd:exceedanceArea/aqd:ExceedanceArea/aqd:areaClassification xlink:href attribute for the AQD_Attainment record cited by ./aqd:parentExceedanceSituation
status: valid
status modified: 2023-05-04
accepted date: 2023-05-04
in scheme: AQD - Quality control and assurance on CDR
hidden label: Area classification should match classification declared in the corresponding Attainment.
error type: WARNING

Exceedence area uom attribute must be in Square kilometers (use http://dd.eionet.europa.eu/vocabulary/uom/area/km2).
type: Concept
notation: I26
definition: /aqd:macroExceedanceSituation/aqd:ExceedanceDescription/aqd:exceedanceArea/aqd:ExceedanceArea/aqd:surfaceArea uom attribute shall resolve to http://dd.eionet.europa.eu/vocabulary/uom/area/km2
status: valid
status modified: 2023-05-04
accepted date: 2023-05-04
in scheme: AQD - Quality control and assurance on CDR
hidden label: Exceedence area uom attribute must be in Square kilometers (use http://dd.eionet.europa.eu/vocabulary/uom/area/km2).
error type: ERROR

Road Length attribute must be in kilometers (use http://dd.eionet.europa.eu/vocabulary/uom/length/km).
type: Concept
notation: I27
definition: /aqd:macroExceedanceSituation/aqd:ExceedanceDescription/aqd:exceedanceArea/aqd:ExceedanceArea/aqd:roadLength uom attribute shall be http://dd.eionet.europa.eu/vocabulary/uom/length/km
status: valid
status modified: 2023-05-04
accepted date: 2023-05-04
in scheme: AQD - Quality control and assurance on CDR
hidden label: Road Length attribute must be in kilometers (use http://dd.eionet.europa.eu/vocabulary/uom/length/km).
error type: ERROR

A link to the exceeding SamplingPoint(s) and/or Model(s) must be provided [at least one].
type: Concept
notation: I29
definition: ./aqd:macroExceedanceSituation/aqd:ExceedanceDescription/aqd:exceedanceArea/aqd:ExceedanceArea/aqd:stationUsed OR ./aqd:macroExceedanceSituation/aqd:ExceedanceDescription/aqd:exceedanceArea/aqd:ExceedanceArea/aqd:modelUsed must be populated If using PAPERS, please ensure that A.2.5.6(a) or A.2.5.6(b) are filled in. For "Station used" ensure that you link to the SAMPLINGPOINT localId
status: valid
status modified: 2023-05-04
accepted date: 2023-05-04
in scheme: AQD - Quality control and assurance on CDR
hidden label: A link to the exceeding SamplingPoint(s) and/or Model(s) must be provided [at least one].
error type: ERROR

Number of existing Plans compared to previous report. ERROR will be returned if XML is an update and ALL localId (100%) are different to previous delivery (for the same YEAR).
type: Concept
notation: I3
definition: Compile & feedback upon the total number of updated Source Apportionments included in the delivery. ERROR will be returned if XML is an update and ALL localId (100%) are different to previous delivery (for the same YEAR).
status: valid
status modified: 2023-05-04
accepted date: 2023-05-04
in scheme: AQD - Quality control and assurance on CDR
hidden label: Number of existing Plans compared to previous report. ERROR will be returned if XML is an update and ALL localId (100%) are different to previous delivery (for the same YEAR).
error type: WARNING

If SamplingPoint(s) and/or Model(s) are provided these must be valid.
type: Concept
notation: I30
definition: If aqd:stationUsed and/or aqd:modelUsed are populated these must be valid elementsstationUsed must link To SamplingPoint via namespace/localidmodelUsed must link to AQD_Model via namespace/ localidIf aqd:station
status: valid
status modified: 2023-05-04
accepted date: 2023-05-04
in scheme: AQD - Quality control and assurance on CDR
hidden label: If SamplingPoint(s) and/or Model(s) are provided these must be valid.
error type: ERROR

The models referenced here must be found in the Attainment document (dataflow G). The following models do not appear in the Attainment documents deliver for this reporting year.
type: Concept
notation: I31
definition: The subject of ./aqd:macroExceedanceSituation/aqd:ExceedanceDescription/aqd:exceedanceArea/aqd:ExceedanceArea/aqd:modelUsed xlink:href attribute shall be found in /aqd:AQD_Attainment/aqd:exceedanceDescriptionFinal/aqd:ExceedanceDescription/aqd:exceedanceArea/aqd:ExceedanceArea/aqd:modelUsed xlink:href attribute for the AQD_Attainment record cited by ./aqd:parentExceedanceSituation
status: valid
status modified: 2023-05-04
accepted date: 2023-05-04
in scheme: AQD - Quality control and assurance on CDR
hidden label: The exceeding AQ_Model must be included in the corresponding Attainment.
error type: ERROR

I32
type: Concept
notation: I32
preferred label: The link to sampling points referenced here must be found in the Attainment document (dataflow G). The following sampling points do not appear in the linked Attainment. Hint: do not xlink to station eiocode/localId
definition: THIS CHECK IS NOT WORKING 100% HINT: Ensure the link is to a Sampling Point localId, NOT a station nor station EOICODE. The subject of ./aqd:macroExceedanceSituation/aqd:ExceedanceDescription/aqd:exceedanceArea/aqd:ExceedanceArea/aqd:stationlUsed xlink:href attribute shall be found in /aqd:AQD_Attainment/aqd:exceedanceDescriptionFinal/aqd:ExceedanceDescription/aqd:exceedanceArea/aqd:ExceedanceArea/aqd:modelUsed xlink:href attribute for the AQD_Attainment record cited by ./aqd:parentExceedanceSituation
status: valid
status modified: 2023-05-04
accepted date: 2023-05-04
in scheme: AQD - Quality control and assurance on CDR
hidden label: The exceeding SamplingPoint must be included in the corresponding Attainment.
error type: ERROR

Spatial extent or administrative unit may be provided.
type: Concept
notation: I33
definition: ./aqd:macroExceedanceSituation/aqd:ExceedanceDescription/aqd:exceedanceArea/aqd:ExceedanceArea/aqd:spatalExtent OR./aqd:macroExceedanceSituation/aqd:ExceedanceDescription/aqd:exceedanceArea/aqd:ExceedanceArea/aqd:administrativeUnit shall be populated
status: valid
status modified: 2023-05-04
accepted date: 2023-05-04
in scheme: AQD - Quality control and assurance on CDR
hidden label: Spatial extent or administrative unit may be provided.
error type: SKIPPED

Information on surface area or road length shall be provided.
type: Concept
notation: I34
definition: ./aqd:macroExceedanceSituation/aqd:ExceedanceDescription/aqd:exceedanceArea/aqd:ExceedanceArea/aqd:surfaceArea OR./aqd:macroExceedanceSituation/aqd:ExceedanceDescription/aqd:exceedanceArea/aqd:ExceedanceArea/aqd:roadLength shall be populated
status: valid
status modified: 2023-05-04
accepted date: 2023-05-04
in scheme: AQD - Quality control and assurance on CDR
hidden label: Information on surface area or road length shall be provided.
error type: ERROR

If exceedance is TRUE: information on population exposed must be provided.
type: Concept
notation: I35
definition: WHERE./aqd:macroExceedanceSituation/aqd:ExceedanceDescription/aqd:exceedance shall EQUAL “true” /aqd:macroExceedanceSituation/aqd:ExceedanceDescription/aqd:exceedanceExposure/aqd:ExceedanceExposure/aqd:populationExposed shall be populated
status: valid
status modified: 2023-05-04
accepted date: 2023-05-04
in scheme: AQD - Quality control and assurance on CDR
hidden label: If exceedance is TRUE: information on population exposed must be provided.

If exceedance is TRUE: information on area exposed must be provided.
type: Concept
notation: I36
definition: /aqd:macroExceedanceSituation/aqd:ExceedanceDescription/aqd:exceedanceExposure/aqd:ExceedanceExposure/aqd:ecosystemAreaExposed shall be populated
status: invalid
status modified: 2023-05-04
accepted date: 2023-05-04
in scheme: AQD - Quality control and assurance on CDR
hidden label: If exceedance is TRUE: information on area exposed must be provided.

Reference year for the population/exposure data in yyyy format.
type: Concept
notation: I37
definition: aqd:AQD_SourceApportionment/aqd:macroExceedanceSituation/aqd:ExceedanceDescription/aqd:exceedanceExposure/aqd:ExceedanceExposure/aqd:referenceYear/gml:TimeInstant/gml:timePosition shall be a calendar year in yyyy format
status: valid
status modified: 2023-05-04
accepted date: 2023-05-04
in scheme: AQD - Quality control and assurance on CDR
hidden label: Reference year for the population/exposure data in yyyy format.
error type: ERROR

Exceedance reason must match vocabulary.
type: Concept
notation: I38
definition: aqd:AQD_SourceApportionment/aqd:macroExceedanceSituation/aqd:ExceedanceDescription/aqd:exceedanceExposure/aqd:reason shall conform to vocabulary http://dd.eionet.europa.eu/vocabulary/aq/exceedancereason/
status: valid
status modified: 2023-05-04
accepted date: 2023-05-04
in scheme: AQD - Quality control and assurance on CDR
hidden label: Exceedance reason must match vocabulary.
error type: WARNING

If the pollutant is SO2 / PM10 / PM2.5 or CO, deduction assessment methods may be populated.
type: Concept
notation: I39
definition: /aqd:AQD_SourceApportionment/aqd:macroExceedanceSituation/aqd:ExceedanceDescription/aqd:deductionAssessmentMethod/aqd:AdjustmentMethod may be populated if ./aqd:pollutant xlink:href attribute EQUALs http://dd.eionet.europa.eu/vocabulary/aq/pollutant/[1/5/10/6001] (via …/aqd:parentExceedanceSituation)
status: valid
status modified: 2023-05-04
accepted date: 2023-05-04
in scheme: AQD - Quality control and assurance on CDR
hidden label: If the pollutant is SO2 / PM10 / PM2.5 or CO, deduction assessment methods may be populated.

List of unique identifier information for all Source Apportionments records. ERROR will be returned if no SA(s) are provided.
type: Concept
notation: I4
definition: Compile & feedback a list of the unique identifier information for all Source Apportionments records included in the delivery. Feedback report shall include the gml:id attribute - ./aqd:inspireId - aqd:AQD_Plan (via ./usedInPlan) - aqd:AQD_Attainment (via aqd:parentExceedanceSituation) - aqd:pollutant (via Attainment link under aqd:parentExceedanceSituation)
status: valid
status modified: 2023-05-04
accepted date: 2023-05-04
in scheme: AQD - Quality control and assurance on CDR
hidden label: List of unique identifier information for all Source Apportionments records. ERROR will be returned if no SA(s) are provided.
error type: BLOCKER

If the pollutant is SO2 / PM10 / PM2.5 or CO, the aqd:adjustmentType MUST be either (fullyCorrected noneApplicable noneApplied) under aqd:deductionAssessmentMethod
type: Concept
notation: I40
definition: WHERE ./aqd:pollutant xlink:href attribute EQUALs http://dd.eionet.europa.eu/vocabulary/aq/pollutant/[1/5/10/6001] (via …/aqd:parentExceedanceSituation then /aqd:AQD_SourceApportionment/aqd:macroExceedanceSituation/aqd:ExceedanceDescription/aqd:deductionAssessmentMethod/aqd:AdjustmentMethod/aqd:assessmentMethod/aqd:adjustmentType must conform to http://dd.eionet.europa.eu/vocabulary/aq/adjustmenttype (fullyCorrected noneApplicable noneApplied)
status: valid
status modified: 2023-05-04
accepted date: 2023-05-04
in scheme: AQD - Quality control and assurance on CDR
hidden label: If the pollutant is SO2 / PM10 / PM2.5 or CO, the aqd:adjustmentType MUST be either (fullyCorrected noneApplicable noneApplied) under aqd:deductionAssessmentMethod
error type: ERROR

If the pollutant is SO2 / PM10 / PM2.5 or CO, a description of the assessment type is expected.
type: Concept
notation: I41
definition: WHERE ./aqd:pollutant xlink:href attribute EQUALs http://dd.eionet.europa.eu/vocabulary/aq/pollutant/[1/5/10/6001] (via …/aqd:parentExceedanceSituation then /aqd:AQD_SourceApportionment/aqd:macroExceedanceSituation/aqd:ExceedanceDescription/aqd:deductionAssessmentMethod/aqd:AdjustmentMethod/aqd:assessmentMethod/aqd:AssessmentMethods/aqd:assessmentTypeDescription must be populated.
status: valid
status modified: 2023-05-04
accepted date: 2023-05-04
in scheme: AQD - Quality control and assurance on CDR
hidden label: If the pollutant is SO2 / PM10 / PM2.5 or CO, a description of the assessment type is expected.
error type: ERROR

If the pollutant is SO2 / PM10 / PM2.5 or CO and deductionAssessmentMethod is populated, adjustmentType must be "fullyCorrected" (else "noneApplicable").
type: Concept
notation: I44
definition: If aqd:AQD_SourceApportionment/aqd:macroExceedanceSituation/aqd:ExceedanceDescription/aqd:deductionAssessmentMethod/aqd:AdjustmentMethod/aqd:adjustmentType is populated WHERE ./aqd:pollutant xlink:href attribute EQUALs http://dd.eionet.europa.eu/vocabulary/aq/pollutant/[1/5/10/6001] (via …/aqd:parentExceedanceSituation) the xlink:href must be "fullyCorrected" if another pollutant it must be "noneApplicable"
status: valid
status modified: 2023-05-04
accepted date: 2023-05-04
in scheme: AQD - Quality control and assurance on CDR
hidden label: If the pollutant is SO2 / PM10 / PM2.5 or CO and deductionAssessmentMethod is populated, adjustmentType must be "fullyCorrected" (else "noneApplicable").
error type: ERROR

If the pollutant is SO2 / PM10 / PM2.5 or CO and deductionAssessmentMethod is populated, adjustmentSource must conform with vocabulary (else "noneApplicable").
type: Concept
notation: I45
definition: WHERE ./aqd:pollutant xlink:href attribute EQUALs http://dd.eionet.europa.eu/vocabulary/aq/pollutant/[1/5/10/6001] (via …/aqd:parentExceedanceSituation) then /aqd:AQD_SourceApportionment/aqd:macroExceedanceSituation/aqd:ExceedanceDescription/aqd:deductionAssessmentMethod/aqd:AdjustmentMethod/aqd:adjustmentSource must be populated & the content of the xlink:href shall conform to http://dd.eionet.europa.eu/vocabulary/aq/adjustmentsourcetype (else this element must not be populated
status: valid
status modified: 2023-05-04
accepted date: 2023-05-04
in scheme: AQD - Quality control and assurance on CDR
hidden label: If the pollutant is SO2 / PM10 / PM2.5 or CO and deductionAssessmentMethod is populated, adjustmentSource must conform with vocabulary (else
error type: ERROR

If the pollutant is SO2 / PM10 / PM2.5 or CO, a link to the assessment method in D or D1b is required via xlink:href attribute.
type: Concept
notation: I42
definition: WHERE ./aqd:pollutant xlink:href attribute EQUALs http://dd.eionet.europa.eu/vocabulary/aq/pollutant/[1/5/10/6001] (via …/aqd:parentExceedanceSituation) at least one of /aqd:AQD_SourceApportionment/aqd:macroExceedanceSituation/aqd:ExceedanceDescription/aqd:deductionAssessmentMethod/aqd:AdjustmentMethod/aqd:assessmentMethod/aqd:AssessmentMethods/aqd:samplingPointAssessmentMetadata/@xlink:hrefor/aqd:AQD_SourceApportionment/aqd:macroExceedanceSituation/aqd:ExceedanceDescription/aqd:deductionAssessmentMethod/aqd:AdjustmentMethod/aqd:assessmentMethod/aqd:AssessmentMethods/aqd:modelAssessmentMetadata/@xlink:href must be populated and correctly link to D/D1b. Cross check the links provided against D – all assessment methods must exist in D
status: valid
status modified: 2023-05-04
accepted date: 2023-05-04
in scheme: AQD - Quality control and assurance on CDR
hidden label: If the pollutant is SO2 / PM10 / PM2.5 or CO, a link to the assessment method in D or D1b is required via xlink:href attribute.
error type: ERROR

If the pollutant is NOT SO2 / PM10 / PM2.5 or CO, the following elements are not expected: assessmentType link to adjusting sampling point/model, assessmentTypeDescription, assessmentType.
type: Concept
notation: I43
definition: WHERE ./aqd:pollutant xlink:href attribute does NOT EQUAL http://dd.eionet.europa.eu/vocabulary/aq/pollutant/[1/5/10/6001] (via …/aqd:parentExceedanceSituatio) the following elments must be empty or not provided: /aqd:AQD_SourceApportionment/aqd:macroExceedanceSituation/aqd:ExceedanceDescription/aqd:deductionAssessmentMethod/aqd:AdjustmentMethod/aqd:assessmentMethod/aqd:AssessmentMethods/aqd:assessmentType ; /aqd:AQD_SourceApportionment/aqd:macroExceedanceSituation/aqd:ExceedanceDescription/aqd:deductionAssessmentMethod/aqd:AdjustmentMethod/aqd:assessmentMethod/aqd:AssessmentMethods/aqd:samplingPointAssessmentMetadata/@xlink:href ; /aqd:AQD_SourceApportionment/aqd:macroExceedanceSituation/aqd:ExceedanceDescription/aqd:deductionAssessmentMethod/aqd:AdjustmentMethod/aqd:assessmentMethod/aqd:AssessmentMethods/aqd:modelAssessmentMetadata/@xlink:href ; /aqd:AQD_SourceApportionment/aqd:macroExceedanceSituation/aqd:ExceedanceDescription/aqd:deductionAssessmentMethod/aqd:AdjustmentMethod/aqd:assessmentMethod/aqd:AssessmentMethods/aqd:assessmentTypeDescription ; /aqd:AQD_SourceApportionment/aqd:macroExceedanceSituation/aqd:ExceedanceDescription/aqd:deductionAssessmentMethod/aqd:AdjustmentMethod/aqd:assessmentMethod/aqd:AssessmentMethods/aqd:assessmentType
status: valid
status modified: 2023-05-04
accepted date: 2023-05-04
in scheme: AQD - Quality control and assurance on CDR
hidden label: If the pollutant is NOT SO2 / PM10 / PM2.5 or CO, the following elements are not expected: assessmentType link to adjusting sampling point/model, assessmentTypeDescription, assessmentType.
error type: WARNING

All gml ID attributes shall have unique code.
type: Concept
notation: I7
definition: All gml:id attributes - ef:inspireId and aqd:inspireId elements shall have unique content
status: valid
status modified: 2023-05-04
accepted date: 2023-05-04
in scheme: AQD - Quality control and assurance on CDR
hidden label: All gml ID attributes shall have unique code.
error type: BLOCKER

Local Id of the Source Apportionments must be unique.
type: Concept
notation: I8
definition: ./aqd:inspireId/base:Identifier/base:localId must be unique code for the Plans records
status: valid
status modified: 2023-05-04
accepted date: 2023-05-04
in scheme: AQD - Quality control and assurance on CDR
hidden label: Local Id of the Source Apportionments must be unique.
error type: BLOCKER

List unique namespaces and count number of elements.
type: Concept
notation: I9
definition: ./aqd:inspireId/base:Identifier/base:namespace List base:namespace and count the number of base:localId assigned to each base:namespace.
status: valid
status modified: 2023-05-04
accepted date: 2023-05-04
in scheme: AQD - Quality control and assurance on CDR
hidden label: List unique namespaces and count number of elements.
error type: INFO

Check if delivery if this is a new delivery or updated delivery (via reporting year)
type: Concept
notation: J0
definition: Checks if this delivery is new or an update (on same reporting year)
status: valid
status modified: 2023-05-04
accepted date: 2023-05-04
in scheme: AQD - Quality control and assurance on CDR
hidden label: Check if delivery if this is a new delivery or updated delivery (via reporting year)
error type: WARNING

Number of AQ Scenarios reported
type: Concept
notation: J1
definition: Compile & feedback upon the total number of scenario records included in the delivery
status: valid
status modified: 2023-05-04
accepted date: 2023-05-04
in scheme: AQD - Quality control and assurance on CDR
hidden label: Compile & feedback upon the total number of scenario records included in the delivery
error type: BLOCKER

Check if namespace is registered in vocabulary (http://dd.eionet.europa.eu/vocabulary/aq/namespace/view)
type: Concept
notation: J10
definition: Check if namespace is registered in vocabulary (http://dd.eionet.europa.eu/vocabulary/aq/namespace/view)
status: valid
status modified: 2023-05-04
accepted date: 2023-05-04
in scheme: AQD - Quality control and assurance on CDR
hidden label: Check if namespace is registered in vocabulary (http://dd.eionet.europa.eu/vocabulary/aq/namespace/view)
error type: BLOCKER

You must provide a reference to a plan document from data flow H via its namespace & localId. The plan document must have the same reporting year as the scenario document.
type: Concept
notation: J11
definition: aqd:AQD_EvaluationScenario/aqd:usedInPlan shall reference an existing AQD_Plan (H) document for the same reporting year same year via namespace/localId
status: valid
status modified: 2023-05-04
accepted date: 2023-05-04
in scheme: AQD - Quality control and assurance on CDR
hidden label: You must provide a reference to a plan document from data flow H via its namespace & localId. The plan document must have the same reporting year as the scenario document.
error type: BLOCKER

You must provide a link to a Source Apportionment (I) document from data flow I via its namespace & localId (for the same reporting year).
type: Concept
notation: J12
definition: aqd:AQD_EvaluationScenario/aqd:sourceApportionment MUST reference an existing AQD_SourceApportionment (I) document via namespace/localId record for the same reporting year .
status: valid
status modified: 2023-05-04
accepted date: 2023-05-04
in scheme: AQD - Quality control and assurance on CDR
hidden label: You must provide a link to a Source Apportionment (I) document from data flow I via its namespace & localId (for the same reporting year).
error type: ERROR

A code of the scenario should be provided as an alpha-numeric code starting with the country ISO code.
type: Concept
notation: J13
definition: aqd:AQD_EvaluationScenario/aqd:codeOfScenario should begin with with the 2-digit country code according to ISO 3166-1.
status: valid
status modified: 2023-05-04
accepted date: 2023-05-04
in scheme: AQD - Quality control and assurance on CDR
hidden label: A code of the scenario should be provided as an alpha-numeric code starting with the country ISO code.
error type: SKIPPED

Short textul description of the publication should be provided. Include the ISBN number if available.
type: Concept
notation: J14
definition: aqd:AQD_EvaluationScenario/aqd:publication/aqd:Publication/aqd:description shall be a text string
status: valid
status modified: 2023-05-04
accepted date: 2023-05-04
in scheme: AQD - Quality control and assurance on CDR
hidden label: Short textul description of the publication should be provided. Include the ISBN number if available.
error type: ERROR

You should provide title as written in the publication.
type: Concept
notation: J15
definition: aqd:AQD_EvaluationScenario/aqd:publication/aqd:Publication/aqd:title shall be a text string
status: valid
status modified: 2023-05-04
accepted date: 2023-05-04
in scheme: AQD - Quality control and assurance on CDR
hidden label: You should provide title as written in the publication.
error type: ERROR

Author(s) should be provided as text (Please provide in one field separated by commas if there are multiple authors).
type: Concept
notation: J16
definition: aqd:AQD_EvaluationScenario/aqd:publication/aqd:Publication/aqd:author shall be a text string (if provided)
status: valid
status modified: 2023-05-04
accepted date: 2023-05-04
in scheme: AQD - Quality control and assurance on CDR
hidden label: Author(s) should be provided as text (Please provide in one field separated by commas if there are multiple authors).
error type: WARNING

The publication date should be provided in yyyy or yyyy-mm-dd format.
type: Concept
notation: J17
definition: aqd:AQD_EvaluationScenario/aqd:publication/aqd:Publication/aqd:publicationDate/gml:TimeInstant/gml:timePosition may be a data in yyyy or yyyy-mm-dd format
status: valid
status modified: 2023-05-04
accepted date: 2023-05-04
in scheme: AQD - Quality control and assurance on CDR
hidden label: The publication date should be provided in yyyy or yyyy-mm-dd format.
error type: BLOCKER

Publisher should be provided as a text (Publishing institution / academic journal / etc.)
type: Concept
notation: J18
definition: aqd:AQD_EvaluationScenario/aqd:publication/aqd:Publication/aqd:publisher shall be a text string
status: valid
status modified: 2023-05-04
accepted date: 2023-05-04
in scheme: AQD - Quality control and assurance on CDR
hidden label: Publisher should be provided as a text (Publishing institution / academic journal / etc.)
error type: BLOCKER

Url to the published AQ Scenario should be valid (if provided).
type: Concept
notation: J19
definition: aqd:AQD_EvaluationScenario/aqd:publication/aqd:Publication/aqd:webLink as a valid url (if provided)
status: valid
status modified: 2023-05-04
accepted date: 2023-05-04
in scheme: AQD - Quality control and assurance on CDR
hidden label: Url to the published AQ Scenario should be valid (if provided).
error type: ERROR

Number of new EvaluationScenarios compared to previous report.
type: Concept
notation: J2
definition: Compile & feedback upon the total number of new EvaluationScenarios records included in the delivery. ERROR will be returned if XML is a new delivery and localId are not new compared to previous deliveries.
status: valid
status modified: 2023-05-04
accepted date: 2023-05-04
in scheme: AQD - Quality control and assurance on CDR
hidden label: Number of new EvaluationScenarios compared to previous report.
error type: INFO

The year for which the projections are developed must be provided and the yyyy format must be used.
type: Concept
notation: J20
definition: aqd:AQD_EvaluationScenario/aqd:attainmentYear/gml:TimeInstant/gml:timePosition must be provided and must conform to yyyy format
status: valid
status modified: 2023-05-04
accepted date: 2023-05-04
in scheme: AQD - Quality control and assurance on CDR
hidden label: The year for which the projections are developed must be provided and the yyyy format must be used.
error type: BLOCKER

Reference year from which the projections started and for which the scenario is available must be provided and must conform to yyyy format.
type: Concept
notation: J21
definition: aqd:AQD_EvaluationScenario/aqd:startYear/gml:TimeInstant/gml:timePosition must be provided and must conform to yyyy format
status: valid
status modified: 2023-05-04
accepted date: 2023-05-04
in scheme: AQD - Quality control and assurance on CDR
hidden label: Reference year from which the projections started and for which the scenario is available must be provided and must conform to yyyy format.
error type: BLOCKER

Check if start year of the evaluation scenario is the same as the source apportionment reference year.
type: Concept
notation: J22
definition: Check aqd:AQD_EvaluationScenario/aqd:startYear/gml:TimeInstant/gml:timePosition must be equal to aqd:AQD_SourceApportionment/aqd:referenceYear/gml:TimeInstant/gml:timePosition referenced via the xlink of (aqd:AQD_EvaluationScenario/aqd:sourceApportionment)
status: invalid
status modified: 2023-05-04
accepted date: 2023-05-04
in scheme: AQD - Quality control and assurance on CDR
hidden label: Check if start year of the evaluation scenario is the same as the source apportionment reference year.
error type: WARNING

A description of the emission scenario used for the baseline analysis should be provided as text.
type: Concept
notation: J23
definition: aqd:AQD_EvaluationScenario/aqd:baselineScenario/aqd:Scenario/aqd:description shall be a text string
status: valid
status modified: 2023-05-04
accepted date: 2023-05-04
in scheme: AQD - Quality control and assurance on CDR
hidden label: A description of the emission scenario used for the baseline analysis should be provided as text.
error type: ERROR

The baseline total emissions should be provided as integer with correct unit.
type: Concept
notation: J24
definition: Check that the element aqd:AQD_EvaluationScenario/aqd:baselineScenario/aqd:Scenario/aqd:totalEmissions is an integer or floating point numeric >= 0 and the unit (@uom) shall resolve to the codelist http://dd.eionet.europa.eu/vocabulary/uom/emission/kt.year-1
status: valid
status modified: 2023-05-04
accepted date: 2023-05-04
in scheme: AQD - Quality control and assurance on CDR
hidden label: The baseline total emissions should be provided as integer with correct unit.
error type: BLOCKER

The expected concentration (under baseline scenario) should be provided as an integer and its unit should conform to vocabulary (use http://dd.eionet.europa.eu/vocabulary/uom/concentration/).
type: Concept
notation: J25
definition: Check that the element aqd:AQD_EvaluationScenario/aqd:baselineScenario/aqd:AQD_Scenario/aqd:expectedConcentration is an integer or floating point numeric >= 0 and the unit (@uom) shall resolve to the codelist http://dd.eionet.europa.eu/vocabulary/uom/concentration/
status: valid
status modified: 2023-05-04
accepted date: 2023-05-04
in scheme: AQD - Quality control and assurance on CDR
hidden label: The expected concentration (under baseline scenario) should be provided as an integer and its unit should conform to vocabulary (use http://dd.eionet.europa.eu/vocabulary/uom/concentration/).
error type: BLOCKER

The number of exceecedance expected (under baseline scenario) should be provided as an integer
type: Concept
notation: J26
definition: Check that the element aqd:AQD_EvaluationScenario/aqd:baselineScenario/aqd:AQD_Scenario/aqd:expectedExceedances is an integer or floating point numeric >= 0
status: valid
status modified: 2023-05-04
accepted date: 2023-05-04
in scheme: AQD - Quality control and assurance on CDR
hidden label: The number of exceecedance expected (under baseline scenario) should be provided as an integer and its unit should conform to vocabulary (use http://dd.eionet.europa.eu/vocabulary/uom/statistics).
error type: ERROR

Measures identified in the AQ Plan that are included in this baseline scenario should be provided (link to dataflow K).
type: Concept
notation: J27
definition: aqd:AQD_EvaluationScenario/aqd:baselineScenario/aqd:Scenario/aqd:measuresApplied shall reference an existing AQD_Measures delivered within a data flow K and the reporting year of K & J shall be the same year via namespace/localId.
status: valid
status modified: 2023-05-04
accepted date: 2023-05-04
in scheme: AQD - Quality control and assurance on CDR
hidden label: Measures identified in the AQ Plan that are included in this baseline scenario should be provided (link to dataflow K).
error type: WARNING

A description of the emission scenario used for the projection analysis should be provided as text.
type: Concept
notation: J28
definition: aqd:AQD_EvaluationScenario/aqd:projectionScenario/aqd:Scenario/aqd:description shall be a text string
status: valid
status modified: 2023-05-04
accepted date: 2023-05-04
in scheme: AQD - Quality control and assurance on CDR
hidden label: A description of the emission scenario used for the projection analysis should be provided as text.
error type: ERROR

The projection total emissions should be provided as integer with correct unit.
type: Concept
notation: J29
definition: Check that the element aqd:AQD_EvaluationScenario/aqd:projectionScenario/aqd:Scenario/aqd:totalEmissions is an integer or floating point numeric >= 0 and the unit (@uom) shall resolve to the codelist http://dd.eionet.europa.eu/vocabulary/uom/emission/kt.year-1
status: valid
status modified: 2023-05-04
accepted date: 2023-05-04
in scheme: AQD - Quality control and assurance on CDR
hidden label: The projection total emissions should be provided as integer with correct unit.
error type: BLOCKER

Number of existing EvaluationScenarios compared to previous report. ERROR will be returned if XML is an update and ALL localId (100%) are different to previous delivery (for the same YEAR).
type: Concept
notation: J3
definition: Compile & feedback upon the total number of updated EvaluationScenarios records included in the delivery. ERROR will be returned if XML is an update and ALL localId (100%) are different to previous delivery (for the same YEAR).
status: valid
status modified: 2023-05-04
accepted date: 2023-05-04
in scheme: AQD - Quality control and assurance on CDR
hidden label: Number of existing EvaluationScenarios compared to previous report. ERROR will be returned if XML is an update and ALL localId (100%) are different to previous delivery (for the same YEAR).
error type: WARNING

The expected concentration (under projection scenario) should be provided as an integer and its unit should conform to vocabulary (use http://dd.eionet.europa.eu/vocabulary/uom/concentration/).
type: Concept
notation: J30
definition: Check that the element aqd:AQD_EvaluationScenario/aqd:projectionScenario/aqd:AQD_Scenario/aqd:expectedConcentration is an integer or floating point numeric >= 0 and the unit (@uom) shall resolve to the codelist http://dd.eionet.europa.eu/vocabulary/uom/concentration/
status: valid
status modified: 2023-05-04
accepted date: 2023-05-04
in scheme: AQD - Quality control and assurance on CDR
hidden label: The expected concentration (under projection scenario) should be provided as an integer and its unit should conform to vocabulary (use http://dd.eionet.europa.eu/vocabulary/uom/concentration/).
error type: ERROR

The number of exceecedance expected (under projection scenario) should be provided as an integer a
type: Concept
notation: J31
definition: Check that the element aqd:AQD_EvaluationScenario/aqd:projectionScenario/aqd:AQD_Scenario/aqd:expectedExceedances is an integer or floating point numeric >= 0
status: valid
status modified: 2023-05-04
accepted date: 2023-05-04
in scheme: AQD - Quality control and assurance on CDR
hidden label: The number of exceecedance expected (under projection scenario) should be provided as an integer and its unit should conform to vocabulary (use http://dd.eionet.europa.eu/vocabulary/uom/statistics).
error type: BLOCKER

Measures identified in the AQ Plan that are included in this projection should be provided (link to dataflow K).
type: Concept
notation: J32
definition: aqd:AQD_EvaluationScenario/aqd:projectionScenario/aqd:Scenario/aqd:measuresApplied shall reference an existing AQD_Measures delivered within a data flow K and the reporting year of K & J shall be the same year via namespace/localId.
status: valid
status modified: 2023-05-04
accepted date: 2023-05-04
in scheme: AQD - Quality control and assurance on CDR
hidden label: Measures identified in the AQ Plan that are included in this projection should be provided (link to dataflow K).
error type: WARNING

List of unique identifier information for all EvaluationScenarios records. It returns BLOCKER if no EvaluationScenarios are provided
type: Concept
notation: J4
definition: List of evaluation scenario records in deliver & mandatory cross references. All evaluation scenarios must link to an AQ Plan document (H), a Source Apportionment record (I). A BLOCKER will return if either of these links are missing.
status: valid
status modified: 2023-05-04
accepted date: 2023-05-04
in scheme: AQD - Quality control and assurance on CDR
hidden label: List of unique identifier information for all EvaluationScenarios records. It returns BLOCKER if no EvaluationScenarios are provided.
error type: BLOCKER

All gml ID attributes shall have unique code.
type: Concept
notation: J7
definition: All gml:id attributes ef:inspireId and aqd:inspireId elements shall have unique content
status: valid
status modified: 2023-05-04
accepted date: 2023-05-04
in scheme: AQD - Quality control and assurance on CDR
hidden label: All gml ID attributes shall have unique code.
error type: BLOCKER

Local Ids of the EvaluationScenarios must be unique & not empty
type: Concept
notation: J8
definition: ./aqd:inspireId/base:Identifier/base:localId must be unique code for the Scenario records & not empty
status: valid
status modified: 2023-05-04
accepted date: 2023-05-04
in scheme: AQD - Quality control and assurance on CDR
hidden label: Local Ids of the EvaluationScenarios must be unique.
error type: BLOCKER

Lists unique namespaces and counts number of elements.
type: Concept
notation: J9
definition: ./aqd:inspireId/base:Identifier/base:namespace List base:namespace and count the number of base:localId assigned to each base:namespace.
status: valid
status modified: 2023-05-04
accepted date: 2023-05-04
in scheme: AQD - Quality control and assurance on CDR
hidden label: Lists unique namespaces and counts number of elements.
error type: WARNING

Check if delivery if this is a new delivery or updated delivery (via reporting year)
type: Concept
notation: K0
definition: Checks if this delivery is new or an update (on same reporting year)
status: valid
status modified: 2023-05-04
accepted date: 2023-05-04
in scheme: AQD - Quality control and assurance on CDR
hidden label: Check if delivery if this is a new delivery or updated delivery (via reporting year)
error type: WARNING

Compile & feedback upon the total number of Measures included in the delivery
type: Concept
notation: K01
definition: Number of Measures reported
status: valid
status modified: 2023-05-04
accepted date: 2023-05-04
in scheme: AQD - Quality control and assurance on CDR
hidden label: Compile & feedback upon the total number of Measures included in the delivery
error type: BLOCKER

Number of new Measures compared to previous report. ERROR will be returned if XML is a new delivery and localId are not new compared to previous deliveries.
type: Concept
notation: K02
definition: Compile & feedback upon the total number of new Measures records included in the delivery. ERROR will be returned if XML is a new delivery and localId are not new compared to previous deliveries.
status: valid
status modified: 2023-05-04
accepted date: 2023-05-04
in scheme: AQD - Quality control and assurance on CDR
hidden label: Number of new Measures compared to previous report. ERROR will be returned if XML is a new delivery and localId are not new compared to previous deliveries.
error type: WARNING

Number of existing Measures compared to previous report. ERROR will be returned if XML is an update and ALL localId (100%) are different to previous delivery (for the same YEAR).
type: Concept
notation: K03
definition: Compile & feedback upon the total number of updated Measures included in the delivery. ERROR will be returned if XML is an update and ALL localId (100%) are different to previous delivery (for the same YEAR).
status: valid
status modified: 2023-05-04
accepted date: 2023-05-04
in scheme: AQD - Quality control and assurance on CDR
hidden label: Number of existing Measures compared to previous report. ERROR will be returned if XML is an update and ALL localId (100%) are different to previous delivery (for the same YEAR).
error type: BLOCKER

List of unique identifier information for all Measures records. It returns ERROR if no Measures are reported.
type: Concept
notation: K04
definition: Compile & feedback a list of the unique identifier information for all Measures records included in the delivery. Feedback report shall include the gml:id attribute ./aqd:inspireId aqd:AQD_SourceApportionment (via ./exceedanceAffected) aqd:AQD_Scenario (via aqd:usedForScenario)
status: valid
status modified: 2023-05-04
accepted date: 2023-05-04
in scheme: AQD - Quality control and assurance on CDR
hidden label: List of unique identifier information for all Measures records. It returns ERROR if no Measures are reported.
error type: BLOCKER

reserved
type: Concept
notation: K05
definition: reserved
status: valid
status modified: 2023-05-04
accepted date: 2023-05-04
in scheme: AQD - Quality control and assurance on CDR
hidden label: reserved
error type: reserved

reserved
type: Concept
notation: K06
definition: reserved
status: valid
status modified: 2023-05-04
accepted date: 2023-05-04
in scheme: AQD - Quality control and assurance on CDR
hidden label: reserved
error type: reserved

All gml ID attributes shall have unique code.
type: Concept
notation: K07
definition: All gml:id attributes ef:inspireId and aqd:inspireId elements shall have unique content
status: valid
status modified: 2023-05-04
accepted date: 2023-05-04
in scheme: AQD - Quality control and assurance on CDR
hidden label: All gml ID attributes shall have unique code.
error type: BLOCKER

Local Ids of the Measures must be unique & not empty
type: Concept
notation: K08
definition: ./aqd:inspireId/base:Identifier/base:localId must be unique code for the Measure records & not empty
status: valid
status modified: 2023-05-04
accepted date: 2023-05-04
in scheme: AQD - Quality control and assurance on CDR
hidden label: Local Ids of the Measures must be unique & not empty
error type: BLOCKER

Lists unique namespaces used and counts number of elements.
type: Concept
notation: K09
definition: ./aqd:inspireId/base:Identifier/base:namespace List base:namespace and count the number of base:localId assigned to each base:namespace.
status: valid
status modified: 2023-05-04
accepted date: 2023-05-04
in scheme: AQD - Quality control and assurance on CDR
hidden label: Lists unique namespaces used and counts number of elements.
error type: WARNING

Check if namespace is registered in vocabulary (http://dd.eionet.europa.eu/vocabulary/aq/namespace/view)
type: Concept
notation: K10
definition: Check if namespace is registered in vocabulary (http://dd.eionet.europa.eu/vocabulary/aq/namespace/view)
status: valid
status modified: 2023-05-04
accepted date: 2023-05-04
in scheme: AQD - Quality control and assurance on CDR
hidden label: Check if namespace is registered in vocabulary (http://dd.eionet.europa.eu/vocabulary/aq/namespace/view)
error type: BLOCKER

You must provide a link to a source apportionment document from data flow I via its namespace & localId.
type: Concept
notation: K11
definition: aqd:AQD_Measures/aqd:exceedanceAffected MUST reference an existing Source Apportionment (I) document via namespace/localId
status: valid
status modified: 2023-05-04
accepted date: 2023-05-04
in scheme: AQD - Quality control and assurance on CDR
hidden label: You must provide a link to a source apportionment document from data flow I via its namespace & localId.
error type: BLOCKER

A link may be provided to Evaluation Scenario (J). This must be valid via namespace & localId.
type: Concept
notation: K12
definition: aqd:AQD_Measures/aqd:usedForScenario shall reference an existing Scenario delivered within a data flow J via namespace/localId.
status: valid
status modified: 2023-05-04
accepted date: 2023-05-04
in scheme: AQD - Quality control and assurance on CDR
hidden label: A link may be provided to Evaluation Scenario (J). This must be valid via namespace & localId.
error type: INFO

Measure code should be a unique local identifier for each measure record. For convenience the same code as localId may be used.
type: Concept
notation: K13
definition: aqd:AQD_Measures/aqd:code should be a unique local identifier for each measure record. For convenience the same code as localId may be used
status: valid
status modified: 2023-05-04
accepted date: 2023-05-04
in scheme: AQD - Quality control and assurance on CDR
hidden label: Measure code should be a unique local identifier for each measure record. For convenience the same code as localId may be used.
error type: SKIPPED

You should provide a short name for the measure.
type: Concept
notation: K14
definition: aqd:AQD_Measures/aqd:name must be populated with a text string
status: valid
status modified: 2023-05-04
accepted date: 2023-05-04
in scheme: AQD - Quality control and assurance on CDR
hidden label: You should provide a short name for the measure.
error type: WARNING

You should provide a short description of the measure.
type: Concept
notation: K15
definition: aqd:AQD_Measures/aqd:description must be provided as a text string
status: valid
status modified: 2023-05-04
accepted date: 2023-05-04
in scheme: AQD - Quality control and assurance on CDR
hidden label: You should provide a short description of the measure.
error type: ERROR

Measure classification should conform to vocabulary (use http://dd.eionet.europa.eu/vocabulary/aq/measureclassification/).
type: Concept
notation: K16
definition: aqd:AQD_Measures/aqd:classification shall resolve to the codelist http://dd.eionet.europa.eu/vocabulary/aq/measureclassification/
status: valid
status modified: 2023-05-04
accepted date: 2023-05-04
in scheme: AQD - Quality control and assurance on CDR
hidden label: Measure classification should conform to vocabulary (use http://dd.eionet.europa.eu/vocabulary/aq/measureclassification/).
error type: BLOCKER

Measure type should conform to vocabulary (use http://dd.eionet.europa.eu/vocabulary/aq/measuretype/).
type: Concept
notation: K17
definition: aqd:AQD_Measures/aqd:measureType shall resolve to the codelist http://dd.eionet.europa.eu/vocabulary/aq/measuretype/
status: valid
status modified: 2023-05-04
accepted date: 2023-05-04
in scheme: AQD - Quality control and assurance on CDR
hidden label: Measure type should conform to vocabulary (use http://dd.eionet.europa.eu/vocabulary/aq/measuretype/).
error type: BLOCKER

Administrative level should conform to vocabulary (use http://dd.eionet.europa.eu/vocabulary/aq/administrativelevel/).
type: Concept
notation: K18
definition: aqd:AQD_Measures/aqd:administrativeLevel shall resolve to the codelist http://dd.eionet.europa.eu/vocabulary/aq/administrativelevel/
status: valid
status modified: 2023-05-04
accepted date: 2023-05-04
in scheme: AQD - Quality control and assurance on CDR
hidden label: Administrative level should conform to vocabulary (use http://dd.eionet.europa.eu/vocabulary/aq/administrativelevel/).
error type: BLOCKER

The measure's timescale should conform to vocabulary (use http://dd.eionet.europa.eu/vocabulary/aq/timescale/).
type: Concept
notation: K19
definition: aqd:AQD_Measures/aqd:timeScale shall resolve to the codelist http://dd.eionet.europa.eu/vocabulary/aq/timescale/
status: valid
status modified: 2023-05-04
accepted date: 2023-05-04
in scheme: AQD - Quality control and assurance on CDR
hidden label: The measure's timescale should conform to vocabulary (use http://dd.eionet.europa.eu/vocabulary/aq/timescale/).
error type: BLOCKER

Information on the cost of the measure should be provided.
type: Concept
notation: K20
definition: aqd:AQD_Measures/aqd:costs/ should be provided
status: valid
status modified: 2023-05-04
accepted date: 2023-05-04
in scheme: AQD - Quality control and assurance on CDR
hidden label: Information on the cost of the measure should be provided.
error type: ERROR

The estimated total costs should be provided. If NOT an explanation on the reasons for not providing it should be included.
type: Concept
notation: K21
definition: If aqd:costs provided aqd:AQD_Measures/aqd:costs/aqd:Costs/aqd:estimatedImplementationCosts should be an integer number. If voided /aqd:AQD_Measures/aqd:costs/aqd:Costs/aqd:comment must be populated with an explanation of why no costs are available.
status: valid
status modified: 2023-05-04
accepted date: 2023-05-04
in scheme: AQD - Quality control and assurance on CDR
hidden label: The estimated total costs should be provided. If NOT an explanation on the reasons for not providing it should be included.
error type: ERROR

If the final total costs of the measure is provided, it needs to be a number.
type: Concept
notation: K22
definition: /aqd:AQD_Measures/aqd:costs/aqd:Costs/aqd:finalImplementationCosts should be an integer number if populated
status: valid
status modified: 2023-05-04
accepted date: 2023-05-04
in scheme: AQD - Quality control and assurance on CDR
hidden label: If the final total costs of the measure is provided, it needs to be a number.
error type: BLOCKER

The currency must be provided conforming to vocabulary (http://dd.eionet.europa.eu/vocabulary/common/currencies/), if estimated costs are provided.
type: Concept
notation: K23
definition: If aqd:AQD_Measures/aqd:costs/aqd:Costs/aqd:estimatedImplementationCosts is populated aqd:AQD_Measures/aqd:costs/aqd:Costs/aqd:currency must be populated and shall resolve to the codelist http://dd.eionet.europa.eu/vocabulary/common/currencies/
status: valid
status modified: 2023-05-04
accepted date: 2023-05-04
in scheme: AQD - Quality control and assurance on CDR
hidden label: The currency must be provided conforming to vocabulary (http://dd.eionet.europa.eu/vocabulary/common/currencies/), if estimated costs are provided.
error type: BLOCKER

Source sector should conform to vocabulary (use http://dd.eionet.europa.eu/vocabulary/aq/sourcesectors/).
type: Concept
notation: K24
definition: aqd:AQD_Measures/aqd:sourceSectors shall resolve to the codelist http://dd.eionet.europa.eu/vocabulary/aq/sourcesectors/
status: valid
status modified: 2023-05-04
accepted date: 2023-05-04
in scheme: AQD - Quality control and assurance on CDR
hidden label: Source sector should conform to vocabulary (use http://dd.eionet.europa.eu/vocabulary/aq/sourcesectors/).
error type: BLOCKER

Spatial scale should conform to vocabulary (use http://dd.eionet.europa.eu/vocabulary/aq/spatialscale/).
type: Concept
notation: K25
definition: aqd:AQD_Measures/aqd:spatialScale shall resolve to the codelist http://dd.eionet.europa.eu/vocabulary/aq/spatialscale/
status: valid
status modified: 2023-05-04
accepted date: 2023-05-04
in scheme: AQD - Quality control and assurance on CDR
hidden label: Spatial scale should conform to vocabulary (use http://dd.eionet.europa.eu/vocabulary/aq/spatialscale/).
error type: BLOCKER

Measure Implementation Status should conform to vocabulary (use http://dd.eionet.europa.eu/vocabulary/aq/measureimplementationstatus/).
type: Concept
notation: K26
definition: aqd:AQD_Measures/aqd:plannedImplementation/aqd:PlannedImplementation/aqd:status shall resolve to the codelist http://dd.eionet.europa.eu/vocabulary/aq/measureimplementationstatus/
status: valid
status modified: 2023-05-04
accepted date: 2023-05-04
in scheme: AQD - Quality control and assurance on CDR
hidden label: Measure Implementation Status should conform to vocabulary (use http://dd.eionet.europa.eu/vocabulary/aq/measureimplementationstatus/).
error type: BLOCKER

The planned start date for the measure should be provided in the right format.
type: Concept
notation: K27
definition: aqd:AQD_Measures/aqd:plannedImplementation/aqd:PlannedImplementation/aqd:implementationPlannedTimePeriod/gml:TimePeriod/gml:beginPosition must be a date in full ISO date format
status: valid
status modified: 2023-05-04
accepted date: 2023-05-04
in scheme: AQD - Quality control and assurance on CDR
hidden label: The planned start date for the measure should be provided in the right format.
error type: BLOCKER

The planned end date for the measure should be provided in the right format. If unknown, it should be voided using indeterminatePosition="unknown".
type: Concept
notation: K28
definition: If not voided aqd:AQD_Measures/aqd:plannedImplementation/aqd:PlannedImplementation/aqd:implementationPlannedTimePeriod/gml:TimePeriod/gml:endPosition must be a date in full ISO format and must be after aqd:AQD_Measures/aqd:plannedImplementation/aqd:PlannedImplementation/aqd:implementationPlannedTimePeriod/gml:TimePeriod/gml:beginPosition. If voided it should be indeterminatePosition="unknown"
status: valid
status modified: 2023-05-04
accepted date: 2023-05-04
in scheme: AQD - Quality control and assurance on CDR
hidden label: The planned end date for the measure should be provided in the right format. If unknown, it should be voided using indeterminatePosition="unknown".
error type: BLOCKER

The actual start date of the measure should be provided in the right format.
type: Concept
notation: K29
definition: aqd:AQD_Measures/aqd:plannedImplementation/aqd:PlannedImplementation/aqd:implementationActualTimePeriod/gml:TimePeriod/gml:beginPosition must be a date in full ISO date format
status: valid
status modified: 2023-05-04
accepted date: 2023-05-04
in scheme: AQD - Quality control and assurance on CDR
hidden label: The actual start date of the measure should be provided in the right format.
error type: ERROR

The actual end date of the measure should be provided in the right format. If unknown, it should be voided using indeterminatePosition="unknown".
type: Concept
notation: K30
definition: If not voided aqd:AQD_Measures/aqd:plannedImplementation/aqd:PlannedImplementation/aqd:implementationActualTimePeriod/gml:TimePeriod/gml:endPosition must be a date in full ISO format and must be after aqd:AQD_Measures/aqd:plannedImplementation/aqd:PlannedImplementation/aqd:implementationActualTimePeriod/gml:TimePeriod/gml:beginPosition. If voided it should be indeterminatePosition="unknown"
status: valid
status modified: 2023-05-04
accepted date: 2023-05-04
in scheme: AQD - Quality control and assurance on CDR
hidden label: The actual end date of the measure should be provided in the right format. If unknown, it should be voided using indeterminatePosition="unknown".
error type: ERROR

The full effect date of the measure must be provided and the format to be yyyy or yyyy-mm-dd.
type: Concept
notation: K31
definition: aqd:AQD_Measures/aqd:plannedImplementation/aqd:PlannedImplementation/aqd:plannedFullEffectDate/gml:TimeInstant/gml:timePosition to be provided in the following format yyyy or yyyy-mm-dd
status: valid
status modified: 2023-05-04
accepted date: 2023-05-04
in scheme: AQD - Quality control and assurance on CDR
hidden label: The full effect date of the measure must be provided and the format to be yyyy or yyyy-mm-dd.
error type: ERROR

reserved
type: Concept
notation: K32
definition: /aqd:AQD_Measures/aqd:plannedImplementation/aqd:PlannedImplementation/aqd:otherDates
status: valid
status modified: 2023-05-04
accepted date: 2023-05-04
in scheme: AQD - Quality control and assurance on CDR
hidden label: reserved

An explanation is expected under aqd:comment if monitoring progress indicators are not provided as text.
type: Concept
notation: K33
definition: A text string may be provided under aqd:AQD_Measures/aqd:plannedImplementation/aqd:PlannedImplementation/aqd:monitoringProgressIndicators ; If voided an explanation of why this information unavailable shall be provided in /aqd:AQD_Measures/aqd:plannedImplementation/aqd:PlannedImplementation/aqd:comment
status: valid
status modified: 2023-05-04
accepted date: 2023-05-04
in scheme: AQD - Quality control and assurance on CDR
hidden label: An explanation is expected under aqd:comment if monitoring progress indicators are not provided as text.
error type: ERROR

Reduction of emissions shall be provided as a number and unit should conform to vocabulary.
type: Concept
notation: K34
definition: Check that the element aqd:AQD_Measures/aqd:reductionOfEmissions/aqd:QuantityCommented/aqd:quantity is an number or floating point numeric >= 0 if attribute xsi:nil="false" (example: <aqd:quantity uom="http://dd.eionet.europa.eu/vocabulary/uom/emission/t.year-1" xsi:nil="false">273</aqd:quantity>)
status: valid
status modified: 2023-05-04
accepted date: 2023-05-04
in scheme: AQD - Quality control and assurance on CDR
hidden label: Reduction of emissions shall be provided as an integer and unit should conform to vocabulary.
error type: BLOCKER

If quantification is either "unpopulated" or "unknown" or "withheld" then the element should be empty.
type: Concept
notation: K35
definition: Check that the element aqd:QuantityCommented/aqd:quantity is empty if attribute xsi:nil="unpopulated" or "unknown" or "withheld" (example: <aqd:quantity uom="Unknown" nilReason="Unpopulated" xsi:nil="true"/>)
status: valid
status modified: 2023-05-04
accepted date: 2023-05-04
in scheme: AQD - Quality control and assurance on CDR
hidden label: If quantification is either "unpopulated" or "unknown" or "withheld" then the element should be empty.
error type: BLOCKER

If the quantification is voided an explanation is required in aqd:comment.
type: Concept
notation: K36
definition: If aqd:QuantityCommented/aqd:quantity attribute xsi:nil="true" aqd:QuantityCommented/aqd:comment must be populated
status: valid
status modified: 2023-05-04
accepted date: 2023-05-04
in scheme: AQD - Quality control and assurance on CDR
hidden label: If the quantification is voided an explanation is required in aqd:comment.
error type: ERROR

The quantification of reductionOfEmissions should conform to vocabulary (use http://dd.eionet.europa.eu/vocabulary/uom/emission).
type: Concept
notation: K37
definition: The unit attribute (aqd:AQD_Measures/aqd:reductionOfEmissions/aqd:QuantityCommented/aqd:quantity/@UoM) shall correspond to http://dd.eionet.europa.eu/vocabulary/uom/emission
status: valid
status modified: 2023-05-04
accepted date: 2023-05-04
in scheme: AQD - Quality control and assurance on CDR
hidden label: The quantification of reductionOfEmissions should conform to vocabulary (use http://dd.eionet.europa.eu/vocabulary/uom/emission).
error type: ERROR

The level of concentration expected should be provided as an integer and its unit should conform to vocabulary (use http://dd.eionet.europa.eu/vocabulary/uom/concentration/).
type: Concept
notation: K38
definition: Check that the element aqd:AQD_Measures/aqd:expectedImpact/aqd:ExpectedImpact/aqd:levelOfConcentration is an integer or floating point numeric >= 0 and the unit (@uom) shall resolve to the codelist http://dd.eionet.europa.eu/vocabulary/uom/concentration/
status: valid
status modified: 2023-05-04
accepted date: 2023-05-04
in scheme: AQD - Quality control and assurance on CDR
hidden label: The level of concentration expected should be provided as an integer and its unit should conform to vocabulary (use http://dd.eionet.europa.eu/vocabulary/uom/concentration/).
error type: ERROR

The number of exceecedance expected should be provided as an integer
type: Concept
notation: K39
definition: Check that the element aqd:AQD_Measures/aqd:expectedImpact/aqd:ExpectedImpact/aqd:numberOfExceedances is an integer or floating point numeric >= 0
status: valid
status modified: 2023-05-04
accepted date: 2023-05-04
in scheme: AQD - Quality control and assurance on CDR
hidden label: The number of exceecedance expected should be provided as an integer and its unit should conform to vocabulary (use http://dd.eionet.europa.eu/vocabulary/uom/statistics).
error type: WARNING

The specification of length should conform to vocabulary (use http://dd.eionet.europa.eu/vocabulary/uom/time/) and must be either /hour or /day.
type: Concept
notation: K40
definition: Check that the element aqd:AQD_Measures/aqd:expectedImpact/aqd:ExpectedImpact/aqd:specificationOfHours xlinks to codelist http://dd.eionet.europa.eu/vocabulary/uom/time/ and the code is either /hour or /day
status: valid
status modified: 2023-05-04
accepted date: 2023-05-04
in scheme: AQD - Quality control and assurance on CDR
hidden label: The specification of length should conform to vocabulary (use http://dd.eionet.europa.eu/vocabulary/uom/time/) and must be either /hour or /day.
error type: ERROR

Checks if this delivery is new or an update (on same reporting year)
type: Concept
notation: M0
definition: Check if delivery if this is a new delivery or updated delivery (via reporting year)
status: valid
status modified: 2023-05-04
accepted date: 2023-05-04
in scheme: AQD - Quality control and assurance on CDR
hidden label: Checks if this delivery is new or an update (on same reporting year)
editorial note: [Crucial]: Yes - Information
error type: WARNING

Total number of individual element reported within this XML Document for assessment methods (models/objective estimation)
type: Concept
notation: M01
definition: Compile & feedback upon the total number of each environmental monitoring feature types included in the delivery
status: valid
status modified: 2023-05-04
accepted date: 2023-05-04
in scheme: AQD - Quality control and assurance on CDR
hidden label: Total number of individual element reported within this XML Document for assessment methods (models/objective estimation)
editorial note: [Crucial]: Yes -
error type: BLOCKER

Total number of new records for each feature type included in the delivery. Warning will be returned if all LocalIds are new.
type: Concept
notation: M02
definition: Compile & feedback upon the total number of new records for each environmental monitoring feature types included in the delivery
status: valid
status modified: 2023-05-04
accepted date: 2023-05-04
in scheme: AQD - Quality control and assurance on CDR
hidden label: Total number of new records for each feature type included in the delivery. Warning will be returned if all LocalIds are new.
editorial note: [Crucial]: Yes -
error type: ERROR

Total number of updated records for each feature type included in the delivery. Warning will be returned if all LocalIds are new.
type: Concept
notation: M03
definition: Compile & feedback upon the total number of modification to existing for each environmental monitoring feature types included in the delivery
status: valid
status modified: 2023-05-04
accepted date: 2023-05-04
in scheme: AQD - Quality control and assurance on CDR
hidden label: Total number of updated records for each feature type included in the delivery. Warning will be returned if all LocalIds are new.
editorial note: [Crucial]: Yes -
error type: ERROR

Full list of reported Environmental Monitoring Features within this XML Document
type: Concept
notation: M04
definition: Compile & feedback a list of the unique identifier information for each new record or modification to an environmental monitoring feature type. Feedback report shall include the gml:id attribute, ef:inspireId, aqd:inspireId, ef:name and/or ompr:name elements as available.
status: valid
status modified: 2023-05-04
accepted date: 2023-05-04
in scheme: AQD - Quality control and assurance on CDR
hidden label: Full list of reported Environmental Monitoring Features within this XML Document
editorial note: [Crucial]: Yes -
error type: INFO

Id elements must have unique content
type: Concept
notation: M05
definition: All gml:id attributes, ef:inspireId and aqd:inspireId elements shall have unique content
status: valid
status modified: 2023-05-04
accepted date: 2023-05-04
in scheme: AQD - Quality control and assurance on CDR
hidden label: Id elements must have unique content
editorial note: [Crucial]: Yes -
error type: BLOCKER

M06
type: Concept
notation: M06
preferred label: ./ef:inspireId/base:Identifier/base:localId shall be an unique code for AQD_Model and unique within the namespace. It is recommended to start with “MOD” and may include ISO2-country code (e.g.: MOD-ES0001)
definition: ./ef:inspireId/base:Identifier/base:localId shall be an unique code for AQD_Model and unique within the namespace. It is recommended to start with “MOD” and may include ISO2-country code (e.g.: MOD-ES0001)
status: valid
status modified: 2023-05-04
accepted date: 2023-05-04
in scheme: AQD - Quality control and assurance on CDR
hidden label: ./ef:inspireId/base:Identifier/base:localId shall be an unique code for AQD_Model and unique within the namespace. It is recommended to start with “MOD” and may include ISO2-country code (e.g.: MOD-ES0001)
editorial note: [Crucial]: Yes -
error type: BLOCKER

List unique namespaces used and count number of Models used.
type: Concept
notation: M07
definition: Count the number of unique AQD_Model (via localId) submitted within base:namespace.
status: valid
status modified: 2023-05-04
accepted date: 2023-05-04
in scheme: AQD - Quality control and assurance on CDR
hidden label: List unique namespaces used and count number of Models used.
editorial note: [Crucial]: Yes -
error type: BLOCKER

Check namespace is registered
type: Concept
notation: M07.1
definition: Check that namespace is registered in vocabulary (http://dd.eionet.europa.eu/vocabulary/aq/namespace/view)
status: valid
status modified: 2023-05-04
accepted date: 2023-05-04
in scheme: AQD - Quality control and assurance on CDR
hidden label: Check namespace is registered
editorial note: reserved
error type: BLOCKER

Model name must be provided
type: Concept
notation: M08
definition: ./ef:name shall return a string
status: valid
status modified: 2023-05-04
accepted date: 2023-05-04
in scheme: AQD - Quality control and assurance on CDR
hidden label: Model name must be provided
editorial note: [Crucial]: Yes -
error type: BLOCKER

The content of /ef:additionalDescription shall provide brief description for the model / objective estimation method
type: Concept
notation: M09
definition: The content of /ef:additionalDescription shall provide brief description for the model / objective estimation method
status: reserved
status modified: 2023-05-04
accepted date: 2023-05-04
in scheme: AQD - Quality control and assurance on CDR
hidden label: The content of /ef:additionalDescription shall provide brief description for the model / objective estimation method
editorial note: Not implemented

Must conform to the code 'air' in the Media codelist in the Inspire registry
type: Concept
notation: M10
definition: The content of aqd:AQD_SamplingPoint/ef:mediaMonitored shall resolve to any concept inhttp://dd.eionet.europa.eu/vocabulary/inspire/MediaValue/
status: valid
status modified: 2023-05-04
accepted date: 2023-05-04
in scheme: AQD - Quality control and assurance on CDR
hidden label: Codelist for am:environmentalDomain requires revision: INSPIRE codelist is required
editorial note: [Crucial]: -
error type: ERROR

./ef:geometry shall contain a valid geometric property type, typically gml:Point, gml:MultiPoint, gml:Grid, gml:RectifiedGrid, gml:Polygon
type: Concept
notation: M11
definition: ./ef:geometry shall contain a valid geometric property type, typically gml:Point, gml:MultiPoint, gml:Grid, gml:RectifiedGrid, gml:Polygon
status: reserved
status modified: 2023-05-04
accepted date: 2023-05-04
in scheme: AQD - Quality control and assurance on CDR
hidden label: ./ef:geometry shall contain a valid geometric property type, typically gml:Point, gml:MultiPoint, gml:Grid, gml:RectifiedGrid, gml:Polygon
editorial note: Not implemented

reserved
type: Concept
notation: M12
definition: reserved
status: reserved
status modified: 2023-05-04
accepted date: 2023-05-04
in scheme: AQD - Quality control and assurance on CDR
hidden label: reserved
editorial note: Removed

reserved
type: Concept
notation: M13
definition: reserved
status: reserved
status modified: 2023-05-04
accepted date: 2023-05-04
in scheme: AQD - Quality control and assurance on CDR
hidden label: reserved
editorial note: Removed

reserved
type: Concept
notation: M14
definition: reserved
status: reserved
status modified: 2023-05-04
accepted date: 2023-05-04
in scheme: AQD - Quality control and assurance on CDR
hidden label: reserved
editorial note: Removed

Check if the operational period for the model is invalid or overlaps
type: Concept
notation: M15
definition: .ef:observingCapability/ef:ObservingCapability/ef:observingTime/gml:TimePeriod/gml:beginPosition shall be equal to or less than ./ef:operationalActivityPeriod/ef:OperationalActivityPeriod/ef:activityTime/gml:TimePeriod /gml:endPosition - gml:TimePeriod within the multiple ef:observingCapability MUST NOT overlap which each other
status: valid
status modified: 2023-05-04
accepted date: 2023-05-04
in scheme: AQD - Quality control and assurance on CDR
hidden label: Model has incorrect operation period
editorial note: [Crucial]: Yes -
error type: BLOCKER

ef:processType must conform to codelist in the Inspire registry
type: Concept
notation: M16
definition: ./ef:observingCapability/ef:ObservingCapability/ef:processType shall resolve to “INSPIRE_OM_Process” via an XLINK: http://inspire.ec.europa.eu/codelist/ProcessTypeValue/process (currently resolves to 404 error)
status: reserved
status modified: 2023-05-04
accepted date: 2023-05-04
in scheme: AQD - Quality control and assurance on CDR
hidden label: ef:processType must conform to codelist in the Inspire registry
editorial note: Not implemented

ef:resultNature must conform to codelist in the Inspire registry
type: Concept
notation: M17
definition: ./ef:observingCapability/ef:ObservingCapability/ef:resultNature element shall resolve to http://inspire.ec.europa.eu/codelist/ResultNatureValue/simulated (currently resolves to 404 error)
status: reserved
status modified: 2023-05-04
accepted date: 2023-05-04
in scheme: AQD - Quality control and assurance on CDR
hidden label: ef:resultNature must conform to codelist in the Inspire registry
editorial note: Not implemented

M18
type: Concept
notation: M18
preferred label: ./ef:observingCapability/ef:ObservingCapability/ef:observedProperty shall resolve to a valid code within http://dd.eionet.europa.eu/vocabulary/aq/pollutant/ Within a unique AQD_Model, multiple ef:observedProperty may be found. These MUST always resolve to the same code
definition: ./ef:observingCapability/ef:ObservingCapability/ef:observedProperty shall resolve to a valid code within http://dd.eionet.europa.eu/vocabulary/aq/pollutant/ Within a unique AQD_Model, multiple ef:observedProperty may be found. These MUST always resolve to the same code
status: valid
status modified: 2023-05-04
accepted date: 2023-05-04
in scheme: AQD - Quality control and assurance on CDR
hidden label: Codelist for all pollutants requires revision: EEA codelist is required
editorial note: [Crucial]: Yes -
error type: BLOCKER

Links between Model and ModelArea shall be traceable and valid
type: Concept
notation: M19
definition: ./ef:observingCapability/ef:ObservingCapability/ef:featureOfInterest shall resolve to a traversable link to a unique AQD_ModelArea (“namespace/localId” of the object)
status: valid
status modified: 2023-05-04
accepted date: 2023-05-04
in scheme: AQD - Quality control and assurance on CDR
hidden label: Incorrect link between Model and ModelArea
editorial note: [Crucial]: Yes -
error type: BLOCKER

Links between Model and ModelProcess shall be traceable and valid
type: Concept
notation: M20
definition: ./ef:observingCapability/ef:ObservingCapability/ef:procedure shall resolve to a traversable local of global URI to ../aqd:AQD_ModelProcess
status: valid
status modified: 2023-05-04
accepted date: 2023-05-04
in scheme: AQD - Quality control and assurance on CDR
hidden label: Incorrect link between Model and ModelProcess
editorial note: [Crucial]: Yes -
error type: BLOCKER

ef:organisationLevel
type: Concept
notation: M21
definition: ./ef:organisationLevel attribute shall resolve to a valid code in http://dd.eionet.europa.eu/vocabulary/aq/reportinglevel/ (e.g. http://dd.eionet.europa.eu/vocabulary/aq/reportinglevel/national
status: reserved
status modified: 2023-05-04
accepted date: 2023-05-04
in scheme: AQD - Quality control and assurance on CDR
hidden label: ef:organisationLevel
editorial note: [Crucial]: YES. Key information. -

reserved
type: Concept
notation: M22
status: reserved
status modified: 2023-05-04
accepted date: 2023-05-04
in scheme: AQD - Quality control and assurance on CDR
error type: reserved

Number of invalid 3 elements in Model and Environmental Objective combinations:
type: Concept
notation: M23
definition: Number of invalid 3 elements aqd:AQD_Model/aqd:environmentalObjective/aqd:EnvironmentalObjective/ combinations
status: valid
status modified: 2023-05-04
accepted date: 2023-05-04
in scheme: AQD - Quality control and assurance on CDR
hidden label: The Environmental Objective combination declared under Model are invalid. Please revise.
error type: ERROR

Check that Assessment Type conforms to either Model or Objective
type: Concept
notation: M24
definition: /aqd:assessmentType shall resolve to http://dd.eionet.europa.eu/vocabulary/aq/assessmenttype/ via xlink:href to either http://dd.eionet.europa.eu/vocabulary/aq/assessmenttype/model or http://dd.eionet.europa.eu/vocabulary/aq/assessmenttype/objective
status: valid
status modified: 2023-05-04
accepted date: 2023-05-04
in scheme: AQD - Quality control and assurance on CDR
hidden label: Codelist for all pollutants requires revision: EEA codelist is required
editorial note: [Crucial]: Yes -
error type: BLOCKER

reserved
type: Concept
notation: M25
definition: If ./aqd:usedAQD equals “true”, the AQD_Model must be xlinked in at least at one /aqd:AQD_AssessmentRegime /aqd:assessmentMethods/aqd:AssessmentMethods/aqd:modelAssessmentMetadata (dataset C)
status: reserved
status modified: 2023-05-04
accepted date: 2023-05-04
in scheme: AQD - Quality control and assurance on CDR
editorial note: Removed

Check if there are any invalid link from Model to zone(s)
type: Concept
notation: M26
definition: ./aqd:zone shall resolve to a traversable local of global URI to AQD_Zones via xlink:href
status: valid
status modified: 2023-05-04
accepted date: 2023-05-04
in scheme: AQD - Quality control and assurance on CDR
hidden label: Incorrect link between Model(s) and Zone(s)
editorial note: [Crucial]: Yes -
error type: WARNING

ModelProcess localId must be unique within the namespace
type: Concept
notation: M27
definition: ./ompr:inspireId/base:Identifier/base:localId shall be an unique code for SamplingPointProcess and within the namespace
status: valid
status modified: 2023-05-04
accepted date: 2023-05-04
in scheme: AQD - Quality control and assurance on CDR
hidden label: LocalId(s) for ModelProcess(es) are not unique
editorial note: [Crucial]: Yes -
error type: BLOCKER

List unique namespaces used and count number of ModelProcess used.
type: Concept
notation: M28
definition: ./ompr:inspireld/base:Identifier/base:namespace shall be a unique namespace identifier for the data source (within an annual e-Reporting cycle). The namespace value will be owned by the data provider of the spatial object
status: valid
status modified: 2023-05-04
accepted date: 2023-05-04
in scheme: AQD - Quality control and assurance on CDR
hidden label: Namespace are not unique
editorial note: [Crucial]: Yes -
error type: BLOCKER

Check namespace is registered
type: Concept
notation: M28.1
definition: Check that namespace is registered in vocabulary (http://dd.eionet.europa.eu/vocabulary/aq/namespace/view)
status: valid
status modified: 2023-05-04
accepted date: 2023-05-04
in scheme: AQD - Quality control and assurance on CDR
hidden label: Unregistered country namespaace has been used
error type: BLOCKER

./ompr:documentation/base2:DocumentationCitation/base2:link shall resolve to a traceable URL
type: Concept
notation: M29
definition: ./ompr:documentation/base2:DocumentationCitation/base2:link shall resolve to a traceable URL
status: valid
status modified: 2023-05-04
accepted date: 2023-05-04
in scheme: AQD - Quality control and assurance on CDR
hidden label: ./ompr:documentation/base2:DocumentationCitation/base2:link shall resolve to a traceable URL
editorial note: [Crucial]: Yes -
error type: BLOCKER

ModelProcess name should be provided
type: Concept
notation: M30
definition: ./ompr:name shall resolve to provide a name for the model process configuration
status: valid
status modified: 2023-05-04
accepted date: 2023-05-04
in scheme: AQD - Quality control and assurance on CDR
hidden label: ModelProcess requires a name. Please revise
editorial note: [Crucial]: -
error type: ERROR

Process parameter for both result-encoding and result-format must be provided
type: Concept
notation: M31
definition: At least one ompr:processParameter/ompr:ProcessParameter/ompr:name MUST to be http://dd.eionet.europa.eu/vocabulary/aq/processparameter/resultencoding AND ompr:processParameter/ompr:ProcessParameter/ompr:description resolve to a text description and one ompr:processParameter/ompr:ProcessParameter/ompr:name MUST http://dd.eionet.europa.eu/vocabulary/aq/processparameter/resultformat AND ompr:processParameter/ompr:ProcessParameter/ompr:description resolve to a text description
status: valid
status modified: 2023-05-04
accepted date: 2023-05-04
in scheme: AQD - Quality control and assurance on CDR
hidden label: Process parameter for both result-encoding and result-format must be provided
editorial note: [Crucial]: YES, key check - NEW - system requirement
error type: BLOCKER

Other model parameters may be reported
type: Concept
notation: M32
definition: ompr:processParameter/ompr:ProcessParameter/ompr:name shall resolve to a valid code within http://dd.eionet.europa.eu/vocabulary/aq/modelparameter/ AND ompr:processParameter/ompr:ProcessParameter/ompr:description resolve to a text description of the model process -- e.g. <ompr:name xlink:href="http://dd.eionet.europa.eu/vocabulary/aq/modelparameter/emissions"/> <ompr:description>NAEI2011 data, scaled forward to 2012 by linear interpolation between 2011 and projected (UEP45) 2012 data.</ompr:description>
status: valid
status modified: 2023-05-04
accepted date: 2023-05-04
in scheme: AQD - Quality control and assurance on CDR
hidden label: Other model parameters may be reported
editorial note: [Crucial]: YES, key check - NEW - system requirement
error type: ERROR

reserved
type: Concept
notation: M33
definition: If the aqd:AQD_Model/aqd:assessmentType resolves to http://dd.eionet.europa.eu/vocabulary/aq/assessmenttype/model (please note that the link between AQD_Model and AQD_ModelProcess is made via an xlink with aqd:AQD_Model/ef:observingCapability/ef:ObservingCapability/ef:procedure - AQD_ModelProcess shall include a description of the following modelparameters: http://dd.eionet.europa.eu/vocabulary/aq/modelparameter/chemistry http://dd.eionet.europa.eu/vocabulary/aq/modelparameter/emissions http://dd.eionet.europa.eu/vocabulary/aq/modelparameter/meterology http://dd.eionet.europa.eu/vocabulary/aq/modelparameter/topography
status: reserved
status modified: 2023-05-04
accepted date: 2023-05-04
in scheme: AQD - Quality control and assurance on CDR
hidden label: reserved
editorial note: Not implemented

A textual description of model process
type: Concept
notation: M34
definition: aqd:AQD_ModelProcess/aqd:description shall provide a free text description of the model - e.g. GIS-based dispersion kernel approach for 1x1km background concentrations from area source emissions, calibrated with monitoring. The contribution from point sources is estimated using a separate dispersion model and then included in the total. A bi-linear interpolation of corrected rural measurement data has been used to map regional background NOx concentrations throughout the UK.
status: valid
status modified: 2023-05-04
accepted date: 2023-05-04
in scheme: AQD - Quality control and assurance on CDR
hidden label: ModelProcess requires a textual description. Please revise
editorial note: [Crucial]: -
error type: ERROR

The unit of the temporal resolution should be provided and conform with vocabulary
type: Concept
notation: M35
definition: /aqd:AQD_ModelProcess/aqd:temporalResolution/aqd:TimeReferences/aqd:unit shall resolve to http://dd.eionet.europa.eu/vocabulary/uom/time/
status: valid
status modified: 2023-05-04
accepted date: 2023-05-04
in scheme: AQD - Quality control and assurance on CDR
hidden label: Codelist for process time reference requires revision: EEA codelist is required
editorial note: [Crucial]: -
error type: ERROR

./aqd:numUnits shall contain an integer value
type: Concept
notation: M36
definition: ./aqd:numUnits shall contain an integer value
status: reserved
status modified: 2023-05-04
accepted date: 2023-05-04
in scheme: AQD - Quality control and assurance on CDR
hidden label: ./aqd:numUnits shall contain an integer value
editorial note: Not implemented

./aqd:spatialResolution shall provide a free text description of the spatial resolution of the model - e.g. 1x1km background concentrations
type: Concept
notation: M37
definition: ./aqd:spatialResolution shall provide a free text description of the spatial resolution of the model - e.g. 1x1km background concentrations
status: reserved
status modified: 2023-05-04
accepted date: 2023-05-04
in scheme: AQD - Quality control and assurance on CDR
hidden label: ./aqd:spatialResolution shall provide a free text description of the spatial resolution of the model - e.g. 1x1km background concentrations
editorial note: Not implemented

./dataQualityDescription shall provide a description of the quality of the model data / objective estimation in relation to the DQOs
type: Concept
notation: M38
definition: ./dataQualityDescription shall provide a description of the quality of the model data / objective estimation in relation to the DQOs
status: reserved
status modified: 2023-05-04
accepted date: 2023-05-04
in scheme: AQD - Quality control and assurance on CDR
hidden label: ./dataQualityDescription shall provide a description of the quality of the model data / objective estimation in relation to the DQOs
editorial note: Not implemented

Check Data Quality Report is provided via a traceable URL
type: Concept
notation: M39
definition: ./dataQualityReport shall provide a traceable URL (Note to data provider, the url should lead to a report describing the data quality equaluation process)
status: valid
status modified: 2023-05-04
accepted date: 2023-05-04
in scheme: AQD - Quality control and assurance on CDR
hidden label: Check Data Quality Report is provided via a traceable URL
editorial note: [Crucial]: Yes -
error type: BLOCKER

ModelArea localId must be unique within the namespace
type: Concept
notation: M40
definition: ./aqd:inspireId/base:Identifier/base:localId shall be an unique code for AQD_Sample and unique within the namespace
status: valid
status modified: 2023-05-04
accepted date: 2023-05-04
in scheme: AQD - Quality control and assurance on CDR
hidden label: LocalId(s) for ModelArea(s) are not unique
editorial note: [Crucial]: Yes -
error type: BLOCKER

List unique namespaces used and count number of ModelArea used.
type: Concept
notation: M41
definition: ./aqd:inspireId/base:Identifier/base:namespace shall be a unique namespace identifier for the data source (within an annual e-Reporting cycle). The namespace value will be owned by the data provider of the spatial object and will be registered in the INSPIRE External Object Identifier Namespaces Register
status: valid
status modified: 2023-05-04
accepted date: 2023-05-04
in scheme: AQD - Quality control and assurance on CDR
hidden label: Namespace are not unique
editorial note: [Crucial]: Yes -
error type: BLOCKER

Check namespace is registered
type: Concept
notation: M41.1
definition: Check that namespace is registered in vocabulary (http://dd.eionet.europa.eu/vocabulary/aq/namespace/view)
status: valid
status modified: 2023-05-04
accepted date: 2023-05-04
in scheme: AQD - Quality control and assurance on CDR
hidden label: Unregistered country namespaace has been used
editorial note: [Crucial]: Yes -
error type: BLOCKER

reserved
type: Concept
notation: M42
definition: Check on ./sam:sampledFeature to be skipped. This element is not relevant and might contain xlink to http://sweet.jpl.nasa.gov/2.2/realm.owl or <sam:sampledFeature nilReason="inapplicable" xsi:nil="true"/>
status: reserved
status modified: 2023-05-04
accepted date: 2023-05-04
in scheme: AQD - Quality control and assurance on CDR
editorial note: Not implemented

The coordinate reference system for the ModelArea must be defined with a correct uniform resource name
type: Concept
notation: M43
definition: /sams:shape/gml:Polygon, ./sams:shape/gml:Point, ./sams:shape/gml:MultiPoint, ./sams:shape/gml:MultiSurface, ./sams:shape/gml:Grid, ./sams:shape/gml:RectifiedGrid the srsName attribute shall be a recognisable URN. The following 3 srsNames are expected urn:ogc:def:crs:EPSG::3035 or urn:ogc:def:crs:EPSG::4258 or urn:ogc:def:crs:EPSG::4326
status: valid
status modified: 2023-05-04
accepted date: 2023-05-04
in scheme: AQD - Quality control and assurance on CDR
hidden label: Coordinate system for ModelArea needs revision
editorial note: [Crucial]: Yes -
error type: BLOCKER

./sams:shape shall contain a valid geometric property type typically gml:Point gml:MultiPoint gml:MultiSurface gml:Grid gml:RectifiedGrid OR gml:Polygon
type: Concept
notation: M44
definition: ./sams:shape shall contain a valid geometric property type typically gml:Point gml:MultiPoint gml:MultiSurface gml:Grid gml:RectifiedGrid OR gml:Polygon
status: reserved
status modified: 2023-05-04
accepted date: 2023-05-04
in scheme: AQD - Quality control and assurance on CDR
hidden label: ./sams:shape shall contain a valid geometric property type, typically gml:Point, gml:MultiPoint, gml:MultiSurface, gml:Grid, gml:RectifiedGrid, gml:Polygon
editorial note: Not implemented

The count attribute must be equal to the Y and X coordinate doublets
type: Concept
notation: M45
definition: .../gml:posList the count attribute shall resolve to the sum of y & x-coordinate doublets.
status: valid
status modified: 2023-05-04
accepted date: 2023-05-04
in scheme: AQD - Quality control and assurance on CDR
hidden label: Coordinate provided for ModelArea needs revision as not all doublets
error type: BLOCKER

The coordinates must be ordered as latitude (y-axis) , longtitude (x-axis)
type: Concept
notation: M46
definition: Check that the coordinates lists in .../gml:posList ar presented in lat / long (y-axis / x-axis) notation.
status: valid
status modified: 2023-05-04
accepted date: 2023-05-04
in scheme: AQD - Quality control and assurance on CDR
hidden label: Coordinate provided for ModelArea needs revision as not latitude/Longitude
error type: WARNING

Cross checks with other data-flows
type: Concept
notation: MCrossCheck
definition: Cross checks with other data-flows
status: valid
status modified: 2023-05-04
accepted date: 2023-05-04
in scheme: AQD - Quality control and assurance on CDR
error type: WARNING

Check that the XML correctly provides XML's prefix/namespaces
type: Concept
notation: NS
definition: Check prefix and namespaces of the gml:featureCollection according to expected root elements (More information at http://www.eionet.europa.eu/aqportal/datamodel)
status: valid
status modified: 2023-05-04
accepted date: 2023-05-04
in scheme: AQD - Quality control and assurance on CDR
hidden label: gml:featureCollection requires revision
editorial note: [Crucial]: Yes - System requirement - Integrated into one qa check
error type: BLOCKER

All EEA vocabulary links must be correctly constructed
type: Concept
notation: VOCAB
definition: Check through out the XML if any URL looks like "http://dd.eionet.europa.eu/vocabularyconcept/aq/". This should be BLOCKED as the EEA vocabulary should be: "http://dd.eionet.europa.eu/vocabulary/aq/"
status: valid
status modified: 2023-05-04
accepted date: 2023-05-04
in scheme: AQD - Quality control and assurance on CDR
editorial note: Crucial
error type: BLOCKER

All EEA vocabulary links must resolve to a correct link
type: Concept
notation: VOCABALL
definition: All EEA vocabulary (starting like "http://dd.eionet.europa.eu/..." or ""https://dd.eionet.europa.eu/...") links must resolve to a correct link
status: valid
status modified: 2023-05-04
accepted date: 2023-05-04
in scheme: AQD - Quality control and assurance on CDR
error type: BLOCKER

XML validation
type: Concept
notation: XML
definition: XML validation to confirm that it is both well-formed and also "valid" in that it follows a defined structure. A well-formed document follows the basic syntactic rules of XML, which are the same for all XML documents.A valid document also respects the rules dictated by XML schema (http://dd.eionet.europa.eu/schemaset/id2011850eu-1.0/view)
status: valid
status modified: 2023-05-04
accepted date: 2023-05-04
in scheme: AQD - Quality control and assurance on CDR
hidden label: XML failed to validate
editorial note: [Crucial]: Yes - System requirement - Integrated into one qa check
error type: BLOCKER

Contribution type
type: ConceptScheme
notation: contributiontype
is part of: Air Quality Directive e-Reporting
registration status: Public draft
user modified: targajau
date modified: 2025-04-10 20:44:29.0
vocabulary type: Common
is numeric concept identifiers: false
is notations equal identifiers: false

Background
type: Concept
notation: background
definition: Background
status: valid
status modified: 2025-04-10
accepted date: 2025-04-10
in scheme: Contribution type

Increment
type: Concept
notation: increment
definition: Increment
status: valid
status modified: 2025-04-10
accepted date: 2025-04-10
in scheme: Contribution type

datatable
type: ConceptScheme
notation: datatable
is part of: Air Quality Directive e-Reporting
registration status: Public draft
user modified: targajau
date modified: 2025-08-29 14:52:40.0
vocabulary type: Common
is numeric concept identifiers: false
is notations equal identifiers: true

model
type: Concept
notation: model
definition: Model datatable
status: valid
status modified: 2025-08-29
accepted date: 2025-08-29
in scheme: datatable

samplingprocess
type: Concept
notation: samplingprocess
definition: Samplingprocess datatable
status: valid
status modified: 2025-08-29
accepted date: 2025-08-29
in scheme: datatable

assessmentregimezone
type: Concept
notation: assessmentregimezone
definition: Assessmentregimezone datatable
status: valid
status modified: 2025-08-29
accepted date: 2025-08-29
in scheme: datatable

planscenario
type: Concept
notation: planscenario
definition: Planscenario datatable
status: valid
status modified: 2025-08-29
accepted date: 2025-08-29
in scheme: datatable

AQD - Local dispersion situation**
type: ConceptScheme
notation: dispersionlocal
is part of: Air Quality Directive e-Reporting
registration status: Public draft
user modified: targajau
date modified: 2013-05-29 08:28:58.0
vocabulary type: Common
is numeric concept identifiers: false
is notations equal identifiers: false

Street canyon
type: Concept
notation: canyon
definition: Continuous/compact buildings along both sides of the street over more than 100 m. Average ratio of height of buildings to width of street > 0,5. (for this purpose "street" means the distance between the two facades of the buildings opposing each other, so including any pavements, gardens, etc.).
status: valid
status modified: 2013-03-22
accepted date: 2013-03-22
in scheme: AQD - Local dispersion situation**

Detached buildings or one-sided compact buildings
type: Concept
notation: detached
definition: Detached buildings on both sides of the street. Compact buildings on one side of the street, few buildings on the other side. Forest or groups or large trees in a surrounding of some 10 m
status: valid
status modified: 2013-03-22
accepted date: 2013-03-22
in scheme: AQD - Local dispersion situation**

Elevated terrain
type: Concept
notation: elevated
definition: Summit, slope or saddle. Relative altitude of the station at least some 10 m related to surroundings of some 100 m. Monitoring stations located on towers or high buildings are not considered as “elevated”.
status: valid
status modified: 2013-03-22
accepted date: 2013-03-22
in scheme: AQD - Local dispersion situation**

Open terrain
type: Concept
notation: open
definition: Flat area without large buildings or large trees in a surrounding of several 10 m
status: valid
status modified: 2013-03-22
accepted date: 2013-03-22
in scheme: AQD - Local dispersion situation**

AQD - Regional dispersion situation
type: ConceptScheme
notation: dispersionregional
is part of: Air Quality Directive e-Reporting
registration status: Public draft
user modified: targajau
date modified: 2013-05-13 10:26:04.0
vocabulary type: Common
is numeric concept identifiers: false
is notations equal identifiers: false

High alpine terrain
type: Concept
notation: alpine
definition: Area with relative altitudes above 1000 m on a scale of some 10 km, not located at the bottom of a valley or basin
status: valid
status modified: 2013-03-22
accepted date: 2013-03-22
in scheme: AQD - Regional dispersion situation

Basin partly surrounded by mountains
type: Concept
notation: basin
definition: Bottom of a basin (relative altitude less than 100 m) located at the border of mountains, surrounded by alpine or mountainous terrain on one side and flat or hilly terrain on the other side.
status: valid
status modified: 2013-03-22
accepted date: 2013-03-22
in scheme: AQD - Regional dispersion situation

Basin in hilly terrain
type: Concept
notation: basin-hilly
definition: Bottom of a basin (relative altitude less than 100 m) in hilly terrain. A basin is characterized as flat or hilly terrain on a scale of 5 to some 10 km surrounded by hilly or mountainous terrain.
status: valid
status modified: 2013-03-22
accepted date: 2013-03-22
in scheme: AQD - Regional dispersion situation

Basin in mountainous terrain
type: Concept
notation: basin-mount
definition: Bottom of a basin (relative altitude less than 100 m) in mountainous terrain.
status: valid
status modified: 2013-03-22
accepted date: 2013-03-22
in scheme: AQD - Regional dispersion situation

Coast with mountainous terrain in interior
type: Concept
notation: coast-mount
definition: Marine coast with mountainous or alpine terrain (see above) in its interior
status: valid
status modified: 2013-03-22
accepted date: 2013-03-22
in scheme: AQD - Regional dispersion situation

Coast with plane terrain in interior
type: Concept
notation: coast-plane
definition: Marine coast with plane or hilly terrain (see above) in its interior
status: valid
status modified: 2013-03-22
accepted date: 2013-03-22
in scheme: AQD - Regional dispersion situation

Hilly terrain
type: Concept
notation: hilly
definition: Area with relative altitudes between 100 and 300 m on a scale of several 10 km
status: valid
status modified: 2013-03-22
accepted date: 2013-03-22
in scheme: AQD - Regional dispersion situation

Mountainous terrain – ridge, pass or summit
type: Concept
notation: mount
definition: Area with relative altitudes between 300 and 1000 m on a scale of some 10 km.
status: valid
status modified: 2013-03-22
accepted date: 2013-03-22
in scheme: AQD - Regional dispersion situation

Mountainous terrain – slope
type: Concept
notation: mount-slope
definition: Area with relative altitudes between 300 and 1000 m on a scale of some 10 km. Slope characterizes locations neither on valley bottom not on ridge, summit or pass.
status: valid
status modified: 2013-03-22
accepted date: 2013-03-22
in scheme: AQD - Regional dispersion situation

Plane terrain
type: Concept
notation: plane
definition: Flat area on a scale of several 10 km with relative altitudes less than 100 m
status: valid
status modified: 2013-03-22
accepted date: 2013-03-22
in scheme: AQD - Regional dispersion situation

Valley in hilly terrain
type: Concept
notation: valley-hilly
definition: Bottom of a valley (relative altitude less than 100 m) in hilly terrain
status: valid
status modified: 2013-03-22
accepted date: 2013-03-22
in scheme: AQD - Regional dispersion situation

Valley in mountainous terrain
type: Concept
notation: valley-mount
definition: Bottom of a valley (relative altitude less than 100 m) in mountainous or alpine terrain
status: valid
status modified: 2013-03-22
accepted date: 2013-03-22
in scheme: AQD - Regional dispersion situation

documentobject
type: ConceptScheme
notation: documentobject
is part of: Air Quality Directive e-Reporting
registration status: Public draft
user modified: targajau
date modified: 2025-08-29 14:55:34.0
vocabulary type: Common
is numeric concept identifiers: false
is notations equal identifiers: true

Data quality report
type: Concept
notation: dataqualityreport
definition: Data quality report
status: valid
status modified: 2025-08-29
accepted date: 2025-08-29
in scheme: documentobject

Classification report
type: Concept
notation: classificationreport
definition: Classification report
status: valid
status modified: 2025-08-29
accepted date: 2025-08-29
in scheme: documentobject

Process documentation
type: Concept
notation: processdocumentation
definition: Process documentation
status: valid
status modified: 2025-08-29
accepted date: 2025-08-29
in scheme: documentobject

Model report
type: Concept
notation: modelreport
definition: Model report
status: valid
status modified: 2025-08-29
accepted date: 2025-08-29
in scheme: documentobject

Plan document
type: Concept
notation: plandocument
definition: Plan document
status: valid
status modified: 2025-08-29
accepted date: 2025-08-29
in scheme: documentobject

Equivalence demonstration report
type: Concept
notation: equivalencedemonstrationreport
definition: Equivalence demonstration report
status: valid
status modified: 2025-08-29
accepted date: 2025-08-29
in scheme: documentobject

AQD - MainEmissionSources
type: ConceptScheme
notation: emissionsource
is part of: Air Quality Directive e-Reporting
registration status: Public draft
user modified: targajau
date modified: 2013-05-13 10:29:45.0
vocabulary type: Common
is numeric concept identifiers: false
is notations equal identifiers: false

Energy Industries
type: Concept
notation: 1A1
definition: Fuel Combustion Activities - Energy Industries
status: valid
status modified: 2013-03-22
accepted date: 2013-03-22
in scheme: AQD - MainEmissionSources
editorial note: UNFCCC CRF category
example: http://unfccc.int/resource/docs/2006/sbsta/eng/09.pdf

Manufacturing Industries and Construction
type: Concept
notation: 1A2
definition: Fuel Combustion Activities - Manufacturing Industries and Construction
status: valid
status modified: 2013-03-22
accepted date: 2013-03-22
in scheme: AQD - MainEmissionSources
editorial note: UNFCCC CRF category
example: http://unfccc.int/resource/docs/2006/sbsta/eng/09.pdf

Transport
type: Concept
notation: 1A3
definition: Fuel Combustion Activities - Transport
status: valid
status modified: 2013-03-22
accepted date: 2013-03-22
in scheme: AQD - MainEmissionSources
editorial note: UNFCCC CRF category
example: http://unfccc.int/resource/docs/2006/sbsta/eng/09.pdf

Other sectors
type: Concept
notation: 1A4
definition: Fuel Combustion Activities - Other sectors including: Commercial / Institutional Combustion, Residential & Agriculture / Forestry / Fishing.
status: valid
status modified: 2013-03-22
accepted date: 2013-03-22
in scheme: AQD - MainEmissionSources
editorial note: UNFCCC CRF category
example: http://unfccc.int/resource/docs/2006/sbsta/eng/09.pdf

Other (not elsewhere specified)
type: Concept
notation: 1A5
definition: Fuel Combustion Activities - Other (not elsewhere specified)
status: valid
status modified: 2013-03-22
accepted date: 2013-03-22
in scheme: AQD - MainEmissionSources
editorial note: UNFCCC CRF category
example: http://unfccc.int/resource/docs/2006/sbsta/eng/09.pdf

Fugitive Emissions from Fuels
type: Concept
notation: 1B
definition: Fugitive Emissions from Fuels. Including Solid Fuels (1B1) and Oil & Natural Gas (1B2).
status: valid
status modified: 2013-03-22
accepted date: 2013-03-22
in scheme: AQD - MainEmissionSources
editorial note: UNFCCC CRF category
example: http://unfccc.int/resource/docs/2006/sbsta/eng/09.pdf

Industrial Processes
type: Concept
notation: 2
definition: Industrial Processes including: Mineral Products (2A), Chemical Industry (2B), Metal Production (2C) and Other Production (2D).
status: valid
status modified: 2013-03-22
accepted date: 2013-03-22
in scheme: AQD - MainEmissionSources
editorial note: UNFCCC CRF category
example: http://unfccc.int/resource/docs/2006/sbsta/eng/09.pdf

Solvent and Other Product Use (Secondary solvents)
type: Concept
notation: 3
definition: Solvent and Other Product Use including: Paint application (3A), Degreasing and Dry Cleaning (3B), Chemical Products, Manufacture and Processing (3C) and other (3D)
status: valid
status modified: 2013-03-22
accepted date: 2013-03-22
in scheme: AQD - MainEmissionSources
editorial note: UNFCCC CRF category
example: http://unfccc.int/resource/docs/2006/sbsta/eng/09.pdf

Agriculture
type: Concept
notation: 4
definition: Agriculture. Including: Enteric Fermentation (4A), Manure Management (4B), Rice Cultivation (4C), Agricultural Soils (4D), Prescribed Burning of Savannas (4E), Field Burning of Agricultural (4F) or Other (4G).
status: valid
status modified: 2013-03-22
accepted date: 2013-03-22
in scheme: AQD - MainEmissionSources
example: http://unfccc.int/resource/docs/2006/sbsta/eng/09.pdf

Land use, land use change and forestry
type: Concept
notation: 5
definition: Land use, land use change and forestry including: Forest land (5A), Cropland (5B), Grassland (5C), Wetlands (5D), Settlements (5E), Other land (5F) and other (5G)
status: valid
status modified: 2013-03-22
accepted date: 2013-03-22
in scheme: AQD - MainEmissionSources
example: http://unfccc.int/resource/docs/2006/sbsta/eng/09.pdf

Waste
type: Concept
notation: 6
definition: Waste inclusing Solid Waste Disposal on Land (6A), Wastre-water Handling (6B), Waste Incineration (6C) and Other (6D).
status: valid
status modified: 2013-03-22
accepted date: 2013-03-22
in scheme: AQD - MainEmissionSources
example: http://unfccc.int/resource/docs/2006/sbsta/eng/09.pdf

Long-range transboundary transport
type: Concept
notation: long-range
definition: Transport over distances of several 100 km, originating from sources which are distributed over a large area.
status: valid
status modified: 2013-03-22
accepted date: 2013-03-22
in scheme: AQD - MainEmissionSources
editorial note: “Source” type which represent contributions not originating from identifiable sources

Other
type: Concept
notation: other
definition: Other, please specify.
status: valid
status modified: 2013-03-22
accepted date: 2013-03-22
in scheme: AQD - MainEmissionSources

Secondary aerosols
type: Concept
notation: SA
definition: Secondary particles originating from gaseous pollutants, the sources of which are distributed over a large area.
status: valid
status modified: 2013-03-22
accepted date: 2013-03-22
in scheme: AQD - MainEmissionSources
editorial note: “Source” type which represent contributions not originating from identifiable sources

AQD - Environmental objective combinations
type: ConceptScheme
notation: environmentalobjective
is part of: Air Quality Directive e-Reporting
registration status: Public draft
user modified: targajau
date modified: 2025-09-09 07:42:15.0
vocabulary type: Common
is numeric concept identifiers: true
is notations equal identifiers: true

Pollutant 1, Objective type LV, Metric hrsAbove, Target H
type: Concept
notation: 1
definition: in force from 2005
status: valid
status modified: 2022-07-19
accepted date: 2022-07-19
in scheme: AQD - Environmental objective combinations
related pollutant: Sulphur dioxide (air)
has protection target: Health
has objective type: Limit Value (LV)
has reporting metric: Hours in exceedance in a calendar year
exceedance threshold: 24
aggregation process: 1 year hour exceed 350
assessment threshold: Not Applicable
exceedance metric: Number of short term exceedances - for number of daily or hourly exceedances
exceedance threshold extra: 24.5

Pollutant 8, Objective type LV, Metric aMean, Target H
type: Concept
notation: 10
definition: in force from 2010
status: valid
status modified: 2022-07-19
accepted date: 2022-07-19
in scheme: AQD - Environmental objective combinations
related pollutant: Nitrogen dioxide (air)
has protection target: Health
has objective type: Limit Value (LV)
has reporting metric: Annual mean / average
exceedance threshold: 40
aggregation process: Annual mean / 1 calendar year
assessment threshold: Above Upper Assessment Threshold (>UAT)
assessment threshold: Below Lower Assessment Threshold (<LAT)
assessment threshold: Between Lower and Upper Assessment Threshold (LAT-UAT)
exceedance metric: numericalExceedance - for average, percentile or AOT reporting metrics
exceedance threshold extra: 40.5

Pollutant 1771, Objective type MO, Metric NA, Target NA
type: Concept
notation: 100
definition: Duplicated to allow MO NA NA
status: valid
status modified: 2022-07-19
accepted date: 2022-07-19
in scheme: AQD - Environmental objective combinations
related pollutant: Elemental carbon in PM2.5 (aerosol)
has protection target: Not applicable
has objective type: Monitoring objective (MO)
has reporting metric: Not applicable
assessment threshold: Not Applicable

Pollutant 1772, Objective type MO, Metric NA, Target NA
type: Concept
notation: 101
definition: Duplicated to allow MO NA NA
status: valid
status modified: 2022-07-19
accepted date: 2022-07-19
in scheme: AQD - Environmental objective combinations
related pollutant: Organic carbon in PM2.5 (aerosol)
has protection target: Not applicable
has objective type: Monitoring objective (MO)
has reporting metric: Not applicable
assessment threshold: Not Applicable

Pollutant 1629, Objective type MO, Metric NA, Target NA
type: Concept
notation: 102
definition: Duplicated to allow MO NA NA
status: valid
status modified: 2022-07-19
accepted date: 2022-07-19
in scheme: AQD - Environmental objective combinations
related pollutant: calcium in PM2.5 (aerosol)
has protection target: Not applicable
has objective type: Monitoring objective (MO)
has reporting metric: Not applicable
assessment threshold: Not Applicable

Pollutant 1659, Objective type MO, Metric NA, Target NA
type: Concept
notation: 103
definition: Duplicated to allow MO NA NA
status: valid
status modified: 2022-07-19
accepted date: 2022-07-19
in scheme: AQD - Environmental objective combinations
related pollutant: magnesium in PM2.5 (aerosol)
has protection target: Not applicable
has objective type: Monitoring objective (MO)
has reporting metric: Not applicable
assessment threshold: Not Applicable

Pollutant 1657, Objective type MO, Metric NA, Target NA
type: Concept
notation: 104
definition: Duplicated to allow MO NA NA
status: valid
status modified: 2022-07-19
accepted date: 2022-07-19
in scheme: AQD - Environmental objective combinations
related pollutant: potassium in PM2.5 (aerosol)
has protection target: Not applicable
has objective type: Monitoring objective (MO)
has reporting metric: Not applicable
assessment threshold: Not Applicable

Pollutant 1668, Objective type MO, Metric NA, Target NA
type: Concept
notation: 105
definition: Duplicated to allow MO NA NA
status: valid
status modified: 2022-07-19
accepted date: 2022-07-19
in scheme: AQD - Environmental objective combinations
related pollutant: sodium in PM2.5 (aerosol)
has protection target: Not applicable
has objective type: Monitoring objective (MO)
has reporting metric: Not applicable
assessment threshold: Not Applicable

Pollutant 1631, Objective type MO, Metric NA, Target NA
type: Concept
notation: 106
definition: Duplicated to allow MO NA NA
status: valid
status modified: 2022-07-19
accepted date: 2022-07-19
in scheme: AQD - Environmental objective combinations
related pollutant: chloride in PM2.5 (aerosol)
has protection target: Not applicable
has objective type: Monitoring objective (MO)
has reporting metric: Not applicable
assessment threshold: Not Applicable

Pollutant 2012, Objective type MO, Metric NA, Target NA
type: Concept
notation: 107
definition: Duplicated to allow MO NA NA
status: valid
status modified: 2022-07-19
accepted date: 2022-07-19
in scheme: AQD - Environmental objective combinations
related pollutant: Lead (precip)
has protection target: Not applicable
has objective type: Monitoring objective (MO)
has reporting metric: Not applicable
assessment threshold: Not Applicable

Pollutant 2014, Objective type MO, Metric NA, Target NA
type: Concept
notation: 108
definition: Duplicated to allow MO NA NA
status: valid
status modified: 2022-07-19
accepted date: 2022-07-19
in scheme: AQD - Environmental objective combinations
related pollutant: Cadmium (precip)
has protection target: Not applicable
has objective type: Monitoring objective (MO)
has reporting metric: Not applicable
assessment threshold: Not Applicable

Pollutant 2015, Objective type MO, Metric NA, Target NA
type: Concept
notation: 109
definition: Duplicated to allow MO NA NA
status: valid
status modified: 2022-07-19
accepted date: 2022-07-19
in scheme: AQD - Environmental objective combinations
related pollutant: Nickel (precip)
has protection target: Not applicable
has objective type: Monitoring objective (MO)
has reporting metric: Not applicable
assessment threshold: Not Applicable

Pollutant 9, Objective type CL, Metric aMean, Target V
type: Concept
notation: 11
definition: in force from 2001
status: valid
status modified: 2022-07-19
accepted date: 2022-07-19
in scheme: AQD - Environmental objective combinations
related pollutant: Nitrogen oxides (air)
has protection target: Vegetation
has objective type: Critical level (CL)
has reporting metric: Annual mean / average
exceedance threshold: 30
aggregation process: Annual mean / 1 calendar year
assessment threshold: Above Upper Assessment Threshold (>UAT)
assessment threshold: Between Lower and Upper Assessment Threshold (LAT-UAT)
assessment threshold: Below Lower Assessment Threshold (<LAT)
exceedance metric: numericalExceedance - for average, percentile or AOT reporting metrics
exceedance threshold extra: 30.5

Pollutant 2018, Objective type MO, Metric NA, Target NA
type: Concept
notation: 110
definition: Duplicated to allow MO NA NA
status: valid
status modified: 2022-07-19
accepted date: 2022-07-19
in scheme: AQD - Environmental objective combinations
related pollutant: Arsenic (precip)
has protection target: Not applicable
has objective type: Monitoring objective (MO)
has reporting metric: Not applicable
assessment threshold: Not Applicable

Pollutant 7013, Objective type MO, Metric NA, Target NA
type: Concept
notation: 111
definition: Duplicated to allow MO NA NA
status: valid
status modified: 2022-07-19
accepted date: 2022-07-19
in scheme: AQD - Environmental objective combinations
related pollutant: Mercury (precip+dry_dep)
has protection target: Not applicable
has objective type: Monitoring objective (MO)
has reporting metric: Not applicable
assessment threshold: Not Applicable

Pollutant 4013, Objective type MO, Metric NA, Target NA
type: Concept
notation: 112
definition: Duplicated to allow MO NA NA
status: valid
status modified: 2022-07-19
accepted date: 2022-07-19
in scheme: AQD - Environmental objective combinations
related pollutant: Elemental Gaseous Mercury (air+aerosol)
has protection target: Not applicable
has objective type: Monitoring objective (MO)
has reporting metric: Not applicable
assessment threshold: Not Applicable

Pollutant 4813, Objective type MO, Metric NA, Target NA
type: Concept
notation: 113
definition: Duplicated to allow MO NA NA
status: valid
status modified: 2022-07-19
accepted date: 2022-07-19
in scheme: AQD - Environmental objective combinations
related pollutant: Total gaseous mercury (air+aerosol)
has protection target: Not applicable
has objective type: Monitoring objective (MO)
has reporting metric: Not applicable
assessment threshold: Not Applicable

Pollutant 653, Objective type MO, Metric NA, Target NA
type: Concept
notation: 114
definition: Duplicated to allow MO NA NA
status: valid
status modified: 2022-07-19
accepted date: 2022-07-19
in scheme: AQD - Environmental objective combinations
related pollutant: reactive_mercury (air+aerosol)
has protection target: Not applicable
has objective type: Monitoring objective (MO)
has reporting metric: Not applicable
assessment threshold: Not Applicable

Pollutant 5013, Objective type MO, Metric NA, Target NA
type: Concept
notation: 115
definition: Duplicated to allow MO NA NA
status: valid
status modified: 2022-07-19
accepted date: 2022-07-19
in scheme: AQD - Environmental objective combinations
related pollutant: Mercury in PM10 (aerosol)
has protection target: Not applicable
has objective type: Monitoring objective (MO)
has reporting metric: Not applicable
assessment threshold: Not Applicable

Pollutant 5610, Objective type MO, Metric NA, Target NA
type: Concept
notation: 116
definition: Duplicated to allow MO NA NA
status: valid
status modified: 2022-07-19
accepted date: 2022-07-19
in scheme: AQD - Environmental objective combinations
related pollutant: Benzo(a)anthracene in PM10 (aerosol)
has protection target: Not applicable
has objective type: Monitoring objective (MO)
has reporting metric: Not applicable
assessment threshold: Not Applicable

Pollutant 5617, Objective type MO, Metric NA, Target NA
type: Concept
notation: 117
definition: Duplicated to allow MO NA NA
status: valid
status modified: 2022-07-19
accepted date: 2022-07-19
in scheme: AQD - Environmental objective combinations
related pollutant: Benzo(b)fluoranthene in PM10 (aerosol)
has protection target: Not applicable
has objective type: Monitoring objective (MO)
has reporting metric: Not applicable
assessment threshold: Not Applicable

Pollutant 5759, Objective type MO, Metric NA, Target NA
type: Concept
notation: 118
definition: Duplicated to allow MO NA NA
status: valid
status modified: 2022-07-19
accepted date: 2022-07-19
in scheme: AQD - Environmental objective combinations
related pollutant: Benzo(j)fluoranthene in PM10 (aerosol)
has protection target: Not applicable
has objective type: Monitoring objective (MO)
has reporting metric: Not applicable
assessment threshold: Not Applicable

Pollutant 5626, Objective type MO, Metric NA, Target NA
type: Concept
notation: 119
definition: Duplicated to allow MO NA NA
status: valid
status modified: 2022-07-19
accepted date: 2022-07-19
in scheme: AQD - Environmental objective combinations
related pollutant: Benzo(k)fluoranthene in PM10 (aerosol)
has protection target: Not applicable
has objective type: Monitoring objective (MO)
has reporting metric: Not applicable
assessment threshold: Not Applicable

Pollutant 5, Objective type LV, Metric daysAbove, Target H
type: Concept
notation: 12
definition: in force from 2005
status: valid
status modified: 2022-07-19
accepted date: 2022-07-19
in scheme: AQD - Environmental objective combinations
related pollutant: Particulate matter < 10 µm (aerosol)
has protection target: Health
has objective type: Limit Value (LV)
has reporting metric: Days in exceedance in a calendar year
exceedance threshold: 35
aggregation process: 1 year day exceed 50
assessment threshold: Below Lower Assessment Threshold (<LAT)
assessment threshold: Between Lower and Upper Assessment Threshold (LAT-UAT)
assessment threshold: Above Upper Assessment Threshold (>UAT)
exceedance metric: Number of short term exceedances - for number of daily or hourly exceedances
exceedance metric: numericalExceedance - for average, percentile or AOT reporting metrics
exceedance threshold extra: 35.5

Pollutant 5655, Objective type MO, Metric NA, Target NA
type: Concept
notation: 120
definition: Duplicated to allow MO NA NA
status: valid
status modified: 2022-07-19
accepted date: 2022-07-19
in scheme: AQD - Environmental objective combinations
related pollutant: indeno_123cd_pyrene in PM10 (aerosol)
has protection target: Not applicable
has objective type: Monitoring objective (MO)
has reporting metric: Not applicable
assessment threshold: Not Applicable

Pollutant 5763, Objective type MO, Metric NA, Target NA
type: Concept
notation: 121
definition: Duplicated to allow MO NA NA
status: valid
status modified: 2022-07-19
accepted date: 2022-07-19
in scheme: AQD - Environmental objective combinations
related pollutant: Dibenzo(ah)anthracene in PM10 (air+aerosol)
has protection target: Not applicable
has objective type: Monitoring objective (MO)
has reporting metric: Not applicable
assessment threshold: Not Applicable

Pollutant 7029, Objective type MO, Metric NA, Target NA
type: Concept
notation: 122
definition: Duplicated to allow MO NA NA
status: valid
status modified: 2022-07-19
accepted date: 2022-07-19
in scheme: AQD - Environmental objective combinations
related pollutant: Benzo(a)pyrene (precip+dry_dep)
has protection target: Not applicable
has objective type: Monitoring objective (MO)
has reporting metric: Not applicable
assessment threshold: Not Applicable

Pollutant 611, Objective type MO, Metric NA, Target NA
type: Concept
notation: 123
definition: Duplicated to allow MO NA NA
status: valid
status modified: 2022-07-19
accepted date: 2022-07-19
in scheme: AQD - Environmental objective combinations
related pollutant: Benzo(a)anthracene (precip+dry_dep)
has protection target: Not applicable
has objective type: Monitoring objective (MO)
has reporting metric: Not applicable
assessment threshold: Not Applicable

Pollutant 618, Objective type MO, Metric NA, Target NA
type: Concept
notation: 124
definition: Duplicated to allow MO NA NA
status: valid
status modified: 2022-07-19
accepted date: 2022-07-19
in scheme: AQD - Environmental objective combinations
related pollutant: Benzo(b)fluoranthene (precip+dry_dep)
has protection target: Not applicable
has objective type: Monitoring objective (MO)
has reporting metric: Not applicable
assessment threshold: Not Applicable

Pollutant 760, Objective type MO, Metric NA, Target NA
type: Concept
notation: 125
definition: Duplicated to allow MO NA NA
status: valid
status modified: 2022-07-19
accepted date: 2022-07-19
in scheme: AQD - Environmental objective combinations
related pollutant: Benzo(j)fluoranthene (precip+dry_dep)
has protection target: Not applicable
has objective type: Monitoring objective (MO)
has reporting metric: Not applicable
assessment threshold: Not Applicable

Pollutant 627, Objective type MO, Metric NA, Target NA
type: Concept
notation: 126
definition: Duplicated to allow MO NA NA
status: valid
status modified: 2022-07-19
accepted date: 2022-07-19
in scheme: AQD - Environmental objective combinations
related pollutant: Benzo(k)fluoranthene (precip+dry_dep)
has protection target: Not applicable
has objective type: Monitoring objective (MO)
has reporting metric: Not applicable
assessment threshold: Not Applicable

Pollutant 656, Objective type MO, Metric NA, Target NA
type: Concept
notation: 127
definition: Duplicated to allow MO NA NA
status: valid
status modified: 2022-07-19
accepted date: 2022-07-19
in scheme: AQD - Environmental objective combinations
related pollutant: indeno_123cd_pyrene (precip+dry_dep)
has protection target: Not applicable
has objective type: Monitoring objective (MO)
has reporting metric: Not applicable
assessment threshold: Not Applicable

Pollutant 7419, Objective type MO, Metric NA, Target NA
type: Concept
notation: 128
definition: Duplicated to allow MO NA NA
status: valid
status modified: 2022-07-19
accepted date: 2022-07-19
in scheme: AQD - Environmental objective combinations
related pollutant: Dibenzo(ah)anthracene (precip+dry_dep)
has protection target: Not applicable
has objective type: Monitoring objective (MO)
has reporting metric: Not applicable
assessment threshold: Not Applicable

Pollutant 20, Objective type MO, Metric NA, Target NA
type: Concept
notation: 129
definition: Duplicated to allow MO NA NA
status: valid
status modified: 2022-07-19
accepted date: 2022-07-19
in scheme: AQD - Environmental objective combinations
related pollutant: Benzene (air)
has protection target: Not applicable
has objective type: Monitoring objective (MO)
has reporting metric: Not applicable
assessment threshold: Not Applicable

Pollutant 5, Objective type LV, Metric aMean, Target H
type: Concept
notation: 13
definition: in force from 2005
status: valid
status modified: 2022-07-19
accepted date: 2022-07-19
in scheme: AQD - Environmental objective combinations
related pollutant: Particulate matter < 10 µm (aerosol)
has protection target: Health
has objective type: Limit Value (LV)
has reporting metric: Annual mean / average
exceedance threshold: 40
aggregation process: Annual mean / 1 calendar year
assessment threshold: Between Lower and Upper Assessment Threshold (LAT-UAT)
assessment threshold: Above Upper Assessment Threshold (>UAT)
assessment threshold: Below Lower Assessment Threshold (<LAT)
exceedance metric: numericalExceedance - for average, percentile or AOT reporting metrics
exceedance threshold extra: 40.5

Pollutant 428, Objective type MO, Metric NA, Target NA
type: Concept
notation: 130
definition: Duplicated to allow MO NA NA
status: valid
status modified: 2022-07-19
accepted date: 2022-07-19
in scheme: AQD - Environmental objective combinations
related pollutant: Ethane (air)
has protection target: Not applicable
has objective type: Monitoring objective (MO)
has reporting metric: Not applicable
assessment threshold: Not Applicable

Pollutant 430, Objective type MO, Metric NA, Target NA
type: Concept
notation: 131
definition: Duplicated to allow MO NA NA
status: valid
status modified: 2022-07-19
accepted date: 2022-07-19
in scheme: AQD - Environmental objective combinations
related pollutant: Ethene (Ethylene) (air)
has protection target: Not applicable
has objective type: Monitoring objective (MO)
has reporting metric: Not applicable
assessment threshold: Not Applicable

Pollutant 432, Objective type MO, Metric NA, Target NA
type: Concept
notation: 132
definition: Duplicated to allow MO NA NA
status: valid
status modified: 2022-07-19
accepted date: 2022-07-19
in scheme: AQD - Environmental objective combinations
related pollutant: Ethyne (Acetylene) (air)
has protection target: Not applicable
has objective type: Monitoring objective (MO)
has reporting metric: Not applicable
assessment threshold: Not Applicable

Pollutant 503, Objective type MO, Metric NA, Target NA
type: Concept
notation: 133
definition: Duplicated to allow MO NA NA
status: valid
status modified: 2022-07-19
accepted date: 2022-07-19
in scheme: AQD - Environmental objective combinations
related pollutant: Propane (air)
has protection target: Not applicable
has objective type: Monitoring objective (MO)
has reporting metric: Not applicable
assessment threshold: Not Applicable

Pollutant 505, Objective type MO, Metric NA, Target NA
type: Concept
notation: 134
definition: Duplicated to allow MO NA NA
status: valid
status modified: 2022-07-19
accepted date: 2022-07-19
in scheme: AQD - Environmental objective combinations
related pollutant: Propene (air)
has protection target: Not applicable
has objective type: Monitoring objective (MO)
has reporting metric: Not applicable
assessment threshold: Not Applicable

Pollutant 394, Objective type MO, Metric NA, Target NA
type: Concept
notation: 135
definition: Duplicated to allow MO NA NA
status: valid
status modified: 2022-07-19
accepted date: 2022-07-19
in scheme: AQD - Environmental objective combinations
related pollutant: n-Butane (air)
has protection target: Not applicable
has objective type: Monitoring objective (MO)
has reporting metric: Not applicable
assessment threshold: Not Applicable

Pollutant 447, Objective type MO, Metric NA, Target NA
type: Concept
notation: 136
definition: Duplicated to allow MO NA NA
status: valid
status modified: 2022-07-19
accepted date: 2022-07-19
in scheme: AQD - Environmental objective combinations
related pollutant: i-Butane (2-methylpropane) (air)
has protection target: Not applicable
has objective type: Monitoring objective (MO)
has reporting metric: Not applicable
assessment threshold: Not Applicable

Pollutant 6005, Objective type MO, Metric NA, Target NA
type: Concept
notation: 137
definition: Duplicated to allow MO NA NA
status: valid
status modified: 2022-07-19
accepted date: 2022-07-19
in scheme: AQD - Environmental objective combinations
related pollutant: 1-Butene (air)
has protection target: Not applicable
has objective type: Monitoring objective (MO)
has reporting metric: Not applicable
assessment threshold: Not Applicable

Pollutant 6006, Objective type MO, Metric NA, Target NA
type: Concept
notation: 138
definition: Duplicated to allow MO NA NA
status: valid
status modified: 2022-07-19
accepted date: 2022-07-19
in scheme: AQD - Environmental objective combinations
related pollutant: trans-2-Butene (air)
has protection target: Not applicable
has objective type: Monitoring objective (MO)
has reporting metric: Not applicable
assessment threshold: Not Applicable

Pollutant 6007, Objective type MO, Metric NA, Target NA
type: Concept
notation: 139
definition: Duplicated to allow MO NA NA
status: valid
status modified: 2022-07-19
accepted date: 2022-07-19
in scheme: AQD - Environmental objective combinations
related pollutant: cis-2-Butene (air)
has protection target: Not applicable
has objective type: Monitoring objective (MO)
has reporting metric: Not applicable
assessment threshold: Not Applicable

Pollutant 6001, Objective type ECO, Metric AEI, Target H
type: Concept
notation: 14
definition: in force from 2015
status: valid
status modified: 2022-07-19
accepted date: 2022-07-19
in scheme: AQD - Environmental objective combinations
related pollutant: Particulate matter < 2.5 µm (aerosol)
has protection target: Health
has objective type: Exposure concentration obligation (ECO)
has reporting metric: Average Exposure Indicator
exceedance threshold: 20
assessment threshold: Not Applicable
exceedance metric: numericalExceedance - for average, percentile or AOT reporting metrics
exceedance threshold extra: 20.5

Pollutant 24, Objective type MO, Metric NA, Target NA
type: Concept
notation: 140
definition: Duplicated to allow MO NA NA
status: valid
status modified: 2022-07-19
accepted date: 2022-07-19
in scheme: AQD - Environmental objective combinations
related pollutant: 1.3 Butadiene (air)
has protection target: Not applicable
has objective type: Monitoring objective (MO)
has reporting metric: Not applicable
assessment threshold: Not Applicable

Pollutant 486, Objective type MO, Metric NA, Target NA
type: Concept
notation: 141
definition: Duplicated to allow MO NA NA
status: valid
status modified: 2022-07-19
accepted date: 2022-07-19
in scheme: AQD - Environmental objective combinations
related pollutant: n-Pentane (air)
has protection target: Not applicable
has objective type: Monitoring objective (MO)
has reporting metric: Not applicable
assessment threshold: Not Applicable

Pollutant 316, Objective type MO, Metric NA, Target NA
type: Concept
notation: 142
definition: Duplicated to allow MO NA NA
status: valid
status modified: 2022-07-19
accepted date: 2022-07-19
in scheme: AQD - Environmental objective combinations
related pollutant: i-Hexane (2-methylpentane) (air)
has protection target: Not applicable
has objective type: Monitoring objective (MO)
has reporting metric: Not applicable
assessment threshold: Not Applicable

Pollutant 6008, Objective type MO, Metric NA, Target NA
type: Concept
notation: 143
definition: Duplicated to allow MO NA NA
status: valid
status modified: 2022-07-19
accepted date: 2022-07-19
in scheme: AQD - Environmental objective combinations
related pollutant: 1-Pentene (air)
has protection target: Not applicable
has objective type: Monitoring objective (MO)
has reporting metric: Not applicable
assessment threshold: Not Applicable

Pollutant 6009, Objective type MO, Metric NA, Target NA
type: Concept
notation: 144
definition: Duplicated to allow MO NA NA
status: valid
status modified: 2022-07-19
accepted date: 2022-07-19
in scheme: AQD - Environmental objective combinations
related pollutant: 2-Pentene (air)
has protection target: Not applicable
has objective type: Monitoring objective (MO)
has reporting metric: Not applicable
assessment threshold: Not Applicable

Pollutant 451, Objective type MO, Metric NA, Target NA
type: Concept
notation: 145
definition: Duplicated to allow MO NA NA
status: valid
status modified: 2022-07-19
accepted date: 2022-07-19
in scheme: AQD - Environmental objective combinations
related pollutant: Isoprene (2-methyl-1,3-butadiene) (air)
has protection target: Not applicable
has objective type: Monitoring objective (MO)
has reporting metric: Not applicable
assessment threshold: Not Applicable

Pollutant 443, Objective type MO, Metric NA, Target NA
type: Concept
notation: 146
definition: Duplicated to allow MO NA NA
status: valid
status modified: 2022-07-19
accepted date: 2022-07-19
in scheme: AQD - Environmental objective combinations
related pollutant: n-Hexane (air)
has protection target: Not applicable
has objective type: Monitoring objective (MO)
has reporting metric: Not applicable
assessment threshold: Not Applicable

Pollutant 316, Objective type MO, Metric NA, Target NA
type: Concept
notation: 147
definition: Duplicated to allow MO NA NA
status: valid
status modified: 2022-07-19
accepted date: 2022-07-19
in scheme: AQD - Environmental objective combinations
related pollutant: i-Hexane (2-methylpentane) (air)
has protection target: Not applicable
has objective type: Monitoring objective (MO)
has reporting metric: Not applicable
assessment threshold: Not Applicable

Pollutant 441, Objective type MO, Metric NA, Target NA
type: Concept
notation: 148
definition: Duplicated to allow MO NA NA
status: valid
status modified: 2022-07-19
accepted date: 2022-07-19
in scheme: AQD - Environmental objective combinations
related pollutant: n-Heptane (air)
has protection target: Not applicable
has objective type: Monitoring objective (MO)
has reporting metric: Not applicable
assessment threshold: Not Applicable

Pollutant 475, Objective type MO, Metric NA, Target NA
type: Concept
notation: 149
definition: Duplicated to allow MO NA NA
status: valid
status modified: 2022-07-19
accepted date: 2022-07-19
in scheme: AQD - Environmental objective combinations
related pollutant: n-Octane (air)
has protection target: Not applicable
has objective type: Monitoring objective (MO)
has reporting metric: Not applicable
assessment threshold: Not Applicable

Pollutant 6001, Objective type LV, Metric aMean, Target H
type: Concept
notation: 15
definition: in force from 2015
status: valid
status modified: 2022-07-19
accepted date: 2022-07-19
in scheme: AQD - Environmental objective combinations
related pollutant: Particulate matter < 2.5 µm (aerosol)
has protection target: Health
has objective type: Limit Value (LV)
has reporting metric: Annual mean / average
exceedance threshold: 25
aggregation process: Annual mean / 1 calendar year
assessment threshold: Above Upper Assessment Threshold (>UAT)
assessment threshold: Below Lower Assessment Threshold (<LAT)
assessment threshold: Between Lower and Upper Assessment Threshold (LAT-UAT)
exceedance metric: numericalExceedance - for average, percentile or AOT reporting metrics
exceedance threshold extra: 25.5

Pollutant 449, Objective type MO, Metric NA, Target NA
type: Concept
notation: 150
definition: Duplicated to allow MO NA NA
status: valid
status modified: 2022-07-19
accepted date: 2022-07-19
in scheme: AQD - Environmental objective combinations
related pollutant: i-Octane (2,2,4-trimethylpentane) (air)
has protection target: Not applicable
has objective type: Monitoring objective (MO)
has reporting metric: Not applicable
assessment threshold: Not Applicable

Pollutant 21, Objective type MO, Metric NA, Target NA
type: Concept
notation: 151
definition: Duplicated to allow MO NA NA
status: valid
status modified: 2022-07-19
accepted date: 2022-07-19
in scheme: AQD - Environmental objective combinations
related pollutant: Toluene (air)
has protection target: Not applicable
has objective type: Monitoring objective (MO)
has reporting metric: Not applicable
assessment threshold: Not Applicable

Pollutant 431, Objective type MO, Metric NA, Target NA
type: Concept
notation: 152
definition: Duplicated to allow MO NA NA
status: valid
status modified: 2022-07-19
accepted date: 2022-07-19
in scheme: AQD - Environmental objective combinations
related pollutant: Ethyl benzene (air)
has protection target: Not applicable
has objective type: Monitoring objective (MO)
has reporting metric: Not applicable
assessment threshold: Not Applicable

Pollutant 464, Objective type MO, Metric NA, Target NA
type: Concept
notation: 153
definition: Duplicated to allow MO NA NA
status: valid
status modified: 2022-07-19
accepted date: 2022-07-19
in scheme: AQD - Environmental objective combinations
related pollutant: m,p-Xylene (air)
has protection target: Not applicable
has objective type: Monitoring objective (MO)
has reporting metric: Not applicable
assessment threshold: Not Applicable

Pollutant 482, Objective type MO, Metric NA, Target NA
type: Concept
notation: 154
definition: Duplicated to allow MO NA NA
status: valid
status modified: 2022-07-19
accepted date: 2022-07-19
in scheme: AQD - Environmental objective combinations
related pollutant: o-Xylene (air)
has protection target: Not applicable
has objective type: Monitoring objective (MO)
has reporting metric: Not applicable
assessment threshold: Not Applicable

Pollutant 6011, Objective type MO, Metric NA, Target NA
type: Concept
notation: 155
definition: Duplicated to allow MO NA NA
status: valid
status modified: 2022-07-19
accepted date: 2022-07-19
in scheme: AQD - Environmental objective combinations
related pollutant: 1,2,4-Trimethylbenzene (air)
has protection target: Not applicable
has objective type: Monitoring objective (MO)
has reporting metric: Not applicable
assessment threshold: Not Applicable

Pollutant 6012, Objective type MO, Metric NA, Target NA
type: Concept
notation: 156
definition: Duplicated to allow MO NA NA
status: valid
status modified: 2022-07-19
accepted date: 2022-07-19
in scheme: AQD - Environmental objective combinations
related pollutant: 1,2,3-Trimethylbenzene (air)
has protection target: Not applicable
has objective type: Monitoring objective (MO)
has reporting metric: Not applicable
assessment threshold: Not Applicable

Pollutant 32, Objective type MO, Metric NA, Target NA
type: Concept
notation: 157
definition: Duplicated to allow MO NA NA
status: valid
status modified: 2022-07-19
accepted date: 2022-07-19
in scheme: AQD - Environmental objective combinations
related pollutant: Total non-methane hydrocarbons (air)
has protection target: Not applicable
has objective type: Monitoring objective (MO)
has reporting metric: Not applicable
assessment threshold: Not Applicable

Pollutant 25, Objective type MO, Metric NA, Target NA
type: Concept
notation: 158
definition: Duplicated to allow MO NA NA
status: valid
status modified: 2022-07-19
accepted date: 2022-07-19
in scheme: AQD - Environmental objective combinations
related pollutant: Formaldehyde (air)
has protection target: Not applicable
has objective type: Monitoring objective (MO)
has reporting metric: Not applicable
assessment threshold: Not Applicable

Pollutant 8, Objective type MO, Metric NA, Target NA
type: Concept
notation: 159
definition: Duplicated to allow MO NA NA
status: valid
status modified: 2022-07-19
accepted date: 2022-07-19
in scheme: AQD - Environmental objective combinations
related pollutant: Nitrogen dioxide (air)
has protection target: Not applicable
has objective type: Monitoring objective (MO)
has reporting metric: Not applicable
assessment threshold: Not Applicable

Pollutant 10, Objective type LV, Metric daysAbove, Target H
type: Concept
notation: 16
definition: in force from 2005
status: valid
status modified: 2022-07-19
accepted date: 2022-07-19
in scheme: AQD - Environmental objective combinations
related pollutant: Carbon monoxide (air)
has protection target: Health
has objective type: Limit Value (LV)
has reporting metric: Days in exceedance in a calendar year
exceedance threshold: 0
aggregation process: 1 year daymax exceed 10
assessment threshold: Above Upper Assessment Threshold (>UAT)
assessment threshold: Below Lower Assessment Threshold (<LAT)
assessment threshold: Between Lower and Upper Assessment Threshold (LAT-UAT)
exceedance metric: Number of short term exceedances - for number of daily or hourly exceedances
exceedance threshold extra: 0.5

Pollutant 5, Objective type MO, Metric NA, Target NA
type: Concept
notation: 160
definition: Duplicated to allow MO NA NA
status: valid
status modified: 2022-07-19
accepted date: 2022-07-19
in scheme: AQD - Environmental objective combinations
related pollutant: Particulate matter < 10 µm (aerosol)
has protection target: Not applicable
has objective type: Monitoring objective (MO)
has reporting metric: Not applicable
assessment threshold: Not Applicable

Pollutant 6001, Objective type LV-S2, Metric aMean, Target H
type: Concept
notation: 161
definition: in force from 2020 Note: Exceedance threshold (20 ugm-3) not included in vocabulary as it it not MANDATORY to report (prevent false error in QA)
status: valid
status modified: 2022-07-19
accepted date: 2020-01-01
in scheme: AQD - Environmental objective combinations
related pollutant: Particulate matter < 2.5 µm (aerosol)
has protection target: Health
has objective type: Limit Value (Stage II) for reporting PM2.5 only
has reporting metric: Annual mean / average
aggregation process: Annual mean / 1 calendar year
assessment threshold: Between Lower and Upper Assessment Threshold (LAT-UAT)
assessment threshold: Below Lower Assessment Threshold (<LAT)
assessment threshold: Above Upper Assessment Threshold (>UAT)
assessment threshold: Not Applicable
exceedance metric: numericalExceedance - for average, percentile or AOT reporting metrics

Pollutant 9, Objective type MO, Metric NA, Target NA
type: Concept
notation: 162
definition: Duplicated to allow MO NA NA
status: valid
status modified: 2022-07-19
accepted date: 2022-07-19
in scheme: AQD - Environmental objective combinations
related pollutant: Nitrogen oxides (air)
has protection target: Not applicable
has objective type: Monitoring objective (MO)
has reporting metric: Not applicable
assessment threshold: Not Applicable

Pollutant 38, Objective type MO, Metric NA, Target NA
type: Concept
notation: 163
definition: Duplicated to allow MO NA NA
status: valid
status modified: 2022-07-19
accepted date: 2022-07-19
in scheme: AQD - Environmental objective combinations
related pollutant: Nitrogen monoxide (air)
has protection target: Not applicable
has objective type: Monitoring objective (MO)
has reporting metric: Not applicable
assessment threshold: Not Applicable

Pollutant 5012, Objective type LV, Metric aMean, Target H
type: Concept
notation: 17
definition: in force from (2005) 2010
status: valid
status modified: 2022-07-19
accepted date: 2022-07-19
in scheme: AQD - Environmental objective combinations
related pollutant: Lead in PM10 (aerosol)
has protection target: Health
has objective type: Limit Value (LV)
has reporting metric: Annual mean / average
exceedance threshold: 0.5
aggregation process: Annual mean / 1 calendar year
assessment threshold: Below Lower Assessment Threshold (<LAT)
assessment threshold: Between Lower and Upper Assessment Threshold (LAT-UAT)
assessment threshold: Above Upper Assessment Threshold (>UAT)
exceedance metric: numericalExceedance - for average, percentile or AOT reporting metrics
exceedance threshold extra: 0.505

Pollutant 20, Objective type LV, Metric aMean, Target H
type: Concept
notation: 18
definition: in force from 2010
status: valid
status modified: 2022-07-19
accepted date: 2022-07-19
in scheme: AQD - Environmental objective combinations
related pollutant: Benzene (air)
has protection target: Health
has objective type: Limit Value (LV)
has reporting metric: Annual mean / average
exceedance threshold: 5
aggregation process: Annual mean / 1 calendar year
assessment threshold: Above Upper Assessment Threshold (>UAT)
assessment threshold: Between Lower and Upper Assessment Threshold (LAT-UAT)
assessment threshold: Below Lower Assessment Threshold (<LAT)
exceedance metric: numericalExceedance - for average, percentile or AOT reporting metrics
exceedance threshold extra: 5.05

Pollutant 5014, Objective type TV, Metric aMean, Target H
type: Concept
notation: 19
definition: in force from 2005
status: valid
status modified: 2022-07-19
accepted date: 2022-07-19
in scheme: AQD - Environmental objective combinations
related pollutant: Cadmium in PM10 (aerosol)
has protection target: Health
has objective type: Target Value (TV)
has reporting metric: Annual mean / average
exceedance threshold: 5
aggregation process: Annual mean / 1 calendar year
assessment threshold: Between Lower and Upper Assessment Threshold (LAT-UAT)
assessment threshold: Above Upper Assessment Threshold (>UAT)
assessment threshold: Below Lower Assessment Threshold (<LAT)
exceedance metric: numericalExceedance - for average, percentile or AOT reporting metrics
exceedance threshold extra: 5.5

Pollutant 1, Objective type LV, Metric daysAbove, Target H
type: Concept
notation: 2
definition: in force from 2005
status: valid
status modified: 2022-07-19
accepted date: 2022-07-19
in scheme: AQD - Environmental objective combinations
related pollutant: Sulphur dioxide (air)
has protection target: Health
has objective type: Limit Value (LV)
has reporting metric: Days in exceedance in a calendar year
exceedance threshold: 3
aggregation process: 1 year day exceed 125
assessment threshold: Above Upper Assessment Threshold (>UAT)
assessment threshold: Below Lower Assessment Threshold (<LAT)
assessment threshold: Between Lower and Upper Assessment Threshold (LAT-UAT)
exceedance metric: Number of short term exceedances - for number of daily or hourly exceedances
exceedance threshold extra: 3.5

Pollutant 5018, Objective type TV, Metric aMean, Target H
type: Concept
notation: 20
definition: in force from 2005
status: valid
status modified: 2022-07-19
accepted date: 2022-07-19
in scheme: AQD - Environmental objective combinations
related pollutant: Arsenic in PM10 (aerosol)
has protection target: Health
has objective type: Target Value (TV)
has reporting metric: Annual mean / average
exceedance threshold: 6
aggregation process: Annual mean / 1 calendar year
assessment threshold: Below Lower Assessment Threshold (<LAT)
assessment threshold: Above Upper Assessment Threshold (>UAT)
assessment threshold: Between Lower and Upper Assessment Threshold (LAT-UAT)
exceedance metric: numericalExceedance - for average, percentile or AOT reporting metrics
exceedance threshold extra: 6.5

Pollutant 5015, Objective type TV, Metric aMean, Target H
type: Concept
notation: 21
definition: in force from 2005
status: valid
status modified: 2022-07-19
accepted date: 2022-07-19
in scheme: AQD - Environmental objective combinations
related pollutant: Nickel in PM10 (aerosol)
has protection target: Health
has objective type: Target Value (TV)
has reporting metric: Annual mean / average
exceedance threshold: 10
aggregation process: Annual mean / 1 calendar year
assessment threshold: Between Lower and Upper Assessment Threshold (LAT-UAT)
assessment threshold: Below Lower Assessment Threshold (<LAT)
assessment threshold: Above Upper Assessment Threshold (>UAT)
exceedance metric: numericalExceedance - for average, percentile or AOT reporting metrics
exceedance threshold extra: 20.5

Pollutant 5029, Objective type TV, Metric aMean, Target H
type: Concept
notation: 22
definition: in force from 2005
status: valid
status modified: 2022-07-19
accepted date: 2022-07-19
in scheme: AQD - Environmental objective combinations
related pollutant: Benzo(a)pyrene in PM10 (aerosol)
has protection target: Health
has objective type: Target Value (TV)
has reporting metric: Annual mean / average
exceedance threshold: 1
aggregation process: Annual mean / 1 calendar year
assessment threshold: Below Lower Assessment Threshold (<LAT)
assessment threshold: Above Upper Assessment Threshold (>UAT)
assessment threshold: Between Lower and Upper Assessment Threshold (LAT-UAT)
exceedance metric: numericalExceedance - for average, percentile or AOT reporting metrics
exceedance threshold extra: 1.05

Pollutant 1045, Objective type MO, Metric aMean, Target NA
type: Concept
notation: 23
status: valid
status modified: 2022-07-19
accepted date: 2022-07-19
in scheme: AQD - Environmental objective combinations
related pollutant: Ammonium in PM2.5 (aerosol)
has protection target: Not applicable
has objective type: Monitoring objective (MO)
has reporting metric: Annual mean / average
assessment threshold: Not Applicable

Pollutant 1046, Objective type MO, Metric aMean, Target NA
type: Concept
notation: 24
status: valid
status modified: 2022-07-19
accepted date: 2022-07-19
in scheme: AQD - Environmental objective combinations
related pollutant: Nitrate in PM2.5 (aerosol)
has protection target: Not applicable
has objective type: Monitoring objective (MO)
has reporting metric: Annual mean / average
assessment threshold: Not Applicable

Pollutant 1047, Objective type MO, Metric aMean, Target NA
type: Concept
notation: 25
status: valid
status modified: 2022-07-19
accepted date: 2022-07-19
in scheme: AQD - Environmental objective combinations
related pollutant: sulphate in PM2.5 (aerosol)
has protection target: Not applicable
has objective type: Monitoring objective (MO)
has reporting metric: Annual mean / average
assessment threshold: Not Applicable

Pollutant 1771, Objective type MO, Metric aMean, Target NA
type: Concept
notation: 26
status: valid
status modified: 2022-07-19
accepted date: 2022-07-19
in scheme: AQD - Environmental objective combinations
related pollutant: Elemental carbon in PM2.5 (aerosol)
has protection target: Not applicable
has objective type: Monitoring objective (MO)
has reporting metric: Annual mean / average
assessment threshold: Not Applicable

Pollutant 1772, Objective type MO, Metric aMean, Target NA
type: Concept
notation: 27
status: valid
status modified: 2022-07-19
accepted date: 2022-07-19
in scheme: AQD - Environmental objective combinations
related pollutant: Organic carbon in PM2.5 (aerosol)
has protection target: Not applicable
has objective type: Monitoring objective (MO)
has reporting metric: Annual mean / average
assessment threshold: Not Applicable

Pollutant 1629, Objective type MO, Metric aMean, Target NA
type: Concept
notation: 28
status: valid
status modified: 2022-07-19
accepted date: 2022-07-19
in scheme: AQD - Environmental objective combinations
related pollutant: calcium in PM2.5 (aerosol)
has protection target: Not applicable
has objective type: Monitoring objective (MO)
has reporting metric: Annual mean / average
assessment threshold: Not Applicable

Pollutant 1659, Objective type MO, Metric aMean, Target NA
type: Concept
notation: 29
status: valid
status modified: 2022-07-19
accepted date: 2022-07-19
in scheme: AQD - Environmental objective combinations
related pollutant: magnesium in PM2.5 (aerosol)
has protection target: Not applicable
has objective type: Monitoring objective (MO)
has reporting metric: Annual mean / average
assessment threshold: Not Applicable

Pollutant 1, Objective type CL, Metric aMean, Target V
type: Concept
notation: 3
definition: in force from 2001
status: valid
status modified: 2022-07-19
accepted date: 2022-07-19
in scheme: AQD - Environmental objective combinations
related pollutant: Sulphur dioxide (air)
has protection target: Vegetation
has objective type: Critical level (CL)
has reporting metric: Annual mean / average
exceedance threshold: 20
aggregation process: Annual mean / 1 calendar year
assessment threshold: Not Applicable
exceedance metric: numericalExceedance - for average, percentile or AOT reporting metrics
exceedance threshold extra: 20.5

Pollutant 1657, Objective type MO, Metric aMean, Target NA
type: Concept
notation: 30
status: valid
status modified: 2022-07-19
accepted date: 2022-07-19
in scheme: AQD - Environmental objective combinations
related pollutant: potassium in PM2.5 (aerosol)
has protection target: Not applicable
has objective type: Monitoring objective (MO)
has reporting metric: Annual mean / average
assessment threshold: Not Applicable

Pollutant 1668, Objective type MO, Metric aMean, Target NA
type: Concept
notation: 31
status: valid
status modified: 2022-07-19
accepted date: 2022-07-19
in scheme: AQD - Environmental objective combinations
related pollutant: sodium in PM2.5 (aerosol)
has protection target: Not applicable
has objective type: Monitoring objective (MO)
has reporting metric: Annual mean / average
assessment threshold: Not Applicable

Pollutant 1631, Objective type MO, Metric aMean, Target NA
type: Concept
notation: 32
status: valid
status modified: 2022-07-19
accepted date: 2022-07-19
in scheme: AQD - Environmental objective combinations
related pollutant: chloride in PM2.5 (aerosol)
has protection target: Not applicable
has objective type: Monitoring objective (MO)
has reporting metric: Annual mean / average
assessment threshold: Not Applicable

Pollutant 2012, Objective type MO, Metric aMean, Target NA
type: Concept
notation: 33
status: valid
status modified: 2022-07-19
accepted date: 2022-07-19
in scheme: AQD - Environmental objective combinations
related pollutant: Lead (precip)
has protection target: Not applicable
has objective type: Monitoring objective (MO)
has reporting metric: Annual mean / average
assessment threshold: Not Applicable

Pollutant 2014, Objective type MO, Metric aMean, Target NA
type: Concept
notation: 34
status: valid
status modified: 2022-07-19
accepted date: 2022-07-19
in scheme: AQD - Environmental objective combinations
related pollutant: Cadmium (precip)
has protection target: Not applicable
has objective type: Monitoring objective (MO)
has reporting metric: Annual mean / average
assessment threshold: Not Applicable

Pollutant 2015, Objective type MO, Metric aMean, Target NA
type: Concept
notation: 35
status: valid
status modified: 2022-07-19
accepted date: 2022-07-19
in scheme: AQD - Environmental objective combinations
related pollutant: Nickel (precip)
has protection target: Not applicable
has objective type: Monitoring objective (MO)
has reporting metric: Annual mean / average
assessment threshold: Not Applicable

Pollutant 2018, Objective type MO, Metric aMean, Target NA
type: Concept
notation: 36
status: valid
status modified: 2022-07-19
accepted date: 2022-07-19
in scheme: AQD - Environmental objective combinations
related pollutant: Arsenic (precip)
has protection target: Not applicable
has objective type: Monitoring objective (MO)
has reporting metric: Annual mean / average
assessment threshold: Not Applicable

Pollutant 7013, Objective type MO, Metric aMean, Target NA
type: Concept
notation: 37
status: valid
status modified: 2022-07-19
accepted date: 2022-07-19
in scheme: AQD - Environmental objective combinations
related pollutant: Mercury (precip+dry_dep)
has protection target: Not applicable
has objective type: Monitoring objective (MO)
has reporting metric: Annual mean / average
assessment threshold: Not Applicable

Pollutant 4013, Objective type MO, Metric aMean, Target NA
type: Concept
notation: 38
status: valid
status modified: 2022-07-19
accepted date: 2022-07-19
in scheme: AQD - Environmental objective combinations
related pollutant: Elemental Gaseous Mercury (air+aerosol)
has protection target: Not applicable
has objective type: Monitoring objective (MO)
has reporting metric: Annual mean / average
assessment threshold: Not Applicable

Pollutant 4813, Objective type MO, Metric aMean, Target NA
type: Concept
notation: 39
status: valid
status modified: 2022-07-19
accepted date: 2022-07-19
in scheme: AQD - Environmental objective combinations
related pollutant: Total gaseous mercury (air+aerosol)
has protection target: Not applicable
has objective type: Monitoring objective (MO)
has reporting metric: Annual mean / average
assessment threshold: Not Applicable

Pollutant 1, Objective type CL, Metric wMean, Target V
type: Concept
notation: 4
definition: in force from 2001
status: valid
status modified: 2022-07-19
accepted date: 2022-07-19
in scheme: AQD - Environmental objective combinations
related pollutant: Sulphur dioxide (air)
has protection target: Vegetation
has objective type: Critical level (CL)
has reporting metric: Winter Mean
exceedance threshold: 20
aggregation process: Winter mean
assessment threshold: Between Lower and Upper Assessment Threshold (LAT-UAT)
assessment threshold: Below Lower Assessment Threshold (<LAT)
assessment threshold: Above Upper Assessment Threshold (>UAT)
exceedance metric: numericalExceedance - for average, percentile or AOT reporting metrics
exceedance threshold extra: 20.5

Pollutant 653, Objective type MO, Metric aMean, Target NA
type: Concept
notation: 40
status: valid
status modified: 2022-07-19
accepted date: 2022-07-19
in scheme: AQD - Environmental objective combinations
related pollutant: reactive_mercury (air+aerosol)
has protection target: Not applicable
has objective type: Monitoring objective (MO)
has reporting metric: Annual mean / average
assessment threshold: Not Applicable

Pollutant 5013, Objective type MO, Metric aMean, Target NA
type: Concept
notation: 41
status: valid
status modified: 2022-07-19
accepted date: 2022-07-19
in scheme: AQD - Environmental objective combinations
related pollutant: Mercury in PM10 (aerosol)
has protection target: Not applicable
has objective type: Monitoring objective (MO)
has reporting metric: Annual mean / average
assessment threshold: Not Applicable

Pollutant 5610, Objective type MO, Metric aMean, Target NA
type: Concept
notation: 42
status: valid
status modified: 2022-07-19
accepted date: 2022-07-19
in scheme: AQD - Environmental objective combinations
related pollutant: Benzo(a)anthracene in PM10 (aerosol)
has protection target: Not applicable
has objective type: Monitoring objective (MO)
has reporting metric: Annual mean / average
assessment threshold: Not Applicable

Pollutant 5617, Objective type MO, Metric aMean, Target NA
type: Concept
notation: 43
status: valid
status modified: 2022-07-19
accepted date: 2022-07-19
in scheme: AQD - Environmental objective combinations
related pollutant: Benzo(b)fluoranthene in PM10 (aerosol)
has protection target: Not applicable
has objective type: Monitoring objective (MO)
has reporting metric: Annual mean / average
assessment threshold: Not Applicable

Pollutant 5759, Objective type MO, Metric aMean, Target NA
type: Concept
notation: 44
status: valid
status modified: 2022-07-19
accepted date: 2022-07-19
in scheme: AQD - Environmental objective combinations
related pollutant: Benzo(j)fluoranthene in PM10 (aerosol)
has protection target: Not applicable
has objective type: Monitoring objective (MO)
has reporting metric: Annual mean / average
assessment threshold: Not Applicable

Pollutant 5626, Objective type MO, Metric aMean, Target NA
type: Concept
notation: 45
status: valid
status modified: 2022-07-19
accepted date: 2022-07-19
in scheme: AQD - Environmental objective combinations
related pollutant: Benzo(k)fluoranthene in PM10 (aerosol)
has protection target: Not applicable
has objective type: Monitoring objective (MO)
has reporting metric: Annual mean / average
assessment threshold: Not Applicable

Pollutant 5655, Objective type MO, Metric aMean, Target NA
type: Concept
notation: 46
status: valid
status modified: 2022-07-19
accepted date: 2022-07-19
in scheme: AQD - Environmental objective combinations
related pollutant: indeno_123cd_pyrene in PM10 (aerosol)
has protection target: Not applicable
has objective type: Monitoring objective (MO)
has reporting metric: Annual mean / average
assessment threshold: Not Applicable

Pollutant 5763, Objective type MO, Metric aMean, Target NA
type: Concept
notation: 47
status: valid
status modified: 2022-07-19
accepted date: 2022-07-19
in scheme: AQD - Environmental objective combinations
related pollutant: Dibenzo(ah)anthracene in PM10 (air+aerosol)
has protection target: Not applicable
has objective type: Monitoring objective (MO)
has reporting metric: Annual mean / average
assessment threshold: Not Applicable

Pollutant 7029, Objective type MO, Metric aMean, Target NA
type: Concept
notation: 48
status: valid
status modified: 2022-07-19
accepted date: 2022-07-19
in scheme: AQD - Environmental objective combinations
related pollutant: Benzo(a)pyrene (precip+dry_dep)
has protection target: Not applicable
has objective type: Monitoring objective (MO)
has reporting metric: Annual mean / average
assessment threshold: Not Applicable

Pollutant 611, Objective type MO, Metric aMean, Target NA
type: Concept
notation: 49
status: valid
status modified: 2022-07-19
accepted date: 2022-07-19
in scheme: AQD - Environmental objective combinations
related pollutant: Benzo(a)anthracene (precip+dry_dep)
has protection target: Not applicable
has objective type: Monitoring objective (MO)
has reporting metric: Annual mean / average
assessment threshold: Not Applicable

Pollutant 7, Objective type TV, Metric daysAbove-3yr, Target H
type: Concept
notation: 5
definition: in force from 2010
status: valid
status modified: 2022-07-19
accepted date: 2022-07-19
in scheme: AQD - Environmental objective combinations
related pollutant: Ozone (air)
has protection target: Health
has objective type: Target Value (TV)
has reporting metric: Days in exceedance averaged over 3 calendar years
exceedance threshold: 25
aggregation process: Daymax exceed 120 averaged over 3 consecutive years
assessment threshold: Not Applicable
exceedance metric: Number of short term exceedances - for number of daily or hourly exceedances
exceedance threshold extra: 25.5

Pollutant 618, Objective type MO, Metric aMean, Target NA
type: Concept
notation: 50
status: valid
status modified: 2022-07-19
accepted date: 2022-07-19
in scheme: AQD - Environmental objective combinations
related pollutant: Benzo(b)fluoranthene (precip+dry_dep)
has protection target: Not applicable
has objective type: Monitoring objective (MO)
has reporting metric: Annual mean / average
assessment threshold: Not Applicable

Pollutant 760, Objective type MO, Metric aMean, Target NA
type: Concept
notation: 51
status: valid
status modified: 2022-07-19
accepted date: 2022-07-19
in scheme: AQD - Environmental objective combinations
related pollutant: Benzo(j)fluoranthene (precip+dry_dep)
has protection target: Not applicable
has objective type: Monitoring objective (MO)
has reporting metric: Annual mean / average
assessment threshold: Not Applicable

Pollutant 627, Objective type MO, Metric aMean, Target NA
type: Concept
notation: 52
status: valid
status modified: 2022-07-19
accepted date: 2022-07-19
in scheme: AQD - Environmental objective combinations
related pollutant: Benzo(k)fluoranthene (precip+dry_dep)
has protection target: Not applicable
has objective type: Monitoring objective (MO)
has reporting metric: Annual mean / average
assessment threshold: Not Applicable

Pollutant 656, Objective type MO, Metric aMean, Target NA
type: Concept
notation: 53
status: valid
status modified: 2022-07-19
accepted date: 2022-07-19
in scheme: AQD - Environmental objective combinations
related pollutant: indeno_123cd_pyrene (precip+dry_dep)
has protection target: Not applicable
has objective type: Monitoring objective (MO)
has reporting metric: Annual mean / average
assessment threshold: Not Applicable

Pollutant 7419, Objective type MO, Metric aMean, Target NA
type: Concept
notation: 54
status: valid
status modified: 2022-07-19
accepted date: 2022-07-19
in scheme: AQD - Environmental objective combinations
related pollutant: Dibenzo(ah)anthracene (precip+dry_dep)
has protection target: Not applicable
has objective type: Monitoring objective (MO)
has reporting metric: Annual mean / average
assessment threshold: Not Applicable

Pollutant 20, Objective type MO, Metric aMean, Target NA
type: Concept
notation: 55
status: valid
status modified: 2022-07-19
accepted date: 2022-07-19
in scheme: AQD - Environmental objective combinations
related pollutant: Benzene (air)
has protection target: Not applicable
has objective type: Monitoring objective (MO)
has reporting metric: Annual mean / average
assessment threshold: Not Applicable

Pollutant 428, Objective type MO, Metric aMean, Target NA
type: Concept
notation: 56
status: valid
status modified: 2022-07-19
accepted date: 2022-07-19
in scheme: AQD - Environmental objective combinations
related pollutant: Ethane (air)
has protection target: Not applicable
has objective type: Monitoring objective (MO)
has reporting metric: Annual mean / average
assessment threshold: Not Applicable

Pollutant 430, Objective type MO, Metric aMean, Target NA
type: Concept
notation: 57
status: valid
status modified: 2022-07-19
accepted date: 2022-07-19
in scheme: AQD - Environmental objective combinations
related pollutant: Ethene (Ethylene) (air)
has protection target: Not applicable
has objective type: Monitoring objective (MO)
has reporting metric: Annual mean / average
assessment threshold: Not Applicable

Pollutant 432, Objective type MO, Metric aMean, Target NA
type: Concept
notation: 58
status: valid
status modified: 2022-07-19
accepted date: 2022-07-19
in scheme: AQD - Environmental objective combinations
related pollutant: Ethyne (Acetylene) (air)
has protection target: Not applicable
has objective type: Monitoring objective (MO)
has reporting metric: Annual mean / average
assessment threshold: Not Applicable

Pollutant 503, Objective type MO, Metric aMean, Target NA
type: Concept
notation: 59
status: valid
status modified: 2022-07-19
accepted date: 2022-07-19
in scheme: AQD - Environmental objective combinations
related pollutant: Propane (air)
has protection target: Not applicable
has objective type: Monitoring objective (MO)
has reporting metric: Annual mean / average
assessment threshold: Not Applicable

Pollutant 7, Objective type LTO, Metric daysAbove, Target H
type: Concept
notation: 6
definition: in force from 2010
status: valid
status modified: 2022-07-19
accepted date: 2022-07-19
in scheme: AQD - Environmental objective combinations
related pollutant: Ozone (air)
has protection target: Health
has objective type: Long term objective (LTO)
has reporting metric: Days in exceedance in a calendar year
exceedance threshold: 0
aggregation process: 1 year daymax exceed 120
assessment threshold: Below the long-term objective
assessment threshold: Above the long-term objective
exceedance metric: Number of short term exceedances - for number of daily or hourly exceedances
exceedance threshold extra: 0.5

Pollutant 505, Objective type MO, Metric aMean, Target NA
type: Concept
notation: 60
status: valid
status modified: 2022-07-19
accepted date: 2022-07-19
in scheme: AQD - Environmental objective combinations
related pollutant: Propene (air)
has protection target: Not applicable
has objective type: Monitoring objective (MO)
has reporting metric: Annual mean / average
assessment threshold: Not Applicable

Pollutant 394, Objective type MO, Metric aMean, Target NA
type: Concept
notation: 61
status: valid
status modified: 2022-07-19
accepted date: 2022-07-19
in scheme: AQD - Environmental objective combinations
related pollutant: n-Butane (air)
has protection target: Not applicable
has objective type: Monitoring objective (MO)
has reporting metric: Annual mean / average
assessment threshold: Not Applicable

Pollutant 447, Objective type MO, Metric aMean, Target NA
type: Concept
notation: 62
status: valid
status modified: 2022-07-19
accepted date: 2022-07-19
in scheme: AQD - Environmental objective combinations
related pollutant: i-Butane (2-methylpropane) (air)
has protection target: Not applicable
has objective type: Monitoring objective (MO)
has reporting metric: Annual mean / average
assessment threshold: Not Applicable

Pollutant 6005, Objective type MO, Metric aMean, Target NA
type: Concept
notation: 63
status: valid
status modified: 2022-07-19
accepted date: 2022-07-19
in scheme: AQD - Environmental objective combinations
related pollutant: 1-Butene (air)
has protection target: Not applicable
has objective type: Monitoring objective (MO)
has reporting metric: Annual mean / average
assessment threshold: Not Applicable

Pollutant 6006, Objective type MO, Metric aMean, Target NA
type: Concept
notation: 64
status: valid
status modified: 2022-07-19
accepted date: 2022-07-19
in scheme: AQD - Environmental objective combinations
related pollutant: trans-2-Butene (air)
has protection target: Not applicable
has objective type: Monitoring objective (MO)
has reporting metric: Annual mean / average
assessment threshold: Not Applicable

Pollutant 6007, Objective type MO, Metric aMean, Target NA
type: Concept
notation: 65
status: valid
status modified: 2022-07-19
accepted date: 2022-07-19
in scheme: AQD - Environmental objective combinations
related pollutant: cis-2-Butene (air)
has protection target: Not applicable
has objective type: Monitoring objective (MO)
has reporting metric: Annual mean / average
assessment threshold: Not Applicable

Pollutant 24, Objective type MO, Metric aMean, Target NA
type: Concept
notation: 66
status: valid
status modified: 2022-07-19
accepted date: 2022-07-19
in scheme: AQD - Environmental objective combinations
related pollutant: 1.3 Butadiene (air)
has protection target: Not applicable
has objective type: Monitoring objective (MO)
has reporting metric: Annual mean / average
assessment threshold: Not Applicable

Pollutant 486, Objective type MO, Metric aMean, Target NA
type: Concept
notation: 67
status: valid
status modified: 2022-07-19
accepted date: 2022-07-19
in scheme: AQD - Environmental objective combinations
related pollutant: n-Pentane (air)
has protection target: Not applicable
has objective type: Monitoring objective (MO)
has reporting metric: Annual mean / average
assessment threshold: Not Applicable

Pollutant 316, Objective type MO, Metric aMean, Target NA
type: Concept
notation: 68
status: valid
status modified: 2022-07-19
accepted date: 2022-07-19
in scheme: AQD - Environmental objective combinations
related pollutant: i-Hexane (2-methylpentane) (air)
has protection target: Not applicable
has objective type: Monitoring objective (MO)
has reporting metric: Annual mean / average
assessment threshold: Not Applicable

Pollutant 6008, Objective type MO, Metric aMean, Target NA
type: Concept
notation: 69
status: valid
status modified: 2022-07-19
accepted date: 2022-07-19
in scheme: AQD - Environmental objective combinations
related pollutant: 1-Pentene (air)
has protection target: Not applicable
has objective type: Monitoring objective (MO)
has reporting metric: Annual mean / average
assessment threshold: Not Applicable

Pollutant 7, Objective type TV, Metric AOT40c-5yr, Target V
type: Concept
notation: 7
status: valid
status modified: 2022-07-19
accepted date: 2022-07-19
in scheme: AQD - Environmental objective combinations
related pollutant: Ozone (air)
has protection target: Vegetation
has objective type: Target Value (TV)
has reporting metric: AOT40 vegetation protection averaged over 5 years
exceedance threshold: 18000
aggregation process: AOT40 vegetation protection averaged over 5 years
assessment threshold: Not Applicable
exceedance metric: numericalExceedance - for average, percentile or AOT reporting metrics
exceedance threshold extra: 18000.5

Pollutant 6009, Objective type MO, Metric aMean, Target NA
type: Concept
notation: 70
status: valid
status modified: 2022-07-19
accepted date: 2022-07-19
in scheme: AQD - Environmental objective combinations
related pollutant: 2-Pentene (air)
has protection target: Not applicable
has objective type: Monitoring objective (MO)
has reporting metric: Annual mean / average
assessment threshold: Not Applicable

Pollutant 451, Objective type MO, Metric aMean, Target NA
type: Concept
notation: 71
status: valid
status modified: 2022-07-19
accepted date: 2022-07-19
in scheme: AQD - Environmental objective combinations
related pollutant: Isoprene (2-methyl-1,3-butadiene) (air)
has protection target: Not applicable
has objective type: Monitoring objective (MO)
has reporting metric: Annual mean / average
assessment threshold: Not Applicable

Pollutant 443, Objective type MO, Metric aMean, Target NA
type: Concept
notation: 72
status: valid
status modified: 2022-07-19
accepted date: 2022-07-19
in scheme: AQD - Environmental objective combinations
related pollutant: n-Hexane (air)
has protection target: Not applicable
has objective type: Monitoring objective (MO)
has reporting metric: Annual mean / average
assessment threshold: Not Applicable

Pollutant 316, Objective type MO, Metric aMean, Target NA
type: Concept
notation: 73
status: valid
status modified: 2022-07-19
accepted date: 2022-07-19
in scheme: AQD - Environmental objective combinations
related pollutant: i-Hexane (2-methylpentane) (air)
has protection target: Not applicable
has objective type: Monitoring objective (MO)
has reporting metric: Annual mean / average
assessment threshold: Not Applicable

Pollutant 441, Objective type MO, Metric aMean, Target NA
type: Concept
notation: 74
status: valid
status modified: 2022-07-19
accepted date: 2022-07-19
in scheme: AQD - Environmental objective combinations
related pollutant: n-Heptane (air)
has protection target: Not applicable
has objective type: Monitoring objective (MO)
has reporting metric: Annual mean / average
assessment threshold: Not Applicable

Pollutant 475, Objective type MO, Metric aMean, Target NA
type: Concept
notation: 75
status: valid
status modified: 2022-07-19
accepted date: 2022-07-19
in scheme: AQD - Environmental objective combinations
related pollutant: n-Octane (air)
has protection target: Not applicable
has objective type: Monitoring objective (MO)
has reporting metric: Annual mean / average
assessment threshold: Not Applicable

Pollutant 449, Objective type MO, Metric aMean, Target NA
type: Concept
notation: 76
status: valid
status modified: 2022-07-19
accepted date: 2022-07-19
in scheme: AQD - Environmental objective combinations
related pollutant: i-Octane (2,2,4-trimethylpentane) (air)
has protection target: Not applicable
has objective type: Monitoring objective (MO)
has reporting metric: Annual mean / average
assessment threshold: Not Applicable

Pollutant 21, Objective type MO, Metric aMean, Target NA
type: Concept
notation: 77
status: valid
status modified: 2022-07-19
accepted date: 2022-07-19
in scheme: AQD - Environmental objective combinations
related pollutant: Toluene (air)
has protection target: Not applicable
has objective type: Monitoring objective (MO)
has reporting metric: Annual mean / average
assessment threshold: Not Applicable

Pollutant 431, Objective type MO, Metric aMean, Target NA
type: Concept
notation: 78
status: valid
status modified: 2022-07-19
accepted date: 2022-07-19
in scheme: AQD - Environmental objective combinations
related pollutant: Ethyl benzene (air)
has protection target: Not applicable
has objective type: Monitoring objective (MO)
has reporting metric: Annual mean / average
assessment threshold: Not Applicable

Pollutant 464, Objective type MO, Metric aMean, Target NA
type: Concept
notation: 79
status: valid
status modified: 2022-07-19
accepted date: 2022-07-19
in scheme: AQD - Environmental objective combinations
related pollutant: m,p-Xylene (air)
has protection target: Not applicable
has objective type: Monitoring objective (MO)
has reporting metric: Annual mean / average
assessment threshold: Not Applicable

Pollutant 7, Objective type LTO, Metric AOT40c, Target V
type: Concept
notation: 8
status: valid
status modified: 2022-07-19
accepted date: 2022-07-19
in scheme: AQD - Environmental objective combinations
related pollutant: Ozone (air)
has protection target: Vegetation
has objective type: Long term objective (LTO)
has reporting metric: AOT40 vegetation protection
exceedance threshold: 6000
aggregation process: AOT40 vegetation protection
assessment threshold: Below the long-term objective
assessment threshold: Above the long-term objective
exceedance metric: numericalExceedance - for average, percentile or AOT reporting metrics
exceedance threshold extra: 6000.5

Pollutant 482, Objective type MO, Metric aMean, Target NA
type: Concept
notation: 80
status: valid
status modified: 2022-07-19
accepted date: 2022-07-19
in scheme: AQD - Environmental objective combinations
related pollutant: o-Xylene (air)
has protection target: Not applicable
has objective type: Monitoring objective (MO)
has reporting metric: Annual mean / average
assessment threshold: Not Applicable

Pollutant 6011, Objective type MO, Metric aMean, Target NA
type: Concept
notation: 81
status: valid
status modified: 2022-07-19
accepted date: 2022-07-19
in scheme: AQD - Environmental objective combinations
related pollutant: 1,2,4-Trimethylbenzene (air)
has protection target: Not applicable
has objective type: Monitoring objective (MO)
has reporting metric: Annual mean / average
assessment threshold: Not Applicable

Pollutant 6012, Objective type MO, Metric aMean, Target NA
type: Concept
notation: 82
status: valid
status modified: 2022-07-19
accepted date: 2022-07-19
in scheme: AQD - Environmental objective combinations
related pollutant: 1,2,3-Trimethylbenzene (air)
has protection target: Not applicable
has objective type: Monitoring objective (MO)
has reporting metric: Annual mean / average
assessment threshold: Not Applicable

Pollutant 32, Objective type MO, Metric aMean, Target NA
type: Concept
notation: 83
status: valid
status modified: 2022-07-19
accepted date: 2022-07-19
in scheme: AQD - Environmental objective combinations
related pollutant: Total non-methane hydrocarbons (air)
has protection target: Not applicable
has objective type: Monitoring objective (MO)
has reporting metric: Annual mean / average
assessment threshold: Not Applicable

Pollutant 25, Objective type MO, Metric aMean, Target NA
type: Concept
notation: 84
status: valid
status modified: 2022-07-19
accepted date: 2022-07-19
in scheme: AQD - Environmental objective combinations
related pollutant: Formaldehyde (air)
has protection target: Not applicable
has objective type: Monitoring objective (MO)
has reporting metric: Annual mean / average
assessment threshold: Not Applicable

Pollutant 5, Objective type LV, Metric daysAbove, Target H
type: Concept
notation: 85
definition: in force from 2005
status: valid
status modified: 2022-07-19
accepted date: 2022-07-19
in scheme: AQD - Environmental objective combinations
related pollutant: Particulate matter < 10 µm (aerosol)
has protection target: Health
has objective type: Limit Value (LV)
has reporting metric: Days in exceedance in a calendar year
exceedance threshold: 50
aggregation process: 1 year 90.4 percentile - COMPLIANCE
assessment threshold: Above Upper Assessment Threshold (>UAT)
assessment threshold: Below Lower Assessment Threshold (<LAT)
assessment threshold: Between Lower and Upper Assessment Threshold (LAT-UAT)
exceedance metric: Number of short term exceedances - for number of daily or hourly exceedances
exceedance threshold extra: 35.5

Pollutant 6001, Objective type LVMOT, Metric aMean, Target H
type: Concept
notation: 86
definition: in force from (2013) 2014
status: valid
status modified: 2022-07-19
accepted date: 2022-07-19
in scheme: AQD - Environmental objective combinations
related pollutant: Particulate matter < 2.5 µm (aerosol)
has protection target: Health
has objective type: Limit value plus applicable margin of tolerance (LVMOT)
has reporting metric: Annual mean / average
exceedance threshold: 26
aggregation process: Annual mean / 1 calendar year
assessment threshold: Between Lower and Upper Assessment Threshold (LAT-UAT)
assessment threshold: Below Lower Assessment Threshold (<LAT)
assessment threshold: Above Upper Assessment Threshold (>UAT)
exceedance metric: numericalExceedance - for average, percentile or AOT reporting metrics
exceedance threshold extra: 26.5

Pollutant 6001, Objective type TV, Metric aMean, Target H
type: Concept
notation: 87
definition: in force from 2010
status: valid
status modified: 2022-07-19
accepted date: 2022-07-19
in scheme: AQD - Environmental objective combinations
related pollutant: Particulate matter < 2.5 µm (aerosol)
has protection target: Health
has objective type: Target Value (TV)
has reporting metric: Annual mean / average
exceedance threshold: 25
aggregation process: Annual mean / 1 calendar year
assessment threshold: Below Lower Assessment Threshold (<LAT)
assessment threshold: Between Lower and Upper Assessment Threshold (LAT-UAT)
assessment threshold: Above Upper Assessment Threshold (>UAT)
exceedance metric: numericalExceedance - for average, percentile or AOT reporting metrics
exceedance threshold extra: 25.5

Pollutant 6001, Objective type ERT, Metric AEI, Target H
type: Concept
notation: 88
definition: in force from 2020
status: valid
status modified: 2022-07-19
accepted date: 2022-07-19
in scheme: AQD - Environmental objective combinations
related pollutant: Particulate matter < 2.5 µm (aerosol)
has protection target: Health
has objective type: Exposure reduction target (ERT)
has reporting metric: Average Exposure Indicator
assessment threshold: Not Applicable
exceedance metric: numericalExceedance - for average, percentile or AOT reporting metrics

Pollutant 8, Objective type LVmaxMOT, Metric aMean, Target H
type: Concept
notation: 89
definition: applicable if time extension given (No time extension after 2015 inclusive).
status: valid
status modified: 2022-07-19
accepted date: 2012-01-01
not accepted date: 2014-12-31
in scheme: AQD - Environmental objective combinations
related pollutant: Nitrogen dioxide (air)
has protection target: Health
has objective type: Limit value plus maximum margin of tolerance
has reporting metric: Annual mean / average
exceedance threshold: 60
aggregation process: Annual mean / 1 calendar year
assessment threshold: Above Upper Assessment Threshold (>UAT)
assessment threshold: Between Lower and Upper Assessment Threshold (LAT-UAT)
assessment threshold: Below Lower Assessment Threshold (<LAT)
exceedance metric: numericalExceedance - for average, percentile or AOT reporting metrics
exceedance threshold extra: 60.5

Pollutant 8, Objective type LV, Metric hrsAbove, Target H
type: Concept
notation: 9
definition: in force from 2010
status: valid
status modified: 2022-07-19
accepted date: 2022-07-19
in scheme: AQD - Environmental objective combinations
related pollutant: Nitrogen dioxide (air)
has protection target: Health
has objective type: Limit Value (LV)
has reporting metric: Hours in exceedance in a calendar year
exceedance threshold: 18
aggregation process: 1 year hour exceed 200
assessment threshold: Above Upper Assessment Threshold (>UAT)
assessment threshold: Below Lower Assessment Threshold (<LAT)
assessment threshold: Between Lower and Upper Assessment Threshold (LAT-UAT)
exceedance metric: Number of short term exceedances - for number of daily or hourly exceedances
exceedance threshold extra: 18.5

Pollutant 8, Objective type LVmaxMOT, Metric hrsAbove, Target H
type: Concept
notation: 90
definition: applicable if time extension given
status: valid
status modified: 2022-07-19
accepted date: 2012-01-01
not accepted date: 2014-12-31
in scheme: AQD - Environmental objective combinations
related pollutant: Nitrogen dioxide (air)
has protection target: Health
has objective type: Limit value plus maximum margin of tolerance
has reporting metric: Hours in exceedance in a calendar year
exceedance threshold: 27
aggregation process: 1 year hour exceed 200
assessment threshold: Above Upper Assessment Threshold (>UAT)
assessment threshold: Between Lower and Upper Assessment Threshold (LAT-UAT)
assessment threshold: Below Lower Assessment Threshold (<LAT)
exceedance metric: Number of short term exceedances - for number of daily or hourly exceedances
exceedance threshold extra: 27.5

Pollutant 8, Objective type MO, Metric aMean, Target NA
type: Concept
notation: 91
status: valid
status modified: 2022-07-19
accepted date: 2022-07-19
in scheme: AQD - Environmental objective combinations
related pollutant: Nitrogen dioxide (air)
has protection target: Not applicable
has objective type: Monitoring objective (MO)
has reporting metric: Annual mean / average
assessment threshold: Not Applicable

Pollutant 5, Objective type MO, Metric aMean, Target NA
type: Concept
notation: 92
status: valid
status modified: 2022-07-19
accepted date: 2022-07-19
in scheme: AQD - Environmental objective combinations
related pollutant: Particulate matter < 10 µm (aerosol)
has protection target: Not applicable
has objective type: Monitoring objective (MO)
has reporting metric: Annual mean / average
assessment threshold: Not Applicable

Pollutant 1, Objective type ALT, Metric 3hAbove, Target H
type: Concept
notation: 93
status: valid
status modified: 2022-07-19
accepted date: 2022-07-19
in scheme: AQD - Environmental objective combinations
related pollutant: Sulphur dioxide (air)
has protection target: Health
has objective type: Alert threshold (ALT)
has reporting metric: Three consecutive hours in exceedance
exceedance threshold: 0
aggregation process: 3 consecutive hours in exceedance of 500
assessment threshold: Not Applicable
exceedance metric: Number of short term exceedances - for number of daily or hourly exceedances
exceedance threshold extra: 0

Pollutant 8, Objective type ALT, Metric 3hAbove, Target H
type: Concept
notation: 94
status: valid
status modified: 2022-07-19
accepted date: 2022-07-19
in scheme: AQD - Environmental objective combinations
related pollutant: Nitrogen dioxide (air)
has protection target: Health
has objective type: Alert threshold (ALT)
has reporting metric: Three consecutive hours in exceedance
exceedance threshold: 0
aggregation process: 3 consecutive hours in exceedance of 400
assessment threshold: Not Applicable
exceedance metric: Number of short term exceedances - for number of daily or hourly exceedances
exceedance threshold extra: 0

Pollutant 7, Objective type INT, Metric hrsAbove, Target H
type: Concept
notation: 95
status: valid
status modified: 2022-07-19
accepted date: 2022-07-19
in scheme: AQD - Environmental objective combinations
related pollutant: Ozone (air)
has protection target: Health
has objective type: Information Threshold (INT)
has reporting metric: Hours in exceedance in a calendar year
exceedance threshold: 0
aggregation process: 1 year hour exceed 180
assessment threshold: Not Applicable
exceedance metric: Number of short term exceedances - for number of daily or hourly exceedances
exceedance threshold extra: 0

Pollutant 7, Objective type ALT, Metric hrsAbove, Target H
type: Concept
notation: 96
status: valid
status modified: 2022-07-19
accepted date: 2022-07-19
in scheme: AQD - Environmental objective combinations
related pollutant: Ozone (air)
has protection target: Health
has objective type: Alert threshold (ALT)
has reporting metric: Hours in exceedance in a calendar year
exceedance threshold: 0
aggregation process: 1 year hour exceed 240
assessment threshold: Not Applicable
exceedance metric: Number of short term exceedances - for number of daily or hourly exceedances
exceedance threshold extra: 0

Pollutant 1045, Objective type MO, Metric NA, Target NA
type: Concept
notation: 97
definition: Duplicated to allow MO NA NA
status: valid
status modified: 2022-07-19
accepted date: 2022-07-19
in scheme: AQD - Environmental objective combinations
related pollutant: Ammonium in PM2.5 (aerosol)
has protection target: Not applicable
has objective type: Monitoring objective (MO)
has reporting metric: Not applicable
assessment threshold: Not Applicable

Pollutant 1046, Objective type MO, Metric NA, Target NA
type: Concept
notation: 98
definition: Duplicated to allow MO NA NA
status: valid
status modified: 2022-07-19
accepted date: 2022-07-19
in scheme: AQD - Environmental objective combinations
related pollutant: Nitrate in PM2.5 (aerosol)
has protection target: Not applicable
has objective type: Monitoring objective (MO)
has reporting metric: Not applicable
assessment threshold: Not Applicable

Pollutant 1047, Objective type MO, Metric NA, Target NA
type: Concept
notation: 99
definition: Duplicated to allow MO NA NA
status: valid
status modified: 2022-07-19
accepted date: 2022-07-19
in scheme: AQD - Environmental objective combinations
related pollutant: sulphate in PM2.5 (aerosol)
has protection target: Not applicable
has objective type: Monitoring objective (MO)
has reporting metric: Not applicable
assessment threshold: Not Applicable

Pollutant 450, Objective type MO, Metric NA, Target NA
type: Concept
notation: 164
definition: To allow MO NA NA
status: valid
status modified: 2025-09-09
accepted date: 2025-09-09
in scheme: AQD - Environmental objective combinations
related pollutant: i-Pentane (2-methylbutane) (air)
has protection target: Not applicable
has objective type: Monitoring objective (MO)
has reporting metric: Not applicable
assessment threshold: Not Applicable

Pollutant 6013, Objective type MO, Metric NA, Target NA
type: Concept
notation: 165
status: valid
status modified: 2025-09-09
accepted date: 2025-09-09
in scheme: AQD - Environmental objective combinations
related pollutant: 1,3,5-Trimethylbenzene (air)
has protection target: Not applicable
has objective type: Monitoring objective (MO)
has reporting metric: Not applicable

AQD - EquivalenceDemonstrated
type: ConceptScheme
notation: equivalencedemonstrated
is part of: Air Quality Directive e-Reporting
registration status: Public draft
user modified: targajau
date modified: 2013-05-13 10:30:18.0
vocabulary type: Common
is numeric concept identifiers: false
is notations equal identifiers: false

Equivalence testing in progress
type: Concept
notation: inprogress
definition: Non-reference measurement method(s) used for which equivalence testing is in progress (as set out in the Directives 2008/50/EC and 2004/107/EC)
status: valid
status modified: 2013-03-22
accepted date: 2013-03-22
in scheme: AQD - EquivalenceDemonstrated

Equivalence not demonstrated
type: Concept
notation: no
definition: Non-reference measurement method(s) used which equivalence has NOT been demonstrated as set out in the Directives 2008/50/EC and 2004/107/EC
status: valid
status modified: 2013-03-22
accepted date: 2013-03-22
in scheme: AQD - EquivalenceDemonstrated

Demonstration not possible, no reference method defined by Directive
type: Concept
notation: noRef
definition: There is no reference method defined by Directive 2008/50/EC or 2004/107/EC. Hence, demonstration is not possible.
status: valid
status modified: 2013-03-22
accepted date: 2013-03-22
in scheme: AQD - EquivalenceDemonstrated

Reference method used, demonstration not necessary.
type: Concept
notation: ref
definition: Measurement method used is a reference methods as defined by Directive 2008/50/EC or 2004/107/EC.
status: valid
status modified: 2013-03-22
accepted date: 2013-03-22
in scheme: AQD - EquivalenceDemonstrated

Equivalence demonstrated
type: Concept
notation: yes
definition: Non-reference measurement method(s) used for which equivalence has been demonstrated as set out in the Directives 2008/50/EC and 2004/107/EC
status: valid
status modified: 2013-03-22
accepted date: 2013-03-22
in scheme: AQD - EquivalenceDemonstrated

AQ - Exceedance metric in attainment
type: ConceptScheme
notation: exceedancemetric
is part of: Air Quality Directive e-Reporting
registration status: Released
user modified: targajau
date modified: 2022-07-15 08:34:25.0
vocabulary type: Common
is numeric concept identifiers: false
is notations equal identifiers: true

Number of short term exceedances - for number of daily or hourly exceedances
type: Concept
notation: numberExceedances
definition: The number of short term exceedances element allows for the description of the highest number of exceedances of short term reporting metrics observed or predicted in the zone for the pollutant and environmental objective specified. Irrespective of whether levels are above the environmental objective, insert the value of the number of exceedance in the units appropriate to the environmental objective and reporting metric.The number of exceedances element is applicable to environmental objectives based on the number of daily or hourly exceedances.
status: valid
status modified: 2022-07-14
accepted date: 2022-07-14
in scheme: AQ - Exceedance metric in attainment

numericalExceedance - for average, percentile or AOT reporting metrics
type: Concept
notation: numericalExceedance
definition: AQD numerical exceedance allows for the description of the highest concentration value observed or predicted in the zone for the pollutant and environmental objective specified. Irrespective of whether levels are above the environmental objective, insert the numerical concentration value in units as appropriate to the environmental objective and reporting metric. The AQD numerical exceedance class is applicable to environmental objectives using average, percentileor AOT reporting metrics. For other short term reporting metrics use <aqd:numberExceedance>.The rounding rules stipulated by the Commissions guidance apply.
status: valid
status modified: 2022-07-14
accepted date: 2022-07-14
in scheme: AQ - Exceedance metric in attainment

percentileExceedance - FOR reporting exceedance when using RANDOM only!
type: Concept
notation: percentileExceedance
definition: percentileExceedance - FOR reporting exceedance when using RANDOM only!
status: valid
status modified: 2022-07-15
accepted date: 2022-07-15
in scheme: AQ - Exceedance metric in attainment

AQD - Exceedance Reason
type: ConceptScheme
notation: exceedancereason
is part of: Air Quality Directive e-Reporting
registration status: Public draft
user modified: targajau
date modified: 2017-03-02 11:04:03.0
vocabulary type: Common
is numeric concept identifiers: false
is notations equal identifiers: false

Heavily trafficked urban centre
type: Concept
notation: S1
definition: Heavily trafficked urban centre
status: valid
status modified: 2013-03-22
accepted date: 2013-03-22
in scheme: AQD - Exceedance Reason

Transport of air pollution originating from sources outside the Member State
type: Concept
notation: S10
definition: Transport of air pollution originating from sources outside the Member State
status: valid
status modified: 2013-03-22
accepted date: 2013-03-22
in scheme: AQD - Exceedance Reason

Local petrol station
type: Concept
notation: S11
definition: Local petrol station
status: valid
status modified: 2013-03-22
accepted date: 2013-03-22
in scheme: AQD - Exceedance Reason

Parking facility
type: Concept
notation: S12
definition: Parking facility
status: valid
status modified: 2013-03-22
accepted date: 2013-03-22
in scheme: AQD - Exceedance Reason

Benzene storage
type: Concept
notation: S13
definition: Benzene storage
status: valid
status modified: 2013-03-22
accepted date: 2013-03-22
in scheme: AQD - Exceedance Reason

Favourable meteorological conditions for ozone formation
type: Concept
notation: S16
definition: Favourable meteorological conditions for ozone formation
status: valid
status modified: 2016-01-11
in scheme: AQD - Exceedance Reason

Emissions due to public works and construction in the vicinity
type: Concept
notation: S17
definition: Emissions due to public works and construction in the vicinity
status: valid
status modified: 2016-01-11
in scheme: AQD - Exceedance Reason

Proximity to a major road
type: Concept
notation: S2
definition: Proximity to a major road
status: valid
status modified: 2013-03-22
accepted date: 2013-03-22
in scheme: AQD - Exceedance Reason

Local industry including power production
type: Concept
notation: S3
definition: Local industry including power production
status: valid
status modified: 2013-03-22
accepted date: 2013-03-22
in scheme: AQD - Exceedance Reason

Quarrying or mining activities
type: Concept
notation: S4
definition: Quarrying or mining activities
status: valid
status modified: 2013-03-22
accepted date: 2013-03-22
in scheme: AQD - Exceedance Reason

Domestic heating
type: Concept
notation: S5
definition: Domestic heating
status: valid
status modified: 2013-03-22
accepted date: 2013-03-22
in scheme: AQD - Exceedance Reason

Accidental emission from industrial source
type: Concept
notation: S6
definition: Accidental emission from industrial source
status: valid
status modified: 2013-03-22
accepted date: 2013-03-22
in scheme: AQD - Exceedance Reason

Accidental emission from non-industrial source
type: Concept
notation: S7
definition: Accidental emission from non-industrial source
status: valid
status modified: 2013-03-22
accepted date: 2013-03-22
in scheme: AQD - Exceedance Reason

Natural source(s) or natural event(s)
type: Concept
notation: S8
definition: Natural source(s) or natural event(s)
status: valid
status modified: 2013-03-22
accepted date: 2013-03-22
in scheme: AQD - Exceedance Reason

Winter sanding of roads
type: Concept
notation: S9
definition: Winter sanding of roads
status: valid
status modified: 2013-03-22
accepted date: 2013-03-22
in scheme: AQD - Exceedance Reason

Other, please specify
type: Concept
notation: other
definition: Other, please specify
status: valid
status modified: 2013-03-22
accepted date: 2013-03-22
in scheme: AQD - Exceedance Reason

Use of studded tyres
type: Concept
notation: S18
definition: Use of studded tyres during winter months. The road dust that studded tyres creates through wear of road surfaces collects on roads and can be resuspended in ambient air during dry conditions leading to elevated concentrations of coarse particulate matter.
status: valid
status modified: 2017-03-02
in scheme: AQD - Exceedance Reason

Exposure Reduction Target
type: ConceptScheme
notation: exposurereductiontarget
is part of: Air Quality Directive e-Reporting
registration status: Public draft
user modified: targajau
date modified: 2023-02-28 12:06:22.0
vocabulary type: Common
is numeric concept identifiers: true
is notations equal identifiers: true

PM2.5 NERT in force in 2020 for AT
type: Concept
notation: 1
definition: Infomation compiled to check exposure reduction for PM2.5 NERT in force in 2020 for AT
status: valid
status modified: 2022-07-19
accepted date: 2022-07-19
in scheme: Exposure Reduction Target
editorial note: No comment
in country: AT
related pollutant: Particulate matter < 2.5 µm (aerosol)
has objective type: Exposure reduction target (ERT)
has reporting metric: Average Exposure Indicator
exceedance threshold: 15.1
exceedance threshold extra: 15.1
baseline value: 17.8
baseline year min: 2009
baseline year max: 2011
reduction target: 15

PM2.5 NERT in force in 2020 for FR
type: Concept
notation: 10
definition: Infomation compiled to check exposure reduction for PM2.5 NERT in force in 2020 for FR
status: valid
status modified: 2022-07-19
accepted date: 2022-07-19
in scheme: Exposure Reduction Target
editorial note: No comment
in country: FR
related pollutant: Particulate matter < 2.5 µm (aerosol)
has objective type: Exposure reduction target (ERT)
has reporting metric: Average Exposure Indicator
exceedance threshold: 14.7
exceedance threshold extra: 14.7
baseline value: 17.3
baseline year min: 2009
baseline year max: 2011
reduction target: 15

PM2.5 NERT in force in 2020 for DE
type: Concept
notation: 11
definition: Infomation compiled to check exposure reduction for PM2.5 NERT in force in 2020 for DE
status: valid
status modified: 2022-07-19
accepted date: 2022-07-19
in scheme: Exposure Reduction Target
editorial note: No comment
in country: DE
related pollutant: Particulate matter < 2.5 µm (aerosol)
has objective type: Exposure reduction target (ERT)
has reporting metric: Average Exposure Indicator
exceedance threshold: 13.6
exceedance threshold extra: 13.6
baseline value: 16
baseline year min: 2008
baseline year max: 2010
reduction target: 15

PM2.5 NERT in force in 2020 for GR
type: Concept
notation: 12
definition: Infomation compiled to check exposure reduction for PM2.5 NERT in force in 2020 for GR
status: valid
status modified: 2022-07-19
accepted date: 2022-07-19
in scheme: Exposure Reduction Target
editorial note: No comment
in country: GR
related pollutant: Particulate matter < 2.5 µm (aerosol)
has objective type: Exposure reduction target (ERT)
has reporting metric: Average Exposure Indicator
exceedance threshold: 14.5
exceedance threshold extra: 14.5
baseline value: 17
baseline year min: 2008
baseline year max: 2010
reduction target: 15

PM2.5 NERT in force in 2020 for HU
type: Concept
notation: 13
definition: Infomation compiled to check exposure reduction for PM2.5 NERT in force in 2020 for HU
status: valid
status modified: 2022-07-19
accepted date: 2022-07-19
in scheme: Exposure Reduction Target
editorial note: No comment
in country: HU
related pollutant: Particulate matter < 2.5 µm (aerosol)
has objective type: Exposure reduction target (ERT)
has reporting metric: Average Exposure Indicator
exceedance threshold: 16.8
exceedance threshold extra: 16.8
baseline value: 21
baseline year min: 2009
baseline year max: 2010
reduction target: 20

PM2.5 NERT in force in 2020 for IE
type: Concept
notation: 14
definition: Infomation compiled to check exposure reduction for PM2.5 NERT in force in 2020 for IE
status: valid
status modified: 2022-07-19
accepted date: 2022-07-19
in scheme: Exposure Reduction Target
editorial note: No comment
in country: IE
related pollutant: Particulate matter < 2.5 µm (aerosol)
has objective type: Exposure reduction target (ERT)
has reporting metric: Average Exposure Indicator
exceedance threshold: 9.2
exceedance threshold extra: 9.2
baseline value: 10.2
baseline year min: 2009
baseline year max: 2011
reduction target: 10

PM2.5 NERT in force in 2020 for IT
type: Concept
notation: 15
definition: Infomation compiled to check exposure reduction for PM2.5 NERT in force in 2020 for IT
status: valid
status modified: 2022-07-19
accepted date: 2022-07-19
in scheme: Exposure Reduction Target
editorial note: No comment
in country: IT
related pollutant: Particulate matter < 2.5 µm (aerosol)
has objective type: Exposure reduction target (ERT)
has reporting metric: Average Exposure Indicator
exceedance threshold: 15.9
exceedance threshold extra: 15.9
baseline value: 19.9
baseline year min: 2009
baseline year max: 2011
reduction target: 20

PM2.5 NERT in force in 2020 for LV
type: Concept
notation: 16
definition: Infomation compiled to check exposure reduction for PM2.5 NERT in force in 2020 for LV
status: valid
status modified: 2022-07-19
accepted date: 2022-07-19
in scheme: Exposure Reduction Target
editorial note: No comment
in country: LV
related pollutant: Particulate matter < 2.5 µm (aerosol)
has objective type: Exposure reduction target (ERT)
has reporting metric: Average Exposure Indicator
exceedance threshold: 14.4
exceedance threshold extra: 14.4
baseline value: 18
baseline year min: 2008
baseline year max: 2010
reduction target: 20

PM2.5 NERT in force in 2020 for LT
type: Concept
notation: 17
definition: Infomation compiled to check exposure reduction for PM2.5 NERT in force in 2020 for LT
status: valid
status modified: 2022-07-19
accepted date: 2022-07-19
in scheme: Exposure Reduction Target
editorial note: No comment
in country: LT
related pollutant: Particulate matter < 2.5 µm (aerosol)
has objective type: Exposure reduction target (ERT)
has reporting metric: Average Exposure Indicator
exceedance threshold: 11.1
exceedance threshold extra: 11.1
baseline value: 12.3
baseline year min: 2009
baseline year max: 2011
reduction target: 10

PM2.5 NERT in force in 2020 for LU
type: Concept
notation: 18
definition: Infomation compiled to check exposure reduction for PM2.5 NERT in force in 2020 for LU
status: valid
status modified: 2022-07-19
accepted date: 2022-07-19
in scheme: Exposure Reduction Target
editorial note: No comment
in country: LU
related pollutant: Particulate matter < 2.5 µm (aerosol)
has objective type: Exposure reduction target (ERT)
has reporting metric: Average Exposure Indicator
exceedance threshold: 14.8
exceedance threshold extra: 14.8
baseline value: 17.4
baseline year min: 2009
baseline year max: 2010
reduction target: 15

PM2.5 NERT in force in 2020 for MT
type: Concept
notation: 19
definition: Infomation compiled to check exposure reduction for PM2.5 NERT in force in 2020 for MT
status: valid
status modified: 2022-07-19
accepted date: 2022-07-19
in scheme: Exposure Reduction Target
editorial note: No comment
in country: MT
related pollutant: Particulate matter < 2.5 µm (aerosol)
has objective type: Exposure reduction target (ERT)
has reporting metric: Average Exposure Indicator
exceedance threshold: 11.2
exceedance threshold extra: 11.2
baseline value: 13.2
baseline year min: 2009
baseline year max: 2011
reduction target: 15

PM2.5 NERT in force in 2020 for BE
type: Concept
notation: 2
definition: Infomation compiled to check exposure reduction for PM2.5 NERT in force in 2020 for BE
status: valid
status modified: 2022-07-19
accepted date: 2022-07-19
in scheme: Exposure Reduction Target
editorial note: No comment
in country: BE
related pollutant: Particulate matter < 2.5 µm (aerosol)
has objective type: Exposure reduction target (ERT)
has reporting metric: Average Exposure Indicator
exceedance threshold: 15.2
exceedance threshold extra: 15.2
baseline value: 19
baseline year min: 2009
baseline year max: 2011
reduction target: 20

PM2.5 NERT in force in 2020 for NL
type: Concept
notation: 20
definition: Infomation compiled to check exposure reduction for PM2.5 NERT in force in 2020 for NL
status: valid
status modified: 2022-07-19
accepted date: 2022-07-19
in scheme: Exposure Reduction Target
editorial note: No comment
in country: NL
related pollutant: Particulate matter < 2.5 µm (aerosol)
has objective type: Exposure reduction target (ERT)
has reporting metric: Average Exposure Indicator
exceedance threshold: 14.5
exceedance threshold extra: 14.5
baseline value: 17
baseline year min: 2009
baseline year max: 2011
reduction target: 15

PM2.5 NERT in force in 2020 for PL
type: Concept
notation: 21
definition: Infomation compiled to check exposure reduction for PM2.5 NERT in force in 2020 for PL
status: valid
status modified: 2022-07-19
accepted date: 2022-07-19
in scheme: Exposure Reduction Target
editorial note: Reduction Target above 22 - Achieve 18 ugm-3
editorial note: Reduction % calculated as a reduction of 9.8 ugm-3 (calculated as 27.8-18).
in country: PL
related pollutant: Particulate matter < 2.5 µm (aerosol)
has objective type: Exposure reduction target (ERT)
has reporting metric: Average Exposure Indicator
exceedance threshold: 18
exceedance threshold extra: 18
baseline value: 27.8
baseline year min: 2009
baseline year max: 2011
reduction target: 35.25

PM2.5 NERT in force in 2020 for PT
type: Concept
notation: 22
definition: Infomation compiled to check exposure reduction for PM2.5 NERT in force in 2020 for PT
status: valid
status modified: 2022-07-19
accepted date: 2022-07-19
in scheme: Exposure Reduction Target
editorial note: No comment
in country: PT
related pollutant: Particulate matter < 2.5 µm (aerosol)
has objective type: Exposure reduction target (ERT)
has reporting metric: Average Exposure Indicator
exceedance threshold: 8.7
exceedance threshold extra: 8.7
baseline value: 9.7
baseline year min: 2008
baseline year max: 2010
reduction target: 10

PM2.5 NERT in force in 2020 for RO
type: Concept
notation: 23
definition: Infomation compiled to check exposure reduction for PM2.5 NERT in force in 2020 for RO
status: valid
status modified: 2022-07-19
accepted date: 2022-07-19
in scheme: Exposure Reduction Target
editorial note: No comment
in country: RO
related pollutant: Particulate matter < 2.5 µm (aerosol)
has objective type: Exposure reduction target (ERT)
has reporting metric: Average Exposure Indicator
exceedance threshold: 14.7
exceedance threshold extra: 14.7
baseline value: 18.4
baseline year min: 2009
baseline year max: 2011
reduction target: 20

PM2.5 NERT in force in 2020 for SK
type: Concept
notation: 24
definition: Infomation compiled to check exposure reduction for PM2.5 NERT in force in 2020 for SK
status: valid
status modified: 2022-07-19
accepted date: 2022-07-19
in scheme: Exposure Reduction Target
editorial note: Reduction % calculated as a reduction of 6.4 ugm-3 (calculated as 24.4-18).
editorial note: Reduction Target above 22 - Achieve 18 ugm-3
in country: SK
related pollutant: Particulate matter < 2.5 µm (aerosol)
has objective type: Exposure reduction target (ERT)
has reporting metric: Average Exposure Indicator
exceedance threshold: 18
exceedance threshold extra: 18
baseline value: 24.4
baseline year min: 2009
baseline year max: 2011
reduction target: 26.2

PM2.5 NERT in force in 2020 for SI
type: Concept
notation: 25
definition: Infomation compiled to check exposure reduction for PM2.5 NERT in force in 2020 for SI
status: valid
status modified: 2022-07-19
accepted date: 2022-07-19
in scheme: Exposure Reduction Target
editorial note: No comment
in country: SI
related pollutant: Particulate matter < 2.5 µm (aerosol)
has objective type: Exposure reduction target (ERT)
has reporting metric: Average Exposure Indicator
exceedance threshold: 17.4
exceedance threshold extra: 17.4
baseline value: 21.7
baseline year min: 2009
baseline year max: 2011
reduction target: 20

PM2.5 NERT in force in 2020 for ES
type: Concept
notation: 26
definition: Infomation compiled to check exposure reduction for PM2.5 NERT in force in 2020 for ES
status: valid
status modified: 2022-07-19
accepted date: 2022-07-19
in scheme: Exposure Reduction Target
editorial note: No comment
in country: ES
related pollutant: Particulate matter < 2.5 µm (aerosol)
has objective type: Exposure reduction target (ERT)
has reporting metric: Average Exposure Indicator
exceedance threshold: 12
exceedance threshold extra: 12
baseline value: 14.1
baseline year min: 2009
baseline year max: 2011
reduction target: 15

PM2.5 NERT in force in 2020 for SE
type: Concept
notation: 27
definition: Infomation compiled to check exposure reduction for PM2.5 NERT in force in 2020 for SE
status: valid
status modified: 2022-07-19
accepted date: 2022-07-19
in scheme: Exposure Reduction Target
editorial note: No comment
in country: SE
related pollutant: Particulate matter < 2.5 µm (aerosol)
has objective type: Exposure reduction target (ERT)
has reporting metric: Average Exposure Indicator
exceedance threshold: 8.5
exceedance threshold extra: 8.5
baseline value: 6.6
baseline year min: 2009
baseline year max: 2011
reduction target: 0

PM2.5 NERT in force in 2020 for NO
type: Concept
notation: 28
definition: Information compiled to check exposure reduction for PM2.5 NERT in force in 2020 for NO
status: valid
status modified: 2022-10-24
accepted date: 2022-10-24
in scheme: Exposure Reduction Target
editorial note: Added by consulting https://cdr.eionet.europa.eu/no/eu/colp0r8w/colquwo3a/envuydlpq
in country: NO
related pollutant: Particulate matter < 2.5 µm (aerosol)
has objective type: Exposure reduction target (ERT)
has reporting metric: Average Exposure Indicator
exceedance threshold: 9
exceedance threshold extra: 9
baseline value: 10
baseline year min: 2009
baseline year max: 2011
reduction target: 10

PM2.5 NERT in force in 2020 for IS
type: Concept
notation: 29
definition: Infomation compiled to check exposure reduction for PM2.5 NERT in force in 2020 for IS
status: valid
status modified: 2022-11-10
accepted date: 2022-11-10
in scheme: Exposure Reduction Target
editorial note: Information provided by IS reporters after consultation
in country: IS
related pollutant: Particulate matter < 2.5 µm (aerosol)
has objective type: Exposure reduction target (ERT)
has reporting metric: Average Exposure Indicator
exceedance threshold: 9.7
exceedance threshold extra: 9.7
baseline value: 10.8
baseline year min: 2008
baseline year max: 2010
reduction target: 10

PM2.5 NERT in force in 2020 for BG
type: Concept
notation: 3
definition: Information compiled to check exposure reduction for PM2.5 NERT in force in 2020 for BG
status: valid
status modified: 2022-07-19
accepted date: 2022-07-19
in scheme: Exposure Reduction Target
editorial note: Reduction Target above 22 - Achieve 18 ugm-3
editorial note: Reduction % calculated as a reduction of 18 ugm-3 (calculated as 36-18).
in country: BG
related pollutant: Particulate matter < 2.5 µm (aerosol)
has objective type: Exposure reduction target (ERT)
has reporting metric: Average Exposure Indicator
exceedance threshold: 18
exceedance threshold extra: 18
baseline value: 36
baseline year min: 2008
baseline year max: 2010
reduction target: 50

PM2.5 NERT in force in 2020 for HR
type: Concept
notation: 4
definition: Infomation compiled to check exposure reduction for PM2.5 NERT in force in 2020 for HR
status: valid
status modified: 2022-07-19
accepted date: 2022-07-19
in scheme: Exposure Reduction Target
editorial note: No comment
in country: HR
related pollutant: Particulate matter < 2.5 µm (aerosol)
has objective type: Exposure reduction target (ERT)
has reporting metric: Average Exposure Indicator
exceedance threshold: 16.5
exceedance threshold extra: 16.5
baseline value: 20.6
baseline year min: 2013
baseline year max: 2015
reduction target: 20

PM2.5 NERT in force in 2020 for CY
type: Concept
notation: 5
definition: Infomation compiled to check exposure reduction for PM2.5 NERT in force in 2020 for CY
status: valid
status modified: 2022-07-19
accepted date: 2022-07-19
in scheme: Exposure Reduction Target
editorial note: No comment
in country: CY
related pollutant: Particulate matter < 2.5 µm (aerosol)
has objective type: Exposure reduction target (ERT)
has reporting metric: Average Exposure Indicator
exceedance threshold: 17.2
exceedance threshold extra: 17.2
baseline value: 21.5
baseline year min: 2009
baseline year max: 2011
reduction target: 20

PM2.5 NERT in force in 2020 for CZ
type: Concept
notation: 6
definition: Infomation compiled to check exposure reduction for PM2.5 NERT in force in 2020 for CZ
status: valid
status modified: 2022-07-19
accepted date: 2022-07-19
in scheme: Exposure Reduction Target
editorial note: Information double checked with reported 2011: https://cdr.eionet.europa.eu/cz/eu/annualair/envuyaeyq/11CZ-Questionnaire2011v2.zip/manage_document
editorial note: Reduction Target above 22 - Achieve 18 ugm-3
editorial note: Reduction Target (percentage) updated to 32.3 following feedback from Alberto González Ortiz
in country: CZ
related pollutant: Particulate matter < 2.5 µm (aerosol)
has objective type: Exposure reduction target (ERT)
has reporting metric: Average Exposure Indicator
exceedance threshold: 18
exceedance threshold extra: 18
baseline value: 26.6
baseline year min: 2009
baseline year max: 2011
reduction target: 32.3

PM2.5 NERT in force in 2020 for DK
type: Concept
notation: 7
definition: Infomation compiled to check exposure reduction for PM2.5 NERT in force in 2020 for DK
status: valid
status modified: 2022-07-19
accepted date: 2022-07-19
in scheme: Exposure Reduction Target
editorial note: No comment
in country: DK
related pollutant: Particulate matter < 2.5 µm (aerosol)
has objective type: Exposure reduction target (ERT)
has reporting metric: Average Exposure Indicator
exceedance threshold: 11.9
exceedance threshold extra: 11.9
baseline value: 14
baseline year min: 2008
baseline year max: 2010
reduction target: 15

PM2.5 NERT in force in 2020 for EE
type: Concept
notation: 8
definition: Infomation compiled to check exposure reduction for PM2.5 NERT in force in 2020 for EE
status: valid
status modified: 2022-07-19
accepted date: 2022-07-19
in scheme: Exposure Reduction Target
editorial note: No comment
in country: EE
related pollutant: Particulate matter < 2.5 µm (aerosol)
has objective type: Exposure reduction target (ERT)
has reporting metric: Average Exposure Indicator
exceedance threshold: 8.5
exceedance threshold extra: 8.5
baseline value: 5.9
baseline year min: 2009
baseline year max: 2011
reduction target: 0

PM2.5 NERT in force in 2020 for FI
type: Concept
notation: 9
definition: Infomation compiled to check exposure reduction for PM2.5 NERT in force in 2020 for FI
status: valid
status modified: 2022-07-19
accepted date: 2022-07-19
in scheme: Exposure Reduction Target
editorial note: No comment
in country: FI
related pollutant: Particulate matter < 2.5 µm (aerosol)
has objective type: Exposure reduction target (ERT)
has reporting metric: Average Exposure Indicator
exceedance threshold: 8.5
exceedance threshold extra: 8.5
baseline value: 8.3
baseline year min: 2009
baseline year max: 2011
reduction target: 0

AQD - AQ Plans - Measure Classification
type: ConceptScheme
notation: measureclassification
is part of: Air Quality Directive e-Reporting
registration status: Public draft
user modified: targajau
date modified: 2016-01-11 15:17:12.0
vocabulary type: Common
is numeric concept identifiers: false
is notations equal identifiers: false

Other (Low Emission Fuels)
type: Concept
notation: LEF-other
definition: Low emission fuels for small, medium and large scale stationary sources and in mobile sources
status: valid
status modified: 2013-03-22
accepted date: 2013-03-22
in scheme: AQD - AQ Plans - Measure Classification

Regulations for fuel quality
type: Concept
notation: LEF-regulations
definition: Low emission fuels for small, medium and large scale stationary sources and in mobile sources
status: valid
status modified: 2013-03-22
accepted date: 2013-03-22
in scheme: AQD - AQ Plans - Measure Classification

Shift to installations using low emission fuels
type: Concept
notation: LEF-shift
definition: Low emission fuels for small, medium and large scale stationary sources and in mobile sources
status: valid
status modified: 2013-03-22
accepted date: 2013-03-22
in scheme: AQD - AQ Plans - Measure Classification

Emission control equipment
type: Concept
notation: emissioncontrol
definition: Emission control equipment for small and medium sized stationary combustion sources / replacement of combustion sources
status: valid
status modified: 2013-03-22
accepted date: 2013-03-22
in scheme: AQD - AQ Plans - Measure Classification

- IPPC permits beyond BAT
type: Concept
notation: measure-IPPC
definition: Measures to reduce pollution through permit systems and economic instruments
status: valid
status modified: 2013-03-22
accepted date: 2013-03-22
in scheme: AQD - AQ Plans - Measure Classification

- LCP permits and national plans going beyond BAT
type: Concept
notation: measure-LCP
definition: Measures to reduce pollution through permit systems and economic instruments
status: valid
status modified: 2013-03-22
accepted date: 2013-03-22
in scheme: AQD - AQ Plans - Measure Classification

Introduction/increase of environment charges
type: Concept
notation: measure-charges
definition: Measures to reduce pollution through permit systems and economic instruments
status: valid
status modified: 2013-03-22
accepted date: 2013-03-22
in scheme: AQD - AQ Plans - Measure Classification

Introduction/increase of environmental funding
type: Concept
notation: measure-funding
definition: Measures to reduce pollution through permit systems and economic instruments
status: valid
status modified: 2013-03-22
accepted date: 2013-03-22
in scheme: AQD - AQ Plans - Measure Classification

Other measures not specified in codelist
type: Concept
notation: measure-other
definition: Measures to reduce pollution through permit systems and economic instruments
status: valid
status modified: 2013-03-22
accepted date: 2013-03-22
in scheme: AQD - AQ Plans - Measure Classification

Tradable permit system
type: Concept
notation: measure-permit
definition: Measures to reduce pollution through permit systems and economic instruments
status: valid
status modified: 2013-03-22
accepted date: 2013-03-22
in scheme: AQD - AQ Plans - Measure Classification

Introduction/increase of environment taxes
type: Concept
notation: measure-taxes
definition: Measures to reduce pollution through permit systems and economic instruments
status: valid
status modified: 2013-03-22
accepted date: 2013-03-22
in scheme: AQD - AQ Plans - Measure Classification

Other
type: Concept
notation: other
definition: Other measure
status: valid
status modified: 2013-03-22
accepted date: 2013-03-22
in scheme: AQD - AQ Plans - Measure Classification

Cleaner vehicle transport services
type: Concept
notation: pproc-cleaner
definition: Public procurement
status: valid
status modified: 2013-03-22
accepted date: 2013-03-22
in scheme: AQD - AQ Plans - Measure Classification

Low emission stationary combustion sources
type: Concept
notation: pproc-low1
definition: Public procurement
status: valid
status modified: 2013-03-22
accepted date: 2013-03-22
in scheme: AQD - AQ Plans - Measure Classification

Low emission fuels for stationary and mobile sources
type: Concept
notation: pproc-low2
definition: Public procurement
status: valid
status modified: 2013-03-22
accepted date: 2013-03-22
in scheme: AQD - AQ Plans - Measure Classification

New vehicles, including low emission vehicles
type: Concept
notation: pproc-new
definition: Public procurement
status: valid
status modified: 2013-03-22
accepted date: 2013-03-22
in scheme: AQD - AQ Plans - Measure Classification

Other (Public procurement)
type: Concept
notation: pproc-other
definition: Public procurement
status: valid
status modified: 2013-03-22
accepted date: 2013-03-22
in scheme: AQD - AQ Plans - Measure Classification

INTERNET (Public information/Education)
type: Concept
notation: public-internet
status: valid
status modified: 2013-03-22
accepted date: 2013-03-22
in scheme: AQD - AQ Plans - Measure Classification

Leaflets (Public information/Education)
type: Concept
notation: public-leaflet
definition: Public information/Education via leaflets
status: valid
status modified: 2013-03-22
accepted date: 2013-03-22
in scheme: AQD - AQ Plans - Measure Classification

other (Public information/Education)
type: Concept
notation: public-other
definition: Public information/Education via other mechanisms
status: valid
status modified: 2013-03-22
accepted date: 2013-03-22
in scheme: AQD - AQ Plans - Measure Classification

RADIO (Public information/Education)
type: Concept
notation: public-radio
definition: Public information/Education via radio.
status: valid
status modified: 2013-03-22
accepted date: 2013-03-22
in scheme: AQD - AQ Plans - Measure Classification

Television (Public information/Education)
type: Concept
notation: public-tv
definition: Public information/Education via television
status: valid
status modified: 2013-03-22
accepted date: 2013-03-22
in scheme: AQD - AQ Plans - Measure Classification

Retrofitting emission control equipment
type: Concept
notation: retrofitting
definition: Retrofitting emission control equipment to vehicles
status: valid
status modified: 2013-03-22
accepted date: 2013-03-22
in scheme: AQD - AQ Plans - Measure Classification

Low emission zones (Traffic planning and management)
type: Concept
notation: traffic-LEZ
status: valid
status modified: 2013-03-22
accepted date: 2013-03-22
in scheme: AQD - AQ Plans - Measure Classification

Congestion pricing zones (Traffic planning and management)
type: Concept
notation: traffic-congestion
status: valid
status modified: 2013-03-22
accepted date: 2013-03-22
in scheme: AQD - AQ Plans - Measure Classification

Differentiation of parking fees (Traffic planning and management)
type: Concept
notation: traffic-difpark
status: valid
status modified: 2013-03-22
accepted date: 2013-03-22
in scheme: AQD - AQ Plans - Measure Classification

Freight transport
type: Concept
notation: traffic-freight
definition: Traffic planning and management
status: valid
status modified: 2013-03-22
accepted date: 2013-03-22
in scheme: AQD - AQ Plans - Measure Classification

Land use planning to ensure sustainable transport facilities
type: Concept
notation: traffic-landuse
definition: Traffic planning and management
status: valid
status modified: 2013-03-22
accepted date: 2013-03-22
in scheme: AQD - AQ Plans - Measure Classification

Management of parking places (Traffic planning and management)
type: Concept
notation: traffic-managepark
definition: Traffic planning and management
status: valid
status modified: 2013-03-22
accepted date: 2013-03-22
in scheme: AQD - AQ Plans - Measure Classification

Other (Traffic planning and management)
type: Concept
notation: traffic-other
definition: Traffic planning and management
status: valid
status modified: 2013-03-22
accepted date: 2013-03-22
in scheme: AQD - AQ Plans - Measure Classification

Effective improvement of public transport
type: Concept
notation: traffic-public
definition: Traffic planning and management
status: valid
status modified: 2013-03-22
accepted date: 2013-03-22
in scheme: AQD - AQ Plans - Measure Classification

Encouragement of shift of transport modes
type: Concept
notation: traffic-shift
definition: Traffic planning and management
status: valid
status modified: 2013-03-22
accepted date: 2013-03-22
in scheme: AQD - AQ Plans - Measure Classification

Slow modes (e.g. expansion of bicycle and pedestrian infrastructure)
type: Concept
notation: traffic-slow
definition: Traffic planning and management
status: valid
status modified: 2013-03-22
accepted date: 2013-03-22
in scheme: AQD - AQ Plans - Measure Classification

Effective reduction of speed limits and control
type: Concept
notation: traffic-speed
definition: Traffic planning and management
status: valid
status modified: 2013-03-22
accepted date: 2013-03-22
in scheme: AQD - AQ Plans - Measure Classification

AQD - AQ Plans - Measure implementation status
type: ConceptScheme
notation: measureimplementationstatus
is part of: Air Quality Directive e-Reporting
registration status: Public draft
user modified: targajau
date modified: 2013-05-13 10:32:53.0
vocabulary type: Common
is numeric concept identifiers: false
is notations equal identifiers: false

Annulation
type: Concept
notation: annulation
status: valid
status modified: 2013-03-22
accepted date: 2013-03-22
in scheme: AQD - AQ Plans - Measure implementation status

Evaluation
type: Concept
notation: evaluation
status: valid
status modified: 2013-03-22
accepted date: 2013-03-22
in scheme: AQD - AQ Plans - Measure implementation status

Implementation
type: Concept
notation: implementation
status: valid
status modified: 2013-03-22
accepted date: 2013-03-22
in scheme: AQD - AQ Plans - Measure implementation status

Other
type: Concept
notation: other
status: valid
status modified: 2013-03-22
accepted date: 2013-03-22
in scheme: AQD - AQ Plans - Measure implementation status

Planning
type: Concept
notation: planning
status: valid
status modified: 2013-03-22
accepted date: 2013-03-22
in scheme: AQD - AQ Plans - Measure implementation status

preparation
type: Concept
notation: preparation
status: valid
status modified: 2013-03-22
accepted date: 2013-03-22
in scheme: AQD - AQ Plans - Measure implementation status

AQD - Measurement Equipment**
type: ConceptScheme
notation: measurementequipment
is part of: Air Quality Directive e-Reporting
registration status: Released
user modified: targajau
date modified: 2025-09-25 14:55:15.0
vocabulary type: Common
is numeric concept identifiers: false
is notations equal identifiers: false

AE22 Aethalometer with PM2.5 cyclone
type: Concept
notation: AE22-PM2.5
status: valid
status modified: 2024-08-02
accepted date: 2024-08-02
in scheme: AQD - Measurement Equipment**
measures pollutant: black_carbon (aerosol)

AE31 Aethalometer
type: Concept
notation: AE31
status: valid
status modified: 2024-08-02
accepted date: 2024-08-02
in scheme: AQD - Measurement Equipment**
measures pollutant: black_carbon (aerosol)

AE33 Aethalometer
type: Concept
notation: AE33
status: valid
status modified: 2024-08-02
accepted date: 2024-08-02
in scheme: AQD - Measurement Equipment**
measures pollutant: black_carbon (aerosol)

AE33 Aethalometer with PM2.5 cyclone
type: Concept
notation: AE33-PM2.5
definition: AE33 Aethalometer with PM2.5 cyclone
status: valid
status modified: 2024-08-02
accepted date: 2024-08-02
in scheme: AQD - Measurement Equipment**
measures pollutant: black_carbon (aerosol)

AE36 Aethalometer
type: Concept
notation: AE36
definition: AE36 Aethalometer
status: valid
status modified: 2025-04-21
accepted date: 2025-04-21
in scheme: AQD - Measurement Equipment**
measures pollutant: black_carbon (aerosol)

Chromatotec AirTOXIC BTX PID - A73022
type: Concept
notation: AIRTOXICA73022
definition: Using gas chromatography: the model airTOXIC BTX PID measures the amount of Benzene Toluene Ethylbenzene and Xylenes in the air from sub-ppb levels up to 1.000 ppb.
status: valid
status modified: 2024-08-02
accepted date: 2024-08-02
in scheme: AQD - Measurement Equipment**
measures pollutant: m,p-Xylene (air)
measures pollutant: p-Xylene (air)
measures pollutant: Ethyl benzene (air)
measures pollutant: m-Xylene (air)
measures pollutant: Benzene (air)
measures pollutant: o-Xylene (air)
measures pollutant: Toluene (air)

AEROLaser 5001 CO Analyser
type: Concept
notation: AL5001
definition: AEROLaser 5001 CO Analyser
status: valid
status modified: 2024-08-23
accepted date: 2024-08-23
in scheme: AQD - Measurement Equipment**
measures pollutant: Carbon monoxide (air)

ANNOX
type: Concept
notation: ANNOX
status: valid
status modified: 2024-08-02
accepted date: 2024-08-02
in scheme: AQD - Measurement Equipment**

Teledyne API undertermined
type: Concept
notation: API
status: valid
status modified: 2024-08-02
accepted date: 2024-08-02
in scheme: AQD - Measurement Equipment**
measures pollutant: Sulphur dioxide (air)

Teledyne API 100 UV Fluorescent SO2 Analyser
type: Concept
notation: API100
status: valid
status modified: 2024-08-02
accepted date: 2024-08-02
in scheme: AQD - Measurement Equipment**
measures pollutant: Sulphur dioxide (air)

Teledyne API 100A UV Fluorescent SO2 Analyser
type: Concept
notation: API100A
status: valid
status modified: 2024-08-02
accepted date: 2024-08-02
in scheme: AQD - Measurement Equipment**
measures pollutant: Sulphur dioxide (air)

Teledyne API 100E UV Fluorescent SO2 Analyser
type: Concept
notation: API100E
status: valid
status modified: 2024-08-02
accepted date: 2024-08-02
in scheme: AQD - Measurement Equipment**
measures pollutant: Sulphur dioxide (air)

Teledyne API 101 UV Fluorescent SO2 Analyser
type: Concept
notation: API101
status: valid
status modified: 2024-08-02
accepted date: 2024-08-02
in scheme: AQD - Measurement Equipment**
measures pollutant: Sulphur dioxide (air)

Teledyne API 101A UV Fluorescent SO2/H2S Analyser
type: Concept
notation: API101A
status: valid
status modified: 2024-08-02
accepted date: 2024-08-02
in scheme: AQD - Measurement Equipment**
measures pollutant: Sulphur dioxide (air)
measures pollutant: Hydrogen sulphide (air)

Teledyne API 200 chemiluminescent NOx analyser
type: Concept
notation: API200
status: valid
status modified: 2024-08-02
accepted date: 2024-08-02
in scheme: AQD - Measurement Equipment**
measures pollutant: Nitrogen monoxide (air)
measures pollutant: Nitrogen dioxide (air)
measures pollutant: Nitrogen oxides (air)

Teledyne API 200A chemiluminescent NOx analyser
type: Concept
notation: API200A
status: valid
status modified: 2024-08-02
accepted date: 2024-08-02
in scheme: AQD - Measurement Equipment**
measures pollutant: Nitrogen dioxide (air)
measures pollutant: Nitrogen monoxide (air)
measures pollutant: Nitrogen oxides (air)

TELEDYNE API 200AU
type: Concept
notation: API200AU
definition: Teledyne API 200AU chemiluminescent NOx analyser
status: valid
status modified: 2024-08-02
accepted date: 2024-08-02
in scheme: AQD - Measurement Equipment**
measures pollutant: Nitrogen oxides (air)
measures pollutant: Nitrogen monoxide (air)
measures pollutant: Nitrogen dioxide (air)

Teledyne API 200E chemiluminescent NOx analyser
type: Concept
notation: API200E
status: valid
status modified: 2024-08-02
accepted date: 2024-08-02
in scheme: AQD - Measurement Equipment**
measures pollutant: Nitrogen dioxide (air)
measures pollutant: Nitrogen oxides (air)
measures pollutant: Nitrogen monoxide (air)

Teledyne API 200EU chemiluminescent NOx analyser
type: Concept
notation: API200EU
status: valid
status modified: 2024-08-02
accepted date: 2024-08-02
in scheme: AQD - Measurement Equipment**
measures pollutant: Nitrogen oxides (air)
measures pollutant: Nitrogen dioxide (air)
measures pollutant: Nitrogen monoxide (air)

Teledyne API 200EU chemiluminescent NOx analyser - blue light
type: Concept
notation: API200EU-BL
status: valid
status modified: 2024-08-02
accepted date: 2024-08-02
in scheme: AQD - Measurement Equipment**
measures pollutant: Nitrogen dioxide (air)
measures pollutant: Nitrogen monoxide (air)
measures pollutant: Nitrogen oxides (air)

Teledyne API 200UP chemiluminescent NOx analyser
type: Concept
notation: API200UP
status: valid
status modified: 2024-08-02
accepted date: 2024-08-02
in scheme: AQD - Measurement Equipment**
measures pollutant: Nitrogen monoxide (air)
measures pollutant: Nitrogen oxides (air)
measures pollutant: Nitrogen dioxide (air)

Teledyne API 200A chemiluminescent NOx analyser
type: Concept
notation: API201A
status: valid
status modified: 2024-08-02
accepted date: 2024-08-02
in scheme: AQD - Measurement Equipment**
measures pollutant: Nitrogen oxides (air)
measures pollutant: Nitrogen monoxide (air)
measures pollutant: Nitrogen dioxide (air)

Teledyne API 300 gas filter correlation CO analyser
type: Concept
notation: API300
status: valid
status modified: 2024-08-02
accepted date: 2024-08-02
in scheme: AQD - Measurement Equipment**
measures pollutant: Carbon monoxide (air)

Teledyne API 300A gas filter correlation CO analyser
type: Concept
notation: API300A
status: valid
status modified: 2024-08-02
accepted date: 2024-08-02
in scheme: AQD - Measurement Equipment**
measures pollutant: Carbon monoxide (air)

Teledyne API 300E gas filter correlation CO analyser
type: Concept
notation: API300E
status: valid
status modified: 2024-08-02
accepted date: 2024-08-02
in scheme: AQD - Measurement Equipment**
measures pollutant: Carbon monoxide (air)

Teledyne API 400 UV photometric O3 analyser
type: Concept
notation: API400
status: valid
status modified: 2024-08-02
accepted date: 2024-08-02
in scheme: AQD - Measurement Equipment**
measures pollutant: Ozone (air)

Teledyne API 400A UV photometric O3 analyser
type: Concept
notation: API400A
status: valid
status modified: 2024-08-02
accepted date: 2024-08-02
in scheme: AQD - Measurement Equipment**
measures pollutant: Ozone (air)

Teledyne API 400E UV photometric O3 analyser
type: Concept
notation: API400E
status: valid
status modified: 2024-08-02
accepted date: 2024-08-02
in scheme: AQD - Measurement Equipment**
measures pollutant: Ozone (air)

Teledyne API M100E UV Fluorescent SO2 Analyser
type: Concept
notation: APIM100E
status: valid
status modified: 2024-08-02
accepted date: 2024-08-02
in scheme: AQD - Measurement Equipment**
measures pollutant: Sulphur dioxide (air)

Teledyne API M200E chemiluminescent NOx analyser
type: Concept
notation: APIM200E
status: valid
status modified: 2024-08-02
accepted date: 2024-08-02
in scheme: AQD - Measurement Equipment**
measures pollutant: Nitrogen oxides (air)
measures pollutant: Nitrogen dioxide (air)
measures pollutant: Nitrogen monoxide (air)

Teledyne API M300E gas filter correlation CO analyser
type: Concept
notation: APIM300E
status: valid
status modified: 2024-08-02
accepted date: 2024-08-02
in scheme: AQD - Measurement Equipment**
measures pollutant: Carbon monoxide (air)

Teledyne API M400E UV photometric O3 analyser
type: Concept
notation: APIM400E
status: valid
status modified: 2024-08-02
accepted date: 2024-08-02
in scheme: AQD - Measurement Equipment**
measures pollutant: Ozone (air)

Teledyne API T100 UV Fluorescent SO2 Analyser
type: Concept
notation: APIT100
status: valid
status modified: 2024-08-02
accepted date: 2024-08-02
in scheme: AQD - Measurement Equipment**
measures pollutant: Sulphur dioxide (air)

Teledyne API T200 chemiluminescent NOx analyser
type: Concept
notation: APIT200
status: valid
status modified: 2024-08-02
accepted date: 2024-08-02
in scheme: AQD - Measurement Equipment**
measures pollutant: Nitrogen oxides (air)
measures pollutant: Nitrogen dioxide (air)
measures pollutant: Nitrogen monoxide (air)

Teledyne API T200U chemiluminescent NOx analyser
type: Concept
notation: APIT200U
definition: he Model T200U Trace-level NO/NO2/NOx analyzer has been developed specifically to address the challenges of low-level monitoring as required in the US NCore network. It uses the proven chemiluminescence principle and is designed to allow ultra-sensitive measurements with a lower detectable limit of 50 ppt while still meeting the requirements for use as a US EPA compliance analyzer.The Model T200U combines a gold plated reaction cell with an enhanced performance pump special low noise photomultiplier tube and unique signal conditioning to provide exceptional sensitivity. In addition a pre-reactor separates the NO-O3 reaction from background chemiluminescence to allow accurate auto-zero of the analyzer.All T Series instruments offer an advanced color display capacitive touch screen intuitive user interface flexible I/O and built-in data acquisition capability. All instrument set up control and access to stored data and diagnostic information is available through the front panel or via RS232 Ethernet or USB com ports either locally or by remote connection.The Model T200U comes with NumaView™ Software. NumaView™ Remote PC Software allows for a remote connection with virtual interface and data downloading capability to analyzers operating NumaView™ Software.e allows for a remote connection with virtual interface and data downloading capability to analyzers operating NumaView™ Software.
status: valid
status modified: 2024-08-02
accepted date: 2024-08-02
in scheme: AQD - Measurement Equipment**
measures pollutant: Nitrogen oxides (air)
measures pollutant: Nitrogen dioxide (air)
measures pollutant: Nitrogen monoxide (air)

Teledyne API T300 gas filter correlation CO analyser
type: Concept
notation: APIT300
status: valid
status modified: 2024-08-02
accepted date: 2024-08-02
in scheme: AQD - Measurement Equipment**
measures pollutant: Carbon monoxide (air)

Teledyne API T400 UV photometric O3 analyser
type: Concept
notation: APIT400
status: valid
status modified: 2024-08-02
accepted date: 2024-08-02
in scheme: AQD - Measurement Equipment**
measures pollutant: Ozone (air)

Teledyne API T500U CAPS NO2 Analyzer
type: Concept
notation: APIT500U
status: valid
status modified: 2024-08-23
accepted date: 2024-08-23
in scheme: AQD - Measurement Equipment**
measures pollutant: Nitrogen dioxide (air)
measures pollutant: Nitrogen oxides (air)
measures pollutant: Nitrogen monoxide (air)

AirmoBTX_GC866
type: Concept
notation: AirmoBTX_GC866
definition: The airmoVOC BTX is a gas chromatograph for the analysis and monitoring of trace amounts of benzene, toluene, ethylbenzene (m/p/o) xylene by FID detection.
status: valid
status modified: 2024-12-12
accepted date: 2024-12-12
in scheme: AQD - Measurement Equipment**
measures pollutant: Benzene (air)
measures pollutant: Toluene (air)
measures pollutant: Ethyl benzene (air)
measures pollutant: m,p-Xylene (air)
measures pollutant: o-Xylene (air)

MetOne BAM-1020
type: Concept
notation: BAM1020
status: valid
status modified: 2024-08-02
accepted date: 2024-08-02
in scheme: AQD - Measurement Equipment**
measures pollutant: Particulate matter < 2.5 µm (aerosol)
measures pollutant: Particulate matter < 10 µm (aerosol)

MetOne BAM-1020 heated
type: Concept
notation: BAM1020heated
status: valid
status modified: 2024-08-02
accepted date: 2024-08-02
in scheme: AQD - Measurement Equipment**
measures pollutant: Particulate matter < 10 µm (aerosol)
measures pollutant: Particulate matter < 2.5 µm (aerosol)

MetOne BAM-1020 unheated
type: Concept
notation: BAM1020unheated
status: valid
status modified: 2024-08-02
accepted date: 2024-08-02
in scheme: AQD - Measurement Equipment**
measures pollutant: Particulate matter < 10 µm (aerosol)
measures pollutant: Particulate matter < 2.5 µm (aerosol)

COMDE DERENDA APM-2
type: Concept
notation: COM_DER_APM2
definition: The method applied by the APM-2 uses the light scattered by tiny particles (nephelometry) to determine the PM10 or PM2.5 concentration in the ambient air directly and continuously.
status: valid
status modified: 2025-07-29
accepted date: 2025-07-29
in scheme: AQD - Measurement Equipment**
measures pollutant: Particulate matter < 2.5 µm (aerosol)
measures pollutant: Particulate matter < 10 µm (aerosol)

CO Monitor Europe
type: Concept
notation: COmonitorEurope
definition: CO Monitor Europe
status: valid
status modified: 2024-08-02
accepted date: 2024-08-02
in scheme: AQD - Measurement Equipment**

Chrompack BTX CP7001 Monitor
type: Concept
notation: CP7001-BTX
status: valid
status modified: 2024-08-02
accepted date: 2024-08-02
in scheme: AQD - Measurement Equipment**
related match: other BTX
measures pollutant: Benzene (air)

DELTA
type: Concept
notation: DELTA
status: valid
status modified: 2024-08-02
accepted date: 2024-08-02
in scheme: AQD - Measurement Equipment**

High Volume Aerosol Sampler DHA-80
type: Concept
notation: DHA80-Digitel
definition: DIGITEL High Volume Samplers DHA-80 are fully automatic systems to sample dust and aerosol particles for later assessment and analysis (gravimetric and analytical determination). The sampler operation range in standard execution is 100 to 1’500 litres per minute (6 to 90 m³/h).
status: valid
status modified: 2024-08-23
accepted date: 2024-08-23
in scheme: AQD - Measurement Equipment**
measures pollutant: Particulate matter < 2.5 µm (aerosol)
measures pollutant: Particulate matter < 10 µm (aerosol)

DKK-TOA_Gu-X-113E
type: Concept
notation: DKK-TOA_Gu-X-113E
definition: This instrument provides continuous and reliable measurement of Ozone in ambient air. Measurement is based on the UV photometric method as specified in ISO-13964
status: valid
status modified: 2024-08-02
accepted date: 2024-08-02
in scheme: AQD - Measurement Equipment**
measures pollutant: Ozone (air)

Low Volume Aerosol Sampler DPA-14
type: Concept
notation: DPA14-Digitel
definition: DIGITEL Low Volume Samplers DPA-14 are fully automatic systems to sample dust and aerosol particles for later assessment and analysis (gravimetric and analytical determination) in accordance with EN12341:2023
status: valid
status modified: 2024-08-23
accepted date: 2024-08-23
in scheme: AQD - Measurement Equipment**
measures pollutant: Particulate matter < 2.5 µm (aerosol)
measures pollutant: Particulate matter < 10 µm (aerosol)

Dasibi 1003-AH Air Water Ozone Concentration PPM Measurement Analyzer Monitor
type: Concept
notation: Dasibi1003AH
status: valid
status modified: 2024-08-23
accepted date: 2024-08-23
in scheme: AQD - Measurement Equipment**
measures pollutant: Ozone (air)

Dasibi 2110A
type: Concept
notation: Dasibi2110A
definition: For measuring NO NO2 and NOx
status: valid
status modified: 2024-08-02
accepted date: 2024-08-02
in scheme: AQD - Measurement Equipment**
measures pollutant: Nitrogen oxides (air)
measures pollutant: Nitrogen monoxide (air)
measures pollutant: Nitrogen dioxide (air)

ECOTECH EC9852
type: Concept
notation: EC9852
definition: The EC9852 Sulfur Compounds Analyzer combines microprocessor control with fluorescence detection and an external converter to measure H2S and SO2 or TS TRS and SO2 or H2S SO2 and H2S + SO2 in the range of 0-2 ppm with a detection limit of 0.5 ppb for SO2.
status: valid
status modified: 2024-08-02
accepted date: 2024-08-02
in scheme: AQD - Measurement Equipment**
measures pollutant: Sulphur dioxide (air)

Eco Physics CLD 700 AL
type: Concept
notation: Ecophysics-CLD700AL
status: valid
status modified: 2024-08-02
accepted date: 2024-08-02
in scheme: AQD - Measurement Equipment**
measures pollutant: Nitrogen oxides (air)
measures pollutant: Nitrogen dioxide (air)
measures pollutant: Nitrogen monoxide (air)

Eco Physics CLD 780 TR
type: Concept
notation: Ecophysics-CLD780TR
status: valid
status modified: 2024-08-02
accepted date: 2024-08-02
in scheme: AQD - Measurement Equipment**
measures pollutant: Nitrogen oxides (air)
measures pollutant: Nitrogen dioxide (air)
measures pollutant: Nitrogen monoxide (air)

Envea AC32e - NO/NO2/NOx Analyzer (replaces enviroAC32E)
type: Concept
notation: EnveaAC32e
status: valid
status modified: 2024-08-23
accepted date: 2024-08-23
in scheme: AQD - Measurement Equipment**
measures pollutant: Nitrogen dioxide (air)
measures pollutant: Nitrogen oxides (air)
measures pollutant: Nitrogen monoxide (air)

MP101M particulate analyzer (replaces enviroMP101M)
type: Concept
notation: EnveaMP101M
status: valid
status modified: 2024-08-23
accepted date: 2024-08-23
in scheme: AQD - Measurement Equipment**
measures pollutant: Particulate matter < 10 µm (aerosol)
measures pollutant: Particulate matter < 2.5 µm (aerosol)

Envea O342e - UV Photometric Ozone Analyzer (replaces enviroO342E)
type: Concept
notation: EnveaO342e
status: valid
status modified: 2024-08-23
accepted date: 2024-08-23
in scheme: AQD - Measurement Equipment**
measures pollutant: Ozone (air)

Environnement S.A. Model 1003-RS O3
type: Concept
notation: Enviro1003RS
definition: Environnement S.A. Model 1003-RS under DASIBI license
status: valid
status modified: 2024-08-02
accepted date: 2024-08-02
in scheme: AQD - Measurement Equipment**
measures pollutant: Ozone (air)

Environnement SF8
type: Concept
notation: Environnement_SF8
definition: Environnement SF8 for black smoke and acidity
status: valid
status modified: 2024-08-02
accepted date: 2024-08-02
in scheme: AQD - Measurement Equipment**

F-701-20 Verewa / Durag
type: Concept
notation: F-701-20
definition: Ambient Air Dust Concentration Monitor
status: valid
status modified: 2024-08-02
accepted date: 2024-08-02
in scheme: AQD - Measurement Equipment**
measures pollutant: Particulate matter < 1 µm (aerosol)
measures pollutant: Particulate matter < 10 µm (aerosol)
measures pollutant: Particulate matter < 2.5 µm (aerosol)

Palas model FIDAS 100
type: Concept
notation: FIDAS100
status: valid
status modified: 2024-12-13
accepted date: 2024-12-13
in scheme: AQD - Measurement Equipment**
measures pollutant: Particulate matter < 2.5 µm (aerosol)
measures pollutant: Particulate matter < 10 µm (aerosol)

Palas model FIDAS 100E
type: Concept
notation: FIDAS100E
status: valid
status modified: 2024-12-13
accepted date: 2024-12-13
in scheme: AQD - Measurement Equipment**
measures pollutant: Particulate matter < 2.5 µm (aerosol)
measures pollutant: Particulate matter < 10 µm (aerosol)

Palas model FIDAS 200
type: Concept
notation: FIDAS200
status: valid
status modified: 2024-08-02
accepted date: 2024-08-02
in scheme: AQD - Measurement Equipment**
measures pollutant: Particulate matter < 1 µm (aerosol)
measures pollutant: Particulate matter < 2.5 µm (aerosol)
measures pollutant: Particulate matter < 10 µm (aerosol)
measures pollutant: Total suspended particulates (aerosol)

Palas model FIDAS 200E
type: Concept
notation: FIDAS200E
status: valid
status modified: 2024-08-02
accepted date: 2024-08-02
in scheme: AQD - Measurement Equipment**
measures pollutant: Particulate matter < 2.5 µm (aerosol)
measures pollutant: Particulate matter < 10 µm (aerosol)
measures pollutant: Total suspended particulates (aerosol)
measures pollutant: Particulate matter < 1 µm (aerosol)

Palas model FIDAS 200S
type: Concept
notation: FIDAS200S
status: valid
status modified: 2024-08-02
accepted date: 2024-08-02
in scheme: AQD - Measurement Equipment**
measures pollutant: Particulate matter < 1 µm (aerosol)
measures pollutant: Total suspended particulates (aerosol)
measures pollutant: Particulate matter < 10 µm (aerosol)
measures pollutant: Particulate matter < 2.5 µm (aerosol)

AMA GC5000 BTX Type FID
type: Concept
notation: GC5000BTX-FID
status: valid
status modified: 2024-08-02
accepted date: 2024-08-02
in scheme: AQD - Measurement Equipment**
measures pollutant: Benzene (air)
measures pollutant: Toluene (air)

AMA GC5000 BTX Type PID
type: Concept
notation: GC5000BTX-PID
status: valid
status modified: 2024-08-02
accepted date: 2024-08-02
in scheme: AQD - Measurement Equipment**
related match: other BTX
measures pollutant: Benzene (air)

SINTECH SPECTRAS BTX GC 855 series undetermined
type: Concept
notation: GC855BTX
status: valid
status modified: 2024-08-02
accepted date: 2024-08-02
in scheme: AQD - Measurement Equipment**
example: http://www.synspec.nl/docs/manuals/manual-3-Manual%20operator%20Syntech%20Spectras%20GC955%20600-800.pdf
measures pollutant: Toluene (air)
measures pollutant: m,p-Xylene (air)
measures pollutant: o-Xylene (air)
measures pollutant: Benzene (air)
measures pollutant: Ethyl benzene (air)

SINTECH SPECTRAS BTX GC 855 serie 600
type: Concept
notation: GC855BTX-600
status: valid
status modified: 2024-08-02
accepted date: 2024-08-02
in scheme: AQD - Measurement Equipment**
related match: other BTX
measures pollutant: Benzene (air)

Chromatotec GC866
type: Concept
notation: GC866
definition: Analysis of VOC/BTEX in ambient air at very low concentration levels (ppb/ppt) thanks to precontration using a trap
status: valid
status modified: 2024-08-02
accepted date: 2024-08-02
in scheme: AQD - Measurement Equipment**
related match: VOC
measures pollutant: Toluene (air)
measures pollutant: p-Xylene (air)
measures pollutant: o-Xylene (air)
measures pollutant: Total volatile organic compounds (air)
measures pollutant: Ethyl benzene (air)
measures pollutant: Benzene (air)

SYNTECH SPECTRAS GC 955 series undetermined
type: Concept
notation: GC955
status: valid
status modified: 2024-08-02
accepted date: 2024-08-02
in scheme: AQD - Measurement Equipment**
example: http://www.synspec.nl/docs/manuals/manual-3-Manual%20operator%20Syntech%20Spectras%20GC955%20600-800.pdf
measures pollutant: Ethane (air)
measures pollutant: o-Xylene (air)
measures pollutant: i-Hexane (2-methylpentane) (air)
measures pollutant: n-Butane (air)
measures pollutant: Ethyne (Acetylene) (air)
measures pollutant: n-Pentane (air)
measures pollutant: 2-Pentene (air)
measures pollutant: Ethyl benzene (air)
measures pollutant: 1.3 Butadiene (air)
measures pollutant: n-Octane (air)
measures pollutant: Propane (air)
measures pollutant: 1-Pentene (air)
measures pollutant: 1-Butene (air)
measures pollutant: trans-2-Butene (air)
measures pollutant: 1,2,3-Trimethylbenzene (air)
measures pollutant: Propene (air)
measures pollutant: cis-2-Butene (air)
measures pollutant: Toluene (air)
measures pollutant: 1,2,4-Trimethylbenzene (air)
measures pollutant: i-Butane (2-methylpropane) (air)
measures pollutant: m,p-Xylene (air)
measures pollutant: n-Hexane (air)
measures pollutant: i-Pentane (2-methylbutane) (air)
measures pollutant: Isoprene (2-methyl-1,3-butadiene) (air)
measures pollutant: Ethene (Ethylene) (air)
measures pollutant: Benzene (air)
measures pollutant: i-Octane (2,2,4-trimethylpentane) (air)
measures pollutant: 1,3,5-Trimethylbenzene (air)
measures pollutant: n-Heptane (air)

SYNTECH SPECTRAS GC 955-600
type: Concept
notation: GC955-600
status: valid
status modified: 2024-08-02
accepted date: 2024-08-02
in scheme: AQD - Measurement Equipment**
example: http://www.synspec.nl/docs/manuals/manual-3-Manual%20operator%20Syntech%20Spectras%20GC955%20600-800.pdf
measures pollutant: o-Xylene (air)
measures pollutant: Toluene (air)
measures pollutant: m,p-Xylene (air)
measures pollutant: Benzene (air)
measures pollutant: Ethyl benzene (air)

SYNTECH SPECTRAS GC 955-601
type: Concept
notation: GC 955-601
definition: Gas chromatograph (GC) specifically built for the measurement of BTEX in ambient air. It can be utilised to simultaneously detect and measure up to 40 different components
status: valid
status modified: 2024-08-02
accepted date: 2024-08-02
in scheme: AQD - Measurement Equipment**
measures pollutant: p-Xylene (air)
measures pollutant: Ethyl benzene (air)
measures pollutant: Benzene (air)
measures pollutant: Total volatile organic compounds (air)
measures pollutant: o-Xylene (air)
measures pollutant: Toluene (air)

SYNTECH SPECTRAS GC 955-615/815
type: Concept
notation: GC955-615_815
definition: SYNSPEC GC955 615/815 Ozone Precursor Analyzer
status: valid
status modified: 2024-12-03
accepted date: 2024-12-03
in scheme: AQD - Measurement Equipment**
measures pollutant: Ethene (Ethylene) (air)
measures pollutant: n-Hexane (air)
measures pollutant: i-Butane (2-methylpropane) (air)
measures pollutant: o-Xylene (air)
measures pollutant: Propane (air)
measures pollutant: n-Octane (air)
measures pollutant: n-Butane (air)
measures pollutant: 2-Pentene (air)
measures pollutant: 1.3 Butadiene (air)
measures pollutant: Toluene (air)
measures pollutant: m,p-Xylene (air)
measures pollutant: n-Heptane (air)
measures pollutant: 1,3,5-Trimethylbenzene (air)
measures pollutant: 1-Butene (air)
measures pollutant: Ethane (air)
measures pollutant: 1,2,3-Trimethylbenzene (air)
measures pollutant: i-Pentane (2-methylbutane) (air)
measures pollutant: Ethyl benzene (air)
measures pollutant: cis-2-Butene (air)
measures pollutant: Isoprene (2-methyl-1,3-butadiene) (air)
measures pollutant: Ethyne (Acetylene) (air)
measures pollutant: n-Pentane (air)
measures pollutant: i-Hexane (2-methylpentane) (air)
measures pollutant: i-Octane (2,2,4-trimethylpentane) (air)
measures pollutant: trans-2-Butene (air)
measures pollutant: 1,2,4-Trimethylbenzene (air)
measures pollutant: Propene (air)
measures pollutant: 1-Pentene (air)
measures pollutant: Benzene (air)

SYNTECH SPECTRAS GC 955-800
type: Concept
notation: GC955-800
status: valid
status modified: 2024-08-02
accepted date: 2024-08-02
in scheme: AQD - Measurement Equipment**
example: http://www.synspec.nl/docs/manuals/manual-3-Manual%20operator%20Syntech%20Spectras%20GC955%20600-800.pdf
related match: other VOC
measures pollutant: Benzene (air)

GRIMM CPC model 5412 Standard Condensation Particle Counter
type: Concept
notation: GRIMM-CPC5412
definition: Compact CPC for nanoparticle counting with optimized detection efficiency and response time with integrated sample flow pump. Different calibrations possible
status: valid
status modified: 2024-08-02
accepted date: 2024-08-02
in scheme: AQD - Measurement Equipment**
measures pollutant: Ultra Fine Particles (UFPs) - recommended unit: particles.cm-3

GRIMM-CPC5420 Scanning Mobility Particle Counter and Sizer
type: Concept
notation: GRIMM-CPC5420
status: valid
status modified: 2024-08-23
accepted date: 2024-08-23
in scheme: AQD - Measurement Equipment**
measures pollutant: Ultra Fine Particles (UFPs) - recommended unit: particles.cm-3

GRIMM model EDM 107 for PM10 PM2.5 PM1 and TC
type: Concept
notation: GRIMM EDM 107
status: valid
status modified: 2024-08-02
accepted date: 2024-08-02
in scheme: AQD - Measurement Equipment**
editorial note: http://www.grimm-aerosol.com/downloads/datasheets/en/GrimmAerosolTechnik_Enviro_EDM107.pdf
example: The GRIMM model 107 monitor is designed to measure particle size distribution and particulate mass based on a light scattering measurement of individual particles in the sampled air
measures pollutant: Particulate matter < 10 µm (aerosol)
measures pollutant: Particulate matter < 2.5 µm (aerosol)

GRIMM model EDM 180 for PM10 and PM2.5
type: Concept
notation: GRIMM EDM 180
status: valid
status modified: 2024-08-02
accepted date: 2024-08-02
in scheme: AQD - Measurement Equipment**
measures pollutant: Particulate matter < 2.5 µm (aerosol)
measures pollutant: Particulate matter < 10 µm (aerosol)

GRIMM model EDM 180-C for PM10 and PM2.5
type: Concept
notation: GRIMM-EDM180C
status: valid
status modified: 2024-08-02
accepted date: 2024-08-02
in scheme: AQD - Measurement Equipment**
measures pollutant: Particulate matter < 2.5 µm (aerosol)
measures pollutant: Particulate matter < 10 µm (aerosol)

GRIMM model EDM 180-D for PM10 PM2.5 PM1 and TC
type: Concept
notation: GRIMM-EDM180D
status: valid
status modified: 2024-08-02
accepted date: 2024-08-02
in scheme: AQD - Measurement Equipment**
measures pollutant: Total suspended particulates (aerosol)
measures pollutant: Particulate matter < 10 µm (aerosol)
measures pollutant: Particulate matter < 1 µm (aerosol)
measures pollutant: Particulate matter < 2.5 µm (aerosol)

GRIMM model EDM 180-MC for PM10 PM2.5 PM1 TC and 31 size channels
type: Concept
notation: GRIMM-EDM180MC
status: valid
status modified: 2024-08-02
accepted date: 2024-08-02
in scheme: AQD - Measurement Equipment**
measures pollutant: Particulate matter < 10 µm (aerosol)
measures pollutant: Total suspended particulates (aerosol)
measures pollutant: Particulate matter < 2.5 µm (aerosol)
measures pollutant: Particulate matter < 1 µm (aerosol)

GRIMM model EDM 280 for TSP PM10 PM4 PM2.5 PM1 PMcoarse
type: Concept
notation: GRIMM-EDM280
definition: GRIMM model EDM 280 for TSP PM10 PM4 PM2.5 PM1 PMcoarse
status: valid
status modified: 2024-08-02
accepted date: 2024-08-02
in scheme: AQD - Measurement Equipment**
measures pollutant: Particulate matter < 2.5 µm (aerosol)
measures pollutant: Particulate matter < 1 µm (aerosol)
measures pollutant: Particulate matter < 10 µm (aerosol)

GRIMM model EDM 365 for PM10 PM2.5 PM1 and TC
type: Concept
notation: GRIMM EDM 365
status: valid
status modified: 2024-08-02
accepted date: 2024-08-02
in scheme: AQD - Measurement Equipment**
editorial note: http://www.grimm-aerosol.com/downloads/datasheets/en/GrimmAerosolTechnik_Enviro_GeneralCatalogue.pdf
measures pollutant: Particulate matter < 10 µm (aerosol)
measures pollutant: Particulate matter < 2.5 µm (aerosol)
measures pollutant: Particulate matter < 1 µm (aerosol)

Model 5420 SMPS+C Scanning Mobility Particle Counter and Sizer
type: Concept
notation: GRIMM-SMPS+C420
status: valid
status modified: 2024-08-23
accepted date: 2024-08-23
in scheme: AQD - Measurement Equipment**
measures pollutant: Ultra Fine Particles (UFPs) - recommended unit: particles.cm-3

IL-Punkkinen for NO2/NO hourly measurements
type: Concept
notation: IL-Punkkinen
definition: Device based on the modified automated Saltzman method by Finnish Meteorological Institute.
status: valid
status modified: 2024-08-02
accepted date: 2024-08-02
in scheme: AQD - Measurement Equipment**

Leckel SEQ47/50
type: Concept
notation: Leckel_SEQ47-50
status: valid
status modified: 2024-08-02
accepted date: 2024-08-02
in scheme: AQD - Measurement Equipment**

MERCURY MONITOR RA-915AM
type: Concept
notation: LumexRA-915AM
definition: RA-915AM monitors are designed for continuous mercury measurements in ambient air indoor air and in natural gas. Ideal for permanent unattended installation at air monitoring stations RA-915AM monitor for ambient air allows ultra-sensitive measurements of background Hg concentrations and is compliant with the European standard EN 15852 for ambient air monitoring.The monitors feature fully-automated unattended operation without the need for the monthly technician maintenance and frequent recalibration. The use of the instrument allows cutting down operation costs as the analyzer requires no argon cylinders for operation and no consumables.The remote data transfer makes it possible to connect the monitor to data collection systems via RS232 Modbus and analogue output.
status: valid
status modified: 2024-08-02
accepted date: 2024-08-02
in scheme: AQD - Measurement Equipment**

Lumex RA-915M mercury vapor analyzer
type: Concept
notation: LumexRA-915M
definition: Mercury Analyzer is a portable multifunctional atomic absorption spectrometer with Zeeman background correction which eliminates the effect of interfering impurities. It is the only high sensitivity and selectivity instrument that does not require gold amalgam pre-concentration and subsequent regeneration steps. This enables the user to conduct real time air monitoring and detection of mercury vapor. Being combined with pyrolysis or cold vapour attachments for liquid and solid sample testing the instrument can determine mercury content in water soil food products natural and stack gases may be used for dental and toxicological applications etc.
status: valid
status modified: 2024-08-02
accepted date: 2024-08-02
in scheme: AQD - Measurement Equipment**

MELOY_NA530R
type: Concept
notation: MELOY_NA530R
definition: Nitrogen Oxides Analyzer
status: valid
status modified: 2024-12-12
accepted date: 2024-12-12
in scheme: AQD - Measurement Equipment**
measures pollutant: Nitrogen monoxide (air)
measures pollutant: Nitrogen oxides (air)
measures pollutant: Nitrogen dioxide (air)

MELOY SA285E
type: Concept
notation: MELOY_SA285E
definition: SO2 Analyzer
status: valid
status modified: 2024-12-12
accepted date: 2024-12-12
in scheme: AQD - Measurement Equipment**
measures pollutant: Sulphur dioxide (air)

ML
type: Concept
notation: ML
status: valid
status modified: 2024-08-02
accepted date: 2024-08-02
in scheme: AQD - Measurement Equipment**
editorial note: check pollutant

Monitor Labs model 2010 O3 analyser
type: Concept
notation: ML2010
status: valid
status modified: 2024-08-02
accepted date: 2024-08-02
in scheme: AQD - Measurement Equipment**
measures pollutant: Ozone (air)

Monitor Labs model 2030 CO analyser
type: Concept
notation: ML2030
status: valid
status modified: 2024-08-02
accepted date: 2024-08-02
in scheme: AQD - Measurement Equipment**
measures pollutant: Carbon monoxide (air)

Monitor Labs model 2040 SO2 analyser
type: Concept
notation: ML2040
status: valid
status modified: 2024-08-02
accepted date: 2024-08-02
in scheme: AQD - Measurement Equipment**
measures pollutant: Sulphur dioxide (air)

Monitor Labs model 2041 NOx analyser
type: Concept
notation: ML2041
status: valid
status modified: 2024-08-02
accepted date: 2024-08-02
in scheme: AQD - Measurement Equipment**
measures pollutant: Nitrogen monoxide (air)
measures pollutant: Nitrogen oxides (air)
measures pollutant: Nitrogen dioxide (air)

Monitor Labs model 2050 SO2 analyser
type: Concept
notation: ML2050
status: valid
status modified: 2024-08-02
accepted date: 2024-08-02
in scheme: AQD - Measurement Equipment**
measures pollutant: Sulphur dioxide (air)

Monitor Labs model 8410 NOx analyser
type: Concept
notation: ML8410
definition: Monitor Labs model 8410 NOx analyser
status: valid
status modified: 2024-08-02
accepted date: 2024-08-02
in scheme: AQD - Measurement Equipment**
measures pollutant: Nitrogen dioxide (air)
measures pollutant: Nitrogen oxides (air)
measures pollutant: Nitrogen monoxide (air)

Monitor Labs model 8440 NOx analyser
type: Concept
notation: ML8440
status: valid
status modified: 2024-08-02
accepted date: 2024-08-02
in scheme: AQD - Measurement Equipment**
editorial note: check pollutant
measures pollutant: Nitrogen oxides (air)
measures pollutant: Nitrogen monoxide (air)
measures pollutant: Nitrogen dioxide (air)

Monitor Labs model 8841 NOx analyser
type: Concept
notation: ML8441
status: valid
status modified: 2024-08-02
accepted date: 2024-08-02
in scheme: AQD - Measurement Equipment**
editorial note: check pollutant
measures pollutant: Nitrogen monoxide (air)
measures pollutant: Nitrogen dioxide (air)
measures pollutant: Nitrogen oxides (air)

Monitor Labs model 8810 O3 analyser
type: Concept
notation: ML8810
status: valid
status modified: 2024-08-02
accepted date: 2024-08-02
in scheme: AQD - Measurement Equipment**
editorial note: check pollutant
measures pollutant: Ozone (air)

Monitor Labs model 8830 CO analyser
type: Concept
notation: ML8830
status: valid
status modified: 2024-08-02
accepted date: 2024-08-02
in scheme: AQD - Measurement Equipment**
editorial note: check pollutant
measures pollutant: Carbon monoxide (air)

Monitor Labs model 8831 CO analyser
type: Concept
notation: ML8831
status: valid
status modified: 2024-08-02
accepted date: 2024-08-02
in scheme: AQD - Measurement Equipment**
editorial note: check pollutant
measures pollutant: Carbon monoxide (air)

Monitor Labs model 8840 NOx analyser
type: Concept
notation: ML8840
status: valid
status modified: 2024-08-02
accepted date: 2024-08-02
in scheme: AQD - Measurement Equipment**
editorial note: check pollutant
measures pollutant: Nitrogen dioxide (air)
measures pollutant: Nitrogen monoxide (air)
measures pollutant: Nitrogen oxides (air)

Monitor Labs model 8841 NOx analyser
type: Concept
notation: ML8841
status: valid
status modified: 2024-08-02
accepted date: 2024-08-02
in scheme: AQD - Measurement Equipment**
editorial note: check pollutant
measures pollutant: Nitrogen oxides (air)
measures pollutant: Nitrogen dioxide (air)
measures pollutant: Nitrogen monoxide (air)

Monitor Labs model 8850 SO2 analyser
type: Concept
notation: ML8850
status: valid
status modified: 2024-08-02
accepted date: 2024-08-02
in scheme: AQD - Measurement Equipment**
editorial note: check pollutant
measures pollutant: Sulphur dioxide (air)

Monitor Labs model 8850M SO2 analyser
type: Concept
notation: ML8850M
status: valid
status modified: 2024-08-02
accepted date: 2024-08-02
in scheme: AQD - Measurement Equipment**
editorial note: check pollutant
measures pollutant: Sulphur dioxide (air)

Monitor Labs model 8850S SO2 analyser
type: Concept
notation: ML8850S
status: valid
status modified: 2024-08-02
accepted date: 2024-08-02
in scheme: AQD - Measurement Equipment**
editorial note: check pollutant
measures pollutant: Sulphur dioxide (air)

Monitor Labs model 8930 CO analyser
type: Concept
notation: ML8930
definition: Monitor Labs model 8930 CO analyser
status: valid
status modified: 2024-08-02
accepted date: 2024-08-02
in scheme: AQD - Measurement Equipment**
measures pollutant: Carbon monoxide (air)

Monitor Labs model 8941A NOx analyser
type: Concept
notation: ML8941A
status: valid
status modified: 2024-08-02
accepted date: 2024-08-02
in scheme: AQD - Measurement Equipment**
editorial note: check pollutant
measures pollutant: Nitrogen monoxide (air)
measures pollutant: Nitrogen dioxide (air)
measures pollutant: Nitrogen oxides (air)

Monitor Labs model 9800
type: Concept
notation: ML9800
status: valid
status modified: 2024-08-02
accepted date: 2024-08-02
in scheme: AQD - Measurement Equipment**
editorial note: check pollutant

Monitor Labs model 9810 O3 analyser
type: Concept
notation: ML9810
status: valid
status modified: 2024-08-02
accepted date: 2024-08-02
in scheme: AQD - Measurement Equipment**
measures pollutant: Ozone (air)

Monitor Labs model 9810A O3 analyser
type: Concept
notation: ML9810A
status: valid
status modified: 2024-08-02
accepted date: 2024-08-02
in scheme: AQD - Measurement Equipment**
measures pollutant: Ozone (air)

Monitor Labs model 9810B O3 analyser
type: Concept
notation: ML9810B
status: valid
status modified: 2024-08-02
accepted date: 2024-08-02
in scheme: AQD - Measurement Equipment**
measures pollutant: Ozone (air)

Monitor Labs model 9811 O3 analyser
type: Concept
notation: ML9811
status: valid
status modified: 2024-08-02
accepted date: 2024-08-02
in scheme: AQD - Measurement Equipment**
measures pollutant: Ozone (air)

Monitor Labs model 9812 O3 analyser
type: Concept
notation: ML9812
status: valid
status modified: 2024-08-02
accepted date: 2024-08-02
in scheme: AQD - Measurement Equipment**
measures pollutant: Ozone (air)

Monitor Labs model 9830 CO analyser
type: Concept
notation: ML9830
status: valid
status modified: 2024-08-02
accepted date: 2024-08-02
in scheme: AQD - Measurement Equipment**
measures pollutant: Carbon monoxide (air)

Monitor Labs model 9830B CO analyser
type: Concept
notation: ML9830B
status: valid
status modified: 2024-08-02
accepted date: 2024-08-02
in scheme: AQD - Measurement Equipment**
measures pollutant: Carbon monoxide (air)

Monitor Labs model 9832 CO analyser
type: Concept
notation: ML9832
status: valid
status modified: 2024-08-02
accepted date: 2024-08-02
in scheme: AQD - Measurement Equipment**
measures pollutant: Carbon monoxide (air)

Monitor Labs model 9840 NOx analyser
type: Concept
notation: ML9840
status: valid
status modified: 2024-08-02
accepted date: 2024-08-02
in scheme: AQD - Measurement Equipment**
measures pollutant: Nitrogen dioxide (air)
measures pollutant: Nitrogen monoxide (air)
measures pollutant: Nitrogen oxides (air)

Monitor Labs model 9841 NOx analyser
type: Concept
notation: ML9841
status: valid
status modified: 2024-08-02
accepted date: 2024-08-02
in scheme: AQD - Measurement Equipment**
measures pollutant: Nitrogen dioxide (air)
measures pollutant: Nitrogen monoxide (air)
measures pollutant: Nitrogen oxides (air)

Monitor Labs model 9841A NOx analyser
type: Concept
notation: ML9841A
status: valid
status modified: 2024-08-02
accepted date: 2024-08-02
in scheme: AQD - Measurement Equipment**
measures pollutant: Nitrogen monoxide (air)
measures pollutant: Nitrogen dioxide (air)
measures pollutant: Nitrogen oxides (air)

Monitor Labs model 9841B NOx analyser
type: Concept
notation: ML9841B
status: valid
status modified: 2024-08-02
accepted date: 2024-08-02
in scheme: AQD - Measurement Equipment**
measures pollutant: Nitrogen monoxide (air)
measures pollutant: Nitrogen oxides (air)
measures pollutant: Nitrogen dioxide (air)

Monitor Labs model 9841T NOx analyser
type: Concept
notation: ML9841T
status: valid
status modified: 2024-08-02
accepted date: 2024-08-02
in scheme: AQD - Measurement Equipment**
measures pollutant: Nitrogen monoxide (air)
measures pollutant: Nitrogen oxides (air)
measures pollutant: Nitrogen dioxide (air)

Monitor Labs model 9850 SO2 analyser
type: Concept
notation: ML9850
status: valid
status modified: 2024-08-02
accepted date: 2024-08-02
in scheme: AQD - Measurement Equipment**
measures pollutant: Sulphur dioxide (air)

Monitor Labs model 9850B SO2 analyser
type: Concept
notation: ML9850B
status: valid
status modified: 2024-08-02
accepted date: 2024-08-02
in scheme: AQD - Measurement Equipment**
measures pollutant: Sulphur dioxide (air)

MRI_1550B
type: Concept
notation: MRI_1550B
definition: The MRI Integrating nephelometer is used to measure the scattering coefficient of the air, caused by aerosol particulates.
status: valid
status modified: 2024-12-12
accepted date: 2024-12-12
in scheme: AQD - Measurement Equipment**
measures pollutant: black_carbon (aerosol)

NIRA-Venus301
type: Concept
notation: NIRA-Venus301
definition: NIRA-Venus301
status: valid
status modified: 2024-08-02
accepted date: 2024-08-02
in scheme: AQD - Measurement Equipment**

PNS 18-DM-3.1
type: Concept
notation: PNS18-DM-3.1
definition: The PNS DM consists of a low/medium volume sampler (LVS or MVS) and a filter changer with intake tube and sampling inlet. It collects fine particulate matter on sampling filters according to EN 12341:2014 (PM10 and PM2.5).
status: valid
status modified: 2024-08-02
accepted date: 2024-08-02
in scheme: AQD - Measurement Equipment**

PNS 18-DM-6.1
type: Concept
notation: PNS18-DM-6.1
definition: The PNS DM consists of a low/medium volume sampler (LVS or MVS) and a filter changer with intake tube and sampling inlet. It collects fine particulate matter on sampling filters according to EN 12341:2014 (PM10 and PM2.5).
status: valid
status modified: 2024-08-02
accepted date: 2024-08-02
in scheme: AQD - Measurement Equipment**

PNS 18T-DM-3.1
type: Concept
notation: PNS18T-DM-3.1
definition: The PNS T-DM combines a low / medium volume sampler (LVS or MVS) and a filter changer in a stainless steel cabinet. It collects fine particulate matter on sampling filters according to EN 12341:2014 (PM10 and PM2.5).
status: valid
status modified: 2024-08-02
accepted date: 2024-08-02
in scheme: AQD - Measurement Equipment**

PNS 18T-DM-6.1
type: Concept
notation: PNS18T-DM-6.1
definition: The PNS T-DM combines a low / medium volume sampler (LVS or MVS) and a filter changer in a stainless steel cabinet. It collects fine particulate matter on sampling filters according to EN 12341:2014 (PM10 and PM2.5).
status: valid
status modified: 2024-08-02
accepted date: 2024-08-02
in scheme: AQD - Measurement Equipment**

PNS 24-DM-3.1
type: Concept
notation: PNS24-DM-3.1
definition: The PNS DM consists of a low/medium volume sampler (LVS or MVS) and a filter changer with intake tube and sampling inlet. It collects fine particulate matter on sampling filters according to EN 12341:2014 (PM10 and PM2.5).
status: valid
status modified: 2024-08-02
accepted date: 2024-08-02
in scheme: AQD - Measurement Equipment**

PNS 24-DM-6.1
type: Concept
notation: PNS24-DM-6.1
definition: The PNS DM consists of a low/medium volume sampler (LVS or MVS) and a filter changer with intake tube and sampling inlet. It collects fine particulate matter on sampling filters according to EN 12341:2014 (PM10 and PM2.5).
status: valid
status modified: 2024-08-02
accepted date: 2024-08-02
in scheme: AQD - Measurement Equipment**

PNS 24T-DM-3.1
type: Concept
notation: PNS24T-DM-3.1
definition: The PNS T-DM combines a low / medium volume sampler (LVS or MVS) and a filter changer in a stainless steel cabinet. It collects fine particulate matter on sampling filters according to EN 12341:2014 (PM10 and PM2.5).
status: valid
status modified: 2024-08-02
accepted date: 2024-08-02
in scheme: AQD - Measurement Equipment**

PNS 24T-DM-6.1
type: Concept
notation: PNS24T-DM-6.1
definition: The PNS T-DM combines a low / medium volume sampler (LVS or MVS) and a filter changer in a stainless steel cabinet. It collects fine particulate matter on sampling filters according to EN 12341:2014 (PM10 and PM2.5).
status: valid
status modified: 2024-08-02
accepted date: 2024-08-02
in scheme: AQD - Measurement Equipment**

Passive Palmes Tube
type: Concept
notation: Passive_Palmes_Tube
definition: Passive Palmes Tube. Generally for NO2. However available for other substances like NOX-NO SO2 O3 C6H6...
status: valid
status modified: 2024-08-02
accepted date: 2024-08-02
in scheme: AQD - Measurement Equipment**

Picarro G2301 Gas Concentration Analyzer
type: Concept
notation: PicarroG2301
definition: The Picarro G2301 gas concentration analyzer provides simultaneous, precise measurement of carbon dioxide (CO2) - methane (CH4) at parts-per-billion (ppb) and water (H2O) vapor at parts-per-million (ppm) sensitivity with negligible drift for atmospheric science air quality and emissions quantification. It meets the World Meteorological Organization (WMO) and Integrated Carbon Observation System (ICOS) performance requirements for CO2 and CH4 atmospheric monitoring.
status: valid
status modified: 2024-08-23
accepted date: 2024-08-23
in scheme: AQD - Measurement Equipment**
measures pollutant: Methane (air)
measures pollutant: Carbon dioxide (air)

Picarro G2401 (used for CO measurement)
type: Concept
notation: PicarroG2401
status: valid
status modified: 2024-08-02
accepted date: 2024-08-02
in scheme: AQD - Measurement Equipment**
measures pollutant: Carbon monoxide (air)

RUPPRECHT & PATASHNICK, SERIES 5400 CARBON MONITOR
type: Concept
notation: R&P5400
definition: The Series 5400 is an automatic speciation analyzer of suspended particulate matter. It measures the elemental and organic carbon contained in suspended particulate matter at averaging times as short as one hour.
status: valid
status modified: 2024-08-23
accepted date: 2024-08-23
in scheme: AQD - Measurement Equipment**
measures pollutant: Organic carbon (aerosol)
measures pollutant: Elemental carbon (aerosol)

SFI O342M
type: Concept
notation: SFIO342M
status: valid
status modified: 2024-08-02
accepted date: 2024-08-02
in scheme: AQD - Measurement Equipment**

SIR S-5001
type: Concept
notation: SIR-S-5001
definition: The SIR Model S-5001 is a Non-Pulsed U.V. Fluorescence Sulfur Dioxide Analyzer. In the nalyzer optically filtered pure monochromatic U.V. light from a Zinc lamp is focused onto the SO2 reaction chamber.
status: valid
status modified: 2024-08-02
accepted date: 2024-08-02
in scheme: AQD - Measurement Equipment**
measures pollutant: Sulphur dioxide (air)

SIR S-5006
type: Concept
notation: SIR-S-5006
definition: The SIR Model S-5006 is a Non-Dispersive Infrared (NDIR) Analyzer for the measurement of Carbon Monoxide concentrations in ambient air
status: valid
status modified: 2024-08-02
accepted date: 2024-08-02
in scheme: AQD - Measurement Equipment**
measures pollutant: Carbon monoxide (air)

SIR S-5012
type: Concept
notation: SIR-S-5012
definition: The SIR Model S-5012 Nitrogen Oxides Analyzer is designed to measure the amount of nitric oxide (NO) nitrogen dioxide (NO2) and total oxides of nitrogen (NOx) in a continuous ambient air sample
status: valid
status modified: 2024-08-02
accepted date: 2024-08-02
in scheme: AQD - Measurement Equipment**
measures pollutant: Nitrogen oxides (air)
measures pollutant: Nitrogen monoxide (air)
measures pollutant: Nitrogen dioxide (air)

SIR S-5014
type: Concept
notation: SIR-S-5014
definition: SIR Model S-5014 ozone analyser is a self-contained instrument which measures the concentration of ozone in a sample of ambient background) gas such as air oxygen nitrogen etc
status: valid
status modified: 2024-08-02
accepted date: 2024-08-02
in scheme: AQD - Measurement Equipment**
measures pollutant: Ozone (air)

SRI 8610
type: Concept
notation: SRI8610
status: valid
status modified: 2024-08-02
accepted date: 2024-08-02
in scheme: AQD - Measurement Equipment**

SRI8610-C
type: Concept
notation: SRI8610-C
definition: Compact gas chromatograph
status: valid
status modified: 2024-08-02
accepted date: 2024-08-02
in scheme: AQD - Measurement Equipment**
related match: VOC
measures pollutant: Benzene (air)
measures pollutant: o-Xylene (air)
measures pollutant: Toluene (air)
measures pollutant: Ethyl benzene (air)
measures pollutant: p-Xylene (air)
measures pollutant: Total volatile organic compounds (air)

SWAM 5a Dual channel monitor
type: Concept
notation: SWAM5aDual
status: valid
status modified: 2024-08-02
accepted date: 2024-08-02
in scheme: AQD - Measurement Equipment**
measures pollutant: Particulate matter < 10 µm (aerosol)
measures pollutant: Particulate matter < 2.5 µm (aerosol)

SWAM 5a Single channel monitor
type: Concept
notation: SWAM5aSingle
definition: FAI SWAM5a Single Channel
status: valid
status modified: 2024-08-02
accepted date: 2024-08-02
in scheme: AQD - Measurement Equipment**
measures pollutant: Particulate matter < 2.5 µm (aerosol)
measures pollutant: Particulate matter < 10 µm (aerosol)

Serinus 10 O3
type: Concept
notation: Serinus10
status: valid
status modified: 2024-08-02
accepted date: 2024-08-02
in scheme: AQD - Measurement Equipment**
measures pollutant: Ozone (air)

Serinus30 CO
type: Concept
notation: Serinus30
status: valid
status modified: 2024-08-02
accepted date: 2024-08-02
in scheme: AQD - Measurement Equipment**
measures pollutant: Carbon monoxide (air)

Serinus 50 SO2
type: Concept
notation: Serinus50
status: valid
status modified: 2024-08-02
accepted date: 2024-08-02
in scheme: AQD - Measurement Equipment**
measures pollutant: Sulphur dioxide (air)

TEOM 1400
type: Concept
notation: TEOM1400
status: valid
status modified: 2024-08-02
accepted date: 2024-08-02
in scheme: AQD - Measurement Equipment**
editorial note: assumed 1400
measures pollutant: Particulate matter < 10 µm (aerosol)
measures pollutant: Particulate matter < 2.5 µm (aerosol)

TEOM 1400A
type: Concept
notation: TEOM1400A
status: valid
status modified: 2024-08-02
accepted date: 2024-08-02
in scheme: AQD - Measurement Equipment**
measures pollutant: Particulate matter < 10 µm (aerosol)
measures pollutant: Particulate matter < 2.5 µm (aerosol)

TEOM 1400AB
type: Concept
notation: TEOM1400AB
status: valid
status modified: 2024-08-02
accepted date: 2024-08-02
in scheme: AQD - Measurement Equipment**
measures pollutant: Particulate matter < 2.5 µm (aerosol)
measures pollutant: Particulate matter < 10 µm (aerosol)

TEOM 1400AB with FDMS module (8500)
type: Concept
notation: TEOM1400AB-FDMS
status: valid
status modified: 2024-08-02
accepted date: 2024-08-02
in scheme: AQD - Measurement Equipment**
editorial note: must be AB
measures pollutant: Particulate matter < 2.5 µm (aerosol)
measures pollutant: Particulate matter < 10 µm (aerosol)

TEOM 1400 FDMS + 8500 B or CB Dryer
type: Concept
notation: TEOM1400FDMS-8500B-CB
status: valid
status modified: 2024-08-02
accepted date: 2024-08-02
in scheme: AQD - Measurement Equipment**

TEOM 1405
type: Concept
notation: TEOM1405
status: valid
status modified: 2024-08-02
accepted date: 2024-08-02
in scheme: AQD - Measurement Equipment**
measures pollutant: Particulate matter < 10 µm (aerosol)
measures pollutant: Particulate matter < 2.5 µm (aerosol)

TEOM 1405D
type: Concept
notation: TEOM1405D
status: valid
status modified: 2024-08-02
accepted date: 2024-08-02
in scheme: AQD - Measurement Equipment**
measures pollutant: Particulate matter < 2.5 µm (aerosol)
measures pollutant: Particulate matter < 10 µm (aerosol)

TEOM 1405DF with FDMS Dichotomous monitor for PM2.5 & PM10
type: Concept
notation: TEOM1405DF-FDMS
status: valid
status modified: 2024-08-02
accepted date: 2024-08-02
in scheme: AQD - Measurement Equipment**
measures pollutant: Particulate matter < 10 µm (aerosol)
measures pollutant: Particulate matter < 2.5 µm (aerosol)

TEOM 1405F with FDMS
type: Concept
notation: TEOM1405F-FDMS
status: valid
status modified: 2024-08-02
accepted date: 2024-08-02
in scheme: AQD - Measurement Equipment**
measures pollutant: Particulate matter < 2.5 µm (aerosol)
measures pollutant: Particulate matter < 10 µm (aerosol)

THERMO 450i
type: Concept
notation: THERMO450i
status: valid
status modified: 2024-08-02
accepted date: 2024-08-02
in scheme: AQD - Measurement Equipment**

THERMO450iQ
type: Concept
notation: THERMO450iQ
definition: The 450iQ analyzer operates on the principle that H2S can be converted to SO2. As the SO2 molecules absorb ultraviolet (UV) light and become excited at one wavelength, the molecules then decay to a lower energy state emitting UV light at a different wavelength.
status: valid
status modified: 2025-07-29
accepted date: 2025-07-29
in scheme: AQD - Measurement Equipment**
measures pollutant: Hydrogen sulphide (air)
measures pollutant: Sulphur dioxide (air)

TSI 3022A CPC
type: Concept
notation: TSI3022ACPC
definition: The Model 3022A Condensation Particle Counter detects particles down to 7 nm in diameter. Using both single-count and photometric detection modes it provides highly accurate measurements for concentrations as high as 107particles/cm3.
status: valid
status modified: 2024-08-02
accepted date: 2024-08-02
in scheme: AQD - Measurement Equipment**

TSI Ultrafine Particle Monitor 3031
type: Concept
notation: TSI3031
definition: The Ultrafine Particle Monitor Model 3031 is specifically designed to measure ultrafine particles long-term. It reports the particle number concentration in six size classes between 20 and 500 nm and requires only minimal maintenance.
status: valid
status modified: 2024-08-23
accepted date: 2024-08-23
in scheme: AQD - Measurement Equipment**
measures pollutant: Ultra Fine Particles (UFPs) - recommended unit: particles.cm-3

TSI Electrostatic Classifier 3080
type: Concept
notation: TSI3080SMPS
definition: TSI's Electrostatic Classifiers 3080 Series produce highly monodisperse, submicrometer aerosol. They have been used in a variety of aerosol-generation or particle-sizing applications with highly accurate and repeatable results.
status: valid
status modified: 2024-08-23
accepted date: 2024-08-23
in scheme: AQD - Measurement Equipment**
measures pollutant: Ultra Fine Particles (UFPs) - recommended unit: particles.cm-3

TSI Nanoparticle Surface Area Monitor 3550
type: Concept
notation: TSI3550NSAM
definition: The Nanoparticle Surface Area Monitor 3550 (NSAM) measures the human lung-deposited surface area of particles (reported as µm 2 /cm 3 ) corresponding to tracheobronchial (TB) and alveolar (A) regions of the lung. The NSAM 3550 provides a simple and fast solution for measuring the surface area equivalent dose in the lung. It is an important instrument for research in the fields of inhalation toxicology health effects and epidemiology and for measuring and monitoring workplace exposure.
status: valid
status modified: 2024-08-23
accepted date: 2024-08-23
in scheme: AQD - Measurement Equipment**
measures pollutant: Ultra Fine Particles (UFPs) - recommended unit: particles.cm-3

TSI Condensation Particle Counter 3750
type: Concept
notation: TSI3750CPC
definition: Enables ambient air monitoring stations to measure size distributions of ultrafine particles in compliance with CEN/TS 17434:2020.
status: valid
status modified: 2024-08-23
accepted date: 2024-08-23
in scheme: AQD - Measurement Equipment**
measures pollutant: Ultra Fine Particles (UFPs) - recommended unit: particles.cm-3

TSI model 3752 High Concentration Condensation Particle Counter
type: Concept
notation: TSI3752CPC
definition: TSI Condensation Particle Counters (CPCs)
status: valid
status modified: 2024-08-02
accepted date: 2024-08-02
in scheme: AQD - Measurement Equipment**
measures pollutant: Ultra Fine Particles (UFPs) - recommended unit: particles.cm-3

TSI Condensation Particle Counter 3772
type: Concept
notation: TSI3772CPC
definition: Condensation Particle Counter Model 3772 is a compact rugged and full-featured instrument that detects airborne particles down to 10 nm at an aerosol flow rate of 1.0 L/min over a concentration range from 0 to 10000 particles/cm 3. It is ideally suited for applications that do not require measurement of high concentrations.
status: valid
status modified: 2024-08-23
accepted date: 2024-08-23
in scheme: AQD - Measurement Equipment**
measures pollutant: Ultra Fine Particles (UFPs) - recommended unit: particles.cm-3

TSI model 3775 Condensation Particle Counter
type: Concept
notation: TSI3775CPC
definition: TSI model 3775 Condensation Particle Counter (Discontinued)
status: valid
status modified: 2024-08-02
accepted date: 2024-08-02
in scheme: AQD - Measurement Equipment**
measures pollutant: Ultra Fine Particles (UFPs) - recommended unit: particles.cm-3

TSI Ultrafine Condensation Particle Counter (UCPC) Model 3776
type: Concept
notation: TSI3776UCPC
definition: The Ultrafine Condensation Particle Counter 3776 (UCPC) a types of condensation particle counter (CPC) is designed primarily for researchers interested in airborne particles smaller than 20 nm. It is a continuous-flow instrument that detects particles down to 2.5 nm. It uses a special sheath-air flow design that improves response to changes in particle concentration and increases counting efficiency for ultrafine particles.
status: valid
status modified: 2024-08-23
accepted date: 2024-08-23
in scheme: AQD - Measurement Equipment**
measures pollutant: Ultra Fine Particles (UFPs) - recommended unit: particles.cm-3

TSI3783
type: Concept
notation: TSI3783
definition: TSI’s EPC™Monitor Model 3783 provides continuous, high precision airborne particle number concentration measurements
status: valid
status modified: 2024-12-12
accepted date: 2024-12-12
in scheme: AQD - Measurement Equipment**
measures pollutant: Ultra Fine Particles (UFPs) - recommended unit: particles.cm-3

TSI 3936 SMPS
type: Concept
notation: TSI3936SMPS
status: valid
status modified: 2024-08-02
accepted date: 2024-08-02
in scheme: AQD - Measurement Equipment**

TSISMPS3938
type: Concept
notation: TSISMPS3938
definition: General Scanning Mobility Particle Sizer
status: valid
status modified: 2024-12-12
accepted date: 2024-12-12
in scheme: AQD - Measurement Equipment**

Thermo 17i
type: Concept
notation: Thermo17i
definition: The Thermo Scientific Model 17i Ammonia Analyzer uses the light producing reaction of nitric oxide (NO) with ozone (O3) as its basic principle. The instrument has three modes of operation NO NOx and Nt.
status: valid
status modified: 2024-08-02
accepted date: 2024-08-02
in scheme: AQD - Measurement Equipment**
measures pollutant: Ammonia (air)
measures pollutant: Nitrogen dioxide (air)
measures pollutant: Total nitrogen
measures pollutant: Nitrogen oxides (air)

THERMO49iq
type: Concept
notation: Thermo49iq
definition: With ultraviolet photometry technology. High stability and low detection limit (0.5 ppm)
status: valid
status modified: 2024-08-02
accepted date: 2024-08-02
in scheme: AQD - Measurement Equipment**
measures pollutant: Ozone (air)

URG
type: Concept
notation: URG
status: valid
status modified: 2024-08-02
accepted date: 2024-08-02
in scheme: AQD - Measurement Equipment**

Environnement VOC71M
type: Concept
notation: VOC71M
status: valid
status modified: 2024-08-02
accepted date: 2024-08-02
in scheme: AQD - Measurement Equipment**
related match: other VOC
measures pollutant: Benzene (air)

Environnement VOC72M
type: Concept
notation: VOC72M
status: valid
status modified: 2024-08-02
accepted date: 2024-08-02
in scheme: AQD - Measurement Equipment**
measures pollutant: Benzene (air)
measures pollutant: m-Xylene (air)
measures pollutant: Ethyl benzene (air)
measures pollutant: p-Xylene (air)
measures pollutant: 1.3 Butadiene (air)
measures pollutant: m,p-Xylene (air)
measures pollutant: Toluene (air)
measures pollutant: o-Xylene (air)

Woesthoff U3S
type: Concept
notation: WoesthoffU3S
definition: Woesthoff U3S
status: valid
status modified: 2024-08-02
accepted date: 2024-08-02
in scheme: AQD - Measurement Equipment**

Aeris AE2010U
type: Concept
notation: aerisAE2010U
definition: The aeris® AE2010U Trace Level Ozone (03) Analyser employs a non-dispersive ultraviolet (UV) absorption
status: valid
status modified: 2024-08-02
accepted date: 2024-08-02
in scheme: AQD - Measurement Equipment**
measures pollutant: Ozone (air)

Aeris AE2030U
type: Concept
notation: aerisAE2030U
definition: The aeris® AE2030U Trace Level Carbon monoxide (CO) analyser employs a n on-dispersive infrared (NDIR) photometer to measure very low concentrations of CO
status: valid
status modified: 2024-08-02
accepted date: 2024-08-02
in scheme: AQD - Measurement Equipment**
measures pollutant: Carbon monoxide (air)

Aeris AE2041U
type: Concept
notation: aerisAE2041U
definition: The aeris® AE2041U Trace Level NO/NO2/NOx chemiluminescence analyser incorporates a single-channel design measuring NO and NOx
status: valid
status modified: 2024-08-02
accepted date: 2024-08-02
in scheme: AQD - Measurement Equipment**
measures pollutant: Nitrogen oxides (air)
measures pollutant: Nitrogen dioxide (air)
measures pollutant: Nitrogen monoxide (air)

Aeris AE2050U
type: Concept
notation: aerisAE2050U
definition: The aeris® AE2050U Trace Level Sulphur Dioxide (S02) Analyser employs pulsed UV fluorescent radiation technology
status: valid
status modified: 2024-08-02
accepted date: 2024-08-02
in scheme: AQD - Measurement Equipment**
measures pollutant: Sulphur dioxide (air)

Aerodyne ACSM
type: Concept
notation: aerodyneACSM
definition: The Aerosol Chemical Speciation Monitor (ACSM) measures mass loading and chemical composition of non-refractory aerosol particles in real-time. Smaller lower cost more robust and simpler to operate than our AMS instruments the ACSM is designed for long-term unattended deployment and routine monitoring applications.
status: valid
status modified: 2024-08-02
accepted date: 2024-08-02
in scheme: AQD - Measurement Equipment**

agilent HP 6890
type: Concept
notation: agilentHP6890
definition: Agilent HP 6890 (used for benzene and toluene measurement)
status: valid
status modified: 2024-08-02
accepted date: 2024-08-02
in scheme: AQD - Measurement Equipment**
measures pollutant: Benzene (air)
measures pollutant: Toluene (air)

CHROMATOTEC airmOzone
type: Concept
notation: airmoOzone
definition: System for analysis of the Ozone precursor VOC
status: valid
status modified: 2024-08-02
accepted date: 2024-08-02
in scheme: AQD - Measurement Equipment**

airmoVOC BTX
type: Concept
notation: airmoVOC_BTX
definition: The airmoVOC BTX is an automatic gas chromatograph dedicated to the analysis and monitoring of trace amounts of BTEX compounds(Benzene Toluene Ethylbenzene m- p- and o-Xylenes)
status: valid
status modified: 2024-08-02
accepted date: 2022-12-02
in scheme: AQD - Measurement Equipment**
measures pollutant: Benzene (air)
measures pollutant: Ethyl benzene (air)
measures pollutant: Toluene (air)
measures pollutant: o-Xylene (air)
measures pollutant: m,p-Xylene (air)

airmotec BTX 1000
type: Concept
notation: airmoVOC_BTX1000
status: valid
status modified: 2024-08-02
accepted date: 2024-08-02
in scheme: AQD - Measurement Equipment**
measures pollutant: m,p-Xylene (air)
measures pollutant: Ethyl benzene (air)
measures pollutant: Benzene (air)
measures pollutant: Toluene (air)

airpointer
type: Concept
notation: airpointer
definition: The airpointer‘s modular design comprising a base unit analyzing modules and sensor modules allows for a configurationaccording to different application requirements.
status: valid
status modified: 2024-08-02
accepted date: 2024-08-02
in scheme: AQD - Measurement Equipment**
measures pollutant: Nitrogen monoxide (air)
measures pollutant: Particulate matter < 10 µm (aerosol)
measures pollutant: Ozone (air)
measures pollutant: Particulate matter < 2.5 µm (aerosol)
measures pollutant: Nitrogen dioxide (air)
measures pollutant: Sulphur dioxide (air)
measures pollutant: Nitrogen oxides (air)
measures pollutant: Carbon monoxide (air)
measures pollutant: Hydrogen sulphide (air)

SYNSPEC model Alpha 400
type: Concept
notation: alpha400
definition: Benzene analyser model Alpha 400
status: valid
status modified: 2024-08-02
accepted date: 2024-08-02
in scheme: AQD - Measurement Equipment**

Andersen/GMW Model FH621-N Beta Monitor
type: Concept
notation: andersenFH621N
definition: Andersen Instruments Model FH62I-N PM10 Beta Attenuation Monitor consisting of the following components: FH101 Vacuum Pump Assembly - FH102 Accessory Kit - FH107 Roof Flange Kit - FH125 Zero and Span PM 10 Mass Foil Calibration Kit - FH62I Beta Attenuation 19-inch Control Module - SA246b PM10Inlet (16.7 liter/min) or the louvered inlet specified in 40 CFR 50 Appendix L Figs. L-2 thru L-19 operated for 24-hour average measurements with an observing time of 60 minutes the calibration factor set to 2400 a glass fiber filter tape an automatic filter advance after each 24-hour sample period and with or without either of the following options: FH0P1 Indoor Cabinet FH0P2 Outdoor Shelter Assembly
status: superseded
status modified: 2024-08-02
accepted date: 2024-08-02
in scheme: AQD - Measurement Equipment**
measures pollutant: Particulate matter < 10 µm (aerosol)

Thermo Andersen Series FH 62 C14 Continuous PM10 Ambient Particulate Monitor
type: Concept
notation: andersenFH62C14
definition: Thermo Andersen Series FH 62 C14 Continuous PM10 Ambient Particulate Monitor and Thermo Scientific Model 5014i Beta (5014i Beta) Continuous Ambient Particulate Monitor ” operated for 24-hour average measurements with the specified 10-micron EPA PM10inlet (or alternative louvered PM10inlet meeting 40 CFR 50 Appendix L specifications) inlet connector sample tube with heater roof flange kit mass foil kit pump kit sample filter tape with operational settings of 1000 L/h (16.67 L/min) sample flowrate daily filter change auto filter change at volumetric flow <950 L/h auto filter change at mass >1500 micrograms and factory default calculation mode settings operated with software version 1.07. Operated calibrated and serviced according to the appropriate Operator Manual
status: valid
status modified: 2024-08-02
accepted date: 2024-08-02
in scheme: AQD - Measurement Equipment**
measures pollutant: Particulate matter < 10 µm (aerosol)

Andersen/GMW Model FH62I-N Beta Monitor
type: Concept
notation: andersenFH62IN
definition: Andersen Instruments Model FH62I-N PM10 Beta Attenuation Monitor consisting of the following components: FH101 Vacuum Pump Assembly - FH102 Accessory Kit - FH107 Roof Flange Kit - FH125 Zero and Span PM 10 Mass Foil Calibration Kit - FH62I Beta Attenuation 19-inch Control Module - SA246b PM10Inlet (16.7 liter/min) or the louvered inlet specified in 40 CFR 50 Appendix L Figs. L-2 thru L-19 - operated for 24-hour average measurements with an observing time of 60 minutes the calibration factor set to 2400 a glass fiber filter tape an automatic filter advance after each 24-hour sample period and with or without either of the following options: FH0P1 Indoor Cabinet - FH0P2 Outdoor Shelter Assembly
status: valid
status modified: 2024-08-02
accepted date: 2024-08-02
in scheme: AQD - Measurement Equipment**
measures pollutant: Particulate matter < 10 µm (aerosol)

Thermo Andersen ESM FH 62 I-R
type: Concept
notation: andersenFH62IR
status: valid
status modified: 2024-08-02
accepted date: 2024-08-02
in scheme: AQD - Measurement Equipment**
example: http://www.epa.gov/ttnamti1/files/ambient/criteria/reference-equivalent-methods-list.pdf
measures pollutant: Total suspended particulates (aerosol)
measures pollutant: Particulate matter < 10 µm (aerosol)
measures pollutant: Particulate matter < 2.5 µm (aerosol)

Modified Andersen GPS-1 sampler
type: Concept
notation: andersenGPS-1-modif
status: valid
status modified: 2024-08-02
accepted date: 2024-08-02
in scheme: AQD - Measurement Equipment**

Andersen/GMW generic High-Volume Air Sampler
type: Concept
notation: andersenHVS
status: valid
status modified: 2024-08-02
accepted date: 2024-08-02
in scheme: AQD - Measurement Equipment**
measures pollutant: Particulate matter < 10 µm (aerosol)

Aurora nephelometer 3000
type: Concept
notation: aurora3000
definition: 3 WAVELENGTH INTEGRATING NEPHELOMETERAerosol particles in the atmosphere directly influence the earth‚Äôs radiative balance by absorbing and scattering the solar radiation and indirectly by changing the clouds microphysical properties."
status: valid
status modified: 2024-08-02
accepted date: 2022-12-02
in scheme: AQD - Measurement Equipment**

Bendix/Combustion Engineering Model 8101-C Oxides of Nitrogen Analyze
type: Concept
notation: bendix8101c
definition: Bendix or Combustion Engineering Model 8101-C Oxides of Nitrogen Analyzer operated on a 0-0.5 ppm range with a Teflon sample filter (Bendix P/N 007163) installed on the sample inlet line.
status: valid
status modified: 2024-08-02
accepted date: 2024-08-02
in scheme: AQD - Measurement Equipment**
editorial note: Definition from US EPA
example: http://www.epa.gov/ttnamti1/files/ambient/criteria/reference-equivalent-methods-list.pdf
measures pollutant: Nitrogen oxides (air)
measures pollutant: Nitrogen monoxide (air)
measures pollutant: Nitrogen dioxide (air)

Columbia Scientific Industries Models 1600
type: Concept
notation: csi1600
definition: CSI Model 1600 Oxides of Nitrogen Analyzer operated on a 0-0.5 ppm range with a Teflon sample filter (CSI P/N M951-8023)installed on the sample inlet line
status: valid
status modified: 2024-08-02
accepted date: 2024-08-02
in scheme: AQD - Measurement Equipment**
editorial note: Definition from US EPA
example: http://www.epa.gov/ttnamti1/files/ambient/criteria/reference-equivalent-methods-list.pdf
measures pollutant: Nitrogen oxides (air)
measures pollutant: Nitrogen monoxide (air)
measures pollutant: Nitrogen dioxide (air)

Columbia Scientific Industries Models 5600
type: Concept
notation: csi5600
definition: CSI Model 5600 Oxides of Nitrogen Analyzer operated on a 0-0.5 ppm range with any signal integration time in the range of 20 to 99 seconds with a Teflon sample filter (CSI P/N M951-8023) installed on the sample inlet line
status: valid
status modified: 2024-08-02
accepted date: 2024-08-02
in scheme: AQD - Measurement Equipment**
editorial note: Definition from US EPA
example: http://www.epa.gov/ttnamti1/files/ambient/criteria/reference-equivalent-methods-list.pdf
measures pollutant: Nitrogen dioxide (air)
measures pollutant: Nitrogen oxides (air)
measures pollutant: Nitrogen monoxide (air)

DASIBI
type: Concept
notation: dasibi
status: valid
status modified: 2024-08-02
accepted date: 2024-08-02
in scheme: AQD - Measurement Equipment**
editorial note: check pollutant

DASIBI 1003 O3 analyser
type: Concept
notation: dasibi1003
status: valid
status modified: 2024-08-02
accepted date: 2024-08-02
in scheme: AQD - Measurement Equipment**
measures pollutant: Ozone (air)

DASIBI 1003-PC O3 analyser
type: Concept
notation: dasibi1003PC
status: valid
status modified: 2024-08-02
accepted date: 2024-08-02
in scheme: AQD - Measurement Equipment**
measures pollutant: Ozone (air)

DASIBI 1003-RS O3 analyser
type: Concept
notation: dasibi1003RS
status: valid
status modified: 2024-08-02
accepted date: 2024-08-02
in scheme: AQD - Measurement Equipment**
measures pollutant: Ozone (air)

DASIBI 1008 O3 analyser
type: Concept
notation: dasibi1008
status: valid
status modified: 2024-08-02
accepted date: 2024-08-02
in scheme: AQD - Measurement Equipment**
measures pollutant: Ozone (air)

DASIBI 1008-AH O3 analyser
type: Concept
notation: dasibi1008AH
status: valid
status modified: 2024-08-02
accepted date: 2024-08-02
in scheme: AQD - Measurement Equipment**
measures pollutant: Ozone (air)

DASIBI 1008-PC O3 analyser
type: Concept
notation: dasibi1008PC
status: valid
status modified: 2024-08-02
accepted date: 2024-08-02
in scheme: AQD - Measurement Equipment**
measures pollutant: Ozone (air)

DASIBI 1008-RS O3 analyser
type: Concept
notation: dasibi1008RS
status: valid
status modified: 2024-08-02
accepted date: 2024-08-02
in scheme: AQD - Measurement Equipment**
measures pollutant: Ozone (air)

DASIBI 1108 O3 analyser
type: Concept
notation: dasibi1108
status: valid
status modified: 2024-08-02
accepted date: 2024-08-02
in scheme: AQD - Measurement Equipment**
measures pollutant: Ozone (air)

DASIBI 2108 NOx analyser
type: Concept
notation: dasibi2108
status: valid
status modified: 2024-08-02
accepted date: 2024-08-02
in scheme: AQD - Measurement Equipment**
measures pollutant: Nitrogen oxides (air)
measures pollutant: Nitrogen dioxide (air)
measures pollutant: Nitrogen monoxide (air)

DASIBI 3008 CO analyser
type: Concept
notation: dasibi3008
status: valid
status modified: 2024-08-02
accepted date: 2024-08-02
in scheme: AQD - Measurement Equipment**
measures pollutant: Carbon monoxide (air)

DASIBI 4108 SO2 analyser
type: Concept
notation: dasibi4108
status: valid
status modified: 2024-08-02
accepted date: 2024-08-02
in scheme: AQD - Measurement Equipment**
measures pollutant: Sulphur dioxide (air)

DASIBI 5014
type: Concept
notation: dasibi5014
status: valid
status modified: 2024-08-02
accepted date: 2024-08-02
in scheme: AQD - Measurement Equipment**
editorial note: check pollutant

DASIBI 7001
type: Concept
notation: dasibi7001
status: valid
status modified: 2024-08-02
accepted date: 2024-08-02
in scheme: AQD - Measurement Equipment**
editorial note: check pollutant

EBERLINE model FH 62-1
type: Concept
notation: eberlineFH62-1
definition: Beta-absorption method PM10 analyser
status: valid
status modified: 2024-08-02
accepted date: 2024-08-02
in scheme: AQD - Measurement Equipment**

Environnement S.A. Model AC21M NO2 Analyzer
type: Concept
notation: enrivoAC21M
status: valid
status modified: 2024-08-02
accepted date: 2024-08-02
in scheme: AQD - Measurement Equipment**
editorial note: check pollutant
measures pollutant: Nitrogen dioxide (air)
measures pollutant: Nitrogen oxides (air)
measures pollutant: Nitrogen monoxide (air)

Environnement S.A. Model AC30M NO2 Analyzer
type: Concept
notation: enrivoAC30M
status: valid
status modified: 2024-08-02
accepted date: 2024-08-02
in scheme: AQD - Measurement Equipment**
measures pollutant: Nitrogen dioxide (air)
measures pollutant: Nitrogen oxides (air)
measures pollutant: Nitrogen monoxide (air)

Environnement S.A. Model AC31M NO2 Analyzer
type: Concept
notation: enrivoAC31M
definition: Environnement S. A. Model AC31M Chemiluminescent Nitrogen Oxide Analyzer operated with a full scale range of 0 -500ppb at any temperature in the range of 15°C to 35°C with a 5-micron PTFE sample particulate filter with the following software settings: Environnement S. A. Model AC31M Chemiluminescent Nitrogen Oxide Analyzer operated with a full scale range of 0 -500ppb at any temperature in the range of 15°C to 35°C with a 5-micron PTFE sample particulate filter with the following software settings: Automatic response time ON Minimum response time set to 60 seconds (RT 2) and with or without any of the following options: Internal Permeation Oven- Connection for Silica Gel Dryer- RS232-422 interface- EV3 valve- Internal Printer
status: valid
status modified: 2024-08-02
accepted date: 2024-08-02
in scheme: AQD - Measurement Equipment**
measures pollutant: Nitrogen oxides (air)
measures pollutant: Nitrogen dioxide (air)
measures pollutant: Nitrogen monoxide (air)

Environnement S.A. Model AC32M NO2 Analyzer
type: Concept
notation: enrivoAC32M
definition: Environnement S. A. Model AC32M Chemiluminescent Nitrogen Oxides Analyzer operated with a full scale range of 0 -500 ppb at any temperature in the range of 10°C to 35°C with a 5-micron PTFE sample particulate filter with response time setting 11 (automatic response time) and with or without the following option:Internal permeation oven.
status: valid
status modified: 2024-08-02
accepted date: 2024-08-02
in scheme: AQD - Measurement Equipment**
editorial note: Definition from US EPA
example: http://www.epa.gov/ttnamti1/files/ambient/criteria/reference-equivalent-methods-list.pdf
measures pollutant: Nitrogen monoxide (air)
measures pollutant: Nitrogen dioxide (air)
measures pollutant: Nitrogen oxides (air)

ENVEA AF22E
type: Concept
notation: enveaAF22E
definition: UV Fluorescence gas monitor offering excellent performances for the monitoring of SO2 in the range 0-10 ppm or 0-1 ppmEco-designed reference air quality monitor QAL1 certified by the TÜV US-EPA approved. Utilizes the standard method for the measurement of sulfur dioxides(EN 14212). With its ultra low power consumption & 24 V supply (option) the AF22e is the sole SO2 monitor on the market able to measure without being connected to the power grid.https://www.envea.global/s/emissions-en/gas-monitors-emissions-en/af22e-dilution/
status: valid
status modified: 2024-08-02
accepted date: 2024-08-02
in scheme: AQD - Measurement Equipment**
measures pollutant: Sulphur dioxide (air)

ENVEA UT3000
type: Concept
notation: enveaUT3000
definition: Total Gaseous Mercury (TGM) Ultratracer. Measuring of Total Gaseous Mercury (TGM) in air and other gases
status: valid
status modified: 2024-08-02
accepted date: 2024-08-02
in scheme: AQD - Measurement Equipment**
measures pollutant: Elemental Gaseous Mercury (air+aerosol)

Environnement S.A. Model AC32E NO2 Analyzer (superseded by EnveaAC32e)
type: Concept
notation: enviroAC32E
status: valid
status modified: 2024-08-02
accepted date: 2024-08-02
in scheme: AQD - Measurement Equipment**
measures pollutant: Nitrogen dioxide (air)
measures pollutant: Nitrogen monoxide (air)
measures pollutant: Nitrogen oxides (air)

Environnement S.A. Model AF20M SO2 Analyzer
type: Concept
notation: enviroAF20M
status: valid
status modified: 2024-08-02
accepted date: 2024-08-02
in scheme: AQD - Measurement Equipment**
measures pollutant: Sulphur dioxide (air)

Environnement S.A. Model AF21M SO2 Analyzer
type: Concept
notation: enviroAF21M
definition: Environnement S.A Model AF21M Sulfur Dioxide Analyzer operated on a range of 0-0.5 ppm with a response time coefficient setting of 01 a Teflon ilter installed in the rear - panel filter assembly and with or without any of the following options: Rack Mount/Slides RS-232-C Interface
status: valid
status modified: 2024-08-02
accepted date: 2024-08-02
in scheme: AQD - Measurement Equipment**
measures pollutant: Sulphur dioxide (air)

Environnement S.A. Model AF22M SO2 Analyzer
type: Concept
notation: enviroAF22M
definition: Environnement S.A Model AF22M UV Fluorescence Sulfur Dioxide Analyzer operated with a full scale range of 0 - 500 ppb at any temperature in the range of 10°C to 35°C with a 5-micron PTFE sample particulate filter with a response time setting of 11 (Automatic response time) with the automatic “ZERO-REF” cycle ON and set for activation every 24 hours and with or without either of the follow ing options: Permeation oven Rack mount slides
status: valid
status modified: 2024-08-02
accepted date: 2024-08-02
in scheme: AQD - Measurement Equipment**
editorial note: Definition from US EPA
example: http://www.epa.gov/ttnamti1/files/ambient/criteria/reference-equivalent-methods-list.pdf
measures pollutant: Sulphur dioxide (air)

Environnement S.A. Model AS32M Nitrogen Dioxide Analyzer
type: Concept
notation: enviroAS32M
status: valid
status modified: 2024-08-02
accepted date: 2024-08-02
in scheme: AQD - Measurement Equipment**
measures pollutant: Nitrogen monoxide (air)
measures pollutant: Nitrogen oxides (air)
measures pollutant: Nitrogen dioxide (air)

Environnement S.A. Model CO10M CO Analyzer
type: Concept
notation: enviroCO10M
status: valid
status modified: 2024-08-02
accepted date: 2024-08-02
in scheme: AQD - Measurement Equipment**
example: http://www.epa.gov/ttnamti1/files/ambient/criteria/reference-equivalent-methods-list.pdf
measures pollutant: Carbon monoxide (air)

Environnement S.A. Model CO11M CO Analyzer
type: Concept
notation: enviroCO11M
definition: Environnement S.A. Model CO11M Ambient Carbon Monoxide Analyzer operated on a full scale range of 0 - 50 ppm at any temperature in the range of 15 °C to 35°C with a 5-micron PTFE sample particulate filter with the following software settings:Automatic nvironnement S.A. Model CO11M Ambient Carbon Monoxide Analyzer operated on a full scale range of 0 - 50 ppm at any temperature in the range of 15 °C to 35°C with a 5-micron PTFE sample particulate filter with the following software settings:Automatic response time ON - Minimum response time set to 40 seconds (RT 13). Automatic ZERO-REF cycle programmed every 24 hours and with or without any of the following options: RS232-422 Serial Interface - Internal Printer
status: valid
status modified: 2024-08-02
accepted date: 2024-08-02
in scheme: AQD - Measurement Equipment**
measures pollutant: Carbon monoxide (air)

Environnement S.A. Model CO12E CO Analyzer
type: Concept
notation: enviroCO12E
status: valid
status modified: 2024-08-02
accepted date: 2024-08-02
in scheme: AQD - Measurement Equipment**
measures pollutant: Carbon monoxide (air)

Environnement S.A. Model CO12M CO Analyzer
type: Concept
notation: enviroCO12M
definition: Environnement S.A Model CO12M Gas Filter Correlation Carbon Monoxide Analyzer operated with a full scale range of 0 - 50 ppm at any temperature in the range of 10°C to 35°C with a 5-micron PTFE sample particulate filter with response time ON and with the automatic “ZERO-REF” cycle either ON or OFF
status: valid
status modified: 2024-08-02
accepted date: 2024-08-02
in scheme: AQD - Measurement Equipment**
editorial note: Definition from US EPA
example: http://www.epa.gov/ttnamti1/files/ambient/criteria/reference-equivalent-methods-list.pdf
measures pollutant: Carbon monoxide (air)

Environnement-HC51M
type: Concept
notation: enviroHC51M
definition: Using a proven flame ionisation detector (FID) the analyzer HC51M measures ambient air hydrocarbons (THC CH4 nmHC) in the range 0-1000 ppm.
status: valid
status modified: 2024-08-02
accepted date: 2024-08-02
in scheme: AQD - Measurement Equipment**

Environnement S.A. Model MP101M (may be used for PM10 and PM2.5) (superseded by EnveaMP101M)
type: Concept
notation: enviroMP101M
definition: Environnement S. A. Model MP101M with PM10 or PM2.5 Beta Gauge Monitor ” configured with the louvered PM 10 or PM2.5 inlet specified in 40 CFR 50 Appendix L or its flat-topped predecessor version and one of the three optional temperature-regulated sampling tubes (RST) and operated with a full scale measurement range of 0 - 0.500 mg/m3 (0 - 500 g/m3) with the sample flow rate set to 1.00 m3/h and flow regulation set to yes the “norms selection” set to m3(actual volume) the “cycle” set to 24 hours the “period” set to none and the “counting time” set to 200 seconds
status: valid
status modified: 2024-08-02
accepted date: 2024-08-02
in scheme: AQD - Measurement Equipment**
editorial note: Definition from US EPA
example: http://www.epa.gov/ttnamti1/files/ambient/criteria/reference-equivalent-methods-list.pdf
measures pollutant: Particulate matter < 10 µm (aerosol)
measures pollutant: Particulate matter < 2.5 µm (aerosol)

Environnement S.A. Model MP2.5M undefined
type: Concept
notation: enviroMP2.5M
status: valid
status modified: 2024-08-02
accepted date: 2024-08-02
in scheme: AQD - Measurement Equipment**
measures pollutant: Particulate matter < 2.5 µm (aerosol)

Environnement S.A. Model MPSI 100
type: Concept
notation: enviroMPSI100
status: valid
status modified: 2024-08-02
accepted date: 2024-08-02
in scheme: AQD - Measurement Equipment**
measures pollutant: Particulate matter < 10 µm (aerosol)

enviroO331M
type: Concept
notation: enviroO331M
status: valid
status modified: 2024-08-02
accepted date: 2024-08-02
in scheme: AQD - Measurement Equipment**

Environnement S.A. Model O341M UV Ozone Analyzer
type: Concept
notation: enviroO341M
definition: Environnement S.A. Model O341M UV Photometric Ozone Analyzer operated on a full scale range of 0 - 500 ppb at any temperature in the range of 15°C to 35°C with the response time set to 50 seconds and with or without any of the following options: Internal Ozone Generator - Span External Control - RS232 - 422 Serial Interface - Internal Printer.
status: valid
status modified: 2024-08-02
accepted date: 2024-08-02
in scheme: AQD - Measurement Equipment**
measures pollutant: Ozone (air)

Environnement S.A. Model O342E UV Ozone Analyzer (superseded by EnveaO342e)
type: Concept
notation: enviroO342E
status: valid
status modified: 2024-08-02
accepted date: 2024-08-02
in scheme: AQD - Measurement Equipment**
measures pollutant: Ozone (air)

Environnement S.A. Model O342M UV Ozone Analyze
type: Concept
notation: enviroO342M
definition: Environnement S.A Model O342M UV Photometric Ozone Analyzer ” operated with a full scale range of 0 - 500 ppb at any temperature in the range of 10°C to 35°C with a 5-micron PTFE sample particulate filter with response time setting of 11 (Automatic response time) and with or without any of the following options: c) Internal ozone generator d) Span external control (zero/span solenoid valve).
status: valid
status modified: 2024-08-02
accepted date: 2024-08-02
in scheme: AQD - Measurement Equipment**
editorial note: Definition from US EPA
example: http://www.epa.gov/ttnamti1/files/ambient/criteria/reference-equivalent-methods-list.pdf
measures pollutant: Ozone (air)

Environnement S.A. SANOA Multigas Longpath Monitoring System
type: Concept
notation: enviroSANOA
definition: Environnement S.A. Model SANOA Multigas Longpath Air Quality Monitoring System consisting of a receiver one or more projectors interface unit a user-provided control unit computer running the SANOA VisionAIR software and associated incidental equipment configured for measuring SO2 with the temperature control and internal calibration cell options installed operated with a measurement range of 0 to 0.5 ppm over an installed monitoring path length of between 27 and 500 meters within an ambient air temperature range of -30 to +45°C with a measurement (integrating) time of 180 seconds and with or without external temperature and barometric pressure sensors or any of the following options: external (meteo) input connection series 1M bus connection OGR type projector analog outputs.
status: valid
status modified: 2024-08-02
accepted date: 2024-08-02
in scheme: AQD - Measurement Equipment**
measures pollutant: Sulphur dioxide (air)

Horiba model APDA 350 TSP analyser
type: Concept
notation: horibaAPDA350
status: valid
status modified: 2024-08-02
accepted date: 2024-08-02
in scheme: AQD - Measurement Equipment**
measures pollutant: Total suspended particulates (aerosol)

Horiba model APDA 350E TSP analyser
type: Concept
notation: horibaAPDA350E
status: valid
status modified: 2024-08-02
accepted date: 2024-08-02
in scheme: AQD - Measurement Equipment**
measures pollutant: Total suspended particulates (aerosol)

Horiba model APDA 351 TSP analyser
type: Concept
notation: horibaAPDA351
status: valid
status modified: 2024-08-02
accepted date: 2024-08-02
in scheme: AQD - Measurement Equipment**
measures pollutant: Total suspended particulates (aerosol)

Horiba model APDA 351E TSP analyser
type: Concept
notation: horibaAPDA351E
status: valid
status modified: 2024-08-02
accepted date: 2024-08-02
in scheme: AQD - Measurement Equipment**
measures pollutant: Total suspended particulates (aerosol)

Horiba model APDA 371
type: Concept
notation: horibaAPDA371
status: valid
status modified: 2024-08-02
accepted date: 2024-08-02
in scheme: AQD - Measurement Equipment**
measures pollutant: Particulate matter < 10 µm (aerosol)
measures pollutant: Particulate matter < 2.5 µm (aerosol)

Horiba model APDA 372
type: Concept
notation: horibaAPDA372
definition: Horiba model APDA 372
status: valid
status modified: 2024-08-02
accepted date: 2024-08-02
in scheme: AQD - Measurement Equipment**
measures pollutant: Particulate matter < 2.5 µm (aerosol)
measures pollutant: Particulate matter < 1 µm (aerosol)
measures pollutant: Particulate matter < 10 µm (aerosol)

Horiba model APHA 360E hydrocarbons analyser
type: Concept
notation: horibaAPHA350E
status: valid
status modified: 2024-08-02
accepted date: 2024-08-02
in scheme: AQD - Measurement Equipment**
related match: hydrocarbons

Horiba model APHA 360 hydrocarbons analyser
type: Concept
notation: horibaAPHA360
status: valid
status modified: 2024-08-02
accepted date: 2024-08-02
in scheme: AQD - Measurement Equipment**
related match: hydrocarbons

Horiba model APHA 370 hydrocarbons analyser
type: Concept
notation: horibaAPHA370
status: valid
status modified: 2024-08-02
accepted date: 2024-08-02
in scheme: AQD - Measurement Equipment**

Horiba model APMA 300 CO analyser
type: Concept
notation: horibaAPMA300
status: valid
status modified: 2024-08-02
accepted date: 2024-08-02
in scheme: AQD - Measurement Equipment**
measures pollutant: Carbon monoxide (air)

Horiba model APMA 300E CO analyser
type: Concept
notation: horibaAPMA300E
status: valid
status modified: 2024-08-02
accepted date: 2024-08-02
in scheme: AQD - Measurement Equipment**
measures pollutant: Carbon monoxide (air)

Horiba model APMA 350 CO analyser
type: Concept
notation: horibaAPMA350
status: valid
status modified: 2024-08-02
accepted date: 2024-08-02
in scheme: AQD - Measurement Equipment**
measures pollutant: Carbon monoxide (air)

Horiba model APMA 350E CO analyser
type: Concept
notation: horibaAPMA350E
status: valid
status modified: 2024-08-02
accepted date: 2024-08-02
in scheme: AQD - Measurement Equipment**
measures pollutant: Carbon monoxide (air)

Horiba model APMA 360 CO analyser
type: Concept
notation: horibaAPMA360
status: valid
status modified: 2024-08-02
accepted date: 2024-08-02
in scheme: AQD - Measurement Equipment**
measures pollutant: Carbon monoxide (air)

Horiba model APMA 360CE CO analyser
type: Concept
notation: horibaAPMA360CE
status: valid
status modified: 2024-08-02
accepted date: 2024-08-02
in scheme: AQD - Measurement Equipment**
measures pollutant: Carbon monoxide (air)

Horiba model APMA 360E CO analyser
type: Concept
notation: horibaAPMA360E
status: valid
status modified: 2024-08-02
accepted date: 2024-08-02
in scheme: AQD - Measurement Equipment**
measures pollutant: Carbon monoxide (air)

Horiba model APMA 370 CO analyser
type: Concept
notation: horibaAPMA370
status: valid
status modified: 2024-08-02
accepted date: 2024-08-02
in scheme: AQD - Measurement Equipment**
measures pollutant: Carbon monoxide (air)

Horiba model APNA 300 NOx analyser
type: Concept
notation: horibaAPNA300
status: valid
status modified: 2024-08-02
accepted date: 2024-08-02
in scheme: AQD - Measurement Equipment**
measures pollutant: Nitrogen dioxide (air)
measures pollutant: Nitrogen monoxide (air)
measures pollutant: Nitrogen oxides (air)

Horiba model APNA 300E NOx analyser
type: Concept
notation: horibaAPNA300E
status: valid
status modified: 2024-08-02
accepted date: 2024-08-02
in scheme: AQD - Measurement Equipment**
measures pollutant: Nitrogen oxides (air)
measures pollutant: Nitrogen monoxide (air)
measures pollutant: Nitrogen dioxide (air)

Horiba model APNA 350 NOx analyser
type: Concept
notation: horibaAPNA350
status: valid
status modified: 2024-08-02
accepted date: 2024-08-02
in scheme: AQD - Measurement Equipment**
measures pollutant: Nitrogen dioxide (air)
measures pollutant: Nitrogen monoxide (air)
measures pollutant: Nitrogen oxides (air)

Horiba model APNA 350E NOx analyser
type: Concept
notation: horibaAPNA350E
status: valid
status modified: 2024-08-02
accepted date: 2024-08-02
in scheme: AQD - Measurement Equipment**
measures pollutant: Nitrogen monoxide (air)
measures pollutant: Nitrogen oxides (air)
measures pollutant: Nitrogen dioxide (air)

Horiba model APNA 360 NOx analyser
type: Concept
notation: horibaAPNA360
status: valid
status modified: 2024-08-02
accepted date: 2024-08-02
in scheme: AQD - Measurement Equipment**
measures pollutant: Nitrogen dioxide (air)
measures pollutant: Nitrogen monoxide (air)
measures pollutant: Nitrogen oxides (air)

Horiba model APNA 360E NOx analyser
type: Concept
notation: horibaAPNA360E
status: valid
status modified: 2024-08-02
accepted date: 2024-08-02
in scheme: AQD - Measurement Equipment**
measures pollutant: Nitrogen monoxide (air)
measures pollutant: Nitrogen oxides (air)
measures pollutant: Nitrogen dioxide (air)

Horiba model APNA 370 NOx analyser
type: Concept
notation: horibaAPNA370
status: valid
status modified: 2024-08-02
accepted date: 2024-08-02
in scheme: AQD - Measurement Equipment**
measures pollutant: Nitrogen oxides (air)
measures pollutant: Nitrogen dioxide (air)
measures pollutant: Nitrogen monoxide (air)

Horiba model APOA 300 O3 analyser
type: Concept
notation: horibaAPOA300
status: valid
status modified: 2024-08-02
accepted date: 2024-08-02
in scheme: AQD - Measurement Equipment**
measures pollutant: Ozone (air)

Horiba model APOA 350 O3 analyser
type: Concept
notation: horibaAPOA350
status: valid
status modified: 2024-08-02
accepted date: 2024-08-02
in scheme: AQD - Measurement Equipment**
measures pollutant: Ozone (air)

Horiba model APOA 350E O3 analyser
type: Concept
notation: horibaAPOA350E
status: valid
status modified: 2024-08-02
accepted date: 2024-08-02
in scheme: AQD - Measurement Equipment**
measures pollutant: Ozone (air)

Horiba model APOA 360 O3 analyser
type: Concept
notation: horibaAPOA360
status: valid
status modified: 2024-08-02
accepted date: 2024-08-02
in scheme: AQD - Measurement Equipment**
measures pollutant: Ozone (air)

Horiba model APOA 350E O3 analyser
type: Concept
notation: horibaAPOA360E
status: valid
status modified: 2024-08-02
accepted date: 2024-08-02
in scheme: AQD - Measurement Equipment**
measures pollutant: Ozone (air)

Horiba model APOA 370 O3 analyser
type: Concept
notation: horibaAPOA370
status: valid
status modified: 2024-08-02
accepted date: 2024-08-02
in scheme: AQD - Measurement Equipment**
measures pollutant: Ozone (air)

Horiba model APSA 300 SO2 analyser
type: Concept
notation: horibaAPSA300
status: valid
status modified: 2024-08-02
accepted date: 2024-08-02
in scheme: AQD - Measurement Equipment**
measures pollutant: Sulphur dioxide (air)

Horiba model APSA 350 SO2 analyser
type: Concept
notation: horibaAPSA350
status: valid
status modified: 2024-08-02
accepted date: 2024-08-02
in scheme: AQD - Measurement Equipment**
measures pollutant: Sulphur dioxide (air)

Horiba model APSA 350E SO2 analyser
type: Concept
notation: horibaAPSA350E
status: valid
status modified: 2024-08-02
accepted date: 2024-08-02
in scheme: AQD - Measurement Equipment**
measures pollutant: Sulphur dioxide (air)

Horiba model APSA 360 SO2 analyser
type: Concept
notation: horibaAPSA360
status: valid
status modified: 2024-08-02
accepted date: 2024-08-02
in scheme: AQD - Measurement Equipment**
measures pollutant: Sulphur dioxide (air)

Horiba model APSA 360A SO2 analyser
type: Concept
notation: horibaAPSA360A
status: valid
status modified: 2024-08-02
accepted date: 2024-08-02
in scheme: AQD - Measurement Equipment**
measures pollutant: Sulphur dioxide (air)

Horiba model APSA 360E SO2 analyser
type: Concept
notation: horibaAPSA360E
status: valid
status modified: 2024-08-02
accepted date: 2024-08-02
in scheme: AQD - Measurement Equipment**
measures pollutant: Sulphur dioxide (air)

Horiba model APSA 370 SO2 analyser
type: Concept
notation: horibaAPSA370
status: valid
status modified: 2024-08-02
accepted date: 2024-08-02
in scheme: AQD - Measurement Equipment**
measures pollutant: Sulphur dioxide (air)
measures pollutant: Hydrogen sulphide (air)

ONLY USED IN ONE STATION IN RS
type: Concept
notation: horibaFH621R
status: valid
status modified: 2024-08-02
accepted date: 2024-08-02
in scheme: AQD - Measurement Equipment**
editorial note: ONLY USED IN ONE STATION IN RS
example: http://www.doiserbia.nb.rs/img/doi/1451-9372/2008/1451-93720801005J.pdf
measures pollutant: Particulate matter < 10 µm (aerosol)

KIMOTO 168s
type: Concept
notation: kimoto168s
status: valid
status modified: 2024-08-02
accepted date: 2024-08-02
in scheme: AQD - Measurement Equipment**
measures pollutant: Particulate matter < 10 µm (aerosol)

Marga
type: Concept
notation: marga
status: valid
status modified: 2024-08-02
accepted date: 2024-08-02
in scheme: AQD - Measurement Equipment**

MCV 30-QL
type: Concept
notation: mcv30ql
status: valid
status modified: 2024-08-02
accepted date: 2024-08-02
in scheme: AQD - Measurement Equipment**
editorial note: check pollutant

MCV 48-AUV
type: Concept
notation: mcv48auv
status: valid
status modified: 2024-08-02
accepted date: 2024-08-02
in scheme: AQD - Measurement Equipment**
editorial note: check pollutant

MCV 64-FUV
type: Concept
notation: mcv64fuv
status: valid
status modified: 2024-08-02
accepted date: 2024-08-02
in scheme: AQD - Measurement Equipment**
editorial note: check pollutant

MCV CAV-A/MSb Captador d'Alt Volum Seqüencial
type: Concept
notation: mcvCAV-AMSb
status: valid
status modified: 2024-08-02
accepted date: 2024-08-02
in scheme: AQD - Measurement Equipment**
example: http://www.mcvsa.com/Productes/Atm%C3%B3sfera/CaptadordealtovolumensecuencialMCVCAVAMSb/tabid/139/Default.aspx
measures pollutant: Particulate matter < 10 µm (aerosol)
measures pollutant: Particulate matter < 2.5 µm (aerosol)

MCV CAV-A/mb Captador d'Alt Volum
type: Concept
notation: mcvCAV-Amb
status: valid
status modified: 2024-08-02
accepted date: 2024-08-02
in scheme: AQD - Measurement Equipment**
example: http://www.mcvsa.com/Productes/Atm%C3%B3sfera/CaptadordealtovolumenMCVCAVAmb/tabid/114/Default.aspx
measures pollutant: Particulate matter < 10 µm (aerosol)
measures pollutant: Particulate matter < 2.5 µm (aerosol)

Meloy Model SA 700 Fluorescence Sulfur Dioxide Analyze
type: Concept
notation: meloySA700
definition: Meloy Model SA 700 Fluorescence Sulfur Dioxide Analyzeroperated on the 0-250 ppb1 the 0-500 ppb or the 0-1000 ppb range with a time constant switch position of either 2 or 3.The analyzer may be operated at temperatures between 20°C and 30°C and at line voltages between 105 and 130 volts with or without any of the following options: FS-1 Current Output - FS-2 Rack Mount Conversion - FS-2A Rack Mount Conversion - FS-2B Rack Mount Conversion - FS-3 Front Panel Mounted Digital Meter - FS-5 Auto/Manual Zero/Span With Status - FS-6Remote/Manual Zero/Span With Status - FS-7 Auto Zero Adjust. voltages between 105 and 130 volts with or without any of the following options: FS-1 Current Output
status: valid
status modified: 2024-08-02
accepted date: 2024-08-02
in scheme: AQD - Measurement Equipment**
measures pollutant: Sulphur dioxide (air)

Multi-gas Micro Monitoring station (MMS) Portable version
type: Concept
notation: multigasMMS
status: valid
status modified: 2024-08-02
accepted date: 2024-08-02
in scheme: AQD - Measurement Equipment**
related match: multiple

Opsis AR500 Open path monitor
type: Concept
notation: opsisAR500
status: valid
status modified: 2024-08-02
accepted date: 2024-08-02
in scheme: AQD - Measurement Equipment**

Opsis AR500 Open path monitor with ER 110
type: Concept
notation: opsisAR500-ER110
status: valid
status modified: 2024-08-02
accepted date: 2024-08-02
in scheme: AQD - Measurement Equipment**
measures pollutant: Ozone (air)
measures pollutant: Benzene (air)
measures pollutant: Nitrogen dioxide (air)
measures pollutant: Sulphur dioxide (air)

Opsis AR500 Open path monitor with ER 120
type: Concept
notation: opsisAR500-ER120
status: valid
status modified: 2024-08-02
accepted date: 2024-08-02
in scheme: AQD - Measurement Equipment**
measures pollutant: Sulphur dioxide (air)
measures pollutant: Benzene (air)
measures pollutant: Nitrogen dioxide (air)
measures pollutant: Ozone (air)

Opsis AR500 Open path monitor with ER 150
type: Concept
notation: opsisAR500-ER150
status: valid
status modified: 2024-08-02
accepted date: 2024-08-02
in scheme: AQD - Measurement Equipment**
measures pollutant: Benzene (air)
measures pollutant: Ozone (air)
measures pollutant: Nitrogen dioxide (air)
measures pollutant: Nitrogen oxides (air)
measures pollutant: Nitrogen monoxide (air)
measures pollutant: Sulphur dioxide (air)
measures pollutant: Toluene (air)

Opsis SM200 Particulate Analyser with PM2.5 & PM10 Heads
type: Concept
notation: opsisSM200
status: valid
status modified: 2024-08-02
accepted date: 2024-08-02
in scheme: AQD - Measurement Equipment**
measures pollutant: Particulate matter < 2.5 µm (aerosol)
measures pollutant: Particulate matter < 10 µm (aerosol)

Osiris Turnkey Instruments
type: Concept
notation: osiris
definition: Osiris air monitoring device measures airborne particles (TSP PM10 PM2.5 and PM1). MCERTS certified for PM10
status: valid
status modified: 2024-08-02
accepted date: 2024-08-02
in scheme: AQD - Measurement Equipment**

Other
type: Concept
notation: other
status: valid
status modified: 2024-08-02
accepted date: 2024-08-02
in scheme: AQD - Measurement Equipment**

Perkin Elmer Clarus 500
type: Concept
notation: perkinelmerC500
definition: Perkin Elmer Clarus 500
status: valid
status modified: 2024-08-02
accepted date: 2024-08-02
in scheme: AQD - Measurement Equipment**

Perking Elmer Turbomatrix Desorber
type: Concept
notation: perkinelmerTurbomatrixDesorber
definition: Perking Elmer Turbomatrix Desorber
status: valid
status modified: 2024-08-02
accepted date: 2024-08-02
in scheme: AQD - Measurement Equipment**

PHILIPS K50031 Chromatographic Analyser
type: Concept
notation: philipsK50031
status: valid
status modified: 2024-08-02
accepted date: 2024-08-02
in scheme: AQD - Measurement Equipment**
related match: NM-VOC & CH4

PHILIPS K50033 API 100E
type: Concept
notation: philipsK50033
status: valid
status modified: 2024-08-02
accepted date: 2024-08-02
in scheme: AQD - Measurement Equipment**
example: http://fbd.beun.edu.tr/index.php/zkufbd/article/download/53/100
measures pollutant: Sulphur dioxide (air)

PHILIPS K50034 API 200A
type: Concept
notation: philipsK50034
status: valid
status modified: 2024-08-02
accepted date: 2024-08-02
in scheme: AQD - Measurement Equipment**
example: http://fbd.beun.edu.tr/index.php/zkufbd/article/download/53/100
measures pollutant: Nitrogen dioxide (air)
measures pollutant: Nitrogen monoxide (air)
measures pollutant: Nitrogen oxides (air)

PHILIPS K50093 API 300A
type: Concept
notation: philipsK50093
status: valid
status modified: 2024-08-02
accepted date: 2024-08-02
in scheme: AQD - Measurement Equipment**
example: http://fbd.beun.edu.tr/index.php/zkufbd/article/download/53/100
measures pollutant: Carbon monoxide (air)

PHILIPS K50094 API 400
type: Concept
notation: philipsK50094
status: valid
status modified: 2024-08-02
accepted date: 2024-08-02
in scheme: AQD - Measurement Equipment**
example: http://fbd.beun.edu.tr/index.php/zkufbd/article/download/53/100
measures pollutant: Ozone (air)

PHILIPS K50102 NO
type: Concept
notation: philipsK50102
status: valid
status modified: 2024-08-02
accepted date: 2024-08-02
in scheme: AQD - Measurement Equipment**
example: http://www.brace.sinanet.apat.it/
measures pollutant: Nitrogen dioxide (air)
measures pollutant: Nitrogen oxides (air)
measures pollutant: Nitrogen monoxide (air)

PHILIPS K50109/00 Gas Filter Correlation CO analyser
type: Concept
notation: philipsK50109
status: valid
status modified: 2024-08-02
accepted date: 2024-08-02
in scheme: AQD - Measurement Equipment**
example: http://www.docstoc.com/docs/145715957/ABC_EAREX07_instruments
measures pollutant: Carbon monoxide (air)

PHILIPS K50110/00 UV Photometric O3 analyser
type: Concept
notation: philipsK50110
status: valid
status modified: 2024-08-02
accepted date: 2024-08-02
in scheme: AQD - Measurement Equipment**
example: http://www.docstoc.com/docs/145715957/ABC_EAREX07_instruments
measures pollutant: Ozone (air)

PHILIPS K50129 unknown
type: Concept
notation: philipsK50129
status: valid
status modified: 2024-08-02
accepted date: 2024-08-02
in scheme: AQD - Measurement Equipment**
editorial note: check pollutant

PHILIPS K50130 unknown
type: Concept
notation: philipsK50130
status: valid
status modified: 2024-08-02
accepted date: 2024-08-02
in scheme: AQD - Measurement Equipment**
editorial note: check pollutant

PHILIPS K50206/00 Pulsed Fluorescence SO2 analyser
type: Concept
notation: philipsK50206
status: valid
status modified: 2024-08-02
accepted date: 2024-08-02
in scheme: AQD - Measurement Equipment**
example: http://www.docstoc.com/docs/145715957/ABC_EAREX07_instruments
measures pollutant: Sulphur dioxide (air)

PHILIPS K50235/00 NO-NOx-NO2 analyser
type: Concept
notation: philipsK50235
status: valid
status modified: 2024-08-02
accepted date: 2024-08-02
in scheme: AQD - Measurement Equipment**
example: http://www.arpa.emr.it/cms3/documenti/_cerca_doc/aria/rimini/rn_valloni_tesi_laurea_mar2010.pdf
measures pollutant: Nitrogen monoxide (air)
measures pollutant: Nitrogen oxides (air)
measures pollutant: Nitrogen dioxide (air)

Philips PW 9700
type: Concept
notation: Philips PW 9700
definition: Philips PW 9700
status: valid
status modified: 2024-08-02
accepted date: 2024-08-02
in scheme: AQD - Measurement Equipment**

PHILIPS PW9755/00 SO2 Analyser
type: Concept
notation: philipsPW9755
status: valid
status modified: 2024-08-02
accepted date: 2024-08-02
in scheme: AQD - Measurement Equipment**
measures pollutant: Sulphur dioxide (air)

PHILIPS PW9762/00 NO/NO2/NOX Analyser
type: Concept
notation: philipsPW9762
status: valid
status modified: 2024-08-02
accepted date: 2024-08-02
in scheme: AQD - Measurement Equipment**
example: http://www.epa.gov/ttnamti1/files/ambient/criteria/reference-equivalent-methods-list.pdf
measures pollutant: Nitrogen dioxide (air)
measures pollutant: Sulphur dioxide (air)
measures pollutant: Nitrogen oxides (air)
measures pollutant: Nitrogen monoxide (air)

philipsPW9771
type: Concept
notation: philipsPW9771
definition: philipsPW9771
status: valid
status modified: 2024-09-02
accepted date: 2024-09-02
in scheme: AQD - Measurement Equipment**
measures pollutant: Ozone (air)

PHILIPS PW9775/00 CO Analyser
type: Concept
notation: philipsPW9775
definition: PHILIPS PW9775/00 CO Analyser
status: valid
status modified: 2024-08-07
accepted date: 2024-08-07
in scheme: AQD - Measurement Equipment**
measures pollutant: Carbon monoxide (air)

Picarro G2103
type: Concept
notation: picarroG2103
definition: Picarro G2103 (used for NH3 measurement)
status: valid
status modified: 2024-08-02
accepted date: 2024-08-02
in scheme: AQD - Measurement Equipment**
measures pollutant: Ammonia (air)

Picarro G2302
type: Concept
notation: picarroG2302
definition: Picarro G2302 (used for CO measurement)
status: valid
status modified: 2024-08-02
accepted date: 2024-08-02
in scheme: AQD - Measurement Equipment**
measures pollutant: Carbon monoxide (air)

Picarro G2303
type: Concept
notation: picarroG2303
definition: Picarro G2303 (used for CO measurement)
status: valid
status modified: 2024-08-02
accepted date: 2024-08-02
in scheme: AQD - Measurement Equipment**
measures pollutant: Carbon monoxide (air)

serinus 40 Nox
type: Concept
notation: serinus40
status: valid
status modified: 2024-08-02
accepted date: 2024-08-02
in scheme: AQD - Measurement Equipment**
editorial note: not from OPSIS
measures pollutant: Nitrogen oxides (air)
measures pollutant: Nitrogen monoxide (air)
measures pollutant: Nitrogen dioxide (air)

serinus 40 with NH3 converter
type: Concept
notation: serinus40NH3
definition: Ecotech serinus 40 used for NOx-NO2-NO modified to measure NOH3 (including a converter)
status: valid
status modified: 2024-08-02
accepted date: 2024-08-02
in scheme: AQD - Measurement Equipment**
measures pollutant: Ammonia (air)

ECOTECH SERINUS 51
type: Concept
notation: serinus51
definition: The Serinus 51 H2S/SO2 instruments can integrate seamlessly into continuous monitoring networks and can sequentially measure H2S and then SO2
status: valid
status modified: 2024-08-02
accepted date: 2024-08-02
in scheme: AQD - Measurement Equipment**
measures pollutant: Sulphur dioxide (air)

EC/OC measurements Sunset Laboratory Inc Thermal / Optical Carbon Analyser (near-real time)
type: Concept
notation: sunsetTOCA
definition: EC/OC measurements Sunset Laboratory Inc Thermal / Optical Carbon Analyser - operated near real time
status: valid
status modified: 2024-08-02
accepted date: 2024-08-02
in scheme: AQD - Measurement Equipment**

Tecan CLD502
type: Concept
notation: tecanCLD502
status: valid
status modified: 2024-08-02
accepted date: 2024-08-02
in scheme: AQD - Measurement Equipment**

Tekran mercury analyser 1130
type: Concept
notation: tekran1130
definition: Tekran mercury analyser 1130
status: valid
status modified: 2024-08-02
accepted date: 2024-08-02
in scheme: AQD - Measurement Equipment**

Tekran mercury analyser 1135
type: Concept
notation: tekran1135
definition: Tekran mercury analyser 1135
status: valid
status modified: 2024-08-02
accepted date: 2024-08-02
in scheme: AQD - Measurement Equipment**

Tekran mercury analyser 2537A
type: Concept
notation: tekran2537A
definition: Tekran mercury analyser 2537A. Elemental mercury is sampled by placing the 1130 before the main 2537A instrument. The respective constituents are sampled from the air using either the 1130 add-on for reactive gaseous mercury or the 1135 add-on for particulate bound mercury.
status: valid
status modified: 2024-08-02
accepted date: 2024-08-02
in scheme: AQD - Measurement Equipment**

Tekran mercury analyser 2537B
type: Concept
notation: tekran2537B
definition: Tekran mercury analyser 2537B
status: valid
status modified: 2024-08-02
accepted date: 2024-08-02
in scheme: AQD - Measurement Equipment**

Tekran mercury analyser 2537X
type: Concept
notation: tekran2537X
definition: Tekran mercury analyser 2537X
status: valid
status modified: 2024-08-02
accepted date: 2024-08-02
in scheme: AQD - Measurement Equipment**

Thermo model 14B chemiluminescence NO-NO2-Nox
type: Concept
notation: thermo14B
status: valid
status modified: 2024-08-02
accepted date: 2024-08-02
in scheme: AQD - Measurement Equipment**
measures pollutant: Nitrogen dioxide (air)
measures pollutant: Nitrogen oxides (air)
measures pollutant: Nitrogen monoxide (air)

Thermo model 14B/E chemiluminescence NO-NO2-Nox
type: Concept
notation: thermo14B-E
status: valid
status modified: 2024-08-02
accepted date: 2024-08-02
in scheme: AQD - Measurement Equipment**
measures pollutant: Nitrogen oxides (air)
measures pollutant: Nitrogen monoxide (air)
measures pollutant: Nitrogen dioxide (air)

Thermo model 14B/E chemiluminescence NO-NO2-Nox
type: Concept
notation: thermo14BE
status: valid
status modified: 2024-08-02
accepted date: 2024-08-02
in scheme: AQD - Measurement Equipment**
measures pollutant: Nitrogen oxides (air)
measures pollutant: Nitrogen monoxide (air)
measures pollutant: Nitrogen dioxide (air)

thermo41h
type: Concept
notation: thermo41h
definition: Gas Filter Correlation CO2 Analyzer 115V-AC
status: valid
status modified: 2024-12-12
accepted date: 2024-12-12
in scheme: AQD - Measurement Equipment**
measures pollutant: Carbon dioxide (air)

Thermo model 42 NO/Nox analyser
type: Concept
notation: thermo42
status: valid
status modified: 2024-08-02
accepted date: 2024-08-02
in scheme: AQD - Measurement Equipment**
editorial note: specific model undetermined
editorial note: check
measures pollutant: Nitrogen dioxide (air)
measures pollutant: Nitrogen monoxide (air)
measures pollutant: Nitrogen oxides (air)

Thermo model 42c NO/Nox analyser
type: Concept
notation: thermo42c
status: valid
status modified: 2024-08-02
accepted date: 2024-08-02
in scheme: AQD - Measurement Equipment**
example: http://www.thermo.com/eThermo/CMA/PDFs/Various/156File_17809.pdf
measures pollutant: Nitrogen monoxide (air)
measures pollutant: Nitrogen dioxide (air)
measures pollutant: Nitrogen oxides (air)

Thermo model 42C-TL (Trace level Nox)
type: Concept
notation: thermo42c-TL
status: valid
status modified: 2024-08-02
accepted date: 2024-08-02
in scheme: AQD - Measurement Equipment**
editorial note: does this exist?
example: https://www.thermo.com/eThermo/CMA/PDFs/Product/productPDF_20985.pdf
measures pollutant: Nitrogen dioxide (air)
measures pollutant: Nitrogen oxides (air)
measures pollutant: Nitrogen monoxide (air)

Thermo model 42i NO/Nox analyser
type: Concept
notation: thermo42i
status: valid
status modified: 2024-08-02
accepted date: 2024-08-02
in scheme: AQD - Measurement Equipment**
measures pollutant: Nitrogen dioxide (air)
measures pollutant: Nitrogen monoxide (air)
measures pollutant: Nitrogen oxides (air)

Thermo model 42i NO/NOx analyser - blue light
type: Concept
notation: thermo42i-BL
status: valid
status modified: 2024-08-02
accepted date: 2024-08-02
in scheme: AQD - Measurement Equipment**
measures pollutant: Nitrogen oxides (air)
measures pollutant: Nitrogen monoxide (air)
measures pollutant: Nitrogen dioxide (air)

Thermo model 42i-TL (Trace level Nox)
type: Concept
notation: thermo42i-TL
status: valid
status modified: 2024-08-02
accepted date: 2024-08-02
in scheme: AQD - Measurement Equipment**
example: https://www.thermo.com/eThermo/CMA/PDFs/Product/productPDF_30698.pdf
measures pollutant: Nitrogen monoxide (air)
measures pollutant: Nitrogen oxides (air)
measures pollutant: Nitrogen dioxide (air)

Thermo model 42s NO/Nox analyser
type: Concept
notation: thermo42s
status: valid
status modified: 2024-08-02
accepted date: 2024-08-02
in scheme: AQD - Measurement Equipment**
measures pollutant: Nitrogen oxides (air)
measures pollutant: Nitrogen monoxide (air)
measures pollutant: Nitrogen dioxide (air)

Thermo model 42w NO/Nox analyser
type: Concept
notation: thermo42w
status: valid
status modified: 2024-08-02
accepted date: 2024-08-02
in scheme: AQD - Measurement Equipment**
measures pollutant: Nitrogen dioxide (air)
measures pollutant: Nitrogen oxides (air)
measures pollutant: Nitrogen monoxide (air)

Thermo model 43 SO2 analyser
type: Concept
notation: thermo43
status: valid
status modified: 2024-08-02
accepted date: 2024-08-02
in scheme: AQD - Measurement Equipment**
editorial note: specific model undetermined
measures pollutant: Sulphur dioxide (air)

Thermo model 43c-TL SO2 analyser
type: Concept
notation: thermo43CTL
status: valid
status modified: 2024-08-02
accepted date: 2024-08-02
in scheme: AQD - Measurement Equipment**
example: https://www.thermo.com/eThermo/CMA/PDFs/Product/productPDF_30540.pdf
measures pollutant: Sulphur dioxide (air)

Thermo model 43a SO2 analyser
type: Concept
notation: thermo43a
status: valid
status modified: 2024-08-02
accepted date: 2024-08-02
in scheme: AQD - Measurement Equipment**
measures pollutant: Sulphur dioxide (air)

Thermo model 43b SO2 analyser
type: Concept
notation: thermo43b
status: valid
status modified: 2024-08-02
accepted date: 2024-08-02
in scheme: AQD - Measurement Equipment**
measures pollutant: Sulphur dioxide (air)

Thermo model 43bs SO2 analyser
type: Concept
notation: thermo43bs
status: valid
status modified: 2024-08-02
accepted date: 2024-08-02
in scheme: AQD - Measurement Equipment**
measures pollutant: Sulphur dioxide (air)

Thermo model 43c SO2 analyser
type: Concept
notation: thermo43c
status: valid
status modified: 2024-08-02
accepted date: 2024-08-02
in scheme: AQD - Measurement Equipment**
measures pollutant: Sulphur dioxide (air)

Thermo model 43h pulsed fluorescence SO2 analyser
type: Concept
notation: thermo43h
status: valid
status modified: 2024-08-02
accepted date: 2024-08-02
in scheme: AQD - Measurement Equipment**
measures pollutant: Sulphur dioxide (air)

Thermo model 43i SO2 analyser
type: Concept
notation: thermo43i
status: valid
status modified: 2024-08-02
accepted date: 2024-08-02
in scheme: AQD - Measurement Equipment**
example: https://static.thermoscientific.com/images/D19736~.pdf
measures pollutant: Sulphur dioxide (air)

Thermo model 43i-TLE (Enhanced Trace Level)
type: Concept
notation: thermo43i-TLE
status: valid
status modified: 2024-08-02
accepted date: 2024-08-02
in scheme: AQD - Measurement Equipment**
example: http://www.thermo.com/eThermo/CMA/PDFs/Product/productPDF_20982.pdf
measures pollutant: Sulphur dioxide (air)

Thermo model 43s SO2 analyser
type: Concept
notation: thermo43s
status: valid
status modified: 2024-08-02
accepted date: 2024-08-02
in scheme: AQD - Measurement Equipment**
editorial note: check
measures pollutant: Sulphur dioxide (air)

Thermo model 43w SO2 analyser
type: Concept
notation: thermo43w
status: valid
status modified: 2024-08-02
accepted date: 2024-08-02
in scheme: AQD - Measurement Equipment**
measures pollutant: Sulphur dioxide (air)

Thermo model 48 CO analyser
type: Concept
notation: thermo48
status: valid
status modified: 2024-08-02
accepted date: 2024-08-02
in scheme: AQD - Measurement Equipment**
measures pollutant: Carbon monoxide (air)

Thermo model 48 CO analyser (gas filter correlation)
type: Concept
notation: thermo48-GFC
status: valid
status modified: 2024-08-02
accepted date: 2024-08-02
in scheme: AQD - Measurement Equipment**
measures pollutant: Carbon monoxide (air)

Thermo model 48c CO analyser
type: Concept
notation: thermo48c
status: valid
status modified: 2024-08-02
accepted date: 2024-08-02
in scheme: AQD - Measurement Equipment**
measures pollutant: Carbon monoxide (air)

Thermo model 48i CO analyser
type: Concept
notation: thermo48i
status: valid
status modified: 2024-08-02
accepted date: 2024-08-02
in scheme: AQD - Measurement Equipment**
measures pollutant: Carbon monoxide (air)

Thermo model 48i-TLE (Enhanced Trace Level)
type: Concept
notation: thermo48i-TLE
status: valid
status modified: 2024-08-02
accepted date: 2024-08-02
in scheme: AQD - Measurement Equipment**
measures pollutant: Carbon monoxide (air)

Thermo model 48w CO analyser
type: Concept
notation: thermo48w
status: valid
status modified: 2024-08-02
accepted date: 2024-08-02
in scheme: AQD - Measurement Equipment**
measures pollutant: Carbon monoxide (air)

Thermo model 49 O3 analyser
type: Concept
notation: thermo49
status: valid
status modified: 2024-08-02
accepted date: 2024-08-02
in scheme: AQD - Measurement Equipment**
measures pollutant: Ozone (air)

Thermo model 49c O3 analyser
type: Concept
notation: thermo49c
status: valid
status modified: 2024-08-02
accepted date: 2024-08-02
in scheme: AQD - Measurement Equipment**
measures pollutant: Ozone (air)

Thermo 49 CPS Ozone Primary Standard
type: Concept
notation: thermo49cps
status: valid
status modified: 2024-08-02
accepted date: 2024-08-02
in scheme: AQD - Measurement Equipment**
editorial note: This is a reference photomer not an analyser
editorial note: Thermo 49 CPS Ozone Primary Standard
example: http://rental.cleanair.com/thermo49cpsozoneprimarystandard
measures pollutant: Ozone (air)

Thermo model 49i O3 analyser
type: Concept
notation: thermo49i
status: valid
status modified: 2024-08-02
accepted date: 2024-08-02
in scheme: AQD - Measurement Equipment**
measures pollutant: Ozone (air)

Thermo model 49w O3 analyser
type: Concept
notation: thermo49w
status: valid
status modified: 2024-08-02
accepted date: 2024-08-02
in scheme: AQD - Measurement Equipment**
measures pollutant: Ozone (air)

Thermo Scientific 5012 MAAP
type: Concept
notation: thermo5012MAAP
definition: The Model 5012 MAAP measures the aerosol-related absorption of light and the corresponding atmospheric black carbon mass concentration. Continuous data is provided by a multiple detector setup to simultaneously measure the transmitted and the scattered light from a particle-loaded filter. Typical applications include determining ambient elemental carbon for health-related effects and aerosol light absorption for visibility monitoring (regional haze) and climate research.
status: valid
status modified: 2024-08-02
accepted date: 2024-08-02
in scheme: AQD - Measurement Equipment**

Thermo 5014i Beta Continuous Ambient Particulate Monitor
type: Concept
notation: thermo5014i
definition: Measure PM-10 PM-2.5 or PM-1 mass concentrations with the Thermo Scientific™ 5014i Beta Continuous Ambient Particulate Monitor. The 5014i distinguishes itself from other beta measurement methods by utilizing a continuous (non-step wise) mass measurement with a proven industry standard which provides for long-term unattended operation. To accurately address potential water bias and volatile loss the Dynamic Heating System allows the user to hold the sample temperature at a fixed value or below a relative humidity threshold.
status: valid
status modified: 2024-08-02
accepted date: 2024-08-02
in scheme: AQD - Measurement Equipment**
measures pollutant: Particulate matter < 10 µm (aerosol)
measures pollutant: Particulate matter < 2.5 µm (aerosol)
measures pollutant: Particulate matter < 1 µm (aerosol)

Thermo model 5030 SHARP Particular Monitor with PM10 & PM2.5 heads
type: Concept
notation: thermo5030SHARP
definition: The Thermo Scientific™ 5030 SHARP continuously measures the mass concentration of particulate utilizing a combination of beta attenuation and light scattering technology.The only continuous (non-step wise) hybrid ambient monitor that provides high resolution measurement of airborne particulates with excellent short and long term precision.
status: valid
status modified: 2024-08-02
accepted date: 2024-08-02
in scheme: AQD - Measurement Equipment**
measures pollutant: Particulate matter < 2.5 µm (aerosol)
measures pollutant: Particulate matter < 10 µm (aerosol)
measures pollutant: Particulate matter < 1 µm (aerosol)

Thermo a or c-series
type: Concept
notation: thermoAorC
status: valid
status modified: 2024-08-02
accepted date: 2024-08-02
in scheme: AQD - Measurement Equipment**

Thermo i-series
type: Concept
notation: thermoI
status: valid
status modified: 2024-08-02
accepted date: 2024-08-02
in scheme: AQD - Measurement Equipment**

too generic
type: Concept
notation: undetermined
status: valid
status modified: 2024-08-02
accepted date: 2024-08-02
in scheme: AQD - Measurement Equipment**
editorial note: too generic

Unknown
type: Concept
notation: unknown
status: valid
status modified: 2024-08-02
accepted date: 2024-08-02
in scheme: AQD - Measurement Equipment**

UNOR 610 (5) - SICK
type: Concept
notation: unor610
definition: UNOR 610 (5) - SICK
status: valid
status modified: 2024-08-02
accepted date: 2024-08-02
in scheme: AQD - Measurement Equipment**

Maihak Unor 6N
type: Concept
notation: unor6N
status: valid
status modified: 2024-08-02
accepted date: 2024-08-02
in scheme: AQD - Measurement Equipment**
editorial note: check pollutant

Varian 3800
type: Concept
notation: varian3800
definition: Varian 3800
status: valid
status modified: 2024-08-02
accepted date: 2024-08-02
in scheme: AQD - Measurement Equipment**

AQD - Measurement Methods
type: ConceptScheme
notation: measurementmethod
is part of: Air Quality Directive e-Reporting
registration status: Public draft
user modified: colinmar
date modified: 2024-09-30 07:48:31.0
vocabulary type: Common
is numeric concept identifiers: false
is notations equal identifiers: false

3-Cups Anemometer
type: Concept
notation: 3-CUPS_ANE
status: valid
status modified: 2024-09-24
accepted date: 2024-09-24
in scheme: AQD - Measurement Methods

Atomic absorption spectrometry (AAS)
type: Concept
notation: AAS
definition: Atomic absorption spectroscopy (AAS) is a spectroanalytical procedure for the quantitative determination of chemical elements employing the absorption of optical radiation (light) by free atoms in the gaseous state. In analytical chemistry the technique is used for determining the concentration of a particular element (the analyte) in a sample to be analyzed. AAS can be used to determine over 70 different elements in solution or directly in solid samples (source: http://en.wikipedia.org/wiki/Atomic_absorption_spectroscopy)
status: valid
status modified: 2024-09-24
accepted date: 2024-09-24
in scheme: AQD - Measurement Methods

AMS/ACSM
type: Concept
notation: AMS-ACSM
definition: Aerosol Mass Spectrometer/Aerosol Chemical Mass Spectrometer
status: valid
status modified: 2019-11-27
in scheme: AQD - Measurement Methods

Beta ray attenuation
type: Concept
notation: BETA
definition: The instrument's primary operating mechanism is the radiometric microbalance system, which relies on changes in the strength of a beta ray beam passing through the filter paper to determine changes in particulate mass collected. A Beta Attenuation Monitor is comprised of three main components: the PM air inlet, the central instrument, and the vacuum pump.
status: valid
status modified: 2013-03-22
accepted date: 2013-03-22
in scheme: AQD - Measurement Methods
scope note: Measurement of Particulate Matter (PM10, PM2.5 & PM1)

Capacitive sensor
type: Concept
notation: CAPA-SENSOR
definition: Capacitive sensors function by using the principle of an ideal plate capacitor. One plate is the sensor itself. The other is the measurement object, which lies across from it. An electrical field is generated between the two plates. A protection ring around the device structure ensures that the electrical field is as homogenous as possible. If an object enters the field, the distance between the two plates changes. This can be measured
status: valid
status modified: 2024-09-24
accepted date: 2024-09-24
in scheme: AQD - Measurement Methods

CAPS
type: Concept
notation: CAPS
definition: For NO2
status: valid
status modified: 2013-10-15
accepted date: 2013-10-15
in scheme: AQD - Measurement Methods

Condensation particle counter
type: Concept
notation: CPC
status: valid
status modified: 2013-03-22
accepted date: 2013-03-22
in scheme: AQD - Measurement Methods

Cavity ring down spectroscopy
type: Concept
notation: CRDS
definition: Cavity ring down spectroscopy for measuring CO2, CH4 & CO
status: valid
status modified: 2013-10-15
accepted date: 2013-10-15
in scheme: AQD - Measurement Methods

Cold vapour atomic fluorescence spectrometry
type: Concept
notation: CV-AFS
definition: Cold vapour atomic fluorescence spectroscopy is a subset of the analytical technique known as atomic fluorescence spectroscopy (AFS). Used in the measurement of trace amounts of volatile heavy metals such as mercury, cold vapour AFS makes use of the unique characteristic of mercury that allows vapour measurement at room temperature. Free mercury atoms in a carrier gas are excited by a collimated ultraviolet light source at a wavelength of 253.7 nanometres. The excited atoms re-radiate their absorbed energy (fluoresce) at this same wavelength.
status: valid
status modified: 2013-03-22
accepted date: 2013-03-22
in scheme: AQD - Measurement Methods
editorial note: Source: http://en.wikipedia.org/wiki/Cold_vapour_atomic_fluorescence_spectroscopy

Differential Optical Absorption Spectroscopy (DOAS)
type: Concept
notation: DOAS
definition: In atmospheric chemistry, differential optical absorption spectroscopy (DOAS) is used to measure concentrations of trace gases. When combined with basic optical spectrometers such as prisms or diffraction gratings and automated, ground-based observation platforms, what we have is a cheap and powerful means for the measurement of such trace gas species as ozone and nitrogen dioxide.
status: valid
status modified: 2013-03-22
accepted date: 2013-03-22
in scheme: AQD - Measurement Methods
scope note: Measurement of SO2, NO2

Flame Atomic Emission Spectroscopy (FAES)
type: Concept
notation: FAES
definition: Flame atomic emission spectroscopy (FAES) is a classical method which has been largely displaced by plasma spectroscopies. Plasmas produce higher atomization ratios, but the theory is similar in both flame and the plasmas. FAES is the classical method used as plasmas have taken over as the preferred method due to the higher atomization ratios that occur.
status: valid
status modified: 2024-09-24
accepted date: 2024-09-24
in scheme: AQD - Measurement Methods

Flame ionization detection (FID)
type: Concept
notation: FID
definition: A flame ionization detector (FID) is a type of gas detector used in gas chromatography. The detection of organic compounds is most effectively done with flame ionization.
status: valid
status modified: 2013-10-15
accepted date: 2013-10-15
in scheme: AQD - Measurement Methods

Gas chromatography
type: Concept
notation: GC
definition: Gas chromatography
status: valid
status modified: 2017-06-27
in scheme: AQD - Measurement Methods

Gas chromatography followed by flame ionization detection (GC-FID)
type: Concept
notation: GC-FID
status: valid
status modified: 2013-03-22
accepted date: 2013-03-22
in scheme: AQD - Measurement Methods

Gas chromatography followed by mass spectrometry (GC-MS)
type: Concept
notation: GC-MS
definition: Gas chromatography–mass spectrometry (GC-MS) is a method that combines the features of gas-liquid chromatography and mass spectrometry to identify different substances within a test sample.
status: valid
status modified: 2013-03-22
accepted date: 2013-03-22
in scheme: AQD - Measurement Methods

Gas chromatography followed by photo ionization detection (GC-PID)
type: Concept
notation: GC-PID
status: valid
status modified: 2015-09-08
in scheme: AQD - Measurement Methods

Gravimetric analysis
type: Concept
notation: GRAVIMETRIC
definition: Gravimetric analysis describes a set of methods in analytical chemistry for the quantitative determination of an analyte based on the mass of a solid. A simple example is the measurement of solids suspended in air sample: A known volume of air is filtered, and the collected solids are weighed
status: valid
status modified: 2024-09-24
accepted date: 2024-09-24
in scheme: AQD - Measurement Methods

Ion chromatography
type: Concept
notation: IC
definition: Ion chromatography (or ion-exchange chromatography) is a process that allows the separation of ions and polar molecules based on their charge. It can be used for almost any kind of charged molecule including large proteins, small nucleotides and amino acids. The solution to be injected is usually called a sample, and the individually separated components are called analytes. It is often used in protein purification, water analysis, and quality control.
status: valid
status modified: 2013-03-22
accepted date: 2013-03-22
in scheme: AQD - Measurement Methods

Infrared gas filter correlation
type: Concept
notation: IR-GFC
status: valid
status modified: 2013-03-22
accepted date: 2013-03-22
in scheme: AQD - Measurement Methods
scope note: Measurement of CO

Multi-Stage Solid State Thermistor
type: Concept
notation: M-S_SST
status: valid
status modified: 2024-09-24
accepted date: 2024-09-24
in scheme: AQD - Measurement Methods

Multi-angle Absorption Photometry (MAAP)
type: Concept
notation: MAAP
definition: The measurement is performed at three detection angles to resolve the influence of light-scattering aerosol components on the angular distribution of the back scattered radiation. The fraction of light absorbed by the deposited aerosol (absorbance ABS) is obtained from a radiative transfer scheme.
status: valid
status modified: 2024-09-24
accepted date: 2024-09-24
in scheme: AQD - Measurement Methods

Non-dispersive infrared spectroscopy (NDIR)
type: Concept
notation: NDIR
definition: A nondispersive infrared sensor (or NDIR) sensor is a simple spectroscopic device often used as gas detector. The main components are an infrared source (lamp), a sample chamber or light tube, a wavelength sample chamber, and gas concentration is measured electro-optically by its absorption of a specific wavelength in the infrared (IR). The IR light is directed through the sample chamber towards the detector. In parallel there is another chamber with an enclosed reference gas, typically nitrogen. The detector has an optical filter in front of it that eliminates all light except the wavelength that the selected gas molecules can absorb.
status: valid
status modified: 2013-03-22
accepted date: 2013-03-22
in scheme: AQD - Measurement Methods
scope note: The reference method for the measurement of carbon monoxide is that described in EN 14626:2005 ‘Ambient air quality — Standard method for the measurement of the concentration of carbon monoxide by non-dispersive infrared spectroscopy’

NTC + Capacitive sensor
type: Concept
notation: NTC-CAP_SEN
status: valid
status modified: 2024-09-24
accepted date: 2024-09-24
in scheme: AQD - Measurement Methods

Optical particle counter + conversion to mass concentration
type: Concept
notation: OPC-CMC
definition: Optical particle counter + conversion to mass concentration for Particular Matter Example: http://dd.eionet.europa.eu/vocabulary/aq/measurementequipment/GRIMM-EDM180
status: valid
status modified: 2013-10-15
accepted date: 2013-10-15
in scheme: AQD - Measurement Methods

Photo Ionization Detection (PID)
type: Concept
notation: PID
definition: A PID uses an ultraviolet (UV) light source to break down VOCs in the air into positive and negative ions. The PID then detects or measures the charge of the ionized gas, with the charge being a function of the concentration of VOCs in the air.
status: valid
status modified: 2024-09-24
accepted date: 2024-09-24
in scheme: AQD - Measurement Methods

Platina Resistand
type: Concept
notation: PLAT_RESISTAND
status: valid
status modified: 2024-09-24
accepted date: 2024-09-24
in scheme: AQD - Measurement Methods

Pyranometer with Thermopile Sensors
type: Concept
notation: PYRANOM_THERMOPILE
definition: Pyranometer with Thermopile Sensors
status: valid
status modified: 2024-09-24
accepted date: 2024-09-24
in scheme: AQD - Measurement Methods

Scanning mobilty particle sizer (SMPS)
type: Concept
notation: SMPS
status: valid
status modified: 2013-03-22
accepted date: 2013-03-22
in scheme: AQD - Measurement Methods

Spectrophotometry
type: Concept
notation: SP
definition: Spectrophotometry is the quantitative measurement of the reflection or transmission properties of a material as a function of wavelength. It is more specific than the general term electromagnetic spectroscopy in that spectrophotometry deals with visible light, near-ultraviolet, and near-infrared, but does not cover time-resolved spectroscopic techniques. Spectrophotometry involves the use of a spectrophotometer. A spectrophotometer is a photometer that can measure intensity as a function of the light source wavelength. Important features of spectrophotometers are spectral bandwidth and linear range of absorption or reflectance measurement.
status: valid
status modified: 2013-10-15
accepted date: 2013-10-15
in scheme: AQD - Measurement Methods

Tipping-Bucket
type: Concept
notation: T-BUCKET
status: valid
status modified: 2024-09-24
accepted date: 2024-09-24
in scheme: AQD - Measurement Methods

Tapered Element Oscillating Microbalance (TEOM)
type: Concept
notation: TEOM
definition: A continuous direct mass measurement of particulate matter utilizing a tapered element oscillating microbalance (TEOM).
status: valid
status modified: 2013-03-22
accepted date: 2013-03-22
in scheme: AQD - Measurement Methods
scope note: Measurement of Particulate Matter (PM10, PM2.5 & PM1)

Tapered Element Oscillating Microbalance (TEOM) with Filter Dynamics Measurement System (FDMS)
type: Concept
notation: TEOM-FDMS
definition: A continuous direct mass measurement particulate matter utilizing a tapered element oscillating microbalance (TEOM) and Filter Dynamics Measurement System (FDMS).
status: valid
status modified: 2013-03-22
accepted date: 2013-03-22
in scheme: AQD - Measurement Methods
scope note: Measurement of Particulate Matter (PM10, PM2.5 & PM1)

Tapered Element Oscillating Microbalance (TEOM) + correction with estimated volatile fraction
type: Concept
notation: TEOM-corVolatile
definition: A continuous direct mass measurement particulate matter utilizing a tapered element oscillating microbalance (TEOM) and correction with estimated volatile fraction (A correction to take into account the missing volatile fraction. This fraction is estimated from another station where a TEOM 1400 and a TEOM FDMS are used in parallel.)
status: valid
status modified: 2018-03-05
in scheme: AQD - Measurement Methods

Thermo-optical EC/OC measurement
type: Concept
notation: Thermo-optical EC/OC measurement
status: valid
status modified: 2013-10-15
accepted date: 2013-10-15
in scheme: AQD - Measurement Methods

UV fluorescence
type: Concept
notation: UV-FL
status: valid
status modified: 2013-03-22
accepted date: 2013-03-22
in scheme: AQD - Measurement Methods
scope note: The reference method for the measurement of sulphur dioxide is that described in EN 14212:2005 ‘Ambient air quality — Standard method for the measurement of the concentration of sulphur dioxide by ultraviolet fluorescence’.

Ultraviolet (UV) photometry
type: Concept
notation: UV-P
definition: Also UV absorption
status: valid
status modified: 2013-03-22
accepted date: 2013-03-22
in scheme: AQD - Measurement Methods
scope note: The reference method for the measurement of ozone is that described in EN 14625:2005 ‘Ambient air quality — Standard method for the measurement of the concentration of ozone by ultraviolet photometry’.

Ultrasone Anemometer
type: Concept
notation: Ultrasone_Anemometer
status: valid
status modified: 2024-09-24
accepted date: 2024-09-24
in scheme: AQD - Measurement Methods

Vakuum-Ultraviolet (VUV) Spectrometry
type: Concept
notation: VUV
definition: Vakuum-Ultraviolet (VUV) Spectrometry
status: valid
status modified: 2017-06-27
in scheme: AQD - Measurement Methods

Zeeman atomic absorption spectrometry (ZeemanAAS)
type: Concept
notation: ZeemanAAS
definition: Analysis of Hg
status: valid
status modified: 2013-10-15
accepted date: 2013-10-15
in scheme: AQD - Measurement Methods

Chemiluminescence
type: Concept
notation: chemi
definition: Chemiluminescence (sometimes "chemoluminescence") is the emission of light (luminescence), as the result of a chemical reaction. One known gas phase reaction is the basis of nitric oxide detection in commercial analytic instruments applied to environmental air-quality testing. Ozone is combined with nitric oxide to form nitrogen dioxide in an activated state. The activated NO2 luminesces broadband visible to infrared light as it reverts to a lower energy state. A photomultiplier and associated electronics counts the photons that are proportional to the amount of NO present. To determine the amount of nitrogen dioxide, NO2, in a sample (containing no NO) it must first be converted to nitric oxide, NO, by passing the sample through a converter before the above ozone activation reaction is applied. The ozone reaction produces a photon count proportional to NO that is proportional to NO2 before it was converted to NO. In the case of a mixed sample that contains both NO and NO2, the above reaction yields the amount of NO and NO2 combined in the air sample, assuming that the sample is passed through the converter.
status: valid
status modified: 2013-03-22
accepted date: 2013-03-22
in scheme: AQD - Measurement Methods
scope note: The reference method for the measurement of nitrogen dioxide and oxides of nitrogen is that described in EN 14211:2005 ‘Ambient air quality — Standard method for the measurement of the concentration of nitrogen dioxide and nitrogen monoxide by chemiluminescence’.

Coulometry
type: Concept
notation: coulometry
status: valid
status modified: 2013-10-15
accepted date: 2013-10-15
in scheme: AQD - Measurement Methods

Light absorption
type: Concept
notation: light-abs
status: valid
status modified: 2013-03-22
accepted date: 2013-03-22
in scheme: AQD - Measurement Methods

Light scattering
type: Concept
notation: light-scat
status: valid
status modified: 2013-10-03
accepted date: 2013-10-03
in scheme: AQD - Measurement Methods

Nephelometry
type: Concept
notation: nephelometry
definition: Nephelometry is a light scattering method to detect particles in liquid samples. The principle is to measure forwarded scattered light when a laser beam passes through a sample and the light is deflected by the particles.
status: valid
status modified: 2013-10-15
accepted date: 2013-10-15
in scheme: AQD - Measurement Methods

Nephelometry + BETA
type: Concept
notation: nephelometry+beta
definition: See description for Nephelometry See description for BETA Example: http://dd.eionet.europa.eu/vocabulary/aq/measurementequipment/thermo5030SHARP
status: valid
status modified: 2013-10-15
accepted date: 2013-10-15
in scheme: AQD - Measurement Methods

Other, please specify
type: Concept
notation: other
status: valid
status modified: 2013-03-22
accepted date: 2013-03-22
in scheme: AQD - Measurement Methods

Potentiometry
type: Concept
notation: Potentiometry
definition: Used for HF & F-
status: valid
status modified: 2013-10-15
accepted date: 2013-10-15
in scheme: AQD - Measurement Methods

Reflectrometry
type: Concept
notation: reflect
status: valid
status modified: 2013-03-22
accepted date: 2013-03-22
in scheme: AQD - Measurement Methods

Saltzman - colorimetric microdetermination of NO2
type: Concept
notation: saltzman
definition: Saltzman method for the determination of NO2 in the atmosphere by colorimetric reaction.
status: valid
status modified: 2019-05-14
in scheme: AQD - Measurement Methods

Analogue Wind Vane
type: Concept
notation: AN-WV
status: valid
status modified: 2024-09-30
accepted date: 2024-09-30
in scheme: AQD - Measurement Methods

AQD - Measurement Type
type: ConceptScheme
notation: measurementtype
is part of: Air Quality Directive e-Reporting
registration status: Public draft
user modified: targajau
date modified: 2015-09-29 10:03:16.0
vocabulary type: Common
is numeric concept identifiers: false
is notations equal identifiers: false

Active sampling
type: Concept
notation: active
status: valid
status modified: 2013-03-22
accepted date: 2013-03-22
in scheme: AQD - Measurement Type

Automatic analyzer
type: Concept
notation: automatic
status: valid
status modified: 2013-03-22
accepted date: 2013-03-22
in scheme: AQD - Measurement Type

Passive sampling
type: Concept
notation: passive
status: valid
status modified: 2013-03-22
accepted date: 2013-03-22
in scheme: AQD - Measurement Type

Remote sensor
type: Concept
notation: remote
status: valid
status modified: 2013-03-22
accepted date: 2013-03-22
in scheme: AQD - Measurement Type

Unknown
type: Concept
notation: unknown
status: valid
status modified: 2015-09-29
in scheme: AQD - Measurement Type

AQD - AQ Plans - Measure Type
type: ConceptScheme
notation: measuretype
is part of: Air Quality Directive e-Reporting
registration status: Public draft
user modified: targajau
date modified: 2016-01-11 15:11:52.0
vocabulary type: Common
is numeric concept identifiers: false
is notations equal identifiers: false

Coordinated measure with other MS
type: Concept
notation: coordinated
status: valid
status modified: 2013-03-22
accepted date: 2013-03-22
in scheme: AQD - AQ Plans - Measure Type

Measure integrated in Air Quality Plan
type: Concept
notation: integrated
status: valid
status modified: 2013-03-22
accepted date: 2013-03-22
in scheme: AQD - AQ Plans - Measure Type

Other
type: Concept
notation: other
status: valid
status modified: 2013-03-22
accepted date: 2013-03-22
in scheme: AQD - AQ Plans - Measure Type

Measure outside of Air quality or Short term Action Plan
type: Concept
notation: outside
status: valid
status modified: 2013-03-22
accepted date: 2013-03-22
in scheme: AQD - AQ Plans - Measure Type

Measure geared at the protection of sensitive groups
type: Concept
notation: sensitive
status: valid
status modified: 2013-03-22
accepted date: 2013-03-22
in scheme: AQD - AQ Plans - Measure Type

Short term measure
type: Concept
notation: short
status: valid
status modified: 2013-03-22
accepted date: 2013-03-22
in scheme: AQD - AQ Plans - Measure Type

AQD - Meteo parameter
type: ConceptScheme
notation: meteoparameter
is part of: Air Quality Directive e-Reporting
registration status: Public draft
user modified: targajau
date modified: 2025-09-12 08:40:55.0
vocabulary type: Common
is numeric concept identifiers: false
is notations equal identifiers: false

Wind velocity
type: Concept
notation: 51
status: valid
status modified: 2014-03-31
accepted date: 2014-03-31
in scheme: AQD - Meteo parameter

Wind direction
type: Concept
status: valid
status modified: 2014-03-31
accepted date: 2014-03-31
in scheme: AQD - Meteo parameter

Pressure
type: Concept
status: valid
status modified: 2014-03-31
accepted date: 2014-03-31
in scheme: AQD - Meteo parameter

Temperature
type: Concept
status: valid
status modified: 2014-03-31
accepted date: 2014-03-31
in scheme: AQD - Meteo parameter

Absolute humidity
type: Concept
status: valid
status modified: 2014-03-31
accepted date: 2014-03-31
in scheme: AQD - Meteo parameter

Mixing height
type: Concept
status: valid
status modified: 2014-03-31
accepted date: 2014-03-31
in scheme: AQD - Meteo parameter

Relative humidity
type: Concept
status: valid
status modified: 2014-03-31
accepted date: 2014-03-31
in scheme: AQD - Meteo parameter

Duration of sunlight
type: Concept
status: valid
status modified: 2014-03-31
accepted date: 2014-03-31
in scheme: AQD - Meteo parameter

Precipitation
type: Concept
status: valid
status modified: 2014-03-31
accepted date: 2014-03-31
in scheme: AQD - Meteo parameter

Wind component south-north
type: Concept
status: valid
status modified: 2014-03-31
accepted date: 2014-03-31
in scheme: AQD - Meteo parameter

Wind component west-east
type: Concept
status: valid
status modified: 2014-03-31
accepted date: 2014-03-31
in scheme: AQD - Meteo parameter

Wind component vertical
type: Concept
status: valid
status modified: 2014-03-31
accepted date: 2014-03-31
in scheme: AQD - Meteo parameter

Volume of air
type: Concept
status: valid
status modified: 2014-03-31
accepted date: 2014-03-31
in scheme: AQD - Meteo parameter

Direct solar IR radiation
type: Concept
status: valid
status modified: 2014-03-31
accepted date: 2014-03-31
in scheme: AQD - Meteo parameter

Direct solar UV radiation
type: Concept
status: valid
status modified: 2014-03-31
accepted date: 2014-03-31
in scheme: AQD - Meteo parameter

Direct solar radiation
type: Concept
status: valid
status modified: 2014-03-31
accepted date: 2014-03-31
in scheme: AQD - Meteo parameter

Global radiation
type: Concept
status: valid
status modified: 2014-03-31
accepted date: 2014-03-31
in scheme: AQD - Meteo parameter

Diffused radiation
type: Concept
status: valid
status modified: 2014-03-31
accepted date: 2014-03-31
in scheme: AQD - Meteo parameter

Reflected radiation
type: Concept
status: valid
status modified: 2014-03-31
accepted date: 2014-03-31
in scheme: AQD - Meteo parameter

Direct solar visible radiation
type: Concept
status: valid
status modified: 2014-03-31
accepted date: 2014-03-31
in scheme: AQD - Meteo parameter

No meteo measured
type: Concept
status: valid
status modified: 2014-04-01
accepted date: 2014-04-01
in scheme: AQD - Meteo parameter

AQD - Model application
type: ConceptScheme
notation: modelapplication
is part of: Air Quality Directive e-Reporting
registration status: Public draft
user modified: targajau
date modified: 2025-09-17 13:19:41.0
vocabulary type: Common
is numeric concept identifiers: false
is notations equal identifiers: true

Natural source adjustment
type: Concept
notation: adjustment
definition: Natural source adjustment
status: valid
status modified: 2025-04-11
accepted date: 2025-04-11
in scheme: AQD - Model application

air quality concentrations
type: Concept
notation: airqualityconcentrations
definition: Assessment of ground air quality level
status: valid
status modified: 2016-02-11
in scheme: AQD - Model application

air quality forecasting
type: Concept
notation: airqualityforecasting
definition: Air quality forecasting
status: valid
status modified: 2016-02-11
in scheme: AQD - Model application

Evidence
type: Concept
notation: assessment
definition: Evidence
status: valid
status modified: 2025-04-11
accepted date: 2025-04-11
in scheme: AQD - Model application

population exposure
type: Concept
notation: populationexposure
definition: Assessment of population exposure
status: valid
status modified: 2016-02-11
in scheme: AQD - Model application

Scenario
type: Concept
notation: scenario
definition: Scenario
status: valid
status modified: 2025-04-11
accepted date: 2025-04-11
in scheme: AQD - Model application

source apportionment
type: Concept
notation: sourceapportionment
definition: Source apportionment
status: valid
status modified: 2016-02-11
in scheme: AQD - Model application

spatial representativeness
type: Concept
notation: sr
definition: spatial representativeness
status: deprecated
status modified: 2025-09-17
accepted date: 2025-09-17
in scheme: AQD - Model application

AQD - Model or objective estimation input parameters
type: ConceptScheme
notation: modelparameter
is part of: Air Quality Directive e-Reporting
registration status: Released
user modified: targajau
date modified: 2020-03-19 17:29:14.0
vocabulary type: Common
is numeric concept identifiers: false
is notations equal identifiers: true

Advection scheme
type: Concept
notation: advection
definition: Description of the scheme used to characterise the horizontal transport of the atmosphere
status: valid
status modified: 2014-04-01
accepted date: 2014-04-01
in scheme: AQD - Model or objective estimation input parameters

Boundary conditions
type: Concept
notation: boundaryconditions
definition: Boundary conditions
status: valid
status modified: 2017-04-12
in scheme: AQD - Model or objective estimation input parameters

Chemistry or chemical schemes applicable
type: Concept
notation: chemistry
definition: A description of the chemical schemes or algorithms describing chemistry used in the model.
status: valid
status modified: 2013-11-13
accepted date: 2013-11-13
in scheme: AQD - Model or objective estimation input parameters

Convection scheme
type: Concept
notation: convection
definition: Description of the scheme used to describe the vertical transport of the atmosphere
status: valid
status modified: 2014-04-01
accepted date: 2014-04-01
in scheme: AQD - Model or objective estimation input parameters

Deposition scheme
type: Concept
notation: deposition
definition: Description of the deposition schemes used to describe dry and wet deposition
status: valid
status modified: 2014-04-01
accepted date: 2014-04-01
in scheme: AQD - Model or objective estimation input parameters

Emissions inventory applied
type: Concept
notation: emissions
definition: Descriptive text to enable the identification tracing of the emissions inventory used as input to the model, including version / year publication & projection information as applicable.
status: valid
status modified: 2013-11-13
accepted date: 2013-11-13
in scheme: AQD - Model or objective estimation input parameters

Meteorology applied
type: Concept
notation: meteorology
definition: Descriptive text on the type of meteorology used to parameterise the model.
status: valid
status modified: 2013-11-13
accepted date: 2013-11-13
in scheme: AQD - Model or objective estimation input parameters

Model application
type: Concept
notation: modelapplication
definition: Parameter used in D1b to declare that modelapplication is to be provided in E1b. In E1b, further description of encoding is to be provided via http://dd.eionet.europa.eu/vocabulary/aq/modelapplication/
status: valid
status modified: 2017-04-12
in scheme: AQD - Model or objective estimation input parameters

Spatial resolution
type: Concept
notation: resolution
definition: Textual description of model resolution
status: valid
status modified: 2017-07-21
in scheme: AQD - Model or objective estimation input parameters

Sampling points used
type: Concept
notation: samplingPoints
definition: A list of the sampling point used to inform an objective estimation assessment technique
status: valid
status modified: 2014-08-14
accepted date: 2014-08-14
in scheme: AQD - Model or objective estimation input parameters

Empirical scaling
type: Concept
notation: scaling
definition: Description of empirical scaling factors applied as part of the model e.g. scaling factors to derive short-term exceedance statistics from long-term means.
status: valid
status modified: 2015-08-03
in scheme: AQD - Model or objective estimation input parameters

Topography scheme
type: Concept
notation: topography
definition: Description scheme for the terrain height and/or surface roughness
status: valid
status modified: 2014-04-01
accepted date: 2014-04-01
in scheme: AQD - Model or objective estimation input parameters

Turbulence
type: Concept
notation: turbulence
definition: Turbulence profiles based on surface similarity and boundary layer scaling used to describe atmospheric turbulence
status: valid
status modified: 2014-04-01
accepted date: 2014-04-01
in scheme: AQD - Model or objective estimation input parameters

Model type
type: Concept
notation: type
definition: Parameter used in D1b to declare that the model type is to be provided in E1b. In E1b, specific description of the type is to be provided via http://dd.eionet.europa.eu/vocabulary/aq/modeltype
status: valid
status modified: 2016-11-07
in scheme: AQD - Model or objective estimation input parameters

Model projection
type: Concept
notation: projection
definition: Xlink to the projection of the results provided in E1b. (example: http://spatialreference.org/ref/epsg/4326/)
status: valid
status modified: 2017-07-27
in scheme: AQD - Model or objective estimation input parameters

Spatial model resolution
type: ConceptScheme
notation: modelresolution
is part of: Air Quality Directive e-Reporting
registration status: Public draft
user modified: targajau
date modified: 2025-04-11 09:59:51.0
vocabulary type: Common
is numeric concept identifiers: false
is notations equal identifiers: false

Resolution of 10 km (x) * 10 km (y)
type: Concept
notation: 10kmx10km
status: valid
status modified: 2020-03-19
in scheme: Spatial model resolution

Resolution of 5 km (x) * 5 km (y)
type: Concept
notation: 5kmx5km
status: valid
status modified: 2020-03-19
in scheme: Spatial model resolution

10 meters
type: Concept
notation: 10
definition: 10 meters
status: valid
status modified: 2025-04-11
accepted date: 2025-04-11
in scheme: Spatial model resolution

100 meters
type: Concept
notation: 100
definition: 100 meters
status: valid
status modified: 2025-04-11
accepted date: 2025-04-11
in scheme: Spatial model resolution

1000 meters
type: Concept
notation: 1000
definition: 1000 meters
status: valid
status modified: 2025-04-11
accepted date: 2025-04-11
in scheme: Spatial model resolution

10000 meters
type: Concept
notation: 10000
definition: 10000 meters
status: valid
status modified: 2025-04-11
accepted date: 2025-04-11
in scheme: Spatial model resolution

AQD - Model type
type: ConceptScheme
notation: modeltype
is part of: Air Quality Directive e-Reporting
registration status: Public draft
user modified: targajau
date modified: 2017-04-12 12:02:26.0
vocabulary type: Common
is numeric concept identifiers: false
is notations equal identifiers: true

eulerian
type: Concept
notation: eulerian
definition: Atmospheric numerical model. Eulerian models define specific reference points in a gridded system that monitors atmospheric properties, including temperature, pressure, chemical concentration of tracers, over time. Being the representative of the Eulerian model, the Unified Model divides the world up into fixed grid cells which allows for modelling the interactive chemistry within the atmosphere, regarded as a three - dimensional single fluid, and applying well - developed convection parameterisation scheme to represent convective motions.
status: valid
status modified: 2016-02-11
in scheme: AQD - Model type

gaussian plume
type: Concept
notation: gaussian
definition: Gaussian plume.
status: valid
status modified: 2016-02-11
in scheme: AQD - Model type

lagrangian
type: Concept
notation: lagrangian
definition: Atmospheric numerical model. Lagrangian models take the perspective of a finite element or so - called ‘air parcel’. Over time both the position and properties of this air parcel are calculated according to the mean wind field data. The path along which air parcel travels is called its trajectory. It can be expressed as a differential equation. Advanced equation for the trajectory contains two components: mean winds and random turbulence.
status: valid
status modified: 2016-02-11
in scheme: AQD - Model type

AQD - Namespace
type: ConceptScheme
notation: namespace
is part of: Air Quality Directive e-Reporting
registration status: Public draft
user modified: gsellart
date modified: 2025-09-01 11:01:58.0
vocabulary type: Common
is numeric concept identifiers: false
is notations equal identifiers: false

AD.GovernAndorra.AQ
type: Concept
notation: AD.GovernAndorra.AQ
definition: Namespace for Andorra for reporting air quality information under Decision 2011/850/EC
status: valid
status modified: 2021-06-17
accepted date: 2021-06-17
in scheme: AQD - Namespace
surface area: 468
alternative label: test
in country: AD
longitude min: 0.4135781
longitude max: 2.7863837
latitude min: 41.4288238
latitude max: 43.6559357
population: 68403
area: 4.68
population difference: 684.03
area difference: 4.68

AL.AEF.AQ
type: Concept
notation: AL.AEF.AQ
definition: Namespace for Albania for reporting air quality information under Decision 2011/850/EC
status: valid
status modified: 2021-06-17
accepted date: 2021-06-17
in scheme: AQD - Namespace
surface area: 28748
in country: AL
longitude min: 18.30448612
longitude max: 22.02004032
latitude min: 38.62499767
latitude max: 43.68824738
population: 2886026
area: 50
population difference: 28860.26
area difference: 50

AR.AQD
type: Concept
notation: AR.AQD
definition: Namespace for Armenia for reporting air quality information under Decision 2011/850/EC
status: valid
status modified: 2021-06-17
accepted date: 2021-06-17
in scheme: AQD - Namespace
longitude min: 43.5827458
longitude max: 38.74120148
latitude min: 46.50571984
latitude max: 41.24812857

AT.0008.20.AQ
type: Concept
notation: AT.0008.20.AQ
definition: Namespace for Austria for reporting air quality information under Decision 2011/850/EC
status: valid
status modified: 2021-06-17
accepted date: 2021-06-17
in scheme: AQD - Namespace
surface area: 83858
in country: AT
longitude min: 8.479969517
longitude max: 17.97966678
latitude min: 45.43181733
latitude max: 50.03907421
population: 9158750
area: 50
population difference: 50000
area difference: 50

BA.EREP.AQD
type: Concept
notation: BA.EREP.AQD
definition: Namespace for Bosnia and Herzegovina for reporting air quality information under Decision 2011/850/EC
status: valid
status modified: 2021-06-17
accepted date: 2021-06-17
in scheme: AQD - Namespace
surface area: 51129
in country: BA
longitude min: 14.75002608
longitude max: 20.59976
latitude min: 41.65
latitude max: 46.23377676
population: 3964388
area: 50
population difference: 39643.88
area difference: 50

BE.CELINE-IRCEL.AQ
type: Concept
definition: Namespace for Belgium for reporting air quality information under Decision 2011/850/EC
status: valid
status modified: 2021-06-17
accepted date: 2021-06-17
in scheme: AQD - Namespace
surface area: 30688
in country: BE
longitude min: 1.513573032
longitude max: 7.156658156
latitude min: 48.52948355
latitude max: 52.47502371
population: 11311117
area: 50
population difference: 50000
area difference: 50

BG.BG-ExEA.AQ
type: Concept
notation: BG.BG-ExEA.AQ
definition: Namespace for Bulgaria for reporting air quality information under Decision 2011/850/EC
status: valid
status modified: 2021-06-17
accepted date: 2021-06-17
in scheme: AQD - Namespace
surface area: 110910
in country: BG
longitude min: 21.38052575
longitude max: 29.5580815
latitude min: 40.23448599
latitude max: 45.234923
population: 6447710
area: 50
population difference: 50000
area difference: 50

CH.BAFU.AQ
type: Concept
notation: CH.BAFU.AQ
definition: Namespace for Switzerland for reporting air quality information under Decision 2011/850/EC
status: valid
status modified: 2021-06-17
accepted date: 2021-06-17
in scheme: AQD - Namespace
surface area: 41290
in country: CH
longitude min: 5.9
longitude max: 10.44270145
latitude min: 45.77694774
latitude max: 47.83082754
population: 8327126
area: 50
population difference: 50000
area difference: 50

CY.DLI-MLSI.AQ
type: Concept
notation: CY.DLI-MLSI.AQ
definition: Namespace for Cyprus for reporting air quality information under Decision 2011/850/EC
status: valid
status modified: 2021-06-17
accepted date: 2021-06-17
in scheme: AQD - Namespace
surface area: 9248
in country: CY
longitude min: 31.25666711
longitude max: 35.00488081
latitude min: 33.57186941
latitude max: 36.1731247
population: 848319
area: 50
population difference: 8483.19
area difference: 50

CZ.CHMI-Prague-Komorany.AQ
type: Concept
notation: CZ.CHMI-Prague-Komorany.AQ
definition: Namespace for Czech Republic for reporting air quality information under Decision 2011/850/EC
status: valid
status modified: 2021-06-17
accepted date: 2021-06-17
in scheme: AQD - Namespace
surface area: 78866
in country: CZ
longitude min: 11.24011112
longitude max: 19.85314416
latitude min: 47.55530528
latitude max: 52.11726777
population: 10553843
area: 50
population difference: 50000
area difference: 50

de
type: Concept
notation: http://gdi.uba.de/arcgis/rest/services/inspire/DE.UBA.AQD
preferred label: http://gdi.uba.de/arcgis/rest/services/inspire/DE.UBA.AQD
status: valid
status modified: 2021-06-17
accepted date: 2021-06-17
in scheme: AQD - Namespace
surface area: 357021
alternative label: http://gdi.uba.de/arcgis/rest/services/inspire/DE.UBA.AQD
in country: DE
longitude min: 4.988658075
longitude max: 16.01699588
latitude min: 46.3024877
latitude max: 55.98310415
population: 82175684
area: 50
population difference: 50000
area difference: 50

DK.NERI.AQ
type: Concept
notation: DK.NERI.AQ
definition: Namespace for Denmark for reporting air quality information under Decision 2011/850/EC
status: valid
status modified: 2021-06-17
accepted date: 2021-06-17
in scheme: AQD - Namespace
surface area: 43094
in country: DK
longitude min: 8.089976841
longitude max: 12.69000614
latitude min: 54.54
latitude max: 57.73001659
population: 5961249
area: 50
population difference: 50000
area difference: 50

EE.EERC.AQ
type: Concept
notation: EE.EERC.AQ
definition: Namespace for Estonia for reporting air quality information under Decision 2011/850/EC
status: valid
status modified: 2021-06-17
accepted date: 2021-06-17
in scheme: AQD - Namespace
surface area: 45226
in country: EE
longitude min: 21.5
longitude max: 29.13169925
latitude min: 56.47452831
latitude max: 60.6110904
population: 1315944
area: 50
population difference: 13159.44
area difference: 50

ES.BDCA.AQD
type: Concept
notation: ES.BDCA.AQD
definition: Namespace for Spain for reporting air quality information under Decision 2011/850/EC
status: valid
status modified: 2021-06-17
accepted date: 2021-06-17
in scheme: AQD - Namespace
surface area: 505782
in country: ES
longitude min: -18.5
longitude max: 4.4
latitude min: 27.5
latitude max: 43.8
population: 46440099
area: 50
population difference: 50000
area difference: 50

FI.FMI.AQ
type: Concept
notation: FI.FMI.AQ
definition: Namespace for Finland for reporting air quality information under Decision 2011/850/EC
status: valid
status modified: 2021-06-17
accepted date: 2021-06-17
in scheme: AQD - Namespace
surface area: 338424
in country: FI
longitude min: 19.64559289
longitude max: 32.51609216
latitude min: 58.75
latitude max: 71.16419302
population: 5487308
area: 50
population difference: 50000
area difference: 50

FR.LCSQA-INERIS.AQ
type: Concept
notation: FR.LCSQA-INERIS.AQ
definition: Namespace for France for reporting air quality information under Decision 2011/850/EC
status: valid
status modified: 2021-06-17
accepted date: 2021-06-17
in scheme: AQD - Namespace
surface area: 640679
in country: FR
longitude min: -54.5247542
longitude max: 9.56001631
latitude min: -30.05338919
latitude max: 51.14850617
population: 66730453
area: 50
population difference: 50000
area difference: 50

gb
type: Concept
notation: http://environment.data.gov.uk/air-quality/so
preferred label: http://environment.data.gov.uk/air-quality/so
definition: Namespace for United Kingdom for reporting air quality information under Decision 2011/850/EC
status: valid
status modified: 2021-06-17
accepted date: 2021-06-17
in scheme: AQD - Namespace
surface area: 243610
alternative label: http://environment.data.gov.uk/air-quality/so
in country: GB
longitude min: -8
longitude max: 1.681530796
latitude min: 49.95999991
latitude max: 60.9
population: 65382556
area: 50
population difference: 50000
area difference: 50

GE.MEPA.AQ
type: Concept
notation: GE.MEPA.AQ
definition: Namespace for Georgia for reporting air quality information under Decision 2011/850/EC
status: valid
status modified: 2021-06-17
accepted date: 2021-06-17
in scheme: AQD - Namespace
in country: GE
longitude min: 38.95500858
longitude max: 47.63790816
latitude min: 40.06444469
latitude max: 44.55310415

gib.air-quality
type: Concept
notation: gib.air-quality
definition: Namespace for Gibraltar for reporting air quality information under Decision 2011/850/EC
status: valid
status modified: 2021-06-17
accepted date: 2021-06-17
in scheme: AQD - Namespace
surface area: 6.25
in country: GI
longitude min: -6.3941295
longitude max: -4.3141295
latitude min: 35.100807
latitude max: 37.180807
population: 33573
area: 0.0625
population difference: 335.73
area difference: 0.0625

GR.MINNENV.AQ
type: Concept
notation: GR.MINNENV.AQ
definition: Namespace for Greece for reporting air quality information under Decision 2011/850/EC
status: valid
status modified: 2021-06-17
accepted date: 2021-06-17
in scheme: AQD - Namespace
surface area: 131940
in country: GR
longitude min: 19.1500159
longitude max: 27.60419559
latitude min: 33.9199877
latitude max: 42.82690461
population: 10783748
area: 50
population difference: 50000
area difference: 50

aqd.azo.hr
type: Concept
notation: aqd.azo.hr
definition: Namespace for Croatia for reporting air quality information under Decision 2011/850/EC
status: valid
status modified: 2021-06-17
accepted date: 2021-06-17
in scheme: AQD - Namespace
surface area: 56542
in country: HR
longitude min: 12.65697554
longitude max: 20.3904757
latitude min: 41.47999136
latitude max: 47.50375092
population: 3861967
area: 50
population difference: 41906.69
area difference: 50

HU.OMSZ.AQ
type: Concept
notation: HU.OMSZ.AQ
definition: Namespace for Hungary for reporting air quality information under Decision 2011/850/EC
status: valid
status modified: 2021-06-17
accepted date: 2021-06-17
in scheme: AQD - Namespace
surface area: 93030
in country: HU
longitude min: 15.20229821
longitude max: 23.71053145
latitude min: 44.75948111
latitude max: 49.62385407
population: 9830485
area: 50
population difference: 50000
area difference: 50

ie
type: Concept
notation: http://erc.epa.ie/airquality/ipr
preferred label: http://erc.epa.ie/airquality/ipr
definition: Namespace for Ireland for reporting air quality information under Decision 2011/850/EC
status: valid
status modified: 2021-06-17
accepted date: 2021-06-17
in scheme: AQD - Namespace
surface area: 70280
alternative label: http://erc.epa.ie/airquality/ipr
in country: IE
longitude min: -10.97708574
longitude max: -5.032985399
latitude min: 50.66930126
latitude max: 56.13162222
population: 4234925
area: 50
population difference: 42349.25
area difference: 50

IS.EA-Iceland.AQ
type: Concept
notation: IS.EA-Iceland.AQ
definition: Namespace for Iceland for reporting air quality information under Decision 2011/850/EC
status: valid
status modified: 2021-06-17
accepted date: 2021-06-17
in scheme: AQD - Namespace
surface area: 103001
in country: IS
longitude min: -25.32618405
longitude max: -12.60973223
latitude min: 62.49638296
latitude max: 67.5267923
population: 368792
area: 50
population difference: 3680
area difference: 50

IT.ISPRA.AQD
type: Concept
notation: IT.ISPRA.AQD
definition: Namespace for Italy for reporting air quality information under Decision 2011/850/EC
status: valid
status modified: 2021-06-17
accepted date: 2021-06-17
in scheme: AQD - Namespace
surface area: 301230
in country: IT
longitude min: 5.749955275
longitude max: 19.48024702
latitude min: 35.4937
latitude max: 48.11539317
population: 60665551
area: 50
population difference: 50000
area difference: 50

KG.NAMESPACE.AQ
type: Concept
notation: KG.NAMESPACE.AQ
definition: TEST namespace
status: valid
status modified: 2021-06-17
accepted date: 2021-06-17
in scheme: AQD - Namespace

LT.LT-EPA.AQ
type: Concept
notation: LT.LT-EPA.AQ
definition: Namespace for Lithuania for reporting air quality information under Decision 2011/850/EC
status: valid
status modified: 2021-06-17
accepted date: 2021-06-17
in scheme: AQD - Namespace
surface area: 65200
in country: LT
longitude min: 20.05580041
longitude max: 27.58827925
latitude min: 52.90570222
latitude max: 57.37252839
population: 2888558
area: 50
population difference: 28885.58
area difference: 50

LU.AdmEnv_AirBruit.AQ
type: Concept
notation: LU.AdmEnv_AirBruit.AQ
definition: Namespace for Luxembourg for reporting air quality information under Decision 2011/850/EC - Population updated 2021
status: valid
status modified: 2025-08-21
accepted date: 2025-08-21
in scheme: AQD - Namespace
surface area: 2586
in country: LU
longitude min: 5.674051955
longitude max: 6.53
latitude min: 49.44266714
latitude max: 50.12805166
population: 672050
area: 25.86
population difference: 26653
area difference: 25.86

LV.LEGMC.AQ
type: Concept
notation: LV.LEGMC.AQ
definition: Namespace for Latvia for reporting air quality information under Decision 2011/850/EC
status: valid
status modified: 2021-06-17
accepted date: 2021-06-17
in scheme: AQD - Namespace
surface area: 64589
in country: LV
longitude min: 20.05580041
longitude max: 29.17670943
latitude min: 54.61510692
latitude max: 58.97015697
population: 1968957
area: 50
population difference: 19689.57
area difference: 50

MD.AQD
type: Concept
notation: MD.AQD
definition: Namespace for Republic of Moldova for reporting air quality information under Decision 2011/850/EC
status: valid
status modified: 2021-06-17
accepted date: 2021-06-17
in scheme: AQD - Namespace
longitude min: 26.61933679
longitude max: 45.48828319
latitude min: 30.02465864
latitude max: 48.46711945

ME.EPA-ME.AQ
type: Concept
notation: ME.EPA-ME.AQ
definition: Namespace for Montenegro for reporting air quality information under Decision 2011/850/EC
status: valid
status modified: 2021-06-17
accepted date: 2021-06-17
in scheme: AQD - Namespace
surface area: 13812
in country: ME
longitude min: 17.45
longitude max: 21.3398
latitude min: 40.87755
latitude max: 44.52384
population: 622218
area: 50
population difference: 6222.18
area difference: 50

MK.MinEPP.AQ
type: Concept
notation: MK.MinEPP.AQ
definition: Namespace for Macedonia for reporting air quality information under Decision 2011/850/EC
status: valid
status modified: 2021-06-17
accepted date: 2021-06-17
in scheme: AQD - Namespace
surface area: 25713
in country: MK
longitude min: 19.46315
longitude max: 23.95237715
latitude min: 39.84272696
latitude max: 43.32025951
population: 2103721
area: 50
population difference: 21037.21
area difference: 50

MT.ERA.AQ
type: Concept
notation: MT.ERA.AQ
definition: Namespace for Malta for reporting air quality information under Decision 2011/850/EC
status: valid
status modified: 2021-06-17
accepted date: 2021-06-17
in scheme: AQD - Namespace
surface area: 316
preferred label: MT.MEPA.AQ
in country: MT
longitude min: 12.9324226
longitude max: 15.8267966
latitude min: 34.6029696
latitude max: 37.2852706
population: 519562
area: 3.16
population difference: 5195.62
area difference: 3.16

NL.RIVM.AQ
type: Concept
notation: NL.RIVM.AQ
definition: Namespace for Netherlands for reporting air quality information under Decision 2011/850/EC
status: valid
status modified: 2021-06-17
accepted date: 2021-06-17
in scheme: AQD - Namespace
surface area: 41526
in country: NL
longitude min: 2.314971144
longitude max: 8.092053257
latitude min: 49.80372102
latitude max: 54.51040335
population: 17811291
area: 50
population difference: 50000
area difference: 50

NO.NILU.AQD
type: Concept
notation: NO.NILU.AQD
definition: Namespace for Norway for reporting air quality information under Decision 2011/850/EC
status: valid
status modified: 2021-06-17
accepted date: 2021-06-17
in scheme: AQD - Namespace
surface area: 385252
in country: NO
longitude min: 3.992078078
longitude max: 32.29341841
latitude min: 57.07888418
latitude max: 81.65714427
population: 5210721
area: 50
population difference: 50000
area difference: 50

PL.CIEP.AQ
type: Concept
notation: PL.CIEP.AQ, mos.gov.pl
definition: Namespaces for Poland for reporting air quality information under Decision 2011/850/EC
status: valid
status modified: 2021-06-17
accepted date: 2021-06-17
in scheme: AQD - Namespace
surface area: 312685
in country: PL
longitude min: 13.07452111
longitude max: 25.02998579
latitude min: 48.02739533
latitude max: 55.85153596
population: 37967209
area: 50
population difference: 50000
area difference: 50

PT.APA.AQ
type: Concept
notation: PT.APA.AQ
definition: Namespace for Portugal for reporting air quality information under Decision 2011/850/EC
status: valid
status modified: 2021-06-17
accepted date: 2021-06-17
in scheme: AQD - Namespace
surface area: 92391
in country: PT
longitude min: -29
longitude max: -6.389087694
latitude min: 32
latitude max: 42.28046866
population: 10341330
area: 50
population difference: 50000
area difference: 50

RO.ANPM.AQ
type: Concept
notation: RO.ANPM.AQ
definition: Namespace for Romania for reporting air quality information under Decision 2011/850/EC
status: valid
status modified: 2021-06-17
accepted date: 2021-06-17
in scheme: AQD - Namespace
surface area: 238391
in country: RO
longitude min: 19.2201925
longitude max: 30.62654341
latitude min: 42.68844473
latitude max: 49.22088125
population: 19760314
area: 50
population difference: 50000
area difference: 50

RS.SEPA.AQ
type: Concept
notation: RS.SEPA.AQ
definition: Namespace for Serbia for reporting air quality information under Decision 2011/850/EC
status: valid
status modified: 2021-06-17
accepted date: 2021-06-17
in scheme: AQD - Namespace
surface area: 88361
in country: RS
longitude min: 17.82982
longitude max: 23.98601851
latitude min: 41.2452244
latitude max: 47.17172984
population: 7076372
area: 50
population difference: 50000
area difference: 50

SE.NV.AQ
type: Concept
notation: SE.NV.AQ
definition: Namespace for Sweden for reporting air quality information under Decision 2011/850/EC
status: valid
status modified: 2021-06-17
accepted date: 2021-06-17
in scheme: AQD - Namespace
surface area: 447435
in country: SE
longitude min: 11.02736861
longitude max: 24.15
latitude min: 55.36173737
latitude max: 69.10624726
population: 10379295
area: 50
population difference: 50000
area difference: 50

SI.ARSO.AQ
type: Concept
notation: SI.ARSO.AQ
definition: Namespace for Slovenia for reporting air quality information under Decision 2011/850/EC
status: valid
status modified: 2021-06-17
accepted date: 2021-06-17
in scheme: AQD - Namespace
surface area: 20273
in country: SI
longitude min: 13.36
longitude max: 16.56480838
latitude min: 45.45231639
latitude max: 46.85238597
population: 2064188
area: 50
population difference: 20641.88
area difference: 50

SK.SHMU.AQ
type: Concept
notation: SK.SHMU.AQ
definition: Namespace for Slovakia for reporting air quality information under Decision 2011/850/EC
status: valid
status modified: 2021-06-17
accepted date: 2021-06-17
in scheme: AQD - Namespace
surface area: 48845
in country: SK
longitude min: 15.87998294
longitude max: 23.55813765
latitude min: 46.75842886
latitude max: 50.571574
population: 5426252
area: 50
population difference: 50000
area difference: 50

TR.UHKIA.AQD
type: Concept
notation: TR.UHKIA.AQD
status: valid
status modified: 2021-06-17
accepted date: 2021-06-17
in scheme: AQD - Namespace
surface area: 783562
in country: TR
longitude min: 25.04335127
longitude max: 45.7939897
latitude min: 34.82153474
latitude max: 43.14148489
population: 78741053
area: 50
population difference: 50000
area difference: 50

UA.AQD
type: Concept
notation: UA.AQD
definition: Namespace for Ukraine for reporting air quality information under Decision 2011/850/EC
status: valid
status modified: 2021-06-17
accepted date: 2021-06-17
in scheme: AQD - Namespace
longitude min: 22.137059
longitude max: 40.2275801
latitude min: 44.184598
latitude max: 52.3791473

XK.EPA-HI-KOSOVO.AQ
type: Concept
notation: XK.EPA-HI-KOSOVO.AQ
definition: Namespace for Kosovo for reporting air quality information under Decision 2011/850/EC
status: valid
status modified: 2021-06-17
accepted date: 2021-06-17
in scheme: AQD - Namespace
in country: XK
longitude min: 19.038041
longitude max: 22.738977
latitude min: 40.870657
latitude max: 44.290976

AQD - Network Type
type: ConceptScheme
notation: networktype
is part of: Air Quality Directive e-Reporting
registration status: Public draft
user modified: targajau
date modified: 2013-05-13 10:37:15.0
vocabulary type: Common
is numeric concept identifiers: false
is notations equal identifiers: false

Local
type: Concept
notation: local
definition: Network designed for the observation of single emission sources
status: valid
status modified: 2013-03-22
accepted date: 2013-03-22
in scheme: AQD - Network Type

National (Entire country)
type: Concept
notation: national
definition: Network designed at National level.
status: valid
status modified: 2013-03-22
accepted date: 2013-03-22
in scheme: AQD - Network Type

Other
type: Concept
notation: other
definition: Networks comprising monitoring sites in more than one country; networks targeted at special ecosystem monitoring.
status: valid
status modified: 2013-03-22
accepted date: 2013-03-22
in scheme: AQD - Network Type

Regional
type: Concept
notation: regional
definition: Network designed at the spatial level of an administrative unit of some 1000s to some 10.000s km²
status: valid
status modified: 2013-03-22
accepted date: 2013-03-22
in scheme: AQD - Network Type

Urban
type: Concept
notation: urban
definition: Network designed at the spatial level of an agglomeration or conurbation.
status: valid
status modified: 2013-03-22
accepted date: 2013-03-22
in scheme: AQD - Network Type

AQD - Objective Type
type: ConceptScheme
notation: objectivetype
is part of: Air Quality Directive e-Reporting
registration status: Public draft
user modified: targajau
date modified: 2016-08-04 10:48:53.0
vocabulary type: Common
is numeric concept identifiers: false
is notations equal identifiers: false

Alert threshold (ALT)
type: Concept
notation: ALT
definition: ‘Alert threshold’ shall mean a level beyond which there is a risk to human health from brief exposure for the population as a whole and at which immediate steps are to be taken by the Member States
status: valid
status modified: 2013-03-22
accepted date: 2013-03-22
in scheme: AQD - Objective Type

Critical level (CL)
type: Concept
notation: CL
definition: 'Critical Level’ shall mean a level fixed on the basis of scientific knowledge, above which direct adverse effects may occur on some receptors, such as trees, other plants or natural ecosystems but not on humans.
status: valid
status modified: 2013-03-22
accepted date: 2013-03-22
in scheme: AQD - Objective Type

Exposure concentration obligation (ECO)
type: Concept
notation: ECO
definition: ‘Exposure Concentration Obligation’ shall mean a level fixed on the basis of the average exposure indicator with the aim of reducing harmful effects on human health, to be attained over a given period.
status: valid
status modified: 2013-03-22
accepted date: 2013-03-22
in scheme: AQD - Objective Type

Exposure reduction target (ERT)
type: Concept
notation: ERT
status: valid
status modified: 2013-03-22
accepted date: 2013-03-22
in scheme: AQD - Objective Type

Information Threshold (INT)
type: Concept
notation: INT
definition: ‘Information threshold’ shall mean a level beyond which there is a risk to human health from brief exposure for particularly sensitive sections of the population and for which immediate and appropriate information is necessary.
status: valid
status modified: 2013-03-22
accepted date: 2013-03-22
in scheme: AQD - Objective Type

Long term objective (LTO)
type: Concept
notation: LTO
definition: ‘Long-Term Objective’ shall mean a level to be attained in the long term, save where not achievable through proportionate measures, with the aim of providing effective protection of human health and the environment.
status: valid
status modified: 2013-03-22
accepted date: 2013-03-22
in scheme: AQD - Objective Type

Limit Value (LV)
type: Concept
notation: LV
definition: ‘Limit Value’ shall mean a level fixed on the basis of scientific knowledge, with the aim of avoiding, preventing or reducing harmful effects on human health and/or the environment as a whole, to be attained within a given period and not to be exceeded once attained.
status: valid
status modified: 2013-03-22
accepted date: 2013-03-22
in scheme: AQD - Objective Type

Limit value plus applicable margin of tolerance (LVMOT)
type: Concept
notation: LVMOT
status: valid
status modified: 2013-03-22
accepted date: 2013-03-22
in scheme: AQD - Objective Type

Limit value plus maximum margin of tolerance
type: Concept
notation: LVmaxMOT
definition: LVmaxMOT to be used if a time extension is in place. MS need to declare compliance with the LV + max MOT.
status: valid
status modified: 2013-11-11
accepted date: 2013-11-11
in scheme: AQD - Objective Type

Monitoring objective (MO)
type: Concept
notation: MO
status: valid
status modified: 2013-03-22
accepted date: 2013-03-22
in scheme: AQD - Objective Type

Target Value (TV)
type: Concept
notation: TV
definition: 'Target value’ shall mean a level fixed with the aim of avoiding, preventing or reducing harmful effects on human health and/or the environment as a whole, to be attained where possible over a given period.
status: valid
status modified: 2013-03-22
accepted date: 2013-03-22
in scheme: AQD - Objective Type

Limit Value (Stage II) for reporting PM2.5 only
type: Concept
notation: LV-S2
definition: Objective type for the reporting of the PM2.5 Stage 2 Limit Value (20 ugm-3) — indicative limit value to be reviewed by the Commission in 2013 in the light of further information on health and environmental effects, technical feasibility and experience of the target value in Member States.
status: valid
status modified: 2016-08-04
in scheme: AQD - Objective Type

AQD - Observation Validity
type: ConceptScheme
notation: observationvalidity
is part of: Air Quality Directive e-Reporting
registration status: Public draft
user modified: targajau
date modified: 2024-07-04 12:03:48.0
vocabulary type: Common
is numeric concept identifiers: true
is notations equal identifiers: false

Not valid
type: Concept
notation: -1
definition: For primary data, data is considered to be invalid due to other circumstances or data is simply missing. For aggregated data, data is not valid because of insufficient data capture following rules set out in Directive and Guidance.
status: valid
status modified: 2013-03-22
accepted date: 2013-03-22
in scheme: AQD - Observation Validity

Not valid due to station maintenance or calibration
type: Concept
notation: -99
definition: Data is considered to be invalid due to the regular calibration or the normal maintenance of the instrumentation (only used for primary data).
status: valid
status modified: 2013-03-22
accepted date: 2013-03-22
in scheme: AQD - Observation Validity

Valid
type: Concept
notation: 1
definition: Primary data considered valid by the data provider for its related reporting purposes. Aggregated data is valid following rules set out in Directive and Guidance.
status: valid
status modified: 2013-03-22
accepted date: 2013-03-22
in scheme: AQD - Observation Validity

Valid, but below detection limit measurement value given
type: Concept
notation: 2
definition: Data considered valid by the data provider for its related reporting purposes. However, the value has been measured below the detection limit and the value reported is the detection limit (only used for primary data).
status: valid
status modified: 2013-03-22
accepted date: 2013-03-22
in scheme: AQD - Observation Validity

Valid, but below detection limit and number replaced by 0.5*detection limit
type: Concept
notation: 3
definition: Data considered valid by the data provider for its related reporting purposes. However, the value has been measured below the detection limit and the value reported is half of this detection limit (only used for primary data).
status: valid
status modified: 2013-03-22
accepted date: 2013-03-22
in scheme: AQD - Observation Validity

Valid (Ozone only) using CCQM.O3.2019
type: Concept
notation: 4
definition: Valid ozone (pollutant code 7) data using new cross section CCQM.O3.2019 (Any ozone previously reported using validation flag 1 is assumed Hearn.1961) Invalid data regardless of cross section to be reported as validation flag -1
status: valid
status modified: 2024-07-04
accepted date: 2024-07-04
in scheme: AQD - Observation Validity

AQD - Observation Verification
type: ConceptScheme
notation: observationverification
is part of: Air Quality Directive e-Reporting
registration status: Public draft
user modified: targajau
date modified: 2013-05-13 10:40:13.0
vocabulary type: Common
is numeric concept identifiers: true
is notations equal identifiers: false

Verified
type: Concept
notation: 1
definition: Data has gone through full quality assurance and quality control by data provider/owner. Data is considered verified and can be formally used for its reporting purposes.
status: valid
status modified: 2013-03-22
accepted date: 2013-03-22
in scheme: AQD - Observation Verification
scope note: Final data having gone through full qa/qc.

Preliminary verified
type: Concept
notation: 2
definition: Data has gone through initial checks by data provider/owner. Extra quality assurance and quality control verifications have been carried out compared to "Not verified" data. Data Verification might be carried out on an ongoing basis and is nominally a process to "clean-up" the initial "Not verified" data. Any corrections to the data made during the verification process are changes the status flag to "Preliminary verified". The data with this data flag is considered provisional and can be used as provisional. This flag is independant to the validity status.
status: valid
status modified: 2013-03-22
accepted date: 2013-03-22
in scheme: AQD - Observation Verification
scope note: Mainly used when Up To Date data is reported. Data subject to changes as further qa/qc is carried out.

Not verified
type: Concept
notation: 3
definition: Data has not gone through (or has gone through minimal) checks by data provider/owner. Some basic screening criteria in order to exclude clearly faulty data as far as possible maybe used. The data with this data flag is considered provisional and can be used as provisional. This flag is independant to the validity status.
status: valid
status modified: 2013-03-22
accepted date: 2013-03-22
in scheme: AQD - Observation Verification
scope note: Mainly used when Up To Date data is reported. Data subject to changes as further qa/qc is carried out.

AQD - Organisational Level
type: ConceptScheme
notation: organisationallevel
is part of: Air Quality Directive e-Reporting
registration status: Public draft
user modified: targajau
date modified: 2013-05-13 10:52:47.0
vocabulary type: Common
is numeric concept identifiers: false
is notations equal identifiers: false

International
type: Concept
notation: international
status: valid
status modified: 2013-05-08
accepted date: 2013-05-08
in scheme: AQD - Organisational Level

Local
type: Concept
notation: local
status: valid
status modified: 2013-05-08
accepted date: 2013-05-08
in scheme: AQD - Organisational Level

Local Authority
type: Concept
notation: localauthority
status: valid
status modified: 2013-05-08
accepted date: 2013-05-08
in scheme: AQD - Organisational Level

Municipality
type: Concept
notation: municipality
status: valid
status modified: 2013-05-08
accepted date: 2013-05-08
in scheme: AQD - Organisational Level

National
type: Concept
notation: national
status: valid
status modified: 2013-05-08
accepted date: 2013-05-08
in scheme: AQD - Organisational Level

Regional
type: Concept
notation: regional
status: valid
status modified: 2013-05-08
accepted date: 2013-05-08
in scheme: AQD - Organisational Level

Plan category
type: ConceptScheme
notation: plancategory
is part of: Air Quality Directive e-Reporting
registration status: Public draft
user modified: targajau
date modified: 2025-04-10 20:42:46.0
vocabulary type: Common
is numeric concept identifiers: false
is notations equal identifiers: false

AQ roadmap
type: Concept
notation: roadmap
definition: AQ roadmap
status: valid
status modified: 2025-04-10
accepted date: 2025-04-10
in scheme: Plan category

Short-term plan
type: Concept
notation: short-termplan
status: valid
status modified: 2025-04-10
accepted date: 2025-04-10
in scheme: Plan category

AQ plan
type: Concept
notation: plan
definition: AQ plan
status: valid
status modified: 2025-04-10
accepted date: 2025-04-10
in scheme: Plan category

PNSDinversion
type: ConceptScheme
notation: PNSDinversion
is part of: Air Quality Directive e-Reporting
registration status: Public draft
user modified: targajau
date modified: 2025-08-29 14:56:09.0
vocabulary type: Common
is numeric concept identifiers: false
is notations equal identifiers: true

none
type: Concept
notation: none
definition: No inversion applied
status: valid
status modified: 2025-08-03
accepted date: 2025-08-03
in scheme: PNSDinversion

AQD - Air Quality Pollutants
type: ConceptScheme
notation: pollutant
is part of: Air Quality Directive e-Reporting
registration status: Released
user modified: targajau
date modified: 2025-09-10 07:28:31.0
vocabulary type: Common
is numeric concept identifiers: true
is notations equal identifiers: false

Sulphur dioxide (air)
type: Concept
notation: SO2
definition: SO2 - recommended unit: µg/m3
status: valid
status modified: 2013-09-20
accepted date: 2013-09-20
in scheme: AQD - Air Quality Pollutants
alternative label: SO2 @bg
scope note: 2011/850/EU
recommended unit: ug.m-3
recommended unit: count
measurement equipment: Teledyne API undertermined
measurement equipment: Teledyne API 100 UV Fluorescent SO2 Analyser
measurement equipment: Teledyne API 100A UV Fluorescent SO2 Analyser
measurement equipment: Teledyne API 100E UV Fluorescent SO2 Analyser
measurement equipment: Teledyne API 101 UV Fluorescent SO2 Analyser
measurement equipment: Teledyne API 101A UV Fluorescent SO2/H2S Analyser
measurement equipment: Teledyne API M100E UV Fluorescent SO2 Analyser
measurement equipment: Teledyne API T100 UV Fluorescent SO2 Analyser
measurement equipment: ECOTECH EC9852
measurement equipment: MELOY SA285E
measurement equipment: Monitor Labs model 2040 SO2 analyser
measurement equipment: Monitor Labs model 2050 SO2 analyser
measurement equipment: Monitor Labs model 8850 SO2 analyser
measurement equipment: Monitor Labs model 8850M SO2 analyser
measurement equipment: Monitor Labs model 8850S SO2 analyser
measurement equipment: Monitor Labs model 9850 SO2 analyser
measurement equipment: Monitor Labs model 9850B SO2 analyser
measurement equipment: SIR S-5001
measurement equipment: Serinus 50 SO2
measurement equipment: THERMO450iQ
measurement equipment: Aeris AE2050U
measurement equipment: airpointer
measurement equipment: DASIBI 4108 SO2 analyser
measurement equipment: ENVEA AF22E
measurement equipment: Environnement S.A. Model AF20M SO2 Analyzer
measurement equipment: Environnement S.A. Model AF21M SO2 Analyzer
measurement equipment: Environnement S.A. Model AF22M SO2 Analyzer
measurement equipment: Environnement S.A. SANOA Multigas Longpath Monitoring System
measurement equipment: Horiba model APSA 300 SO2 analyser
measurement equipment: Horiba model APSA 350 SO2 analyser
measurement equipment: Horiba model APSA 350E SO2 analyser
measurement equipment: Horiba model APSA 360 SO2 analyser
measurement equipment: Horiba model APSA 360A SO2 analyser
measurement equipment: Horiba model APSA 360E SO2 analyser
measurement equipment: Horiba model APSA 370 SO2 analyser
measurement equipment: Meloy Model SA 700 Fluorescence Sulfur Dioxide Analyze
measurement equipment: Opsis AR500 Open path monitor with ER 110
measurement equipment: Opsis AR500 Open path monitor with ER 120
measurement equipment: Opsis AR500 Open path monitor with ER 150
measurement equipment: PHILIPS K50033 API 100E
measurement equipment: PHILIPS K50206/00 Pulsed Fluorescence SO2 analyser
measurement equipment: PHILIPS PW9755/00 SO2 Analyser
measurement equipment: PHILIPS PW9762/00 NO/NO2/NOX Analyser
measurement equipment: ECOTECH SERINUS 51
measurement equipment: Thermo model 43 SO2 analyser
measurement equipment: Thermo model 43c-TL SO2 analyser
measurement equipment: Thermo model 43a SO2 analyser
measurement equipment: Thermo model 43b SO2 analyser
measurement equipment: Thermo model 43bs SO2 analyser
measurement equipment: Thermo model 43c SO2 analyser
measurement equipment: Thermo model 43h pulsed fluorescence SO2 analyser
measurement equipment: Thermo model 43i SO2 analyser
measurement equipment: Thermo model 43i-TLE (Enhanced Trace Level)
measurement equipment: Thermo model 43s SO2 analyser
measurement equipment: Thermo model 43w SO2 analyser
has protection target: Vegetation
has protection target: Health
mandatory unit: ug.m-3

Carbon monoxide (air)
type: Concept
notation: CO
definition: CO - recommended unit: mg/m3
status: valid
status modified: 2013-09-20
accepted date: 2013-09-20
in scheme: AQD - Air Quality Pollutants
alternative label: CO @bg
scope note: 2011/850/EU
recommended unit: mg.m-3
measurement equipment: AEROLaser 5001 CO Analyser
measurement equipment: Teledyne API 300 gas filter correlation CO analyser
measurement equipment: Teledyne API 300A gas filter correlation CO analyser
measurement equipment: Teledyne API 300E gas filter correlation CO analyser
measurement equipment: Teledyne API M300E gas filter correlation CO analyser
measurement equipment: Teledyne API T300 gas filter correlation CO analyser
measurement equipment: Monitor Labs model 2030 CO analyser
measurement equipment: Monitor Labs model 8830 CO analyser
measurement equipment: Monitor Labs model 8831 CO analyser
measurement equipment: Monitor Labs model 8930 CO analyser
measurement equipment: Monitor Labs model 9830 CO analyser
measurement equipment: Monitor Labs model 9830B CO analyser
measurement equipment: Monitor Labs model 9832 CO analyser
measurement equipment: Picarro G2401 (used for CO measurement)
measurement equipment: SIR S-5006
measurement equipment: Serinus30 CO
measurement equipment: Aeris AE2030U
measurement equipment: airpointer
measurement equipment: DASIBI 3008 CO analyser
measurement equipment: Environnement S.A. Model CO10M CO Analyzer
measurement equipment: Environnement S.A. Model CO11M CO Analyzer
measurement equipment: Environnement S.A. Model CO12E CO Analyzer
measurement equipment: Environnement S.A. Model CO12M CO Analyzer
measurement equipment: Horiba model APMA 300 CO analyser
measurement equipment: Horiba model APMA 300E CO analyser
measurement equipment: Horiba model APMA 350 CO analyser
measurement equipment: Horiba model APMA 350E CO analyser
measurement equipment: Horiba model APMA 360 CO analyser
measurement equipment: Horiba model APMA 360CE CO analyser
measurement equipment: Horiba model APMA 360E CO analyser
measurement equipment: Horiba model APMA 370 CO analyser
measurement equipment: PHILIPS K50093 API 300A
measurement equipment: PHILIPS K50109/00 Gas Filter Correlation CO analyser
measurement equipment: PHILIPS PW9775/00 CO Analyser
measurement equipment: Picarro G2302
measurement equipment: Picarro G2303
measurement equipment: Thermo model 48 CO analyser
measurement equipment: Thermo model 48 CO analyser (gas filter correlation)
measurement equipment: Thermo model 48c CO analyser
measurement equipment: Thermo model 48i CO analyser
measurement equipment: Thermo model 48i-TLE (Enhanced Trace Level)
measurement equipment: Thermo model 48w CO analyser
has protection target: Health
mandatory unit: mg.m-3

Lead in PM2.5 (aerosol)
type: Concept
notation: Pb in PM2.5
definition: Pb in PM2.5 - recommended unit: µg/m3
status: valid
status modified: 2013-09-20
accepted date: 2013-09-20
in scheme: AQD - Air Quality Pollutants
alternative label: Pb in PM2.5
scope note: Reciprocal exchange
recommended unit: ug.m-3

Mercury in PM2.5 (aerosol)
type: Concept
notation: Hg in PM2.5
definition: Hg in PM2.5 - recommended unit: ng/m3
status: valid
status modified: 2013-09-20
accepted date: 2013-09-20
in scheme: AQD - Air Quality Pollutants
alternative label: Hg in PM2.5
recommended unit: ng.m-3

Cadmium in PM2.5 (aerosol)
type: Concept
notation: Cd in PM2.5
definition: Cd in PM2.5 - recommended unit: ng/m3
status: valid
status modified: 2013-09-20
accepted date: 2013-09-20
in scheme: AQD - Air Quality Pollutants
alternative label: Cd in PM2.5
recommended unit: ng.m-3

Nickel in PM2.5 (aerosol)
type: Concept
notation: Ni in PM2.5
definition: Ni in PM2.5 - recommended unit: ng/m3
status: valid
status modified: 2013-09-20
accepted date: 2013-09-20
in scheme: AQD - Air Quality Pollutants
alternative label: Ni in PM2.5
recommended unit: ng.m-3

Chromium in PM2.5 (aerosol)
type: Concept
notation: Cr in PM2.5
definition: Cr in PM2.5 - recommended unit: ng/m3
status: valid
status modified: 2013-09-20
accepted date: 2013-09-20
in scheme: AQD - Air Quality Pollutants
alternative label: Cr in PM2.5
recommended unit: ng.m-3

Manganese in PM2.5 (aerosol)
type: Concept
notation: Mn in PM2.5
definition: Mn in PM2.5 - recommended unit: ng/m3
status: valid
status modified: 2013-09-20
accepted date: 2013-09-20
in scheme: AQD - Air Quality Pollutants
alternative label: Mn in PM2.5
recommended unit: ng.m-3

Arsenic in PM2.5 (aerosol)
type: Concept
notation: As in PM2.5
definition: As in PM2.5 - recommended unit: ng/m3
status: valid
status modified: 2013-09-20
accepted date: 2013-09-20
in scheme: AQD - Air Quality Pollutants
alternative label: As in PM2.5 @bg
recommended unit: ng.m-3

Benzo(a)pyrene in PM2.5 (aerosol)
type: Concept
notation: BaP in PM2.5
definition: BaP in PM2.5 - recommended unit: ng/m3
status: valid
status modified: 2013-09-20
accepted date: 2013-09-20
in scheme: AQD - Air Quality Pollutants
alternative label: BaP in PM2.5
scope note: Reciprocal exchange
recommended unit: ng.m-3

Ammonium in PM2.5 (aerosol)
type: Concept
notation: NH4+ in PM2.5
definition: NH4+ in PM2.5 - recommended unit: µg/m3
status: valid
status modified: 2013-09-20
accepted date: 2013-09-20
in scheme: AQD - Air Quality Pollutants
alternative label: NH4+ in PM2.5
scope note: 2011/850/EU
recommended unit: ug.m-3

Nitrate in PM2.5 (aerosol)
type: Concept
notation: NO3- in PM2.5
definition: NO3- in PM2.5 - recommended unit: µg/m3
status: valid
status modified: 2013-09-20
accepted date: 2013-09-20
in scheme: AQD - Air Quality Pollutants
alternative label: NO3- in PM2.5
scope note: 2011/850/EU
recommended unit: ug.m-3

sulphate in PM2.5 (aerosol)
type: Concept
notation: SO42- in PM2.5
definition: SO42- in PM2.5 - recommended unit: µg/m3
status: valid
status modified: 2013-09-20
accepted date: 2013-09-20
in scheme: AQD - Air Quality Pollutants
alternative label: SO42- in PM2.5
scope note: 2011/850/EU
recommended unit: ug.m-3

Selenium in PM2.5 (aerosol)
type: Concept
notation: Se in PM2.5
definition: Se in PM2.5 - recommended unit: ng/m3
status: valid
status modified: 2013-09-20
accepted date: 2013-09-20
in scheme: AQD - Air Quality Pollutants
alternative label: Se in PM2.5
recommended unit: ng.m-3

Vanedium in PM2.5 (aerosol)
type: Concept
notation: V in PM2.5
definition: V in PM2.5 - recommended unit: ng/m3
status: valid
status modified: 2013-09-20
accepted date: 2013-09-20
in scheme: AQD - Air Quality Pollutants
alternative label: V in PM2.5
recommended unit: ng.m-3

Zinc in PM2.5 (aerosol)
type: Concept
notation: Zn in PM2.5
definition: Zn in PM2.5 - recommended unit: ng/m3
status: valid
status modified: 2013-09-20
accepted date: 2013-09-20
in scheme: AQD - Air Quality Pollutants
alternative label: Zn in PM2.5
recommended unit: ng.m-3

Cobalt in PM2.5 (aerosol)
type: Concept
notation: Co in PM2.5
definition: Co in PM2.5 - recommended unit: ng/m3
status: valid
status modified: 2013-09-20
accepted date: 2013-09-20
in scheme: AQD - Air Quality Pollutants
alternative label: Co in PM2.5
recommended unit: ng.m-3

Iron in PM2.5 (aerosol)
type: Concept
notation: Fe in PM2.5
definition: Fe in PM2.5 - recommended unit: ng/m3
status: valid
status modified: 2013-09-20
accepted date: 2013-09-20
in scheme: AQD - Air Quality Pollutants
alternative label: Fe in PM2.5
recommended unit: ng.m-3

Copper in PM2.5 (aerosol)
type: Concept
notation: Cu in PM2.5
definition: Cu in PM2.5 - recommended unit: ng/m3
status: valid
status modified: 2013-09-20
accepted date: 2013-09-20
in scheme: AQD - Air Quality Pollutants
alternative label: Cu in PM2.5
recommended unit: ng.m-3

Hydrogen sulphide (air)
type: Concept
notation: H2S
definition: H2S - recommended unit: µg/m3
status: valid
status modified: 2013-09-20
accepted date: 2013-09-20
in scheme: AQD - Air Quality Pollutants
alternative label: H2S
scope note: Reciprocal exchange
recommended unit: ug.m-3
measurement equipment: Teledyne API 101A UV Fluorescent SO2/H2S Analyser
measurement equipment: THERMO450iQ
measurement equipment: airpointer
measurement equipment: Horiba model APSA 370 SO2 analyser

Benzo(a)pyrene in PM2.5 (air+aerosol)
type: Concept
notation: BaP in PM2.5
definition: BaP in PM2.5 - recommended unit: ng/m3
status: valid
status modified: 2013-09-20
accepted date: 2013-09-20
in scheme: AQD - Air Quality Pollutants
alternative label: BaP in PM2.5
recommended unit: ng.m-3

Lead (aerosol)
type: Concept
notation: Pb
definition: Pb - recommended unit: µg/m3
status: valid
status modified: 2013-09-20
accepted date: 2013-09-20
in scheme: AQD - Air Quality Pollutants
alternative label: Pb
scope note: Reciprocal exchange
recommended unit: ug.m-3

Mercury (aerosol)
type: Concept
notation: Hg
definition: Hg - recommended unit: ng/m3
status: valid
status modified: 2013-09-20
accepted date: 2013-09-20
in scheme: AQD - Air Quality Pollutants
alternative label: Hg
scope note: Reciprocal exchange
recommended unit: ng.m-3

Cadmium (aerosol)
type: Concept
notation: Cd
definition: Cd - recommended unit: ng/m3
status: valid
status modified: 2013-09-20
accepted date: 2013-09-20
in scheme: AQD - Air Quality Pollutants
alternative label: Cd
scope note: Reciprocal exchange
recommended unit: ng.m-3

Chrysene in PM2.5 (aerosol)
type: Concept
notation: Chrysene in PM2.5 (aerosol)
definition: Chrysene in PM2.5 - recommended unit: ng/m3
status: valid
status modified: 2024-08-16
accepted date: 2024-08-16
in scheme: AQD - Air Quality Pollutants
recommended unit: ng.m-3

Dibenzo(ah)anthracene in PM2.5 (aerosol)
type: Concept
notation: Dibenzo(ah)anthracene in PM2.5
definition: Dibenzo(ah)anthracene in PM2.5 - recommended unit: ng/m3
status: valid
status modified: 2013-09-20
accepted date: 2013-09-20
in scheme: AQD - Air Quality Pollutants
alternative label: Dibenzo(ah)anthracene in PM2.5
recommended unit: ng.m-3

Nickel (aerosol)
type: Concept
notation: Ni
definition: Ni - recommended unit: ng/m3
status: valid
status modified: 2013-09-20
accepted date: 2013-09-20
in scheme: AQD - Air Quality Pollutants
alternative label: Ni
scope note: Reciprocal exchange
recommended unit: ng.m-3

Chromium (aerosol)
type: Concept
notation: Cr
definition: Cr - recommended unit: ng/m3
status: valid
status modified: 2013-09-20
accepted date: 2013-09-20
in scheme: AQD - Air Quality Pollutants
alternative label: Cr
scope note: Reciprocal exchange
recommended unit: ng.m-3

Anthracene in PM2.5 (aerosol)
type: Concept
notation: Anthracene in PM2.5 (aerosol)
definition: Anthracene in PM2.5 (aerosol) - recommended unit: ng/m3
status: valid
status modified: 2024-08-16
accepted date: 2024-08-16
in scheme: AQD - Air Quality Pollutants
recommended unit: ng.m-3

Benzo(a)anthracene in PM2.5 (aerosol)
type: Concept
notation: Benzo(a)anthracene in PM2.5
definition: Benzo(a)anthracene in PM2.5 - recommended unit: ng/m3
status: valid
status modified: 2013-09-20
accepted date: 2013-09-20
in scheme: AQD - Air Quality Pollutants
alternative label: Benzo(a)anthracene in PM2.5
recommended unit: ng.m-3

Benzo(b)fluoranthene in PM2.5 (aerosol)
type: Concept
notation: Benzo(b)fluoranthene in PM2.5 (aerosol)
definition: Benzo(b)fluoranthene in PM2.5 - recommended unit: ng/m3
status: valid
status modified: 2024-08-16
accepted date: 2024-08-16
in scheme: AQD - Air Quality Pollutants
recommended unit: ng.m-3

Benzo(b)fluoranthene in PM2.5 (air+aerosol)
type: Concept
notation: Benzo(b)fluoranthene in PM2.5
definition: Benzo(b)fluoranthene in PM2.5 - recommended unit: ng/m3
status: valid
status modified: 2013-09-20
accepted date: 2013-09-20
in scheme: AQD - Air Quality Pollutants
alternative label: Benzo(b)fluoranthene in PM2.5
recommended unit: ng.m-3

Benzo(ghi)perylene in PM2.5 (aerosol)
type: Concept
notation: Benzo(ghi)perylene in PM2.5 (aerosol)
definition: Benzo(ghi)perylene in PM2.5 - recommended unit: ng/m3
status: valid
status modified: 2024-08-16
accepted date: 2024-08-16
in scheme: AQD - Air Quality Pollutants
recommended unit: ng.m-3

Benzo(k)fluoranthene in PM2.5 (aerosol)
type: Concept
notation: Benzo(k)fluoranthene in PM2.5
definition: Benzo(k)fluoranthene in PM2.5 - recommended unit: ng/m3
status: valid
status modified: 2013-09-20
accepted date: 2013-09-20
in scheme: AQD - Air Quality Pollutants
alternative label: Benzo(k)fluoranthene in PM2.5
recommended unit: ng.m-3

calcium in PM2.5 (aerosol)
type: Concept
notation: Ca2+ in PM2.5
definition: Ca2+ in PM2.5 - recommended unit: µg/m3
status: valid
status modified: 2013-09-20
accepted date: 2013-09-20
in scheme: AQD - Air Quality Pollutants
alternative label: Ca2+ in PM2.5
scope note: 2011/850/EU
recommended unit: ug.m-3

chloride in PM2.5 (aerosol)
type: Concept
notation: Cl- in PM2.5
definition: Cl- in PM2.5 - recommended unit: µg/m3
status: valid
status modified: 2013-09-20
accepted date: 2013-09-20
in scheme: AQD - Air Quality Pollutants
alternative label: Cl- in PM2.5
scope note: 2011/850/EU
recommended unit: ug.m-3

Fluoranthene in PM2.5 (aerosol)
type: Concept
notation: Fluoranthene in PM2.5 (aerosol)
definition: Fluoranthene in PM2.5 (aerosol) - recommended unit: ng/m3
status: valid
status modified: 2024-08-16
accepted date: 2024-08-16
in scheme: AQD - Air Quality Pollutants
recommended unit: ng.m-3

indeno_123cd_pyrene in PM2.5 (aerosol)
type: Concept
notation: Indeno-(1,2,3-cd)pyrene in PM2.5
definition: Indeno-(1,2,3-cd)pyrene in PM2.5 - recommended unit: ng/m3
status: valid
status modified: 2013-09-20
accepted date: 2013-09-20
in scheme: AQD - Air Quality Pollutants
alternative label: Indeno-(1,2,3-cd)pyrene in PM2.5 @bg
recommended unit: ng.m-3

potassium in PM2.5 (aerosol)
type: Concept
notation: K+ in PM2.5
definition: K+ in PM2.5 - recommended unit: µg/m3
status: valid
status modified: 2013-09-20
accepted date: 2013-09-20
in scheme: AQD - Air Quality Pollutants
alternative label: K+ in PM2.5
scope note: 2011/850/EU
recommended unit: ug.m-3

magnesium in PM2.5 (aerosol)
type: Concept
notation: Mg2+ in PM2.5
definition: Mg2+ in PM2.5 - recommended unit: µg/m3
status: valid
status modified: 2013-09-20
accepted date: 2013-09-20
in scheme: AQD - Air Quality Pollutants
alternative label: Mg2+ in PM2.5
scope note: 2011/850/EU
recommended unit: ug.m-3

sodium in PM2.5 (aerosol)
type: Concept
notation: Na+ in PM2.5
definition: Na+ in PM2.5 - recommended unit: µg/m3
status: valid
status modified: 2013-09-20
accepted date: 2013-09-20
in scheme: AQD - Air Quality Pollutants
alternative label: Na+ in PM2.5
scope note: 2011/850/EU
recommended unit: ug.m-3

Manganese (aerosol)
type: Concept
notation: Mn
definition: Mn - recommended unit: ng/m3
status: valid
status modified: 2013-09-20
accepted date: 2013-09-20
in scheme: AQD - Air Quality Pollutants
alternative label: Mn
scope note: Reciprocal exchange
recommended unit: ng.m-3

Phenanthrene in PM2.5 (aerosol)
type: Concept
notation: Phenanthrene in PM2.5 (aerosol)
definition: Phenanthrene in PM2.5 (aerosol) - recommended unit: ng/m3
status: valid
status modified: 2024-08-16
accepted date: 2024-08-16
in scheme: AQD - Air Quality Pollutants
recommended unit: ng.m-3

Pyrene in PM2.5 (aerosol)
type: Concept
notation: Pyrene in PM2.5 (aerosol)
definition: Pyrene in PM2.5 (aerosol) - recommended unit: ng/m3
status: valid
status modified: 2024-08-16
accepted date: 2024-08-16
in scheme: AQD - Air Quality Pollutants
recommended unit: ng.m-3

Benzo(j)fluoranthene in PM2.5 (aerosol)
type: Concept
notation: Benzo(j)fluoranthene in PM2.5
definition: Benzo(j)fluoranthene in PM2.5 - recommended unit: ng/m3
status: valid
status modified: 2013-09-20
accepted date: 2013-09-20
in scheme: AQD - Air Quality Pollutants
alternative label: Benzo(j)fluoranthene in PM2.5
recommended unit: ng.m-3

Elemental carbon in PM2.5 (aerosol)
type: Concept
notation: EC in PM2.5
definition: EC in PM2.5 - recommended unit: µg/m3
status: valid
status modified: 2013-09-20
accepted date: 2013-09-20
in scheme: AQD - Air Quality Pollutants
alternative label: EC in PM2.5
scope note: 2011/850/EU
recommended unit: ug.m-3

Organic carbon in PM2.5 (aerosol)
type: Concept
notation: OC in PM2.5
definition: OC in PM2.5 - recommended unit: µg/m3
status: valid
status modified: 2013-09-20
accepted date: 2013-09-20
in scheme: AQD - Air Quality Pollutants
alternative label: OC in PM2.5
scope note: 2011/850/EU
recommended unit: ug.m-3

Arsenic (aerosol)
type: Concept
notation: As
definition: As - recommended unit: ng/m3
status: valid
status modified: 2013-09-20
accepted date: 2013-09-20
in scheme: AQD - Air Quality Pollutants
alternative label: As
scope note: Reciprocal exchange
recommended unit: ng.m-3

Carbon disulphide (air)
type: Concept
notation: CS2
definition: CS2 - recommended unit: µg/m3
status: valid
status modified: 2013-09-20
accepted date: 2013-09-20
in scheme: AQD - Air Quality Pollutants
alternative label: CS2
scope note: Reciprocal exchange
recommended unit: ug.m-3

Benzene (air)
type: Concept
notation: C6H6
definition: C6H6 - recommended unit: µg/m3
status: valid
status modified: 2013-09-20
accepted date: 2013-09-20
in scheme: AQD - Air Quality Pollutants
alternative label: C6H6 @bg
scope note: 2011/850/EU
recommended unit: ug.m-3
measurement equipment: Chromatotec AirTOXIC BTX PID - A73022
measurement equipment: AirmoBTX_GC866
measurement equipment: Chrompack BTX CP7001 Monitor
measurement equipment: AMA GC5000 BTX Type FID
measurement equipment: AMA GC5000 BTX Type PID
measurement equipment: SINTECH SPECTRAS BTX GC 855 series undetermined
measurement equipment: SINTECH SPECTRAS BTX GC 855 serie 600
measurement equipment: Chromatotec GC866
measurement equipment: SYNTECH SPECTRAS GC 955 series undetermined
measurement equipment: SYNTECH SPECTRAS GC 955-600
measurement equipment: SYNTECH SPECTRAS GC 955-601
measurement equipment: SYNTECH SPECTRAS GC 955-615/815
measurement equipment: SYNTECH SPECTRAS GC 955-800
measurement equipment: SRI8610-C
measurement equipment: Environnement VOC71M
measurement equipment: Environnement VOC72M
measurement equipment: agilent HP 6890
measurement equipment: airmoVOC BTX
measurement equipment: airmotec BTX 1000
measurement equipment: Opsis AR500 Open path monitor with ER 110
measurement equipment: Opsis AR500 Open path monitor with ER 120
measurement equipment: Opsis AR500 Open path monitor with ER 150
has protection target: Health

Lead (precip)
type: Concept
notation: Pb
definition: Pb - recommended unit: µg/l
status: valid
status modified: 2013-09-20
accepted date: 2013-09-20
in scheme: AQD - Air Quality Pollutants
alternative label: Pb
scope note: Reciprocal exchange
recommended unit: ug.l-1

Mercury (precip)
type: Concept
notation: Hg
definition: Hg - recommended unit: ng/l
status: valid
status modified: 2013-09-20
accepted date: 2013-09-20
in scheme: AQD - Air Quality Pollutants
alternative label: Hg
scope note: Reciprocal exchange
recommended unit: ng.l-1

Cadmium (precip)
type: Concept
notation: Cd
definition: Cd - recommended unit: µg/l
status: valid
status modified: 2013-09-20
accepted date: 2013-09-20
in scheme: AQD - Air Quality Pollutants
alternative label: Cd
scope note: Reciprocal exchange
recommended unit: ug.l-1

Nickel (precip)
type: Concept
notation: Ni
definition: Ni - recommended unit: µg/l
status: valid
status modified: 2013-09-20
accepted date: 2013-09-20
in scheme: AQD - Air Quality Pollutants
alternative label: Ni
scope note: Reciprocal exchange
recommended unit: ug.l-1

Chromium (precip)
type: Concept
notation: Cr
definition: Cr - recommended unit: µg/l
status: valid
status modified: 2013-09-20
accepted date: 2013-09-20
in scheme: AQD - Air Quality Pollutants
alternative label: Cr
scope note: Reciprocal exchange
recommended unit: ug.l-1

Manganese (precip)
type: Concept
notation: Mn
definition: Mn - recommended unit: µg/l
status: valid
status modified: 2013-09-20
accepted date: 2013-09-20
in scheme: AQD - Air Quality Pollutants
alternative label: Mn
scope note: Reciprocal exchange
recommended unit: ug.l-1

Arsenic (precip)
type: Concept
notation: As
definition: As - recommended unit: µg/l
status: valid
status modified: 2013-09-20
accepted date: 2013-09-20
in scheme: AQD - Air Quality Pollutants
alternative label: As
scope note: Reciprocal exchange
recommended unit: ug.l-1

Total nitrogen (precip)
type: Concept
notation: NT
definition: Total nitrogen in precipitation - recommended unit: mg N/l
status: valid
status modified: 2024-04-05
accepted date: 2024-04-05
in scheme: AQD - Air Quality Pollutants
recommended unit: mgN.l-1

Zinc (precip)
type: Concept
notation: Zn
definition: Zn - recommended unit: µg/l
status: valid
status modified: 2013-09-20
accepted date: 2013-09-20
in scheme: AQD - Air Quality Pollutants
alternative label: Zn
scope note: Reciprocal exchange
recommended unit: ug.l-1

Cobalt (precip)
type: Concept
notation: Co
definition: Co - recommended unit: µg/l
status: valid
status modified: 2013-09-20
accepted date: 2013-09-20
in scheme: AQD - Air Quality Pollutants
alternative label: Co
scope note: Reciprocal exchange
recommended unit: ug.l-1

Iron (precip)
type: Concept
notation: Fe
definition: Fe - recommended unit: µg/l
status: valid
status modified: 2013-09-20
accepted date: 2013-09-20
in scheme: AQD - Air Quality Pollutants
alternative label: Fe
scope note: Reciprocal exchange
recommended unit: ug.l-1

Copper (precip)
type: Concept
notation: Cu
definition: Cu - recommended unit: µg/l
status: valid
status modified: 2013-09-20
accepted date: 2013-09-20
in scheme: AQD - Air Quality Pollutants
alternative label: Cu
scope note: Reciprocal exchange
recommended unit: ug.l-1

acidity(pH) (precip)
type: Concept
notation: pH
definition: pH - recommended unit: pH units
status: valid
status modified: 2013-09-20
accepted date: 2013-09-20
in scheme: AQD - Air Quality Pollutants
alternative label: pH @bg
scope note: Reciprocal exchange
recommended unit: pHunits

Toluene (air)
type: Concept
notation: C6H5-CH3
definition: C6H5-CH3 - recommended unit: µg/m3
status: valid
status modified: 2013-09-20
accepted date: 2013-09-20
in scheme: AQD - Air Quality Pollutants
alternative label: C6H5-CH3
scope note: 2011/850/EU
recommended unit: ug.m-3
measurement equipment: Chromatotec AirTOXIC BTX PID - A73022
measurement equipment: AirmoBTX_GC866
measurement equipment: AMA GC5000 BTX Type FID
measurement equipment: SINTECH SPECTRAS BTX GC 855 series undetermined
measurement equipment: Chromatotec GC866
measurement equipment: SYNTECH SPECTRAS GC 955 series undetermined
measurement equipment: SYNTECH SPECTRAS GC 955-600
measurement equipment: SYNTECH SPECTRAS GC 955-601
measurement equipment: SYNTECH SPECTRAS GC 955-615/815
measurement equipment: SRI8610-C
measurement equipment: Environnement VOC72M
measurement equipment: agilent HP 6890
measurement equipment: airmoVOC BTX
measurement equipment: airmotec BTX 1000
measurement equipment: Opsis AR500 Open path monitor with ER 150

Styrene (air)
type: Concept
notation: C6H5-CH=CH2
definition: C6H5-CH=CH2 - recommended unit: µg/m3
status: valid
status modified: 2013-09-20
accepted date: 2013-09-20
in scheme: AQD - Air Quality Pollutants
alternative label: C6H5-CH=CH2
scope note: Reciprocal exchange
recommended unit: ug.m-3

Acrylonitrile (air)
type: Concept
notation: CH2=CH-CN
definition: CH2=CH-CN - recommended unit: µg/m3
status: valid
status modified: 2013-09-20
accepted date: 2013-09-20
in scheme: AQD - Air Quality Pollutants
alternative label: CH2=CH-CN
scope note: Reciprocal exchange
recommended unit: ug.m-3

Benzo(b,j,k)fluoranthene (precip)
type: Concept
notation: Benzo(b,j,k)fluoranthene
definition: Benzo(b,j,k)fluoranthene - recommended unit: ng/l
status: valid
status modified: 2013-09-20
accepted date: 2013-09-20
in scheme: AQD - Air Quality Pollutants
alternative label: Benzo(b,j,k)fluoranthene
scope note: Reciprocal exchange
recommended unit: ng.l-1

1.3 Butadiene (air)
type: Concept
notation: CH2=CH-CH=CH2
definition: CH2=CH-CH=CH2 - recommended unit: µg/m3
status: valid
status modified: 2013-09-20
accepted date: 2013-09-20
in scheme: AQD - Air Quality Pollutants
alternative label: CH2=CH-CH=CH2
scope note: 2011/850/EU
recommended unit: ug.m-3
measurement equipment: SYNTECH SPECTRAS GC 955 series undetermined
measurement equipment: SYNTECH SPECTRAS GC 955-615/815
measurement equipment: Environnement VOC72M

Formaldehyde (air)
type: Concept
notation: HCHO
definition: HCHO - recommended unit: µg/m3
status: valid
status modified: 2013-09-20
accepted date: 2013-09-20
in scheme: AQD - Air Quality Pollutants
alternative label: Methanal (air)
scope note: 2011/850/EU
recommended unit: ug.m-3

Trichloroethylene (air)
type: Concept
notation: CHCl=CCl2
definition: CHCl=CCl2 - recommended unit: µg/m3
status: valid
status modified: 2013-09-20
accepted date: 2013-09-20
in scheme: AQD - Air Quality Pollutants
alternative label: CHCl=CCl2
scope note: Reciprocal exchange
recommended unit: ug.m-3

Tetrachloroethylene (air)
type: Concept
notation: C2Cl4
definition: C2Cl4 - recommended unit: µg/m3
status: valid
status modified: 2013-09-20
accepted date: 2013-09-20
in scheme: AQD - Air Quality Pollutants
alternative label: C2Cl4
scope note: Reciprocal exchange
recommended unit: ug.m-3

phosphate (precip)
type: Concept
notation: PO43-
definition: PO43- - recommended unit: mg S/l
status: valid
status modified: 2013-09-20
accepted date: 2013-09-20
in scheme: AQD - Air Quality Pollutants
alternative label: PO43-
scope note: Reciprocal exchange
recommended unit: mgS.m-1

Total phosphorus (precip)
type: Concept
notation: TP
definition: Total phosphorus (precip)
status: valid
status modified: 2020-03-27
in scheme: AQD - Air Quality Pollutants
recommended unit: mg.l-1

Dichloromethane (air)
type: Concept
notation: CH2Cl2
definition: CH2Cl2 - recommended unit: µg/m3
status: valid
status modified: 2013-09-20
accepted date: 2013-09-20
in scheme: AQD - Air Quality Pollutants
alternative label: CH2Cl2
scope note: Reciprocal exchange
recommended unit: ug.m-3

PFBA (precip)
type: Concept
notation: PFBA
definition: PFBA - recommended unit: ng.l-1
status: valid
status modified: 2018-12-13
accepted date: 2018-12-13
in scheme: AQD - Air Quality Pollutants
alternative label: PFBA
scope note: Reciprocal exchange
recommended unit: ng.l-1

PFPeA (precip)
type: Concept
notation: PFPeA
definition: PFPeA - recommended unit: ng.l-1
status: valid
status modified: 2018-12-13
accepted date: 2018-12-13
in scheme: AQD - Air Quality Pollutants
alternative label: PFPeA
scope note: Reciprocal exchange
recommended unit: ng.l-1

PFHxA (precip)
type: Concept
notation: PFHxA
definition: PFHxA - recommended unit: ng.l-1
status: valid
status modified: 2018-12-13
accepted date: 2018-12-13
in scheme: AQD - Air Quality Pollutants
alternative label: PFHxA
scope note: Reciprocal exchange
recommended unit: ng.l-1

PFHpA (precip)
type: Concept
notation: PFHpA
definition: PFHpA - recommended unit: ng.l-1
status: valid
status modified: 2018-12-13
accepted date: 2018-12-13
in scheme: AQD - Air Quality Pollutants
alternative label: PFHpA
scope note: Reciprocal exchange
recommended unit: ng.l-1

PFOA (precip)
type: Concept
notation: PFOA
definition: PFOA - recommended unit: ng.l-1
status: valid
status modified: 2018-12-13
accepted date: 2018-12-13
in scheme: AQD - Air Quality Pollutants
alternative label: PFOA
scope note: Reciprocal exchange
recommended unit: ng.l-1

PFNA (precip)
type: Concept
notation: PFNA
definition: PFNA - recommended unit: ng.l-1
status: valid
status modified: 2018-12-13
accepted date: 2018-12-13
in scheme: AQD - Air Quality Pollutants
alternative label: PFNA
scope note: Reciprocal exchange
recommended unit: ng.l-1

PFDA (precip)
type: Concept
notation: PFDA
definition: PFDA - recommended unit: ng.l-1
status: valid
status modified: 2018-12-13
accepted date: 2018-12-13
in scheme: AQD - Air Quality Pollutants
alternative label: PFDA
scope note: Reciprocal exchange
recommended unit: ng.l-1

PFUnDA (precip)
type: Concept
notation: PFUnDA
definition: PFUnDA - recommended unit: ng.l-1
status: valid
status modified: 2018-12-13
accepted date: 2018-12-13
in scheme: AQD - Air Quality Pollutants
alternative label: PFUnDA
scope note: Reciprocal exchange
recommended unit: ng.l-1

PFBS (precip)
type: Concept
notation: PFBS
definition: PFBS - recommended unit: ng.l-1
status: valid
status modified: 2018-12-13
accepted date: 2018-12-13
in scheme: AQD - Air Quality Pollutants
alternative label: PFBS
scope note: Reciprocal exchange
recommended unit: ng.l-1

PFHxS (precip)
type: Concept
notation: PFHxS
definition: PFHxS - recommended unit: ng.l-1
status: valid
status modified: 2018-12-13
accepted date: 2018-12-13
in scheme: AQD - Air Quality Pollutants
alternative label: PFHxS
scope note: Reciprocal exchange
recommended unit: ng.l-1

PFOSA (precip)
type: Concept
notation: PFOSA
definition: PFOSA - recommended unit: ng.l-1
status: valid
status modified: 2018-12-13
accepted date: 2018-12-13
in scheme: AQD - Air Quality Pollutants
alternative label: PFOSA
scope note: Reciprocal exchange
recommended unit: ng.l-1

6:2-FTS (precip)
type: Concept
notation: 6:2-FTS
definition: 6:2-FTS - recommended unit: ng.l-1
status: valid
status modified: 2018-12-13
accepted date: 2018-12-13
in scheme: AQD - Air Quality Pollutants
alternative label: 6:2-FTS
scope note: Reciprocal exchange
recommended unit: ng.l-1

PFOS (precip)
type: Concept
notation: PFOS
definition: PFOS - recommended unit: ng.l-1
status: valid
status modified: 2018-12-13
accepted date: 2018-12-13
in scheme: AQD - Air Quality Pollutants
alternative label: PFOS
scope note: Reciprocal exchange
recommended unit: ng.l-1

PFDS (precip)
type: Concept
notation: PFDS
definition: PFDS - recommended unit: ng.l-1
status: valid
status modified: 2018-12-13
accepted date: 2018-12-13
in scheme: AQD - Air Quality Pollutants
alternative label: PFDS
scope note: Reciprocal exchange
recommended unit: ng.l-1

Benzo(a)pyrene (precip)
type: Concept
notation: BaP
definition: BaP - recommended unit: ng/l
status: valid
status modified: 2013-09-20
accepted date: 2013-09-20
in scheme: AQD - Air Quality Pollutants
alternative label: BaP
scope note: Reciprocal exchange
recommended unit: ng.l-1

Strong acidity (air)
type: Concept
notation: SA
definition: SA - recommended unit: µg SO2/m3
status: valid
status modified: 2013-09-20
accepted date: 2013-09-20
in scheme: AQD - Air Quality Pollutants
alternative label: SA
scope note: Reciprocal exchange
recommended unit: ugSO2.m-3

Polyaromatic hydrocarbons (air+aerosol)
type: Concept
notation: PAH
definition: PAH - recommended unit: ng/m3
status: valid
status modified: 2013-09-20
accepted date: 2013-09-20
in scheme: AQD - Air Quality Pollutants
alternative label: PAH
scope note: Reciprocal exchange
recommended unit: ng.m-3

Lead in TSP (aerosol)
type: Concept
notation: Pb in TSP
definition: Pb in TSP - recommended unit: µg/m3
status: valid
status modified: 2013-09-20
accepted date: 2013-09-20
in scheme: AQD - Air Quality Pollutants
alternative label: Pb in TSP
scope note: Reciprocal exchange
recommended unit: ug.m-3

Mercury in TSP (aerosol)
type: Concept
notation: Hg in TSP
definition: Hg in TSP - recommended unit: ng/m3
status: valid
status modified: 2013-09-20
accepted date: 2013-09-20
in scheme: AQD - Air Quality Pollutants
alternative label: Hg in TSP
scope note: Reciprocal exchange
recommended unit: ng.m-3

Cadmium in TSP (aerosol)
type: Concept
notation: Cd in TSP
definition: Cd in TSP - recommended unit: ng/m3
status: valid
status modified: 2013-09-20
accepted date: 2013-09-20
in scheme: AQD - Air Quality Pollutants
alternative label: Cd in TSP
scope note: Reciprocal exchange
recommended unit: ng.m-3

Nickel in TSP (aerosol)
type: Concept
notation: Ni in TSP
definition: Ni in TSP - recommended unit: ng/m3
status: valid
status modified: 2013-09-20
accepted date: 2013-09-20
in scheme: AQD - Air Quality Pollutants
alternative label: Ni in TSP
recommended unit: ng.m-3

Chromium in TSP (aerosol)
type: Concept
notation: Cr in TSP
definition: Cr in TSP - recommended unit: ng/m3
status: valid
status modified: 2013-09-20
accepted date: 2013-09-20
in scheme: AQD - Air Quality Pollutants
alternative label: Cr in TSP
recommended unit: ng.m-3

Manganese in TSP (aerosol)
type: Concept
notation: Mn in TSP
definition: Mn in TSP - recommended unit: ng/m3
status: valid
status modified: 2013-09-20
accepted date: 2013-09-20
in scheme: AQD - Air Quality Pollutants
alternative label: Mn in TSP
recommended unit: ng.m-3

Arsenic in TSP (aerosol)
type: Concept
notation: As in TSP
definition: As in TSP - recommended unit: ng/m3
status: valid
status modified: 2013-09-20
accepted date: 2013-09-20
in scheme: AQD - Air Quality Pollutants
alternative label: As in TSP
recommended unit: ng.m-3

CFC_11 (air)
type: Concept
notation: CFC-11
definition: CFC-11 - recommended unit: pptv
status: valid
status modified: 2013-09-20
accepted date: 2013-09-20
in scheme: AQD - Air Quality Pollutants
alternative label: CFC-11
scope note: Reciprocal exchange
recommended unit: pptv

CFC_113 (air)
type: Concept
notation: CFC-113
definition: CFC-113 - recommended unit: pptv
status: valid
status modified: 2013-09-20
accepted date: 2013-09-20
in scheme: AQD - Air Quality Pollutants
alternative label: CFC-113
scope note: Reciprocal exchange
recommended unit: pptv

CFC_12 (air)
type: Concept
notation: CFC-12
definition: CFC-12 - recommended unit: pptv
status: valid
status modified: 2013-09-20
accepted date: 2013-09-20
in scheme: AQD - Air Quality Pollutants
alternative label: CFC-12
scope note: Reciprocal exchange
recommended unit: pptv

Zinc in TSP (aerosol)
type: Concept
notation: Zn in TSP
definition: Zn in TSP - recommended unit: ng/m3
status: valid
status modified: 2013-09-20
accepted date: 2013-09-20
in scheme: AQD - Air Quality Pollutants
alternative label: Zn in TSP
recommended unit: ng.m-3

HCFC_123 (air)
type: Concept
notation: HCFC-123
definition: HCFC-123 - recommended unit: pptv
status: valid
status modified: 2013-09-20
accepted date: 2013-09-20
in scheme: AQD - Air Quality Pollutants
alternative label: HCFC-123
scope note: Reciprocal exchange
recommended unit: pptv

Copper in TSP (aerosol)
type: Concept
notation: Cu in TSP
definition: Cu in TSP - recommended unit: ng/m3
status: valid
status modified: 2013-09-20
accepted date: 2013-09-20
in scheme: AQD - Air Quality Pollutants
alternative label: Cu in TSP
recommended unit: ng.m-3

HCFC_22 (air)
type: Concept
notation: HCFC-22
definition: HCFC-22 - recommended unit: pptv
status: valid
status modified: 2013-09-20
accepted date: 2013-09-20
in scheme: AQD - Air Quality Pollutants
alternative label: HCFC-22
scope note: Reciprocal exchange
recommended unit: pptv

N1methylnaphtalene (air+aerosol)
type: Concept
notation: 1-methylnaphtalene
definition: 1-methylnaphtalene - recommended unit: ng/m3
status: valid
status modified: 2013-09-20
accepted date: 2013-09-20
in scheme: AQD - Air Quality Pollutants
alternative label: 1-methylnaphtalene
scope note: Reciprocal exchange
recommended unit: ng.m-3

Vinyl chloride (air)
type: Concept
notation: VC
definition: VC - recommended unit: µg/m3
status: valid
status modified: 2013-09-20
accepted date: 2013-09-20
in scheme: AQD - Air Quality Pollutants
alternative label: VC
scope note: Reciprocal exchange
recommended unit: ug.m-3

N1methylphenanthrene (air+aerosol)
type: Concept
notation: 1-methylphenanthrene
definition: 1-methylphenanthrene - recommended unit: ng/m3
status: valid
status modified: 2013-09-20
accepted date: 2013-09-20
in scheme: AQD - Air Quality Pollutants
alternative label: 1-methylphenanthrene
scope note: Reciprocal exchange
recommended unit: ng.m-3

N2butanone (air)
type: Concept
notation: Methyletylketone (MEK)
definition: Methyletylketone (MEK) - recommended unit: µg/m3
status: valid
status modified: 2013-09-20
accepted date: 2013-09-20
in scheme: AQD - Air Quality Pollutants
alternative label: Methyletylketone (MEK)
scope note: Reciprocal exchange
recommended unit: ug.m-3

N2butenal (air)
type: Concept
notation: Crotonaldehyde
definition: Crotonaldehyde - recommended unit: µg/m3
status: valid
status modified: 2013-09-20
accepted date: 2013-09-20
in scheme: AQD - Air Quality Pollutants
alternative label: Crotonaldehyde
scope note: Reciprocal exchange
recommended unit: ug.m-3

N2methylanthracene (air+aerosol)
type: Concept
notation: 2-methylanthracene
definition: 2-methylanthracene - recommended unit: ng/m3
status: valid
status modified: 2013-09-20
accepted date: 2013-09-20
in scheme: AQD - Air Quality Pollutants
alternative label: 2-methylanthracene
scope note: Reciprocal exchange
recommended unit: ng.m-3

N2methylbenzencarbaldehyde (air)
type: Concept
notation: 2-methylbenzaldehyde
definition: 2-methylbenzaldehyde - recommended unit: µg/m3
status: valid
status modified: 2013-09-20
accepted date: 2013-09-20
in scheme: AQD - Air Quality Pollutants
alternative label: 2-methylbenzaldehyde
scope note: Reciprocal exchange
recommended unit: ug.m-3

N2methylnaphtalene (air+aerosol)
type: Concept
notation: 2-methylnaphtalene
definition: 2-methylnaphtalene - recommended unit: ng/m3
status: valid
status modified: 2013-09-20
accepted date: 2013-09-20
in scheme: AQD - Air Quality Pollutants
alternative label: 2-methylnaphtalene
scope note: Reciprocal exchange
recommended unit: ng.m-3

i-Hexane (2-methylpentane) (air)
type: Concept
notation: (CH3)2-CH-CH2-CH2-CH3
definition: (CH3)2-CH-CH2-CH2-CH3 - recommended unit: µg/m3
status: valid
status modified: 2013-09-20
accepted date: 2013-09-20
in scheme: AQD - Air Quality Pollutants
alternative label: (CH3)2-CH-CH2-CH2-CH3
scope note: 2011/850/EU
recommended unit: ug.m-3
measurement equipment: SYNTECH SPECTRAS GC 955 series undetermined
measurement equipment: SYNTECH SPECTRAS GC 955-615/815

N2methylphenanthrene (air+aerosol)
type: Concept
notation: 2-methylphenanthrene
definition: 2-methylphenanthrene - recommended unit: ng/m3
status: valid
status modified: 2013-09-20
accepted date: 2013-09-20
in scheme: AQD - Air Quality Pollutants
alternative label: 2-methylphenanthrene
scope note: Reciprocal exchange
recommended unit: ng.m-3

N2methylpropenal (air)
type: Concept
notation: Methacroleine
definition: Methacroleine - recommended unit: µg/m3
status: valid
status modified: 2013-09-20
accepted date: 2013-09-20
in scheme: AQD - Air Quality Pollutants
alternative label: Methacroleine
scope note: Reciprocal exchange
related match: N2methylpropenal + Butanal (air)
recommended unit: ug.m-3

N2oxopropanal (air)
type: Concept
notation: Methylglyoxal
definition: Methylglyoxal - recommended unit: µg/m3
status: valid
status modified: 2013-09-20
accepted date: 2013-09-20
in scheme: AQD - Air Quality Pollutants
alternative label: Methylglyoxal
scope note: Reciprocal exchange
recommended unit: ug.m-3

Total non-methane hydrocarbons (air)
type: Concept
notation: THC (NM)
definition: THC (NM) - recommended unit: µg C/m3
status: valid
status modified: 2013-09-20
accepted date: 2013-09-20
in scheme: AQD - Air Quality Pollutants
alternative label: THC (NM)
scope note: 2011/850/EU
recommended unit: ugC.m-3

N2propenal (air)
type: Concept
notation: Acroleine
definition: Acroleine - recommended unit: µg/m3
status: valid
status modified: 2013-09-20
accepted date: 2013-09-20
in scheme: AQD - Air Quality Pollutants
alternative label: Acroleine
scope note: Reciprocal exchange
related match: Propanone + N2propenal (air)
recommended unit: ug.m-3

N3buten2one (air)
type: Concept
notation: Methylvinylketone (MVK)
definition: Methylvinylketone (MVK) - recommended unit: µg/m3
status: valid
status modified: 2013-09-20
accepted date: 2013-09-20
in scheme: AQD - Air Quality Pollutants
alternative label: Methylvinylketone (MVK)
scope note: Reciprocal exchange
recommended unit: ug.m-3

N3methylbenzencarbaldehyde (air)
type: Concept
notation: 3-methylbenzaldehyde
definition: 3-methylbenzaldehyde - recommended unit: µg/m3
status: valid
status modified: 2013-09-20
accepted date: 2013-09-20
in scheme: AQD - Air Quality Pollutants
alternative label: 3-methylbenzaldehyde
scope note: Reciprocal exchange
recommended unit: ug.m-3

N3methylpentane (air)
type: Concept
notation: 3-methylpentane
definition: 3-methylpentane - recommended unit: pptv
status: valid
status modified: 2013-09-20
accepted date: 2013-09-20
in scheme: AQD - Air Quality Pollutants
alternative label: 3-methylpentane
scope note: Reciprocal exchange
recommended unit: pptv

N4methylbenzencarbaldehyde (air)
type: Concept
notation: 4-methylbenzaldehyde
definition: 4-methylbenzaldehyde - recommended unit: µg/m3
status: valid
status modified: 2013-09-20
accepted date: 2013-09-20
in scheme: AQD - Air Quality Pollutants
alternative label: 4-methylbenzaldehyde
scope note: Reciprocal exchange
recommended unit: ug.m-3

NOy (air)
type: Concept
notation: NOy
definition: NOy - recommended unit: µg N/m3
status: valid
status modified: 2013-09-20
accepted date: 2013-09-20
in scheme: AQD - Air Quality Pollutants
alternative label: NOy
scope note: Reciprocal exchange
recommended unit: ugN.m-3

Total volatile organic compounds (air)
type: Concept
notation: T-VOC
definition: T-VOC - recommended unit: µg/m3
status: valid
status modified: 2013-09-20
accepted date: 2013-09-20
in scheme: AQD - Air Quality Pollutants
alternative label: T-VOC
scope note: Reciprocal exchange
recommended unit: ug.m-3
measurement equipment: Chromatotec GC866
measurement equipment: SYNTECH SPECTRAS GC 955-601
measurement equipment: SRI8610-C

PCB_105 (precip)
type: Concept
notation: PCB-105
definition: PCB-105 - recommended unit: ng/l
status: valid
status modified: 2013-09-20
accepted date: 2013-09-20
in scheme: AQD - Air Quality Pollutants
alternative label: PCB-105
scope note: Reciprocal exchange
recommended unit: ng.l-1

PCB_128 (precip)
type: Concept
notation: PCB-128
definition: PCB-128 - recommended unit: ng/l
status: valid
status modified: 2013-09-20
accepted date: 2013-09-20
in scheme: AQD - Air Quality Pollutants
alternative label: PCB-128
scope note: Reciprocal exchange
recommended unit: ng.l-1

PCB_149 (precip)
type: Concept
notation: PCB-149
definition: PCB-149 - recommended unit: ng/l
status: valid
status modified: 2013-09-20
accepted date: 2013-09-20
in scheme: AQD - Air Quality Pollutants
alternative label: PCB-149
scope note: Reciprocal exchange
recommended unit: ng.l-1

PCB_156 (precip)
type: Concept
notation: PCB-156
definition: PCB-156 - recommended unit: ng/l
status: valid
status modified: 2013-09-20
accepted date: 2013-09-20
in scheme: AQD - Air Quality Pollutants
alternative label: PCB-156
scope note: Reciprocal exchange
recommended unit: ng.l-1

Peroxyacetyl nitrate (air)
type: Concept
notation: PAN
definition: PAN - recommended unit: µg/m3
status: valid
status modified: 2013-09-20
accepted date: 2013-09-20
in scheme: AQD - Air Quality Pollutants
alternative label: PAN
scope note: Reciprocal exchange
recommended unit: ug.m-3

PCB_177 (precip)
type: Concept
notation: PCB-177
definition: PCB-177 - recommended unit: ng/l
status: valid
status modified: 2013-09-20
accepted date: 2013-09-20
in scheme: AQD - Air Quality Pollutants
alternative label: PCB-177
scope note: Reciprocal exchange
recommended unit: ng.l-1

PCB_18 (precip)
type: Concept
notation: PCB-18
definition: PCB-18 - recommended unit: ng/l
status: valid
status modified: 2013-09-20
accepted date: 2013-09-20
in scheme: AQD - Air Quality Pollutants
alternative label: PCB-18
scope note: Reciprocal exchange
recommended unit: ng.l-1

PCB_26 (precip)
type: Concept
notation: PCB-26
definition: PCB-26 - recommended unit: ng/l
status: valid
status modified: 2013-09-20
accepted date: 2013-09-20
in scheme: AQD - Air Quality Pollutants
alternative label: PCB-26
scope note: Reciprocal exchange
recommended unit: ng.l-1

PCB_31 (precip)
type: Concept
notation: PCB-31
definition: PCB-31 - recommended unit: ng/l
status: valid
status modified: 2013-09-20
accepted date: 2013-09-20
in scheme: AQD - Air Quality Pollutants
alternative label: PCB-31
scope note: Reciprocal exchange
recommended unit: ng.l-1

PCB_44 (precip)
type: Concept
notation: PCB-44
definition: PCB-44 - recommended unit: ng/l
status: valid
status modified: 2013-09-20
accepted date: 2013-09-20
in scheme: AQD - Air Quality Pollutants
alternative label: PCB-44
scope note: Reciprocal exchange
recommended unit: ng.l-1

Ammonia (air)
type: Concept
notation: NH3
definition: NH3 - recommended unit: µg/m3
status: valid
status modified: 2013-09-20
accepted date: 2013-09-20
in scheme: AQD - Air Quality Pollutants
alternative label: NH3
scope note: Reciprocal exchange
recommended unit: ug.m-3
measurement equipment: Thermo 17i
measurement equipment: Picarro G2103
measurement equipment: serinus 40 with NH3 converter

acenaphthene (air+aerosol)
type: Concept
notation: Acenaphthene
definition: Acenaphthene - recommended unit: ng/m3
status: valid
status modified: 2013-09-20
accepted date: 2013-09-20
in scheme: AQD - Air Quality Pollutants
alternative label: Acenaphthene
scope note: Reciprocal exchange
recommended unit: ng.m-3

acenaphtylene (air+aerosol)
type: Concept
notation: Acenaphtylene
definition: Acenaphtylene - recommended unit: ng/m3
status: valid
status modified: 2013-09-20
accepted date: 2013-09-20
in scheme: AQD - Air Quality Pollutants
alternative label: Acenaphtylene
scope note: Reciprocal exchange
recommended unit: ng.m-3

aldrin (precip)
type: Concept
notation: Aldrin
definition: Aldrin - recommended unit: ng/l
status: valid
status modified: 2013-09-20
accepted date: 2013-09-20
in scheme: AQD - Air Quality Pollutants
alternative label: Aldrin
scope note: Reciprocal exchange
recommended unit: ng.l-1

Wet nitrogen deposition (flux)
type: Concept
notation: N-DEP
definition: N-DEP - recommended unit: mg N/m2.m
status: valid
status modified: 2013-09-20
accepted date: 2013-09-20
in scheme: AQD - Air Quality Pollutants
alternative label: N-DEP
scope note: Reciprocal exchange
recommended unit: mgN.m-2.m-1

chloride in TSP (aerosol)
type: Concept
notation: Cl- in TSP
definition: Cl- in TSP - recommended unit: µg/m3
status: valid
status modified: 2013-09-20
accepted date: 2013-09-20
in scheme: AQD - Air Quality Pollutants
alternative label: Cl- in TSP
recommended unit: ug.m-3

anthanthrene (air+aerosol)
type: Concept
notation: Anthanthrene
definition: Anthanthrene - recommended unit: ng/m3
status: valid
status modified: 2013-09-20
accepted date: 2013-09-20
in scheme: AQD - Air Quality Pollutants
alternative label: Anthanthrene
scope note: Reciprocal exchange
recommended unit: ng.m-3

sodium in TSP (aerosol)
type: Concept
notation: Na+ in TSP
definition: Na+ in TSP - recommended unit: µg/m3
status: valid
status modified: 2013-09-20
accepted date: 2013-09-20
in scheme: AQD - Air Quality Pollutants
alternative label: Na+ in TSP
recommended unit: ug.m-3

Wet sulphur deposition (flux)
type: Concept
notation: S-DEP
definition: S-DEP - recommended unit: mg S/m2.m
status: valid
status modified: 2013-09-20
accepted date: 2013-09-20
in scheme: AQD - Air Quality Pollutants
alternative label: S-DEP
scope note: Reciprocal exchange
recommended unit: mgS.m-2.m-1

Benzenecarbaldehyde (air)
type: Concept
notation: Benzaldehyde
definition: Benzaldehyde - recommended unit: µg/m3
status: valid
status modified: 2013-09-20
accepted date: 2013-09-20
in scheme: AQD - Air Quality Pollutants
alternative label: Benzaldehyde
scope note: Reciprocal exchange
recommended unit: ug.m-3

Benzo(a)fluoranthene (air+aerosol)
type: Concept
notation: Benzo(a)fluoranthene
definition: Benzo(a)fluoranthene - recommended unit: ng/m3
status: valid
status modified: 2013-09-20
accepted date: 2013-09-20
in scheme: AQD - Air Quality Pollutants
alternative label: Benzo(a)fluoranthene
scope note: Reciprocal exchange
recommended unit: ng.m-3

Tolualdehyde (air)
type: Concept
notation: C8H8O
definition: C8H8O - recommended unit: µg/m3
status: valid
status modified: 2016-03-29
in scheme: AQD - Air Quality Pollutants
recommended unit: ug.m-3

Nitrogen monoxide (air)
type: Concept
notation: NO
definition: NO - recommended unit: µg/m3
status: valid
status modified: 2013-09-20
accepted date: 2013-09-20
in scheme: AQD - Air Quality Pollutants
alternative label: NO
scope note: Reciprocal exchange
recommended unit: ug.m-3
measurement equipment: Teledyne API 200 chemiluminescent NOx analyser
measurement equipment: Teledyne API 200A chemiluminescent NOx analyser
measurement equipment: TELEDYNE API 200AU
measurement equipment: Teledyne API 200E chemiluminescent NOx analyser
measurement equipment: Teledyne API 200EU chemiluminescent NOx analyser
measurement equipment: Teledyne API 200EU chemiluminescent NOx analyser - blue light
measurement equipment: Teledyne API 200UP chemiluminescent NOx analyser
measurement equipment: Teledyne API M200E chemiluminescent NOx analyser
measurement equipment: Teledyne API T200 chemiluminescent NOx analyser
measurement equipment: Teledyne API T200U chemiluminescent NOx analyser
measurement equipment: Teledyne API T500U CAPS NO2 Analyzer
measurement equipment: Dasibi 2110A
measurement equipment: Eco Physics CLD 700 AL
measurement equipment: Eco Physics CLD 780 TR
measurement equipment: Envea AC32e - NO/NO2/NOx Analyzer (replaces enviroAC32E)
measurement equipment: MELOY_NA530R
measurement equipment: Monitor Labs model 2041 NOx analyser
measurement equipment: Monitor Labs model 8410 NOx analyser
measurement equipment: Monitor Labs model 8440 NOx analyser
measurement equipment: Monitor Labs model 8841 NOx analyser
measurement equipment: Monitor Labs model 8840 NOx analyser
measurement equipment: Monitor Labs model 8941A NOx analyser
measurement equipment: Monitor Labs model 9840 NOx analyser
measurement equipment: Monitor Labs model 9841 NOx analyser
measurement equipment: Monitor Labs model 9841A NOx analyser
measurement equipment: Monitor Labs model 9841B NOx analyser
measurement equipment: Monitor Labs model 9841T NOx analyser
measurement equipment: SIR S-5012
measurement equipment: Aeris AE2041U
measurement equipment: airpointer
measurement equipment: Bendix/Combustion Engineering Model 8101-C Oxides of Nitrogen Analyze
measurement equipment: Columbia Scientific Industries Models 1600
measurement equipment: Columbia Scientific Industries Models 5600
measurement equipment: DASIBI 2108 NOx analyser
measurement equipment: Environnement S.A. Model AC21M NO2 Analyzer
measurement equipment: Environnement S.A. Model AC30M NO2 Analyzer
measurement equipment: Environnement S.A. Model AC31M NO2 Analyzer
measurement equipment: Environnement S.A. Model AC32M NO2 Analyzer
measurement equipment: Environnement S.A. Model AC32E NO2 Analyzer (superseded by EnveaAC32e)
measurement equipment: Environnement S.A. Model AS32M Nitrogen Dioxide Analyzer
measurement equipment: Horiba model APNA 300 NOx analyser
measurement equipment: Horiba model APNA 300E NOx analyser
measurement equipment: Horiba model APNA 350 NOx analyser
measurement equipment: Horiba model APNA 350E NOx analyser
measurement equipment: Horiba model APNA 360 NOx analyser
measurement equipment: Horiba model APNA 360E NOx analyser
measurement equipment: Horiba model APNA 370 NOx analyser
measurement equipment: Opsis AR500 Open path monitor with ER 150
measurement equipment: PHILIPS K50034 API 200A
measurement equipment: PHILIPS K50102 NO
measurement equipment: PHILIPS K50235/00 NO-NOx-NO2 analyser
measurement equipment: PHILIPS PW9762/00 NO/NO2/NOX Analyser
measurement equipment: serinus 40 Nox
measurement equipment: Thermo model 14B chemiluminescence NO-NO2-Nox
measurement equipment: Thermo model 14B/E chemiluminescence NO-NO2-Nox
measurement equipment: Thermo model 42 NO/Nox analyser
measurement equipment: Thermo model 42c NO/Nox analyser
measurement equipment: Thermo model 42C-TL (Trace level Nox)
measurement equipment: Thermo model 42i NO/Nox analyser
measurement equipment: Thermo model 42i NO/NOx analyser - blue light
measurement equipment: Thermo model 42i-TL (Trace level Nox)
measurement equipment: Thermo model 42s NO/Nox analyser
measurement equipment: Thermo model 42w NO/Nox analyser

Benzo(b+j+k)fluoranthenes (air+aerosol)
type: Concept
notation: Benzo(b+j+k)fluoranthenes
definition: Benzo(b+j+k)fluoranthenes - recommended unit: ng/m3
status: valid
status modified: 2013-09-20
accepted date: 2013-09-20
in scheme: AQD - Air Quality Pollutants
alternative label: Benzo(b+j+k)fluoranthenes
scope note: Reciprocal exchange
recommended unit: ng.m-3

Benzo(e)pyrene (air+aerosol)
type: Concept
notation: Benzo(e)pyrene
definition: Benzo(e)pyrene - recommended unit: ng/m3
status: valid
status modified: 2013-09-20
accepted date: 2013-09-20
in scheme: AQD - Air Quality Pollutants
alternative label: Benzo(e)pyrene
scope note: Reciprocal exchange
recommended unit: ng.m-3

Benzo(k+j)fluoranthene (air+aerosol)
type: Concept
notation: Benzo(k+j)fluoranthene
definition: Benzo(k+j)fluoranthene (air+aerosol) - recommended unit: ng/m3
status: valid
status modified: 2022-04-22
accepted date: 2022-04-22
in scheme: AQD - Air Quality Pollutants
recommended unit: ng.m-3

Hydrogen chloride (air)
type: Concept
notation: HCl
definition: HCl - recommended unit: µg/m3
status: valid
status modified: 2013-09-20
accepted date: 2013-09-20
in scheme: AQD - Air Quality Pollutants
alternative label: HCl
scope note: Reciprocal exchange
recommended unit: ug.m-3

biphenyl (air+aerosol)
type: Concept
notation: Biphenyl
definition: Biphenyl - recommended unit: ng/m3
status: valid
status modified: 2013-09-20
accepted date: 2013-09-20
in scheme: AQD - Air Quality Pollutants
alternative label: Biphenyl
scope note: Reciprocal exchange
recommended unit: ng.m-3

black_carbon (aerosol)
type: Concept
notation: Black Carbon
definition: Black Carbon - recommended unit: µg/m3
status: valid
status modified: 2013-09-20
accepted date: 2013-09-20
in scheme: AQD - Air Quality Pollutants
alternative label: Black Carbon
scope note: Reciprocal exchange
recommended unit: ug.m-3
measurement equipment: AE22 Aethalometer with PM2.5 cyclone
measurement equipment: AE31 Aethalometer
measurement equipment: AE33 Aethalometer
measurement equipment: AE33 Aethalometer with PM2.5 cyclone
measurement equipment: AE36 Aethalometer
measurement equipment: MRI_1550B

butanales (air)
type: Concept
notation: Butanales
definition: Butanales - recommended unit: µg/m3
status: valid
status modified: 2013-09-20
accepted date: 2013-09-20
in scheme: AQD - Air Quality Pollutants
alternative label: Butanales
scope note: Reciprocal exchange
related match: N2methylpropenal + Butanal (air)
recommended unit: ug.m-3

n-Butane (air)
type: Concept
notation: H3C-CH2-CH2-CH3
definition: H3C-CH2-CH2-CH3 - recommended unit: µg/m3
status: valid
status modified: 2013-09-20
accepted date: 2013-09-20
in scheme: AQD - Air Quality Pollutants
alternative label: H3C-CH2-CH2-CH3
scope note: 2011/850/EU
related match: Propone + Isobutane (air)
recommended unit: ug.m-3
measurement equipment: SYNTECH SPECTRAS GC 955 series undetermined
measurement equipment: SYNTECH SPECTRAS GC 955-615/815

butenes (air)
type: Concept
notation: Butenes
definition: Butenes - recommended unit: pptv
status: valid
status modified: 2013-09-20
accepted date: 2013-09-20
in scheme: AQD - Air Quality Pollutants
alternative label: Butenes
scope note: Reciprocal exchange
recommended unit: pptv

N2methylpropenal + Butanal (air)
type: Concept
notation: Methacroleine + Butanal
definition: Methacroleine + Butanal - recommended unit: µg/m3
status: valid
status modified: 2016-03-29
in scheme: AQD - Air Quality Pollutants
related match: butanales (air)
related match: N2methylpropenal (air)
recommended unit: ug.m-3

Total suspended particulates (aerosol)
type: Concept
notation: SPM
definition: SPM - recommended unit: µg/m3
status: valid
status modified: 2013-09-20
accepted date: 2013-09-20
in scheme: AQD - Air Quality Pollutants
alternative label: SPM
scope note: Reciprocal exchange
recommended unit: ug.m-3
measurement equipment: Palas model FIDAS 200
measurement equipment: Palas model FIDAS 200E
measurement equipment: Palas model FIDAS 200S
measurement equipment: GRIMM model EDM 180-D for PM10 PM2.5 PM1 and TC
measurement equipment: GRIMM model EDM 180-MC for PM10 PM2.5 PM1 TC and 31 size channels
measurement equipment: Thermo Andersen ESM FH 62 I-R
measurement equipment: Horiba model APDA 350 TSP analyser
measurement equipment: Horiba model APDA 350E TSP analyser
measurement equipment: Horiba model APDA 351 TSP analyser
measurement equipment: Horiba model APDA 351E TSP analyser

Hydrogen fluoride (air)
type: Concept
notation: HF
definition: HF - recommended unit: µg/m3
status: valid
status modified: 2013-09-20
accepted date: 2013-09-20
in scheme: AQD - Air Quality Pollutants
alternative label: HF
scope note: Reciprocal exchange
recommended unit: ug.m-3

carbontetrachloride (air)
type: Concept
notation: Carbon-tetrachloride
definition: Carbon-tetrachloride - recommended unit: pptv
status: valid
status modified: 2013-09-20
accepted date: 2013-09-20
in scheme: AQD - Air Quality Pollutants
alternative label: Carbon-tetrachloride
scope note: Reciprocal exchange
recommended unit: pptv

Elemental Gaseous Mercury (air+aerosol)
type: Concept
notation: Hg0
definition: Hg0 - recommended unit: ng/m3
status: valid
status modified: 2013-09-20
accepted date: 2013-09-20
in scheme: AQD - Air Quality Pollutants
alternative label: Hg0
scope note: 2011/850/EU
recommended unit: ng.m-3
measurement equipment: ENVEA UT3000

chrysene (precip)
type: Concept
notation: Chrysene
definition: Chrysene - recommended unit: ng/l
status: valid
status modified: 2013-09-20
accepted date: 2013-09-20
in scheme: AQD - Air Quality Pollutants
alternative label: Chrysene
scope note: Reciprocal exchange
recommended unit: ng.l-1

Methane (air)
type: Concept
notation: CH4
definition: CH4 - recommended unit: µg/m3
status: valid
status modified: 2013-09-20
accepted date: 2013-09-20
in scheme: AQD - Air Quality Pollutants
alternative label: CH4
scope note: Reciprocal exchange
recommended unit: ug.m-3
measurement equipment: Picarro G2301 Gas Concentration Analyzer

conductivity (precip)
type: Concept
notation: k
definition: k - recommended unit: uS/cm
status: valid
status modified: 2013-09-20
accepted date: 2013-09-20
in scheme: AQD - Air Quality Pollutants
alternative label: k
scope note: Reciprocal exchange
recommended unit: uS.cm-1

coronene (air+aerosol)
type: Concept
notation: Coronene
definition: Coronene - recommended unit: ng/m3
status: valid
status modified: 2013-09-20
accepted date: 2013-09-20
in scheme: AQD - Air Quality Pollutants
alternative label: Coronene
scope note: Reciprocal exchange
recommended unit: ng.m-3

cyclohexane (air)
type: Concept
notation: Cyclo-hexane
definition: Cyclo-hexane - recommended unit: pptv
status: valid
status modified: 2013-09-20
accepted date: 2013-09-20
in scheme: AQD - Air Quality Pollutants
alternative label: Cyclo-hexane
scope note: Reciprocal exchange
recommended unit: pptv

Cyklopenta(cd)pyrene (air+aerosol)
type: Concept
notation: Cyklopenta(cd)pyrene
definition: Cyklopenta(cd)pyrene - recommended unit: ng/m3
status: valid
status modified: 2013-09-20
accepted date: 2013-09-20
in scheme: AQD - Air Quality Pollutants
alternative label: Cyklopenta(cd)pyrene
scope note: Reciprocal exchange
recommended unit: ng.m-3

Dibenzo(ac+ah)anthracenes (precip)
type: Concept
notation: Dibenzo(ac+ah)anthracenes
definition: Dibenzo(ac+ah)anthracenes - recommended unit: ng/m3
status: valid
status modified: 2013-09-20
accepted date: 2013-09-20
in scheme: AQD - Air Quality Pollutants
alternative label: Dibenzo(ac+ah)anthracenes @bg
scope note: Reciprocal exchange
recommended unit: ng.l-1

Dibenzo(ah)anthracene (precip)
type: Concept
notation: Dibenzo(ah)anthracene
definition: Dibenzo(ah)anthracene - recommended unit: ng/l
status: valid
status modified: 2013-09-20
accepted date: 2013-09-20
in scheme: AQD - Air Quality Pollutants
alternative label: Dibenzo(ah)anthracene
scope note: Reciprocal exchange
recommended unit: ng.l-1

Phenol
type: Concept
notation: C6H5OH
definition: C6H6O or C6H5OH
status: valid
status modified: 2020-03-03
in scheme: AQD - Air Quality Pollutants

dibenzofuran (air+aerosol)
type: Concept
notation: Dibenzofuran
definition: Dibenzofuran - recommended unit: ng/m3
status: valid
status modified: 2013-09-20
accepted date: 2013-09-20
in scheme: AQD - Air Quality Pollutants
alternative label: Dibenzofuran
scope note: Reciprocal exchange
recommended unit: ng.m-3

dibenzothiophene (air+aerosol)
type: Concept
notation: Dibenzothiophene
definition: Dibenzothiophene - recommended unit: ng/m3
status: valid
status modified: 2013-09-20
accepted date: 2013-09-20
in scheme: AQD - Air Quality Pollutants
alternative label: Dibenzothiophene
scope note: Reciprocal exchange
recommended unit: ng.m-3

dinitrogenoxide (air)
type: Concept
notation: N2O
definition: N2O - recommended unit: ppbv
status: valid
status modified: 2013-09-20
accepted date: 2013-09-20
in scheme: AQD - Air Quality Pollutants
alternative label: N2O
scope note: Reciprocal exchange
recommended unit: ppbv

endrin (precip)
type: Concept
notation: Endrin
definition: Endrin - recommended unit: ng/l
status: valid
status modified: 2013-09-20
accepted date: 2013-09-20
in scheme: AQD - Air Quality Pollutants
alternative label: Endrin
scope note: Reciprocal exchange
recommended unit: ng.l-1

ethanal (air)
type: Concept
notation: Acetaldehyde
definition: Acetaldehyde - recommended unit: µg/m3
status: valid
status modified: 2013-09-20
accepted date: 2013-09-20
in scheme: AQD - Air Quality Pollutants
alternative label: Acetaldehyde
scope note: Reciprocal exchange
recommended unit: ug.m-3

Ethane (air)
type: Concept
notation: C2H6
definition: C2H6 - recommended unit: µg/m3
status: valid
status modified: 2013-09-20
accepted date: 2013-09-20
in scheme: AQD - Air Quality Pollutants
alternative label: C2H6
scope note: 2011/850/EU
recommended unit: ug.m-3
measurement equipment: SYNTECH SPECTRAS GC 955 series undetermined
measurement equipment: SYNTECH SPECTRAS GC 955-615/815

ethanedial (air)
type: Concept
notation: Glyoxal
definition: Glyoxal - recommended unit: µg/m3
status: valid
status modified: 2013-09-20
accepted date: 2013-09-20
in scheme: AQD - Air Quality Pollutants
alternative label: Glyoxal
scope note: Reciprocal exchange
recommended unit: ug.m-3

Ethene (Ethylene) (air)
type: Concept
notation: H2C=CH2
definition: H2C=CH2 - recommended unit: µg/m3
status: valid
status modified: 2013-09-20
accepted date: 2013-09-20
in scheme: AQD - Air Quality Pollutants
alternative label: H2C=CH2
scope note: 2011/850/EU
recommended unit: ug.m-3
measurement equipment: SYNTECH SPECTRAS GC 955 series undetermined
measurement equipment: SYNTECH SPECTRAS GC 955-615/815

Ethyl benzene (air)
type: Concept
notation: C6H5-C2H5
definition: C6H5-C2H5 - recommended unit: µg/m3
status: valid
status modified: 2013-09-20
accepted date: 2013-09-20
in scheme: AQD - Air Quality Pollutants
alternative label: C6H5-C2H5
scope note: 2011/850/EU
recommended unit: ug.m-3
measurement equipment: Chromatotec AirTOXIC BTX PID - A73022
measurement equipment: AirmoBTX_GC866
measurement equipment: SINTECH SPECTRAS BTX GC 855 series undetermined
measurement equipment: Chromatotec GC866
measurement equipment: SYNTECH SPECTRAS GC 955 series undetermined
measurement equipment: SYNTECH SPECTRAS GC 955-600
measurement equipment: SYNTECH SPECTRAS GC 955-601
measurement equipment: SYNTECH SPECTRAS GC 955-615/815
measurement equipment: SRI8610-C
measurement equipment: Environnement VOC72M
measurement equipment: airmoVOC BTX
measurement equipment: airmotec BTX 1000

Ethyne (Acetylene) (air)
type: Concept
notation: HC=CH
definition: HC=CH - recommended unit: µg/m3
status: valid
status modified: 2013-09-20
accepted date: 2013-09-20
in scheme: AQD - Air Quality Pollutants
alternative label: HC=CH
scope note: 2011/850/EU
recommended unit: ug.m-3
measurement equipment: SYNTECH SPECTRAS GC 955 series undetermined
measurement equipment: SYNTECH SPECTRAS GC 955-615/815

Ethyltoluene
type: Concept
notation: C9H12
definition: C9H12 - recommended unit: µg/m3
status: valid
status modified: 2016-03-29
in scheme: AQD - Air Quality Pollutants
recommended unit: ug.m-3

PCB_105 (air+aerosol)
type: Concept
notation: PCB-105
definition: PCB-105 - recommended unit: pg/m3
status: valid
status modified: 2013-09-20
accepted date: 2013-09-20
in scheme: AQD - Air Quality Pollutants
alternative label: PCB-105
scope note: Reciprocal exchange
recommended unit: pg.m-3

PCB_149 (air+aerosol)
type: Concept
notation: PCB-149
definition: PCB-149 - recommended unit: pg/m3
status: valid
status modified: 2013-09-20
accepted date: 2013-09-20
in scheme: AQD - Air Quality Pollutants
alternative label: PCB-149
scope note: Reciprocal exchange
recommended unit: pg.m-3

PCB_156 (air+aerosol)
type: Concept
notation: PCB-156
definition: PCB-156 - recommended unit: pg/m3
status: valid
status modified: 2013-09-20
accepted date: 2013-09-20
in scheme: AQD - Air Quality Pollutants
alternative label: PCB-156
scope note: Reciprocal exchange
recommended unit: pg.m-3

Propylbenzene (air)
type: Concept
notation: C9H12
definition: C9H12 - recommended unit: µg/m3
status: valid
status modified: 2016-03-29
in scheme: AQD - Air Quality Pollutants
recommended unit: ug.m-3

PCB_18 (air+aerosol)
type: Concept
notation: PCB-18
definition: PCB-18 - recommended unit: pg/m3
status: valid
status modified: 2013-09-20
accepted date: 2013-09-20
in scheme: AQD - Air Quality Pollutants
alternative label: PCB-18
scope note: Reciprocal exchange
recommended unit: pg.m-3

PCB_31 (air+aerosol)
type: Concept
notation: PCB-31
definition: PCB-31 - recommended unit: pg/m3
status: valid
status modified: 2013-09-20
accepted date: 2013-09-20
in scheme: AQD - Air Quality Pollutants
alternative label: PCB-31
scope note: Reciprocal exchange
recommended unit: pg.m-3

fluorene (air+aerosol)
type: Concept
notation: Fluorene
definition: Fluorene - recommended unit: ng/m3
status: valid
status modified: 2013-09-20
accepted date: 2013-09-20
in scheme: AQD - Air Quality Pollutants
alternative label: Fluorene
scope note: Reciprocal exchange
recommended unit: ng.m-3

halon_1211 (air)
type: Concept
notation: Halon 1211
definition: Halon 1211 - recommended unit: pptv
status: valid
status modified: 2013-09-20
accepted date: 2013-09-20
in scheme: AQD - Air Quality Pollutants
alternative label: Halon 1211
scope note: Reciprocal exchange
recommended unit: pptv

halon_1301 (air)
type: Concept
notation: Halon 1301
definition: Halon 1301 - recommended unit: pptv
status: valid
status modified: 2013-09-20
accepted date: 2013-09-20
in scheme: AQD - Air Quality Pollutants
alternative label: Halon 1301
scope note: Reciprocal exchange
recommended unit: pptv

Total nitrogen
type: Concept
notation: NT
definition: Total nitrogen
status: valid
status modified: 2022-08-11
accepted date: 2022-08-11
in scheme: AQD - Air Quality Pollutants
measurement equipment: Thermo 17i
mandatory unit: ug.m-3

heptachlor (precip)
type: Concept
notation: Heptachlor
definition: Heptachlor - recommended unit: ng/l
status: valid
status modified: 2013-09-20
accepted date: 2013-09-20
in scheme: AQD - Air Quality Pollutants
alternative label: Heptachlor
scope note: Reciprocal exchange
recommended unit: ng.l-1

chrysene (air+aerosol)
type: Concept
notation: Chrysene
definition: Chrysene - recommended unit: ng/m3
status: valid
status modified: 2013-09-20
accepted date: 2013-09-20
in scheme: AQD - Air Quality Pollutants
alternative label: Chrysene
scope note: Reciprocal exchange
recommended unit: ng.m-3

chrysene_triphenylene (air+aerosol)
type: Concept
notation: Chrysene + Triphenylene
definition: Chrysene + Triphenylene - recommended unit: ng/m3
status: valid
status modified: 2013-09-20
accepted date: 2013-09-20
in scheme: AQD - Air Quality Pollutants
alternative label: Chrysene + Triphenylene
scope note: Reciprocal exchange
recommended unit: ng.m-3

n-Heptane (air)
type: Concept
notation: C7H16
definition: C7H16 - recommended unit: µg/m3
status: valid
status modified: 2013-09-20
accepted date: 2013-09-20
in scheme: AQD - Air Quality Pollutants
alternative label: C7H16
scope note: 2011/850/EU
recommended unit: ug.m-3
measurement equipment: SYNTECH SPECTRAS GC 955 series undetermined
measurement equipment: SYNTECH SPECTRAS GC 955-615/815

hexanal (air)
type: Concept
notation: n-Hexanal
definition: n-Hexanal - recommended unit: µg/m3
status: valid
status modified: 2013-09-20
accepted date: 2013-09-20
in scheme: AQD - Air Quality Pollutants
alternative label: n-Hexanal
scope note: Reciprocal exchange
recommended unit: ug.m-3

n-Hexane (air)
type: Concept
notation: C6H14
definition: C6H14 - recommended unit: µg/m3
status: valid
status modified: 2013-09-20
accepted date: 2013-09-20
in scheme: AQD - Air Quality Pollutants
alternative label: C6H14
scope note: 2011/850/EU
recommended unit: ug.m-3
measurement equipment: SYNTECH SPECTRAS GC 955 series undetermined
measurement equipment: SYNTECH SPECTRAS GC 955-615/815

i-Butane (2-methylpropane) (air)
type: Concept
notation: H3C-CH(CH3)2
definition: H3C-CH(CH3)2 - recommended unit: µg/m3
status: valid
status modified: 2013-09-20
accepted date: 2013-09-20
in scheme: AQD - Air Quality Pollutants
alternative label: H3C-CH(CH3)2
scope note: 2011/850/EU
recommended unit: ug.m-3
measurement equipment: SYNTECH SPECTRAS GC 955 series undetermined
measurement equipment: SYNTECH SPECTRAS GC 955-615/815

isoheptane (air)
type: Concept
notation: i-Heptane
definition: i-Heptane - recommended unit: µg/m3
status: valid
status modified: 2013-09-20
accepted date: 2013-09-20
in scheme: AQD - Air Quality Pollutants
alternative label: i-Heptane
scope note: Reciprocal exchange
recommended unit: ug.m-3

i-Octane (2,2,4-trimethylpentane) (air)
type: Concept
notation: (CH3)3-C-CH2-CH-(CH3)2
definition: (CH3)3-C-CH2-CH-(CH3)2 - recommended unit: µg/m3
status: valid
status modified: 2013-09-20
accepted date: 2013-09-20
in scheme: AQD - Air Quality Pollutants
alternative label: (CH3)3-C-CH2-CH-(CH3)2
scope note: 2011/850/EU
recommended unit: ug.m-3
measurement equipment: SYNTECH SPECTRAS GC 955 series undetermined
measurement equipment: SYNTECH SPECTRAS GC 955-615/815

Particulate ammonium (aerosol)
type: Concept
notation: NH4
definition: NH4 - recommended unit: µg/m3
status: valid
status modified: 2013-09-20
accepted date: 2013-09-20
in scheme: AQD - Air Quality Pollutants
alternative label: NH4
scope note: Reciprocal exchange
recommended unit: ug.m-3

i-Pentane (2-methylbutane) (air)
type: Concept
notation: H3C-CH2-CH(CH3)2
definition: H3C-CH2-CH(CH3)2 - recommended unit: µg/m3
status: valid
status modified: 2013-09-20
accepted date: 2013-09-20
in scheme: AQD - Air Quality Pollutants
alternative label: H3C-CH2-CH(CH3)2
scope note: 2011/850/EU
related match: n-Pentane + i-Pentane (2-methylbutane)
recommended unit: ug.m-3
measurement equipment: SYNTECH SPECTRAS GC 955 series undetermined
measurement equipment: SYNTECH SPECTRAS GC 955-615/815

Isoprene (2-methyl-1,3-butadiene) (air)
type: Concept
notation: CH2=CH-C(CH3)=CH2
definition: CH2=CH-C(CH3)=CH2 - recommended unit: µg/m3
status: valid
status modified: 2013-09-20
accepted date: 2013-09-20
in scheme: AQD - Air Quality Pollutants
alternative label: CH2=CH-C(CH3)=CH2
scope note: 2011/850/EU
recommended unit: ug.m-3
measurement equipment: SYNTECH SPECTRAS GC 955 series undetermined
measurement equipment: SYNTECH SPECTRAS GC 955-615/815

1,4-Dichlorobenzene (air)
type: Concept
notation: C6H4Cl2
definition: C6H4Cl2 - recommended unit: µg/m3
status: valid
status modified: 2016-03-29
in scheme: AQD - Air Quality Pollutants
recommended unit: ug.m-3

n-Nonane (air)
type: Concept
notation: C9H20
definition: C9H20 - recommended unit: µg/m3
status: valid
status modified: 2016-03-29
in scheme: AQD - Air Quality Pollutants
alternative label: Nonane
alternative label: n-Nonano @es
recommended unit: ug.m-3

Tetrachloroethylene (air)
type: Concept
notation: C2Cl4
definition: C2Cl4 - recommended unit: µg/m3
status: valid
status modified: 2016-03-29
in scheme: AQD - Air Quality Pollutants
recommended unit: ug.m-3

Tetrachloromethane (air)
type: Concept
notation: Tetrachloromethane (air)
definition: Tetrachloromethane (air) - recommended unit: µg/m3
status: valid
status modified: 2016-06-16
in scheme: AQD - Air Quality Pollutants
recommended unit: ug.m-3

Chlorobenzene (air)
type: Concept
notation: Chlorobenzene (air)
definition: Chlorobenzene (air) - recommended unit: µg/m3
status: valid
status modified: 2016-06-16
in scheme: AQD - Air Quality Pollutants
recommended unit: ug.m-3

1,1,2-trichloroethane (air)
type: Concept
notation: 1,1,2-trichloroethane (air)
definition: 1,1,2-trichloroethane (air) - recommended unit: µg/m3
status: valid
status modified: 2016-06-16
in scheme: AQD - Air Quality Pollutants
recommended unit: ug.m-3

1,1-dichloroethane (air)
type: Concept
notation: 1,1-dichloroethane (air)
definition: 1,1-dichloroethane (air) - recommended unit: µg/m3
status: valid
status modified: 2016-06-16
in scheme: AQD - Air Quality Pollutants
recommended unit: ug.m-3

Particulate nitrate (aerosol)
type: Concept
notation: NO3
definition: NO3 - recommended unit: µg/m3
status: valid
status modified: 2013-09-20
accepted date: 2013-09-20
in scheme: AQD - Air Quality Pollutants
alternative label: NO3
scope note: Reciprocal exchange
recommended unit: ug.m-3

1,2-dichloroethylene (air)
type: Concept
notation: 1,2-dichloroethylene (air)
definition: 1,2-dichloroethylene (air) - recommended unit: µg/m3
status: valid
status modified: 2016-06-16
in scheme: AQD - Air Quality Pollutants
recommended unit: ug.m-3

1,2-dichloroethane (air)
type: Concept
notation: 1,2-dichloroethane (air)
definition: 1,2-dichloroethane (air) - recommended unit: µg/m3
status: valid
status modified: 2016-06-16
in scheme: AQD - Air Quality Pollutants
recommended unit: ug.m-3

1,1,1-trichloroethane (air)
type: Concept
notation: 1,1,1-trichloroethane (air)
definition: 1,1,1-trichloroethane (air) - recommended unit: µg/m3
status: valid
status modified: 2016-06-16
in scheme: AQD - Air Quality Pollutants
recommended unit: ug.m-3

methylchloroform (air)
type: Concept
notation: Methyl-chloroform
definition: Methyl-chloroform - recommended unit: pptv
status: valid
status modified: 2013-09-20
accepted date: 2013-09-20
in scheme: AQD - Air Quality Pollutants
alternative label: Methyl-chloroform
scope note: Reciprocal exchange
recommended unit: pptv

m,p-Xylene (air)
type: Concept
notation: m,p-C6H4(CH3)2
definition: m,p-C6H4(CH3)2 - recommended unit: µg/m3
status: valid
status modified: 2013-09-20
accepted date: 2013-09-20
in scheme: AQD - Air Quality Pollutants
alternative label: m,p-C6H4(CH3)2
scope note: 2011/850/EU
recommended unit: ug.m-3
measurement equipment: Chromatotec AirTOXIC BTX PID - A73022
measurement equipment: AirmoBTX_GC866
measurement equipment: SINTECH SPECTRAS BTX GC 855 series undetermined
measurement equipment: SYNTECH SPECTRAS GC 955 series undetermined
measurement equipment: SYNTECH SPECTRAS GC 955-600
measurement equipment: SYNTECH SPECTRAS GC 955-615/815
measurement equipment: Environnement VOC72M
measurement equipment: airmoVOC BTX
measurement equipment: airmotec BTX 1000

naphtalene (air+aerosol)
type: Concept
notation: Naphtalene
definition: Naphtalene - recommended unit: ng/m3
status: valid
status modified: 2013-09-20
accepted date: 2013-09-20
in scheme: AQD - Air Quality Pollutants
alternative label: Naphtalene
scope note: Reciprocal exchange
recommended unit: ng.m-3

neohexane (air)
type: Concept
notation: Neo-hexane
definition: Neo-hexane - recommended unit: pptv
status: valid
status modified: 2013-09-20
accepted date: 2013-09-20
in scheme: AQD - Air Quality Pollutants
alternative label: Neo-hexane
scope note: Reciprocal exchange
recommended unit: pptv

neopentane (air)
type: Concept
notation: Neo-pentane
definition: Neo-pentane - recommended unit: pptv
status: valid
status modified: 2013-09-20
accepted date: 2013-09-20
in scheme: AQD - Air Quality Pollutants
alternative label: Neo-pentane
scope note: Reciprocal exchange
recommended unit: pptv

Particulate sulphate (aerosol)
type: Concept
notation: SO4 (H2SO4 aerosols) (SO4--)
definition: SO4 (H2SO4 aerosols) (SO4--) - recommended unit: µg/m3
status: valid
status modified: 2013-09-20
accepted date: 2013-09-20
in scheme: AQD - Air Quality Pollutants
alternative label: SO4 (H2SO4 aerosols) (SO4--)
scope note: Reciprocal exchange
recommended unit: ug.m-3

n-Octane (air)
type: Concept
notation: C8H18
definition: C8H18 - recommended unit: µg/m3
status: valid
status modified: 2013-09-20
accepted date: 2013-09-20
in scheme: AQD - Air Quality Pollutants
alternative label: C8H18
scope note: 2011/850/EU
recommended unit: ug.m-3
measurement equipment: SYNTECH SPECTRAS GC 955 series undetermined
measurement equipment: SYNTECH SPECTRAS GC 955-615/815

Selenium (aerosol)
type: Concept
notation: Se
definition: Se - recommended unit: ng/m3
status: valid
status modified: 2013-09-20
accepted date: 2013-09-20
in scheme: AQD - Air Quality Pollutants
alternative label: Se
scope note: Reciprocal exchange
recommended unit: ng.m-3

Total gaseous mercury (air+aerosol)
type: Concept
notation: Hg0 + Hg-reactive
definition: Hg0 + Hg-reactive - recommended unit: ng/m3
status: valid
status modified: 2013-09-20
accepted date: 2013-09-20
in scheme: AQD - Air Quality Pollutants
alternative label: Hg0 + Hg-reactive
scope note: 2011/850/EU
recommended unit: ng.m-3

o-Xylene (air)
type: Concept
notation: o-C6H4-(CH3)2
definition: o-C6H4-(CH3)2 - recommended unit: µg/m3
status: valid
status modified: 2013-09-20
accepted date: 2013-09-20
in scheme: AQD - Air Quality Pollutants
alternative label: o-C6H4-(CH3)2
scope note: 2011/850/EU
recommended unit: ug.m-3
measurement equipment: Chromatotec AirTOXIC BTX PID - A73022
measurement equipment: AirmoBTX_GC866
measurement equipment: SINTECH SPECTRAS BTX GC 855 series undetermined
measurement equipment: Chromatotec GC866
measurement equipment: SYNTECH SPECTRAS GC 955 series undetermined
measurement equipment: SYNTECH SPECTRAS GC 955-600
measurement equipment: SYNTECH SPECTRAS GC 955-601
measurement equipment: SYNTECH SPECTRAS GC 955-615/815
measurement equipment: SRI8610-C
measurement equipment: Environnement VOC72M
measurement equipment: airmoVOC BTX

TCDD (air+aerosol)
type: Concept
notation: TCDD
definition: TCDD - recommended unit: fg.m-3
status: valid
status modified: 2018-12-13
accepted date: 2018-12-13
in scheme: AQD - Air Quality Pollutants
alternative label: TCDD
scope note: Reciprocal exchange
recommended unit: fg.m-3

CDD1N (air+aerosol)
type: Concept
notation: CDD1N
definition: CDD1N - recommended unit: fg.m-3
status: valid
status modified: 2018-12-13
accepted date: 2018-12-13
in scheme: AQD - Air Quality Pollutants
alternative label: CDD1N
scope note: Reciprocal exchange
recommended unit: fg.m-3

CDD4X (air+aerosol)
type: Concept
notation: CDD4X
definition: CDD4X - recommended unit: fg.m-3
status: valid
status modified: 2018-12-13
accepted date: 2018-12-13
in scheme: AQD - Air Quality Pollutants
alternative label: CDD4X
scope note: Reciprocal exchange
recommended unit: fg.m-3

CDD6X (air+aerosol)
type: Concept
notation: CDD6X
definition: CDD6X - recommended unit: fg.m-3
status: valid
status modified: 2018-12-13
accepted date: 2018-12-13
in scheme: AQD - Air Quality Pollutants
alternative label: CDD6X
scope note: Reciprocal exchange
recommended unit: fg.m-3

CDD9X (air+aerosol)
type: Concept
notation: CDD9X
definition: CDD9X - recommended unit: fg.m-3
status: valid
status modified: 2018-12-13
accepted date: 2018-12-13
in scheme: AQD - Air Quality Pollutants
alternative label: CDD9X
scope note: Reciprocal exchange
recommended unit: fg.m-3

CDD6P (air+aerosol)
type: Concept
notation: CDD6P
definition: CDD6P - recommended unit: fg.m-3
status: valid
status modified: 2018-12-13
accepted date: 2018-12-13
in scheme: AQD - Air Quality Pollutants
alternative label: CDD6P
scope note: Reciprocal exchange
recommended unit: fg.m-3

CDDO (air+aerosol)
type: Concept
notation: CDDO
definition: CDDO - recommended unit: fg.m-3
status: valid
status modified: 2018-12-13
accepted date: 2018-12-13
in scheme: AQD - Air Quality Pollutants
alternative label: CDDO
scope note: Reciprocal exchange
recommended unit: fg.m-3

CDF2T (air+aerosol)
type: Concept
notation: CDF2T
definition: CDF2T - recommended unit: fg.m-3
status: valid
status modified: 2018-12-13
accepted date: 2018-12-13
in scheme: AQD - Air Quality Pollutants
alternative label: CDF2T
scope note: Reciprocal exchange
recommended unit: fg.m-3

CDFDN (air+aerosol)
type: Concept
notation: CDFDN
definition: CDFDN - recommended unit: fg.m-3
status: valid
status modified: 2018-12-13
accepted date: 2018-12-13
in scheme: AQD - Air Quality Pollutants
alternative label: CDFDN
scope note: Reciprocal exchange
recommended unit: fg.m-3

CDF2N (air+aerosol)
type: Concept
notation: CDF2N
definition: CDF2N - recommended unit: fg.m-3
status: valid
status modified: 2018-12-13
accepted date: 2018-12-13
in scheme: AQD - Air Quality Pollutants
alternative label: CDF2N
scope note: Reciprocal exchange
recommended unit: fg.m-3

CDFDX (air+aerosol)
type: Concept
notation: CDFDX
definition: CDFDX - recommended unit: fg.m-3
status: valid
status modified: 2018-12-13
accepted date: 2018-12-13
in scheme: AQD - Air Quality Pollutants
alternative label: CDFDX
scope note: Reciprocal exchange
recommended unit: fg.m-3

CDF6X (air+aerosol)
type: Concept
notation: CDF6X
definition: CDF6X - recommended unit: fg.m-3
status: valid
status modified: 2018-12-13
accepted date: 2018-12-13
in scheme: AQD - Air Quality Pollutants
alternative label: CDF6X
scope note: Reciprocal exchange
recommended unit: fg.m-3

CDF9X (air+aerosol)
type: Concept
notation: CDF9X
definition: CDF9X - recommended unit: fg.m-3
status: valid
status modified: 2018-12-13
accepted date: 2018-12-13
in scheme: AQD - Air Quality Pollutants
alternative label: CDF9X
scope note: Reciprocal exchange
recommended unit: fg.m-3

CDF4X (air+aerosol)
type: Concept
notation: CDF4X
definition: CDF4X - recommended unit: fg.m-3
status: valid
status modified: 2018-12-13
accepted date: 2018-12-13
in scheme: AQD - Air Quality Pollutants
alternative label: CDF4X
scope note: Reciprocal exchange
recommended unit: fg.m-3

CDF6P (air+aerosol)
type: Concept
notation: CDF6P
definition: CDF6P - recommended unit: fg.m-3
status: valid
status modified: 2018-12-13
accepted date: 2018-12-13
in scheme: AQD - Air Quality Pollutants
alternative label: CDF6P
scope note: Reciprocal exchange
recommended unit: fg.m-3

CDF9P (air+aerosol)
type: Concept
notation: CDF9P
definition: CDF9P - recommended unit: fg.m-3
status: valid
status modified: 2018-12-13
accepted date: 2018-12-13
in scheme: AQD - Air Quality Pollutants
alternative label: CDF9P
scope note: Reciprocal exchange
recommended unit: fg.m-3

pentanal (air)
type: Concept
notation: Valeraldehyde
definition: Valeraldehyde - recommended unit: µg/m3
status: valid
status modified: 2013-09-20
accepted date: 2013-09-20
in scheme: AQD - Air Quality Pollutants
alternative label: Valeraldehyde
scope note: Reciprocal exchange
recommended unit: ug.m-3

CDFO (air+aerosol)
type: Concept
notation: CDFO
definition: CDFO - recommended unit: fg.m-3
status: valid
status modified: 2018-12-13
accepted date: 2018-12-13
in scheme: AQD - Air Quality Pollutants
alternative label: CDFO
scope note: Reciprocal exchange
recommended unit: fg.m-3

CDFX1 (air+aerosol)
type: Concept
notation: CDFX1
definition: CDFX1 - recommended unit: fg.m-3
status: valid
status modified: 2018-12-13
accepted date: 2018-12-13
in scheme: AQD - Air Quality Pollutants
alternative label: CDFX1
scope note: Reciprocal exchange
recommended unit: fg.m-3

CDFP2 (air+aerosol)
type: Concept
notation: CDFP2
definition: CDFP2 - recommended unit: fg.m-3
status: valid
status modified: 2018-12-13
accepted date: 2018-12-13
in scheme: AQD - Air Quality Pollutants
alternative label: CDFP2
scope note: Reciprocal exchange
recommended unit: fg.m-3

n-Pentane (air)
type: Concept
notation: H3C-(CH2)3-CH3
definition: H3C-(CH2)3-CH3 - recommended unit: µg/m3
status: valid
status modified: 2013-09-20
accepted date: 2013-09-20
in scheme: AQD - Air Quality Pollutants
alternative label: H3C-(CH2)3-CH3
scope note: 2011/850/EU
related match: n-Pentane + i-Pentane (2-methylbutane)
recommended unit: ug.m-3
measurement equipment: SYNTECH SPECTRAS GC 955 series undetermined
measurement equipment: SYNTECH SPECTRAS GC 955-615/815

PFBA (air+aerosol)
type: Concept
notation: PFBA
definition: PFBA - recommended unit: pg.m-3
status: valid
status modified: 2018-12-13
accepted date: 2018-12-13
in scheme: AQD - Air Quality Pollutants
alternative label: PFBA
scope note: Reciprocal exchange
recommended unit: pg.m-3

PFPeA (air+aerosol)
type: Concept
notation: PFPeA
definition: PFPeA - recommended unit: pg.m-3
status: valid
status modified: 2018-12-13
accepted date: 2018-12-13
in scheme: AQD - Air Quality Pollutants
alternative label: PFPeA
scope note: Reciprocal exchange
recommended unit: pg.m-3

PFHxA (air+aerosol)
type: Concept
notation: PFHxA
definition: PFHxA - recommended unit: pg.m-3
status: valid
status modified: 2018-12-13
accepted date: 2018-12-13
in scheme: AQD - Air Quality Pollutants
alternative label: PFHxA
scope note: Reciprocal exchange
recommended unit: pg.m-3

PFHpA (air+aerosol)
type: Concept
notation: PFHpA
definition: PFHpA - recommended unit: pg.m-3
status: valid
status modified: 2018-12-13
accepted date: 2018-12-13
in scheme: AQD - Air Quality Pollutants
alternative label: PFHpA
scope note: Reciprocal exchange
recommended unit: pg.m-3

PFOA (air+aerosol)
type: Concept
notation: PFOA
definition: PFOA - recommended unit: pg.m-3
status: valid
status modified: 2018-12-13
accepted date: 2018-12-13
in scheme: AQD - Air Quality Pollutants
alternative label: PFOA
scope note: Reciprocal exchange
recommended unit: pg.m-3

c9 (air+aerosol)
type: Concept
notation: PFNA
definition: PFNA - recommended unit: pg.m-3
status: valid
status modified: 2018-12-13
accepted date: 2018-12-13
in scheme: AQD - Air Quality Pollutants
alternative label: c9
scope note: Reciprocal exchange
recommended unit: pg.m-3

PFDA (air+aerosol)
type: Concept
notation: PFDA
definition: PFDA - recommended unit: pg.m-3
status: valid
status modified: 2018-12-13
accepted date: 2018-12-13
in scheme: AQD - Air Quality Pollutants
alternative label: PFDA
scope note: Reciprocal exchange
recommended unit: pg.m-3

PFUnDA (air+aerosol)
type: Concept
notation: PFUnDA
definition: PFUnDA - recommended unit: pg.m-3
status: valid
status modified: 2018-12-13
accepted date: 2018-12-13
in scheme: AQD - Air Quality Pollutants
alternative label: PFUnDA
scope note: Reciprocal exchange
recommended unit: pg.m-3

pentenes (air)
type: Concept
notation: Pentenes
definition: Pentenes - recommended unit: pptv
status: valid
status modified: 2013-09-20
accepted date: 2013-09-20
in scheme: AQD - Air Quality Pollutants
alternative label: Pentenes
scope note: Reciprocal exchange
recommended unit: pptv

PFBS (air+aerosol)
type: Concept
notation: PFBS
definition: PFBS - recommended unit: pg.m-3
status: valid
status modified: 2018-12-13
accepted date: 2018-12-13
in scheme: AQD - Air Quality Pollutants
alternative label: PFBS
scope note: Reciprocal exchange
recommended unit: pg.m-3

PFHxS (air+aerosol)
type: Concept
notation: PFHxS
definition: PFHxS - recommended unit: pg.m-3
status: valid
status modified: 2018-12-13
accepted date: 2018-12-13
in scheme: AQD - Air Quality Pollutants
alternative label: PFHxS
scope note: Reciprocal exchange
recommended unit: pg.m-3

PFOSA (air+aerosol)
type: Concept
notation: PFOSA
definition: PFOSA - recommended unit: pg.m-3
status: valid
status modified: 2018-12-13
accepted date: 2018-12-13
in scheme: AQD - Air Quality Pollutants
alternative label: PFOSA
scope note: Reciprocal exchange
recommended unit: pg.m-3

6:2-FTS (air+aerosol)
type: Concept
notation: 6:2-FTS
definition: 6:2-FTS - recommended unit: pg.m-3
status: valid
status modified: 2018-12-13
accepted date: 2018-12-13
in scheme: AQD - Air Quality Pollutants
alternative label: 6:2-FTS
scope note: Reciprocal exchange
recommended unit: pg.m-3

PFOS (air+aerosol)
type: Concept
notation: PFOS
definition: PFOS - recommended unit: pg.m-3
status: valid
status modified: 2018-12-13
accepted date: 2018-12-13
in scheme: AQD - Air Quality Pollutants
alternative label: PFOS
scope note: Reciprocal exchange
recommended unit: pg.m-3

PFDS (air+aerosol)
type: Concept
notation: PFDS
definition: PFDS - recommended unit: pg.m-3
status: valid
status modified: 2018-12-13
accepted date: 2018-12-13
in scheme: AQD - Air Quality Pollutants
alternative label: PFDS
scope note: Reciprocal exchange
recommended unit: pg.m-3

perylene (air+aerosol)
type: Concept
notation: Perylene
definition: Perylene - recommended unit: ng/m3
status: valid
status modified: 2013-09-20
accepted date: 2013-09-20
in scheme: AQD - Air Quality Pollutants
alternative label: Perylene
scope note: Reciprocal exchange
recommended unit: ng.m-3

Vanadium (aerosol)
type: Concept
notation: V
definition: V - recommended unit: ng/m3
status: valid
status modified: 2013-09-20
accepted date: 2013-09-20
in scheme: AQD - Air Quality Pollutants
alternative label: V
scope note: Reciprocal exchange
recommended unit: ng.m-3

BDE47 (air+aerosol)
type: Concept
notation: BDE47
definition: BDE47 - recommended unit: pg.m-3
status: valid
status modified: 2018-12-13
accepted date: 2018-12-13
in scheme: AQD - Air Quality Pollutants
alternative label: BDE47
scope note: Reciprocal exchange
recommended unit: pg.m-3

BDE85 (air+aerosol)
type: Concept
notation: BDE85
definition: BDE85 - recommended unit: pg.m-3
status: valid
status modified: 2018-12-13
accepted date: 2018-12-13
in scheme: AQD - Air Quality Pollutants
alternative label: BDE85
scope note: Reciprocal exchange
recommended unit: pg.m-3

BDE99 (air+aerosol)
type: Concept
notation: BDE99
definition: BDE99 - recommended unit: pg.m-3
status: valid
status modified: 2018-12-13
accepted date: 2018-12-13
in scheme: AQD - Air Quality Pollutants
alternative label: BDE99
scope note: Reciprocal exchange
recommended unit: pg.m-3

BDE100 (air+aerosol)
type: Concept
notation: BDE100
definition: BDE100 - recommended unit: pg.m-3
status: valid
status modified: 2018-12-13
accepted date: 2018-12-13
in scheme: AQD - Air Quality Pollutants
alternative label: BDE100
scope note: Reciprocal exchange
recommended unit: pg.m-3

BDE153 (air+aerosol)
type: Concept
notation: BDE153
definition: BDE153 - recommended unit: pg.m-3
status: valid
status modified: 2018-12-13
accepted date: 2018-12-13
in scheme: AQD - Air Quality Pollutants
alternative label: BDE153
scope note: Reciprocal exchange
recommended unit: pg.m-3

BDE154 (air+aerosol)
type: Concept
notation: BDE154
definition: BDE154 - recommended unit: pg.m-3
status: valid
status modified: 2018-12-13
accepted date: 2018-12-13
in scheme: AQD - Air Quality Pollutants
alternative label: BDE154
scope note: Reciprocal exchange
recommended unit: pg.m-3

BDE209 (air+aerosol)
type: Concept
notation: BDE209
definition: BDE209 - recommended unit: pg.m-3
status: valid
status modified: 2018-12-13
accepted date: 2018-12-13
in scheme: AQD - Air Quality Pollutants
alternative label: BDE209
scope note: Reciprocal exchange
recommended unit: pg.m-3

SCCP (air+aerosol)
type: Concept
notation: SCCP
definition: SCCP - recommended unit: ng.m-3
status: valid
status modified: 2018-12-13
accepted date: 2018-12-13
in scheme: AQD - Air Quality Pollutants
alternative label: SCCP
scope note: Reciprocal exchange
recommended unit: ng.m-3

MCCP (air+aerosol)
type: Concept
notation: MCCP
definition: MCCP - recommended unit: ng.m-3
status: valid
status modified: 2018-12-13
accepted date: 2018-12-13
in scheme: AQD - Air Quality Pollutants
alternative label: MCCP
scope note: Reciprocal exchange
recommended unit: ng.m-3

phenyletanone (air)
type: Concept
notation: Acetophenone
definition: Acetophenone - recommended unit: µg/m3
status: valid
status modified: 2013-09-20
accepted date: 2013-09-20
in scheme: AQD - Air Quality Pollutants
alternative label: Acetophenone
scope note: Reciprocal exchange
recommended unit: ug.m-3

HBCD (air+aerosol)
type: Concept
notation: HBCD
definition: HBCD - recommended unit: pg.m-3
status: valid
status modified: 2018-12-13
accepted date: 2018-12-13
in scheme: AQD - Air Quality Pollutants
alternative label: HBCD
scope note: Reciprocal exchange
recommended unit: pg.m-3

HBB (air+aerosol)
type: Concept
notation: HBB
definition: HBB - recommended unit: pg.m-3
status: valid
status modified: 2018-12-13
accepted date: 2018-12-13
in scheme: AQD - Air Quality Pollutants
alternative label: HBB
scope note: Reciprocal exchange
recommended unit: pg.m-3

PBT (air+aerosol)
type: Concept
notation: PBT
definition: PBT - recommended unit: pg.m-3
status: valid
status modified: 2018-12-13
accepted date: 2018-12-13
in scheme: AQD - Air Quality Pollutants
alternative label: PBT
scope note: Reciprocal exchange
recommended unit: pg.m-3

PBEB (air+aerosol)
type: Concept
notation: PBEB
definition: PBEB - recommended unit: pg.m-3
status: valid
status modified: 2018-12-13
accepted date: 2018-12-13
in scheme: AQD - Air Quality Pollutants
alternative label: PBEB
scope note: Reciprocal exchange
recommended unit: pg.m-3

α-DBE-DBCH (air+aerosol)
type: Concept
notation: α-DBE-DBCH
definition: α-DBE-DBCH - recommended unit: pg.m-3
status: valid
status modified: 2018-12-13
accepted date: 2018-12-13
in scheme: AQD - Air Quality Pollutants
alternative label: α-DBE-DBCH
scope note: Reciprocal exchange
recommended unit: pg.m-3

β-DBE-DBCH (air+aerosol)
type: Concept
notation: β-DBE-DBCH
definition: β-DBE-DBCH - recommended unit: pg.m-3
status: valid
status modified: 2018-12-13
accepted date: 2018-12-13
in scheme: AQD - Air Quality Pollutants
alternative label: β-DBE-DBCH
scope note: Reciprocal exchange
recommended unit: pg.m-3

BEH-TEBP (air+aerosol)
type: Concept
notation: BEH-TEBP
definition: BEH-TEBP - recommended unit: pg.m-3
status: valid
status modified: 2018-12-13
accepted date: 2018-12-13
in scheme: AQD - Air Quality Pollutants
alternative label: BEH-TEBP
scope note: Reciprocal exchange
recommended unit: pg.m-3

BTBPT (air+aerosol)
type: Concept
notation: BTBPT
definition: BTBPT - recommended unit: pg.m-3
status: valid
status modified: 2018-12-13
accepted date: 2018-12-13
in scheme: AQD - Air Quality Pollutants
alternative label: BTBPT
scope note: Reciprocal exchange
recommended unit: pg.m-3

EH-TBB (air+aerosol)
type: Concept
notation: EH-TBB
definition: EH-TBB - recommended unit: pg.m-3
status: valid
status modified: 2018-12-13
accepted date: 2018-12-13
in scheme: AQD - Air Quality Pollutants
alternative label: EH-TBB
scope note: Reciprocal exchange
recommended unit: pg.m-3

Syn-DP (air+aerosol)
type: Concept
notation: Syn-DP
definition: Syn-DP - recommended unit:
status: valid
status modified: 2018-12-13
accepted date: 2018-12-13
in scheme: AQD - Air Quality Pollutants
alternative label: Syn-DP @bg
scope note: Reciprocal exchange
recommended unit: pg.m-3

Anti-DP (air+aerosol)
type: Concept
notation: Anti-DP
definition: Anti-DP - recommended unit: pg.m-3
status: valid
status modified: 2018-12-13
accepted date: 2018-12-13
in scheme: AQD - Air Quality Pollutants
alternative label: Anti-DP
scope note: Reciprocal exchange
recommended unit: pg.m-3

DBDPE (air+aerosol)
type: Concept
notation: DBDPE
definition: DBDPE - recommended unit: pg.m-3
status: valid
status modified: 2018-12-13
accepted date: 2018-12-13
in scheme: AQD - Air Quality Pollutants
alternative label: DBDPE
scope note: Reciprocal exchange
recommended unit: pg.m-3

TBP (air+aerosol)
type: Concept
notation: TBP
definition: TBP - recommended unit: pg.m-3
status: valid
status modified: 2018-12-13
accepted date: 2018-12-13
in scheme: AQD - Air Quality Pollutants
alternative label: TBP
scope note: Reciprocal exchange
recommended unit: pg.m-3

Particulate matter < 10 µm (aerosol)
type: Concept
notation: PM10
definition: PM10 - recommended unit: µg/m3
status: valid
status modified: 2013-09-20
accepted date: 2013-09-20
in scheme: AQD - Air Quality Pollutants
alternative label: PM10 @bg
scope note: 2011/850/EU
recommended unit: ug.m-3
measurement equipment: MetOne BAM-1020
measurement equipment: MetOne BAM-1020 heated
measurement equipment: MetOne BAM-1020 unheated
measurement equipment: COMDE DERENDA APM-2
measurement equipment: High Volume Aerosol Sampler DHA-80
measurement equipment: Low Volume Aerosol Sampler DPA-14
measurement equipment: MP101M particulate analyzer (replaces enviroMP101M)
measurement equipment: F-701-20 Verewa / Durag
measurement equipment: Palas model FIDAS 100
measurement equipment: Palas model FIDAS 100E
measurement equipment: Palas model FIDAS 200
measurement equipment: Palas model FIDAS 200E
measurement equipment: Palas model FIDAS 200S
measurement equipment: GRIMM model EDM 107 for PM10 PM2.5 PM1 and TC
measurement equipment: GRIMM model EDM 180 for PM10 and PM2.5
measurement equipment: GRIMM model EDM 180-C for PM10 and PM2.5
measurement equipment: GRIMM model EDM 180-D for PM10 PM2.5 PM1 and TC
measurement equipment: GRIMM model EDM 180-MC for PM10 PM2.5 PM1 TC and 31 size channels
measurement equipment: GRIMM model EDM 280 for TSP PM10 PM4 PM2.5 PM1 PMcoarse
measurement equipment: GRIMM model EDM 365 for PM10 PM2.5 PM1 and TC
measurement equipment: SWAM 5a Dual channel monitor
measurement equipment: SWAM 5a Single channel monitor
measurement equipment: TEOM 1400
measurement equipment: TEOM 1400A
measurement equipment: TEOM 1400AB
measurement equipment: TEOM 1400AB with FDMS module (8500)
measurement equipment: TEOM 1405
measurement equipment: TEOM 1405D
measurement equipment: TEOM 1405DF with FDMS Dichotomous monitor for PM2.5 & PM10
measurement equipment: TEOM 1405F with FDMS
measurement equipment: airpointer
measurement equipment: Andersen/GMW Model FH621-N Beta Monitor
measurement equipment: Thermo Andersen Series FH 62 C14 Continuous PM10 Ambient Particulate Monitor
measurement equipment: Andersen/GMW Model FH62I-N Beta Monitor
measurement equipment: Thermo Andersen ESM FH 62 I-R
measurement equipment: Andersen/GMW generic High-Volume Air Sampler
measurement equipment: Environnement S.A. Model MP101M (may be used for PM10 and PM2.5) (superseded by EnveaMP101M)
measurement equipment: Environnement S.A. Model MPSI 100
measurement equipment: Horiba model APDA 371
measurement equipment: Horiba model APDA 372
measurement equipment: ONLY USED IN ONE STATION IN RS
measurement equipment: KIMOTO 168s
measurement equipment: MCV CAV-A/MSb Captador d'Alt Volum Seqüencial
measurement equipment: MCV CAV-A/mb Captador d'Alt Volum
measurement equipment: Opsis SM200 Particulate Analyser with PM2.5 & PM10 Heads
measurement equipment: Thermo 5014i Beta Continuous Ambient Particulate Monitor
measurement equipment: Thermo model 5030 SHARP Particular Monitor with PM10 & PM2.5 heads
has protection target: Health
mandatory unit: ug.m-3

Gaseous nitric acid (air)
type: Concept
notation: HNO3
definition: HNO3 - recommended unit: µg/m3
status: valid
status modified: 2013-09-20
accepted date: 2013-09-20
in scheme: AQD - Air Quality Pollutants
alternative label: HNO3
scope note: Reciprocal exchange
recommended unit: ug.m-3

2-Methylpropanal (air)
type: Concept
notation: C4H8O
definition: 2-methylpropanal isobutanal isobutylaldehyde
status: valid
status modified: 2019-11-26
in scheme: AQD - Air Quality Pollutants

Lead in PM10 (aerosol)
type: Concept
notation: Pb in PM10
definition: Pb in PM10 - recommended unit: µg/m3
status: valid
status modified: 2013-09-20
accepted date: 2013-09-20
in scheme: AQD - Air Quality Pollutants
alternative label: Pb in PM10 @bg
scope note: 2011/850/EU
recommended unit: ug.m-3
has protection target: Health

Mercury in PM10 (aerosol)
type: Concept
notation: Hg in PM10
definition: Hg in PM10 - recommended unit: ng/m3
status: valid
status modified: 2013-09-20
accepted date: 2013-09-20
in scheme: AQD - Air Quality Pollutants
alternative label: Hg in PM10
scope note: 2011/850/EU
recommended unit: ng.m-3

Cadmium in PM10 (aerosol)
type: Concept
notation: Cd in PM10
definition: Cd in PM10 - recommended unit: ng/m3
status: valid
status modified: 2013-09-20
accepted date: 2013-09-20
in scheme: AQD - Air Quality Pollutants
alternative label: Cd in PM10 @bg
scope note: 2011/850/EU
recommended unit: ng.m-3
has protection target: Health

Nickel in PM10 (aerosol)
type: Concept
notation: Ni in PM10
definition: Ni in PM10 - recommended unit: ng/m3
status: valid
status modified: 2013-09-20
accepted date: 2013-09-20
in scheme: AQD - Air Quality Pollutants
alternative label: Ni in PM10 @bg
scope note: 2011/850/EU
recommended unit: ng.m-3
has protection target: Health

Chromium in PM10 (aerosol)
type: Concept
notation: Cr in PM10
definition: Cr in PM10 - recommended unit: ng/m3
status: valid
status modified: 2013-09-20
accepted date: 2013-09-20
in scheme: AQD - Air Quality Pollutants
alternative label: Cr in PM10
recommended unit: ng.m-3

Manganese in PM10 (aerosol)
type: Concept
notation: Mn in PM10
definition: Mn in PM10 - recommended unit: ng/m3
status: valid
status modified: 2013-09-20
accepted date: 2013-09-20
in scheme: AQD - Air Quality Pollutants
alternative label: Mn in PM10
recommended unit: ng.m-3

Arsenic in PM10 (aerosol)
type: Concept
notation: As in PM10
definition: As in PM10 - recommended unit: ng/m3
status: valid
status modified: 2013-09-20
accepted date: 2013-09-20
in scheme: AQD - Air Quality Pollutants
alternative label: As in PM10 @bg
scope note: 2011/850/EU
recommended unit: ng.m-3
has protection target: Health

propanal (air)
type: Concept
notation: Propanal
definition: Propanal - recommended unit: µg/m3
status: valid
status modified: 2013-09-20
accepted date: 2013-09-20
in scheme: AQD - Air Quality Pollutants
alternative label: Propanal
scope note: Reciprocal exchange
recommended unit: ug.m-3

Benzo(a)pyrene in PM10 (aerosol)
type: Concept
notation: BaP in PM10
definition: BaP in PM10 - recommended unit: ng/m3
status: valid
status modified: 2013-09-20
accepted date: 2013-09-20
in scheme: AQD - Air Quality Pollutants
alternative label: BaP in PM10 @bg
scope note: 2011/850/EU
recommended unit: ng.m-3
has protection target: Health

Propane (air)
type: Concept
notation: H3C-CH2-CH3
definition: H3C-CH2-CH3 - recommended unit: µg/m3
status: valid
status modified: 2013-09-20
accepted date: 2013-09-20
in scheme: AQD - Air Quality Pollutants
alternative label: H3C-CH2-CH3
scope note: 2011/850/EU
recommended unit: ug.m-3
measurement equipment: SYNTECH SPECTRAS GC 955 series undetermined
measurement equipment: SYNTECH SPECTRAS GC 955-615/815

propanone (air)
type: Concept
notation: Acetone
definition: Acetone - recommended unit: µg/m3
status: valid
status modified: 2013-09-20
accepted date: 2013-09-20
in scheme: AQD - Air Quality Pollutants
alternative label: Acetone
scope note: Reciprocal exchange
related match: Propanone + N2propenal (air)
recommended unit: ug.m-3

Ammonium in PM10 (aerosol)
type: Concept
notation: NH4+ in PM10
definition: NH4+ in PM10 - recommended unit: µg/m3
status: valid
status modified: 2013-09-20
accepted date: 2013-09-20
in scheme: AQD - Air Quality Pollutants
alternative label: NH4+ in PM10
scope note: Reciprocal exchange
recommended unit: ug.m-3

Nitrate in PM10 (aerosol)
type: Concept
notation: NO3- in PM10
definition: NO3- in PM10 - recommended unit: µg/m3
status: valid
status modified: 2013-09-20
accepted date: 2013-09-20
in scheme: AQD - Air Quality Pollutants
alternative label: NO3- in PM10
scope note: Reciprocal exchange
recommended unit: ug.m-3

sulphate in PM10 (aerosol)
type: Concept
notation: SO42- in PM10
definition: SO42- in PM10 - recommended unit: µg/m3
status: valid
status modified: 2013-09-20
accepted date: 2013-09-20
in scheme: AQD - Air Quality Pollutants
alternative label: SO42- in PM10
scope note: Reciprocal exchange
recommended unit: ug.m-3

Selenium in PM10 (aerosol)
type: Concept
notation: Se in PM10
definition: Se in PM10 - recommended unit: ng/m3
status: valid
status modified: 2013-09-20
accepted date: 2013-09-20
in scheme: AQD - Air Quality Pollutants
alternative label: Se in PM10
recommended unit: ng.m-3

Vanedium in PM10 (aerosol)
type: Concept
notation: V in PM10
definition: V in PM10 - recommended unit: ng/m3
status: valid
status modified: 2013-09-20
accepted date: 2013-09-20
in scheme: AQD - Air Quality Pollutants
alternative label: V in PM10
recommended unit: ng.m-3

Propene (air)
type: Concept
notation: CH2=CH-CH3
definition: CH2=CH-CH3 - recommended unit: µg/m3
status: valid
status modified: 2013-09-20
accepted date: 2013-09-20
in scheme: AQD - Air Quality Pollutants
alternative label: CH2=CH-CH3
scope note: 2011/850/EU
related match: Propone + Isobutane (air)
recommended unit: ug.m-3
measurement equipment: SYNTECH SPECTRAS GC 955 series undetermined
measurement equipment: SYNTECH SPECTRAS GC 955-615/815

Propone + Isobutane (air)
type: Concept
notation: CH2=CH-CH3 + H3C-CH2-CH2-CH3
definition: CH2=CH-CH3 + H3C-CH2-CH2-CH3 - recommended unit: µg/m3
status: valid
status modified: 2016-03-29
in scheme: AQD - Air Quality Pollutants
related match: n-Butane (air)
related match: Propene (air)
recommended unit: ug.m-3

Tin in PM10 (aerosol)
type: Concept
notation: Sn in PM10
definition: Sn in PM10 - recommended unit: ug/m3
status: valid
status modified: 2016-03-17
in scheme: AQD - Air Quality Pollutants
alternative label: Sn in PM10
recommended unit: ug.m-3

Zinc in PM10 (aerosol)
type: Concept
notation: Zn in PM10
definition: Zn in PM10 - recommended unit: ng/m3
status: valid
status modified: 2013-09-20
accepted date: 2013-09-20
in scheme: AQD - Air Quality Pollutants
alternative label: Zn in PM10
recommended unit: ng.m-3

Cobalt in PM10 (aerosol)
type: Concept
notation: Co in PM10
definition: Co in PM10 - recommended unit: ng/m3
status: valid
status modified: 2013-09-20
accepted date: 2013-09-20
in scheme: AQD - Air Quality Pollutants
alternative label: Co in PM10
recommended unit: ng.m-3

Iron in PM10 (aerosol)
type: Concept
notation: Fe in PM10
definition: Fe in PM10 - recommended unit: ng/m3
status: valid
status modified: 2013-09-20
accepted date: 2013-09-20
in scheme: AQD - Air Quality Pollutants
alternative label: Fe in PM10
recommended unit: ng.m-3

n-Pentane + i-Pentane (2-methylbutane)
type: Concept
notation: H3C-(CH2)3-CH3 + H3C-CH2-CH(CH3)2
definition: H3C-(CH2)3-CH3 + H3C-CH2-CH(CH3)2 - recommended unit: µg/m3
status: valid
status modified: 2016-03-29
in scheme: AQD - Air Quality Pollutants
alternative label: Pentane + Isopentane
related match: i-Pentane (2-methylbutane) (air)
related match: n-Pentane (air)
recommended unit: ug.m-3

Copper in PM10 (aerosol)
type: Concept
notation: Cu in PM10
definition: Cu in PM10 - recommended unit: ng/m3
status: valid
status modified: 2013-09-20
accepted date: 2013-09-20
in scheme: AQD - Air Quality Pollutants
alternative label: Cu in PM10
recommended unit: ng.m-3

retene (air+aerosol)
type: Concept
notation: Retene
definition: Retene - recommended unit: ng/m3
status: valid
status modified: 2013-09-20
accepted date: 2013-09-20
in scheme: AQD - Air Quality Pollutants
alternative label: Retene
scope note: Reciprocal exchange
recommended unit: ng.m-3

Propanone + N2propenal (air)
type: Concept
notation: Acetone + Acrolein
definition: Acetone + Acrolein- recommended unit: µg/m3
status: valid
status modified: 2016-03-29
in scheme: AQD - Air Quality Pollutants
alternative label: Acetone + Acrolein (air)
related match: propanone (air)
related match: N2propenal (air)
recommended unit: ug.m-3

HC C2-C6(excl. AROM. & CHLH) (air+aerosol)
type: Concept
notation: HC C2-C6(excl. AROM. & CHLH)
definition: HC C2-C6(excl. AROM. & CHLH) - recommended unit: µg/m3
status: valid
status modified: 2013-09-20
accepted date: 2013-09-20
in scheme: AQD - Air Quality Pollutants
alternative label: HC C2-C6(excl. AROM. & CHLH)
scope note: Reciprocal exchange
recommended unit: ug.m-3

Benzo(a)pyrene in PM10 (air+aerosol)
type: Concept
notation: BaP in PM10
definition: BaP in PM10 - recommended unit: ng/m3
status: valid
status modified: 2013-09-20
accepted date: 2013-09-20
in scheme: AQD - Air Quality Pollutants
alternative label: BaP in PM10
scope note: Reciprocal exchange
recommended unit: ng.m-3

sum_PCB (precip)
type: Concept
notation: sum-PCB
definition: sum-PCB - recommended unit: ng/l
status: valid
status modified: 2013-09-20
accepted date: 2013-09-20
in scheme: AQD - Air Quality Pollutants
alternative label: sum-PCB
scope note: Reciprocal exchange
recommended unit: ng.l-1

HC > C6 (excl. AROM. & CHLH) (air+aerosol)
type: Concept
notation: HC > C6 (excl. AROM. & CHLH)
definition: HC > C6 (excl. AROM. & CHLH) - recommended unit: µg/m3
status: valid
status modified: 2013-09-20
accepted date: 2013-09-20
in scheme: AQD - Air Quality Pollutants
alternative label: HC > C6 (excl. AROM. & CHLH)
scope note: Reciprocal exchange
recommended unit: ug.m-3

sum_sulph_diox_sulphate (air+aerosol)
type: Concept
notation: SO2 + SO4--
definition: SO2 + SO4-- - recommended unit: µg S/m3
status: valid
status modified: 2013-09-20
accepted date: 2013-09-20
in scheme: AQD - Air Quality Pollutants
alternative label: SO2 + SO4--
scope note: Reciprocal exchange
recommended unit: ugS.m-3

Aromatics (except C6H6) (air)
type: Concept
notation: Aromatics (except C6H6)
definition: Aromatics (except C6H6) - recommended unit: µg/m3
status: valid
status modified: 2013-09-20
accepted date: 2013-09-20
in scheme: AQD - Air Quality Pollutants
alternative label: Aromatics (except C6H6)
scope note: Reciprocal exchange
recommended unit: ug.m-3

1-Methyl anthracene in PM10 (air+aerosol)
type: Concept
notation: 1-Methyl anthracene in PM10
definition: 1-Methyl anthracene in PM10 - recommended unit: ng/m3
status: valid
status modified: 2014-07-31
accepted date: 2014-07-31
in scheme: AQD - Air Quality Pollutants
recommended unit: ng.m-3

Anthanthrene in PM10 (aerosol)
type: Concept
notation: Anthanthrene in PM10
definition: Anthanthrene in PM10 - recommended unit: ng/m3
status: valid
status modified: 2014-07-31
accepted date: 2014-07-31
in scheme: AQD - Air Quality Pollutants
recommended unit: ng.m-3

Benzo(b,j,k)fluoranthene in PM10 (aerosol)
type: Concept
notation: Benzo(b,j,k)fluorantheneInPM1
definition: Benzo(b,j,k)fluorantheneInPM1 - recommended unit: ng/m3
status: valid
status modified: 2013-09-20
accepted date: 2013-09-20
in scheme: AQD - Air Quality Pollutants
alternative label: Benzo(b,j,k)fluorantheneInPM1
scope note: Reciprocal exchange
recommended unit: ng.m-3

Benzo(e)pyrene in PM10 (aerosol)
type: Concept
notation: Benzo(e)pyrene in PM10
definition: Benzo(e)pyrene in PM10 - recommended unit: ng/m3
status: valid
status modified: 2014-07-31
accepted date: 2014-07-31
in scheme: AQD - Air Quality Pollutants
recommended unit: ng.m-3

Benzo(k+j)fluoranthene in PM10 (aerosol)
type: Concept
notation: Benzo(k+j)fluoranthene in PM10
definition: Benzo(k+j)fluoranthene in PM10 (aerosol) - recommended unit: ng/m3
status: valid
status modified: 2022-04-22
accepted date: 2022-04-22
in scheme: AQD - Air Quality Pollutants
recommended unit: ng.m-3

Chlorinated hydrocarbons (air)
type: Concept
notation: Chlorinated hydrocarbons
definition: Chlorinated hydrocarbons - recommended unit: µg/m3
status: valid
status modified: 2013-09-20
accepted date: 2013-09-20
in scheme: AQD - Air Quality Pollutants
alternative label: Chlorinated hydrocarbons
scope note: Reciprocal exchange
recommended unit: ug.m-3

Chrysene in PM10 (aerosol)
type: Concept
notation: Chrysene in PM10
definition: Chrysene in PM10 - recommended unit: ng/m3
status: valid
status modified: 2014-07-31
accepted date: 2014-07-31
in scheme: AQD - Air Quality Pollutants
recommended unit: ng.m-3

Coronene in PM10 (aerosol)
type: Concept
notation: Coronene in PM10
definition: Coronene in PM10 - recommended unit: ng/m3
status: valid
status modified: 2014-07-31
accepted date: 2014-07-31
in scheme: AQD - Air Quality Pollutants
recommended unit: ng.m-3

Cyclopenta(c,d)pyrene in PM10 (aerosol)
type: Concept
notation: Cyclopenta(c,d)pyrene in PM10
definition: Cyclopenta(c,d)pyrene in PM10 - recommended unit: ng/m3
status: valid
status modified: 2014-07-31
accepted date: 2014-07-31
in scheme: AQD - Air Quality Pollutants
recommended unit: ng.m-3

Dibenzo(ac+ah)anthracene in PM10 (aerosol)
type: Concept
notation: Dibenzo(ac+ah)anthracene in PM10
definition: Dibenzo(ac+ah)anthracene in PM10 - recommended unit: ng/m3
status: valid
status modified: 2013-12-10
accepted date: 2013-12-10
in scheme: AQD - Air Quality Pollutants
scope note: 2011/850/EU
recommended unit: ng.m-3

Dibenzo(ah)anthracene in PM10 (aerosol)
type: Concept
notation: Dibenzo(ah)anthracene in PM10
definition: Dibenzo(ah)anthracene in PM10 - recommended unit: ng/m3
status: valid
status modified: 2013-09-20
accepted date: 2013-09-20
in scheme: AQD - Air Quality Pollutants
alternative label: Dibenzo(ah)anthracene in PM10
scope note: 2011/850/EU
recommended unit: ng.m-3

Benzo(b,j)fluoranthene in PM10 (aerosol)
type: Concept
notation: Benzo(b,j)fluorantheneinPM10
definition: Benzo(b,j)fluorantheneInPM10 - recommended unit: ng/m3
status: valid
status modified: 2013-10-03
accepted date: 2013-10-03
in scheme: AQD - Air Quality Pollutants
recommended unit: ng.m-3

Perylene in PM10 (aerosol)
type: Concept
notation: Perylene in PM10
definition: Perylene in PM10 - recommended unit: ng/m3
status: valid
status modified: 2014-07-31
accepted date: 2014-07-31
in scheme: AQD - Air Quality Pollutants
recommended unit: ng.m-3

4.5-Methylene phenanthrene in PM10 (air+aerosol)
type: Concept
notation: 4.5-Methylene phenanthrene in PM10
definition: 4.5-Methylene phenanthrene in PM10 - recommended unit: ng/m3
status: valid
status modified: 2014-07-31
accepted date: 2014-07-31
in scheme: AQD - Air Quality Pollutants
recommended unit: ng.m-3

5-Methyl Chrysene in PM10 (aerosol)
type: Concept
notation: 5-Methyl Chrysene in PM10
definition: 5-Methyl Chrysene in PM10 - recommended unit: ng/m3
status: valid
status modified: 2014-07-31
accepted date: 2014-07-31
in scheme: AQD - Air Quality Pollutants
recommended unit: ng.m-3

9-Methyl anthracene in PM10 (air+aerosol)
type: Concept
notation: 9-Methyl anthracene in PM10
definition: 9-Methyl anthracene in PM10 - recommended unit: ng/m3
status: valid
status modified: 2014-07-31
accepted date: 2014-07-31
in scheme: AQD - Air Quality Pollutants
recommended unit: ng.m-3

Benzo(b)naphtho(2,1-d)thiophene in PM10 (aerosol)
type: Concept
notation: Benzo(b)naphtho(2,1-d)thiophene in PM10
definition: Benzo(b)naphtho(2,1-d)thiophene in PM10 - recommended unit: ng/m3
status: valid
status modified: 2014-07-31
accepted date: 2014-07-31
in scheme: AQD - Air Quality Pollutants
recommended unit: ng.m-3

Benzo(c)phenanthrene in PM10 (aerosol)
type: Concept
notation: Benzo(c)phenanthrene in PM10
definition: Benzo(c)phenanthrene in PM10 - recommended unit: ng/m3
status: valid
status modified: 2014-07-31
accepted date: 2014-07-31
in scheme: AQD - Air Quality Pollutants
recommended unit: ng.m-3

Cholanthrene in PM10 (aerosol)
type: Concept
notation: Cholanthrene in PM10
definition: Cholanthrene in PM10 - recommended unit: ng/m3
status: valid
status modified: 2014-07-31
accepted date: 2014-07-31
in scheme: AQD - Air Quality Pollutants
recommended unit: ng.m-3

Dibenzo(ac)anthracene in PM10 (aerosol)
type: Concept
notation: Dibenzo(ac)anthracene in PM10
definition: Dibenzo(ac)anthracene in PM10 - recommended unit: ng/m3
status: valid
status modified: 2014-07-31
accepted date: 2014-07-31
in scheme: AQD - Air Quality Pollutants
recommended unit: ng.m-3

Dibenzo(al)pyrene in PM10 (aerosol)
type: Concept
notation: Dibenzo(al)pyrene in PM10
definition: Dibenzo(al)pyrene in PM10 - recommended unit: ng/m3
status: valid
status modified: 2014-07-31
accepted date: 2014-07-31
in scheme: AQD - Air Quality Pollutants
recommended unit: ng.m-3

Benzo(b+j)fluoranthene in PM10 (air+aerosol)
type: Concept
notation: Benzo(b+j)fluoranthene in PM10
definition: Benzo(b+j)fluoranthene in PM10 - recommended unit: ng/m3
status: valid
status modified: 2014-07-31
accepted date: 2014-07-31
in scheme: AQD - Air Quality Pollutants
recommended unit: ng.m-3

Anthracene in PM10 (aerosol)
type: Concept
notation: Anthracene in PM10 (aerosol)
definition: Anthracene in PM10 (aerosol) - recommended unit: ng/m3
status: valid
status modified: 2016-06-16
in scheme: AQD - Air Quality Pollutants
recommended unit: ng.m-3

Benzo(a)anthracene in PM10 (air+aerosol)
type: Concept
notation: Benzo(a)anthracene in PM10
definition: Benzo(a)anthracene in PM10 - recommended unit: ng/m3
status: valid
status modified: 2013-09-20
accepted date: 2013-09-20
in scheme: AQD - Air Quality Pollutants
alternative label: Benzo(a)anthracene in PM10
scope note: Reciprocal exchange
recommended unit: ng.m-3

Benzo(a)anthracene in PM10 (aerosol)
type: Concept
notation: Benzo(a)anthracene in PM10
definition: Benzo(a)anthracene in PM10 - recommended unit: ng/m3
status: valid
status modified: 2013-09-20
accepted date: 2013-09-20
in scheme: AQD - Air Quality Pollutants
alternative label: Benzo(a)anthracene in PM10
scope note: 2011/850/EU
recommended unit: ng.m-3

Benzo(b)fluoranthene in PM10 (air+aerosol)
type: Concept
notation: Benzo(b)fluoranthene in PM10
definition: Benzo(b)fluoranthene in PM10 - recommended unit: ng/m3
status: valid
status modified: 2013-09-20
accepted date: 2013-09-20
in scheme: AQD - Air Quality Pollutants
alternative label: Benzo(b)fluoranthene in PM10
scope note: Reciprocal exchange
recommended unit: ng.m-3

Benzo(b)fluoranthene in PM10 (aerosol)
type: Concept
notation: Benzo(b)fluoranthene in PM10
definition: Benzo(b)fluoranthene in PM10 - recommended unit: ng/m3
status: valid
status modified: 2013-09-20
accepted date: 2013-09-20
in scheme: AQD - Air Quality Pollutants
alternative label: Benzo(b)fluoranthene in PM10
scope note: 2011/850/EU
recommended unit: ng.m-3

5-Methyl Chrysene in PM10 (air+aerosol)
type: Concept
notation: 5-Methyl Chrysene in PM10
definition: 5-Methyl Chrysene in PM10 - recommended unit: ng/m3
status: valid
status modified: 2014-07-31
accepted date: 2014-07-31
in scheme: AQD - Air Quality Pollutants
recommended unit: ng.m-3

Benzo(ghi)perylene in PM10 (aerosol)
type: Concept
notation: Benzo(ghi)perylene in PM10
definition: Benzo(ghi)perylene in PM10 - recommended unit: ng/m3
status: valid
status modified: 2014-07-31
accepted date: 2014-07-31
in scheme: AQD - Air Quality Pollutants
recommended unit: ng.m-3

Benzo(b)naphtho(2,1-d)thiophene in PM10 (air+aerosol)
type: Concept
notation: Benzo(b)naphtho(2,1-d)thiophene in PM10
definition: Benzo(b)naphtho(2,1-d)thiophene in PM10 - recommended unit: ng/m3
status: valid
status modified: 2014-07-31
accepted date: 2014-07-31
in scheme: AQD - Air Quality Pollutants
recommended unit: ng.m-3

Benzo(k)fluoranthene in PM10 (air+aerosol)
type: Concept
notation: Benzo(k)fluoranthene in PM10
definition: Benzo(k)fluoranthene in PM10 - recommended unit: ng/m3
status: valid
status modified: 2013-09-20
accepted date: 2013-09-20
in scheme: AQD - Air Quality Pollutants
alternative label: Benzo(k)fluoranthene in PM10
scope note: Reciprocal exchange
recommended unit: ng.m-3

Benzo(k)fluoranthene in PM10 (aerosol)
type: Concept
notation: Benzo(k)fluoranthene in PM10
definition: Benzo(k)fluoranthene in PM10 - recommended unit: ng/m3
status: valid
status modified: 2013-09-20
accepted date: 2013-09-20
in scheme: AQD - Air Quality Pollutants
alternative label: Benzo(k)fluoranthene in PM10
scope note: 2011/850/EU
recommended unit: ng.m-3

Dibenzo(ac)anthracene in PM10 (air+aerosol)
type: Concept
notation: Dibenzo(ac)anthracene in PM10
definition: Dibenzo(ac)anthracene in PM10 - recommended unit: ng/m3
status: valid
status modified: 2014-07-31
accepted date: 2014-07-31
in scheme: AQD - Air Quality Pollutants
recommended unit: ng.m-3

Dibenzo(al)pyrene in PM10 (air+aerosol)
type: Concept
notation: Dibenzo(al)pyrene in PM10
definition: Dibenzo(al)pyrene in PM10 - recommended unit: ng/m3
status: valid
status modified: 2014-07-31
accepted date: 2014-07-31
in scheme: AQD - Air Quality Pollutants
recommended unit: ng.m-3

calcium in PM10 (aerosol)
type: Concept
notation: Ca2+ in PM10
definition: Ca2+ in PM10 - recommended unit: µg/m3
status: valid
status modified: 2013-09-20
accepted date: 2013-09-20
in scheme: AQD - Air Quality Pollutants
alternative label: Ca2+ in PM10
scope note: Reciprocal exchange
recommended unit: ug.m-3

chloride in PM10 (aerosol)
type: Concept
notation: Cl- in PM10
definition: Cl- in PM10 - recommended unit: µg/m3
status: valid
status modified: 2013-09-20
accepted date: 2013-09-20
in scheme: AQD - Air Quality Pollutants
alternative label: Cl- in PM10
scope note: Reciprocal exchange
recommended unit: ug.m-3

Dibenzo(ah+ac)anthracene in PM10 (aerosol)
type: Concept
notation: Dibenzo(ah+ac)anthracene in PM10
definition: Dibenzo(ah+ac)anthracene in PM10 - recommended unit: ng/m3
status: valid
status modified: 2014-07-31
accepted date: 2014-07-31
in scheme: AQD - Air Quality Pollutants
recommended unit: ng.m-3

Dibenzo(ae)pyrene in PM10 (aerosol)
type: Concept
notation: Dibenzo(ae)pyrene in PM10
definition: Dibenzo(ae)pyrene in PM10 - recommended unit: ng/m3
status: valid
status modified: 2014-07-31
accepted date: 2014-07-31
in scheme: AQD - Air Quality Pollutants
recommended unit: ng.m-3

Dibenzo(ah)pyrene in PM10 (aerosol)
type: Concept
notation: Dibenzo(ah)pyrene in PM10
definition: Dibenzo(ah)pyrene in PM10 - recommended unit: ng/m3
status: valid
status modified: 2014-07-31
accepted date: 2014-07-31
in scheme: AQD - Air Quality Pollutants
recommended unit: ng.m-3

Dibenzo(ai)pyrene in PM10 (aerosol)
type: Concept
notation: Dibenzo(ai)pyrene in PM10
definition: Dibenzo(ai)pyrene in PM10 - recommended unit: ng/m3
status: valid
status modified: 2014-07-31
accepted date: 2014-07-31
in scheme: AQD - Air Quality Pollutants
recommended unit: ng.m-3

Fluoranthene in PM10 (aerosol)
type: Concept
notation: Fluoranthene in PM10 (aerosol)
definition: Fluoranthene in PM10 (aerosol)
status: valid
status modified: 2016-06-16
in scheme: AQD - Air Quality Pollutants
recommended unit: ng.m-3

indeno_123cd_pyrene in PM10 (air+aerosol)
type: Concept
notation: Indeno-(1,2,3-cd)pyrene in PM
definition: Indeno-(1,2,3-cd)pyrene in PM - recommended unit: ng/m3
status: valid
status modified: 2013-09-20
accepted date: 2013-09-20
in scheme: AQD - Air Quality Pollutants
alternative label: Indeno-(1,2,3-cd)pyrene in PM
scope note: Reciprocal exchange
recommended unit: ng.m-3

indeno_123cd_pyrene in PM10 (aerosol)
type: Concept
notation: Indeno-(1,2,3-cd)pyrene in PM
definition: Indeno-(1,2,3-cd)pyrene in PM - recommended unit: ng/m3
status: valid
status modified: 2013-09-20
accepted date: 2013-09-20
in scheme: AQD - Air Quality Pollutants
alternative label: Indeno-(1,2,3-cd)pyrene in PM
scope note: 2011/850/EU
recommended unit: ng.m-3

potassium in PM10 (aerosol)
type: Concept
notation: K+ in PM10
definition: K+ in PM10 - recommended unit: µg/m3
status: valid
status modified: 2013-09-20
accepted date: 2013-09-20
in scheme: AQD - Air Quality Pollutants
alternative label: K+ in PM10
scope note: Reciprocal exchange
recommended unit: ug.m-3

magnesium in PM10 (aerosol)
type: Concept
notation: Mg2+ in PM10
definition: Mg2+ in PM10 - recommended unit: µg/m3
status: valid
status modified: 2013-09-20
accepted date: 2013-09-20
in scheme: AQD - Air Quality Pollutants
alternative label: Mg2+ in PM10
scope note: Reciprocal exchange
recommended unit: ug.m-3

sodium in PM10 (aerosol)
type: Concept
notation: Na+ in PM10
definition: Na+ in PM10 - recommended unit: µg/m3
status: valid
status modified: 2013-09-20
accepted date: 2013-09-20
in scheme: AQD - Air Quality Pollutants
alternative label: Na+ in PM10
scope note: Reciprocal exchange
recommended unit: ug.m-3

Phenanthrene in PM10 (aerosol)
type: Concept
notation: Phenanthrene in PM10 (aerosol)
definition: Phenanthrene in PM10 (aerosol) - recommended unit: ng/m3
status: valid
status modified: 2016-06-16
in scheme: AQD - Air Quality Pollutants
recommended unit: ng.m-3

Pyrene in PM10 (aerosol)
type: Concept
notation: Pyrene in PM10 (aerosol)
definition: Pyrene in PM10 (aerosol) - recommended unit: ng/m3
status: valid
status modified: 2016-06-16
in scheme: AQD - Air Quality Pollutants
recommended unit: ng.m-3

Benzo(c)phenanthrene in PM10 (air+aerosol)
type: Concept
notation: Benzo(c)phenanthrene in PM10
definition: Benzo(c)phenanthrene in PM10 - recommended unit: ng/m3
status: valid
status modified: 2014-07-31
accepted date: 2014-07-31
in scheme: AQD - Air Quality Pollutants
recommended unit: ng.m-3

Dibenzo(ah+ac)anthracene in PM10 (air+aerosol)
type: Concept
notation: Dibenzo(ah+ac)anthracene in PM10
definition: Dibenzo(ah+ac)anthracene in PM10 - recommended unit: ng/m3
status: valid
status modified: 2014-07-31
accepted date: 2014-07-31
in scheme: AQD - Air Quality Pollutants
recommended unit: ng.m-3

Benzo(j)fluoranthene in PM10 (aerosol)
type: Concept
notation: Benzo(j)fluoranthene in PM10
definition: Benzo(j)fluoranthene in PM10 - recommended unit: ng/m3
status: valid
status modified: 2013-09-20
accepted date: 2013-09-20
in scheme: AQD - Air Quality Pollutants
alternative label: Benzo(j)fluoranthene in PM10
scope note: 2011/850/EU
recommended unit: ng.m-3

Benzo(j)fluoranthene in PM10 (air+aerosol)
type: Concept
notation: Benzo(j)fluoranthene in PM10
definition: Benzo(j)fluoranthene in PM10 - recommended unit: ng/m3
status: valid
status modified: 2013-09-20
accepted date: 2013-09-20
in scheme: AQD - Air Quality Pollutants
alternative label: Benzo(j)fluoranthene in PM10
scope note: Reciprocal exchange
recommended unit: ng.m-3

Dibenzo(ah)anthracene in PM10 (air+aerosol)
type: Concept
notation: Dibenzo(ah)anthracene in PM10
definition: Dibenzo(ah)anthracene in PM10 - recommended unit: ng/m3
status: valid
status modified: 2013-09-20
accepted date: 2013-09-20
in scheme: AQD - Air Quality Pollutants
alternative label: Dibenzo(ah)anthracene in PM10
scope note: Reciprocal exchange
recommended unit: ng.m-3

Elemental carbon in PM10 (aerosol)
type: Concept
notation: EC in PM10
definition: EC in PM10 - recommended unit: µg/m3
status: valid
status modified: 2013-09-20
accepted date: 2013-09-20
in scheme: AQD - Air Quality Pollutants
alternative label: EC in PM10
recommended unit: ug.m-3

Organic carbon in PM10 (aerosol)
type: Concept
notation: OC in PM10
definition: OC in PM10 - recommended unit: µg/m3
status: valid
status modified: 2013-09-20
accepted date: 2013-09-20
in scheme: AQD - Air Quality Pollutants
alternative label: OC in PM10
recommended unit: ug.m-3

Black smoke (air)
type: Concept
notation: BS
definition: BS - recommended unit: µg/m3
status: valid
status modified: 2013-09-20
accepted date: 2013-09-20
in scheme: AQD - Air Quality Pollutants
alternative label: BS
scope note: Reciprocal exchange
recommended unit: ug.m-3

Particulate matter < 2.5 µm (aerosol)
type: Concept
notation: PM2.5
definition: PM2.5 - recommended unit: µg/m3
status: valid
status modified: 2013-09-20
accepted date: 2013-09-20
in scheme: AQD - Air Quality Pollutants
alternative label: PM2.5 @bg
scope note: 2011/850/EU
recommended unit: ug.m-3
measurement equipment: MetOne BAM-1020
measurement equipment: MetOne BAM-1020 heated
measurement equipment: MetOne BAM-1020 unheated
measurement equipment: COMDE DERENDA APM-2
measurement equipment: High Volume Aerosol Sampler DHA-80
measurement equipment: Low Volume Aerosol Sampler DPA-14
measurement equipment: MP101M particulate analyzer (replaces enviroMP101M)
measurement equipment: F-701-20 Verewa / Durag
measurement equipment: Palas model FIDAS 100
measurement equipment: Palas model FIDAS 100E
measurement equipment: Palas model FIDAS 200
measurement equipment: Palas model FIDAS 200E
measurement equipment: Palas model FIDAS 200S
measurement equipment: GRIMM model EDM 107 for PM10 PM2.5 PM1 and TC
measurement equipment: GRIMM model EDM 180 for PM10 and PM2.5
measurement equipment: GRIMM model EDM 180-C for PM10 and PM2.5
measurement equipment: GRIMM model EDM 180-D for PM10 PM2.5 PM1 and TC
measurement equipment: GRIMM model EDM 180-MC for PM10 PM2.5 PM1 TC and 31 size channels
measurement equipment: GRIMM model EDM 280 for TSP PM10 PM4 PM2.5 PM1 PMcoarse
measurement equipment: GRIMM model EDM 365 for PM10 PM2.5 PM1 and TC
measurement equipment: SWAM 5a Dual channel monitor
measurement equipment: SWAM 5a Single channel monitor
measurement equipment: TEOM 1400
measurement equipment: TEOM 1400A
measurement equipment: TEOM 1400AB
measurement equipment: TEOM 1400AB with FDMS module (8500)
measurement equipment: TEOM 1405
measurement equipment: TEOM 1405D
measurement equipment: TEOM 1405DF with FDMS Dichotomous monitor for PM2.5 & PM10
measurement equipment: TEOM 1405F with FDMS
measurement equipment: airpointer
measurement equipment: Thermo Andersen ESM FH 62 I-R
measurement equipment: Environnement S.A. Model MP101M (may be used for PM10 and PM2.5) (superseded by EnveaMP101M)
measurement equipment: Environnement S.A. Model MP2.5M undefined
measurement equipment: Horiba model APDA 371
measurement equipment: Horiba model APDA 372
measurement equipment: MCV CAV-A/MSb Captador d'Alt Volum Seqüencial
measurement equipment: MCV CAV-A/mb Captador d'Alt Volum
measurement equipment: Opsis SM200 Particulate Analyser with PM2.5 & PM10 Heads
measurement equipment: Thermo 5014i Beta Continuous Ambient Particulate Monitor
measurement equipment: Thermo model 5030 SHARP Particular Monitor with PM10 & PM2.5 heads
has protection target: Health

Particulate matter < 1 µm (aerosol)
type: Concept
notation: PM1
definition: PM1 - recommended unit: µg/m3
status: valid
status modified: 2013-09-20
accepted date: 2013-09-20
in scheme: AQD - Air Quality Pollutants
alternative label: PM1
scope note: Reciprocal exchange
recommended unit: ug.m-3
measurement equipment: F-701-20 Verewa / Durag
measurement equipment: Palas model FIDAS 200
measurement equipment: Palas model FIDAS 200E
measurement equipment: Palas model FIDAS 200S
measurement equipment: GRIMM model EDM 180-D for PM10 PM2.5 PM1 and TC
measurement equipment: GRIMM model EDM 180-MC for PM10 PM2.5 PM1 TC and 31 size channels
measurement equipment: GRIMM model EDM 280 for TSP PM10 PM4 PM2.5 PM1 PMcoarse
measurement equipment: GRIMM model EDM 365 for PM10 PM2.5 PM1 and TC
measurement equipment: Horiba model APDA 372
measurement equipment: Thermo 5014i Beta Continuous Ambient Particulate Monitor
measurement equipment: Thermo model 5030 SHARP Particular Monitor with PM10 & PM2.5 heads

Ultra Fine Particles (UFPs) - recommended unit: particles.cm-3
type: Concept
notation: UFPs
definition: Ultra Fine Particles (UFPs) means particles with a diameter less than or equal to 100 nanometers (10^-9 m), where UFP are measured as the particle number concentrations per cubic centimetre for a size range with a lower limit of 10 nm and for a size range with no restriction on the upper limit
status: valid
status modified: 2022-03-24
accepted date: 2022-03-24
in scheme: AQD - Air Quality Pollutants
scope note: Added by Jaume Targa
recommended unit: particles.cm-3
measurement equipment: GRIMM CPC model 5412 Standard Condensation Particle Counter
measurement equipment: GRIMM-CPC5420 Scanning Mobility Particle Counter and Sizer
measurement equipment: Model 5420 SMPS+C Scanning Mobility Particle Counter and Sizer
measurement equipment: TSI Ultrafine Particle Monitor 3031
measurement equipment: TSI Electrostatic Classifier 3080
measurement equipment: TSI Nanoparticle Surface Area Monitor 3550
measurement equipment: TSI Condensation Particle Counter 3750
measurement equipment: TSI model 3752 High Concentration Condensation Particle Counter
measurement equipment: TSI Condensation Particle Counter 3772
measurement equipment: TSI model 3775 Condensation Particle Counter
measurement equipment: TSI Ultrafine Condensation Particle Counter (UCPC) Model 3776
measurement equipment: TSI3783
mandatory unit: particles.cm-3

PNSD - Particle Number Size Distribution
type: Concept
notation: PNSD
definition: particle number size distribution (PNSD) is the frequency distribution of the particle number concentration represented as a function of the logarithm of particle size, such that the area under the distribution between two sizes is the number concentration of that size range.
status: valid
status modified: 2025-08-03
accepted date: 2025-08-03
in scheme: AQD - Air Quality Pollutants
recommended unit: particles.cm-3
mandatory unit: particles.cm-3

1-Butene (air)
type: Concept
notation: H2C=CH-CH2-CH3
definition: H2C=CH-CH2-CH3 - recommended unit: µg/m3
status: valid
status modified: 2013-09-20
accepted date: 2013-09-20
in scheme: AQD - Air Quality Pollutants
alternative label: H2C=CH-CH2-CH3
scope note: 2011/850/EU
recommended unit: ug.m-3
measurement equipment: SYNTECH SPECTRAS GC 955 series undetermined
measurement equipment: SYNTECH SPECTRAS GC 955-615/815

trans-2-Butene (air)
type: Concept
notation: trans-H3C-CH=CH-CH3
definition: trans-H3C-CH=CH-CH3 - recommended unit: µg/m3
status: valid
status modified: 2013-09-20
accepted date: 2013-09-20
in scheme: AQD - Air Quality Pollutants
alternative label: trans-H3C-CH=CH-CH3
scope note: 2011/850/EU
recommended unit: ug.m-3
measurement equipment: SYNTECH SPECTRAS GC 955 series undetermined
measurement equipment: SYNTECH SPECTRAS GC 955-615/815

cis-2-Butene (air)
type: Concept
notation: cis-H3C-CH=CH-CH3
definition: cis-H3C-CH=CH-CH3 - recommended unit: µg/m3
status: valid
status modified: 2013-09-20
accepted date: 2013-09-20
in scheme: AQD - Air Quality Pollutants
alternative label: cis-H3C-CH=CH-CH3
scope note: 2011/850/EU
recommended unit: ug.m-3
measurement equipment: SYNTECH SPECTRAS GC 955 series undetermined
measurement equipment: SYNTECH SPECTRAS GC 955-615/815

1-Pentene (air)
type: Concept
notation: H2C=CH-CH2-CH2-CH3
definition: H2C=CH-CH2-CH2-CH3 - recommended unit: µg/m3
status: valid
status modified: 2013-09-20
accepted date: 2013-09-20
in scheme: AQD - Air Quality Pollutants
alternative label: H2C=CH-CH2-CH2-CH3
scope note: 2011/850/EU
recommended unit: ug.m-3
measurement equipment: SYNTECH SPECTRAS GC 955 series undetermined
measurement equipment: SYNTECH SPECTRAS GC 955-615/815

2-Pentene (air)
type: Concept
notation: H3C-HC=CH-CH2-CH3
definition: H3C-HC=CH-CH2-CH3 - recommended unit: µg/m3
status: valid
status modified: 2013-09-20
accepted date: 2013-09-20
in scheme: AQD - Air Quality Pollutants
alternative label: H3C-HC=CH-CH2-CH3 @bg
scope note: 2011/850/EU
recommended unit: ug.m-3
measurement equipment: SYNTECH SPECTRAS GC 955 series undetermined
measurement equipment: SYNTECH SPECTRAS GC 955-615/815

N3methylphenanthrene (air+aerosol)
type: Concept
notation: 3-methylphenantrene
definition: 3-methylphenantrene - recommended unit: ng/m3
status: valid
status modified: 2013-09-20
accepted date: 2013-09-20
in scheme: AQD - Air Quality Pollutants
alternative label: 3-methylphenantrene
scope note: Reciprocal exchange
recommended unit: ng.m-3

1,2,4-Trimethylbenzene (air)
type: Concept
notation: 1,2,4-C6H3(CH3)3
definition: 1,2,4-C6H3(CH3)3 - recommended unit: µg/m3
status: valid
status modified: 2013-09-20
accepted date: 2013-09-20
in scheme: AQD - Air Quality Pollutants
alternative label: 1,2,4-C6H3(CH3)3
scope note: 2011/850/EU
recommended unit: ug.m-3
measurement equipment: SYNTECH SPECTRAS GC 955 series undetermined
measurement equipment: SYNTECH SPECTRAS GC 955-615/815

1,2,3-Trimethylbenzene (air)
type: Concept
notation: 1,2,3-C6H3(CH3)3
definition: 1,2,3-C6H3(CH3)3 - recommended unit: µg/m3
status: valid
status modified: 2013-09-20
accepted date: 2013-09-20
in scheme: AQD - Air Quality Pollutants
alternative label: 1,2,3-C6H3(CH3)3
scope note: 2011/850/EU
recommended unit: ug.m-3
measurement equipment: SYNTECH SPECTRAS GC 955 series undetermined
measurement equipment: SYNTECH SPECTRAS GC 955-615/815

1,3,5-Trimethylbenzene (air)
type: Concept
notation: 1,3,5-C6H3(CH3)3
definition: 1,3,5-C6H3(CH3)3 - recommended unit: µg/m3
status: valid
status modified: 2013-09-20
accepted date: 2013-09-20
in scheme: AQD - Air Quality Pollutants
alternative label: 1,3,5-C6H3(CH3)3
scope note: 2011/850/EU
recommended unit: ug.m-3
measurement equipment: SYNTECH SPECTRAS GC 955 series undetermined
measurement equipment: SYNTECH SPECTRAS GC 955-615/815

Benzo(a)pyrene (air+aerosol)
type: Concept
notation: BaP
definition: BaP - recommended unit: ng/m3
status: valid
status modified: 2013-09-20
accepted date: 2013-09-20
in scheme: AQD - Air Quality Pollutants
alternative label: BaP
scope note: Reciprocal exchange
recommended unit: ng.m-3

1-Hexene (air)
type: Concept
notation: C6H12
definition: C6H12 - recommended unit: µg/m3
status: valid
status modified: 2016-03-29
in scheme: AQD - Air Quality Pollutants
recommended unit: ug.m-3

Butyl acetate (air)
type: Concept
notation: C6H12O2
definition: Butyl acetate (air) - C6H12O2 - recommended unit: µg/m3
status: valid
status modified: 2020-03-27
in scheme: AQD - Air Quality Pollutants
recommended unit: ug.m-3

N9methylphenanthrene (air+aerosol)
type: Concept
notation: 9-methylphenantrene
definition: 9-methylphenantrene - recommended unit: ng/m3
status: valid
status modified: 2013-09-20
accepted date: 2013-09-20
in scheme: AQD - Air Quality Pollutants
alternative label: 9-methylphenantrene
scope note: Reciprocal exchange
recommended unit: ng.m-3

Ultra Fine Particles (UFPs) with a lower limit of 3 nanometers and no restriction on the upper limit - recommended unit: particles.cm-3
type: Concept
notation: UFPs >3nm
definition: Ultra Fine Particles (UFPs) means particles with a diameter less than or equal to 100 nanometers (10^-9 m), where UFP are measured as the particle number concentrations per cubic centimetre for a size range with a lower limit of 3 nm and for a size range with no restriction on the upper limit - PLEASE USE /6003 FOR REPORTING UFP ACCORDING TO RECAST EU 2024/2881
status: valid
status modified: 2025-05-26
accepted date: 2025-05-26
in scheme: AQD - Air Quality Pollutants
mandatory unit: particles.cm-3

Ultra Fine Particles (UFPs) with a lower limit of 4 nanometers and no restriction on the upper limit - recommended unit: particles.cm-3
type: Concept
notation: UFPs >4nm
definition: Ultra Fine Particles (UFPs) means particles with a diameter less than or equal to 100 nanometers (10^-9 m), where UFP are measured as the particle number concentrations per cubic centimetre for a size range with a lower limit of 4 nm and for a size range with no restriction on the upper limit - PLEASE USE /6003 FOR REPORTING UFP ACCORDING TO RECAST EU 2024/2881
status: valid
status modified: 2025-05-26
accepted date: 2025-05-26
in scheme: AQD - Air Quality Pollutants
mandatory unit: particles.cm-3

Ultra Fine Particles (UFPs) with a lower limit of 7 nanometers and no restriction on the upper limit - recommended unit: particles.cm-3
type: Concept
notation: UFPs >7nm
definition: Ultra Fine Particles (UFPs) means particles with a diameter less than or equal to 100 nanometers (10^-9 m), where UFP are measured as the particle number concentrations per cubic centimetre for a size range with a lower limit of 7 nm and for a size range with no restriction on the upper limit - PLEASE USE /6003 FOR REPORTING UFP ACCORDING TO RECAST EU 2024/2881
status: valid
status modified: 2025-05-26
accepted date: 2025-05-26
in scheme: AQD - Air Quality Pollutants
mandatory unit: particles.cm-3

aluminium (aerosol)
type: Concept
notation: Al
definition: Al - recommended unit: ng/m3
status: valid
status modified: 2013-09-20
accepted date: 2013-09-20
in scheme: AQD - Air Quality Pollutants
alternative label: Al
scope note: Reciprocal exchange
recommended unit: ng.m-3

aluminium (precip)
type: Concept
notation: Al
definition: Al - recommended unit: µg/l
status: valid
status modified: 2013-09-20
accepted date: 2013-09-20
in scheme: AQD - Air Quality Pollutants
alternative label: Al
scope note: Reciprocal exchange
recommended unit: ug.l-1

anthracene (air+aerosol)
type: Concept
notation: Anthracene
definition: Anthracene - recommended unit: ng/m3
status: valid
status modified: 2013-09-20
accepted date: 2013-09-20
in scheme: AQD - Air Quality Pollutants
alternative label: Anthracene
scope note: Reciprocal exchange
recommended unit: ng.m-3

anthracene (precip)
type: Concept
notation: Anthracene
definition: Anthracene - recommended unit: ng/l
status: valid
status modified: 2013-09-20
accepted date: 2013-09-20
in scheme: AQD - Air Quality Pollutants
alternative label: Anthracene
scope note: Reciprocal exchange
recommended unit: ng.l-1

anthracene (precip+dry_dep)
type: Concept
notation: Anthracene
definition: Anthracene - recommended unit: µg/m2/day
status: valid
status modified: 2013-09-20
accepted date: 2013-09-20
in scheme: AQD - Air Quality Pollutants
alternative label: Anthracene
scope note: Reciprocal exchange
recommended unit: ug.m-2.day-1

Benzo(a)anthracene (air+aerosol)
type: Concept
notation: Benzo(a)anthracene
definition: Benzo(a)anthracene - recommended unit: ng/m3
status: valid
status modified: 2013-09-20
accepted date: 2013-09-20
in scheme: AQD - Air Quality Pollutants
alternative label: Benzo(a)anthracene
scope note: Reciprocal exchange
recommended unit: ng.m-3

Benzo(a)anthracene (precip)
type: Concept
notation: Benzo(a)anthracene
definition: Benzo(a)anthracene - recommended unit: ng/l
status: valid
status modified: 2013-09-20
accepted date: 2013-09-20
in scheme: AQD - Air Quality Pollutants
alternative label: Benzo(a)anthracene
scope note: Reciprocal exchange
recommended unit: ng.l-1

Benzo(a)anthracene (precip+dry_dep)
type: Concept
notation: Benzo(a)anthracene
definition: Benzo(a)anthracene - recommended unit: µg/m2/day
status: valid
status modified: 2013-09-20
accepted date: 2013-09-20
in scheme: AQD - Air Quality Pollutants
alternative label: Benzo(a)anthracene
scope note: 2011/850/EU
recommended unit: ug.m-2.day-1

Benzo(a)fluorene (air+aerosol)
type: Concept
notation: Benzo(a)fluorene
definition: Benzo(a)fluorene - recommended unit: ng/m3
status: valid
status modified: 2013-09-20
accepted date: 2013-09-20
in scheme: AQD - Air Quality Pollutants
alternative label: Benzo(a)fluorene
scope note: Reciprocal exchange
recommended unit: ng.m-3

Benzo(b)fluoranthene (air+aerosol)
type: Concept
notation: Benzo(b)fluoranthene
definition: Benzo(b)fluoranthene - recommended unit: ng/m3
status: valid
status modified: 2013-09-20
accepted date: 2013-09-20
in scheme: AQD - Air Quality Pollutants
alternative label: Benzo(b)fluoranthene
scope note: Reciprocal exchange
recommended unit: ng.m-3

Benzo(b)fluoranthene (precip)
type: Concept
notation: Benzo(b)fluoranthene
definition: Benzo(b)fluoranthene - recommended unit: ng/l
status: valid
status modified: 2013-09-20
accepted date: 2013-09-20
in scheme: AQD - Air Quality Pollutants
alternative label: Benzo(b)fluoranthene
scope note: Reciprocal exchange
recommended unit: ng.l-1

Benzo(b)fluoranthene (precip+dry_dep)
type: Concept
notation: Benzo(b)fluoranthene
definition: Benzo(b)fluoranthene - recommended unit: µg/m2/day
status: valid
status modified: 2013-09-20
accepted date: 2013-09-20
in scheme: AQD - Air Quality Pollutants
alternative label: Benzo(b)fluoranthene
scope note: 2011/850/EU
recommended unit: ug.m-2.day-1

Benzo(b)fluorene (air+aerosol)
type: Concept
notation: Benzo(b)fluorene
definition: Benzo(b)fluorene - recommended unit: ng/m3
status: valid
status modified: 2013-09-20
accepted date: 2013-09-20
in scheme: AQD - Air Quality Pollutants
alternative label: Benzo(b)fluorene
scope note: Reciprocal exchange
recommended unit: ng.m-3

Fluoride (except HF) (air)
type: Concept
notation: Fluor (except HF)
definition: Fluor (except HF) - recommended unit: µg/m3
status: valid
status modified: 2013-09-20
accepted date: 2013-09-20
in scheme: AQD - Air Quality Pollutants
alternative label: Fluor (except HF)
scope note: Reciprocal exchange
recommended unit: ug.m-3

Benzo(ghi)fluoranthene (air+aerosol)
type: Concept
notation: Benzo(ghi)fluoranthene
definition: Benzo(ghi)fluoranthene - recommended unit: ng/m3
status: valid
status modified: 2013-09-20
accepted date: 2013-09-20
in scheme: AQD - Air Quality Pollutants
alternative label: Benzo(ghi)fluoranthene
scope note: Reciprocal exchange
recommended unit: ng.m-3

Benzo(ghi)fluoranthene (precip)
type: Concept
notation: Benzo(ghi)fluoranthene
definition: Benzo(ghi)fluoranthene - recommended unit: ng/l
status: valid
status modified: 2013-09-20
accepted date: 2013-09-20
in scheme: AQD - Air Quality Pollutants
alternative label: Benzo(ghi)fluoranthene
scope note: Reciprocal exchange
recommended unit: ng.l-1

Benzo(ghi)perylene (air+aerosol)
type: Concept
notation: Benzo(ghi)perylene
definition: Benzo(ghi)perylene - recommended unit: ng/m3
status: valid
status modified: 2013-09-20
accepted date: 2013-09-20
in scheme: AQD - Air Quality Pollutants
alternative label: Benzo(ghi)perylene
scope note: Reciprocal exchange
recommended unit: ng.m-3

Benzo(ghi)perylene (precip)
type: Concept
notation: Benzo(ghi)perylene
definition: Benzo(ghi)perylene - recommended unit: ng/l
status: valid
status modified: 2013-09-20
accepted date: 2013-09-20
in scheme: AQD - Air Quality Pollutants
alternative label: Benzo(ghi)perylene
scope note: Reciprocal exchange
recommended unit: ng.l-1

Benzo(ghi)perylene (precip+dry_dep)
type: Concept
notation: Benzo(ghi)perylene
definition: Benzo(ghi)perylene - recommended unit: µg/m2/day
status: valid
status modified: 2013-09-20
accepted date: 2013-09-20
in scheme: AQD - Air Quality Pollutants
alternative label: Benzo(ghi)perylene
scope note: Reciprocal exchange
recommended unit: ug.m-2.day-1

Benzo(k)fluoranthene (air+aerosol)
type: Concept
notation: Benzo(k)fluoranthene
definition: Benzo(k)fluoranthene - recommended unit: ng/m3
status: valid
status modified: 2013-09-20
accepted date: 2013-09-20
in scheme: AQD - Air Quality Pollutants
alternative label: Benzo(k)fluoranthene
scope note: Reciprocal exchange
recommended unit: ng.m-3

Benzo(k)fluoranthene (precip)
type: Concept
notation: Benzo(k)fluoranthene
definition: Benzo(k)fluoranthene - recommended unit: ng/l
status: valid
status modified: 2013-09-20
accepted date: 2013-09-20
in scheme: AQD - Air Quality Pollutants
alternative label: Benzo(k)fluoranthene
scope note: Reciprocal exchange
recommended unit: ng.l-1

Benzo(k)fluoranthene (precip+dry_dep)
type: Concept
notation: Benzo(k)fluoranthene
definition: Benzo(k)fluoranthene - recommended unit: µg/m2/day
status: valid
status modified: 2013-09-20
accepted date: 2013-09-20
in scheme: AQD - Air Quality Pollutants
alternative label: Benzo(k)fluoranthene
scope note: 2011/850/EU
recommended unit: ug.m-2.day-1

calcium (aerosol)
type: Concept
notation: Ca++
definition: Ca++ - recommended unit: µg/m3
status: valid
status modified: 2013-09-20
accepted date: 2013-09-20
in scheme: AQD - Air Quality Pollutants
alternative label: Ca++
scope note: Reciprocal exchange
recommended unit: ug.m-3

Zinc (aerosol)
type: Concept
notation: Zn
definition: Zn - recommended unit: ng/m3
status: valid
status modified: 2013-09-20
accepted date: 2013-09-20
in scheme: AQD - Air Quality Pollutants
alternative label: Zn
scope note: Reciprocal exchange
recommended unit: ng.m-3

calcium (precip)
type: Concept
notation: Ca++
definition: Ca++ - recommended unit: mg/l
status: valid
status modified: 2013-09-20
accepted date: 2013-09-20
in scheme: AQD - Air Quality Pollutants
alternative label: Ca++
scope note: Reciprocal exchange
recommended unit: mg.l-1

chloride (aerosol)
type: Concept
notation: Cl-
definition: Cl- - recommended unit: µg/m3
status: valid
status modified: 2013-09-20
accepted date: 2013-09-20
in scheme: AQD - Air Quality Pollutants
alternative label: Cl-
scope note: Reciprocal exchange
recommended unit: ug.m-3

chloride (precip)
type: Concept
notation: Cl-
definition: Cl- - recommended unit: mg/l
status: valid
status modified: 2013-09-20
accepted date: 2013-09-20
in scheme: AQD - Air Quality Pollutants
alternative label: Cl-
scope note: Reciprocal exchange
recommended unit: mg.l-1

Dibenz(ac+ah)anthracenes (air+aerosol)
type: Concept
notation: Dibenz(ac+ah)anthracenes
definition: Dibenz(ac+ah)anthracenes - recommended unit: ng/m3
status: valid
status modified: 2013-09-20
accepted date: 2013-09-20
in scheme: AQD - Air Quality Pollutants
alternative label: Dibenz(ac+ah)anthracenes
scope note: Reciprocal exchange
recommended unit: ng.m-3

Dibenz(ac+ah)anthracenes (precip) - PLEASE use .../418
type: Concept
notation: Dibenz(ac+ah)anthracenes
definition: Dibenz(ac+ah)anthracenes - recommended unit: ng/l
status: retired
status modified: 2013-09-20
accepted date: 2013-09-20
not accepted date: 2018-04-05
in scheme: AQD - Air Quality Pollutants
alternative label: Dibenz(ac+ah)anthracenes @bg
scope note: Reciprocal exchange
recommended unit: ng.l-1

Dibenz(ah)anthracene (precip) - please use .../419
type: Concept
notation: Dibenz(ah)anthracene
definition: Dibenz(ah)anthracene - recommended unit: ng/l
status: retired
status modified: 2013-09-20
accepted date: 2013-09-20
in scheme: AQD - Air Quality Pollutants
alternative label: Dibenz(ah)anthracene @bg
scope note: Reciprocal exchange
recommended unit: ng.l-1

Dibenzo(ae)pyrene (air+aerosol)
type: Concept
notation: Dibenzo(ae)pyrene
definition: Dibenzo(ae)pyrene - recommended unit: ng/m3
status: valid
status modified: 2013-09-20
accepted date: 2013-09-20
in scheme: AQD - Air Quality Pollutants
alternative label: Dibenzo(ae)pyrene
scope note: Reciprocal exchange
recommended unit: ng.m-3

Dibenzo(ah)pyrene (air+aerosol)
type: Concept
notation: Dibenzo(ah)pyrene
definition: Dibenzo(ah)pyrene - recommended unit: ng/m3
status: valid
status modified: 2013-09-20
accepted date: 2013-09-20
in scheme: AQD - Air Quality Pollutants
alternative label: Dibenzo(ah)pyrene
scope note: Reciprocal exchange
recommended unit: ng.m-3

Dibenzo(ai)pyrene (air+aerosol)
type: Concept
notation: Dibenzo(ai)pyrene
definition: Dibenzo(ai)pyrene - recommended unit: ng/m3
status: valid
status modified: 2013-09-20
accepted date: 2013-09-20
in scheme: AQD - Air Quality Pollutants
alternative label: Dibenzo(ai)pyrene
scope note: Reciprocal exchange
recommended unit: ng.m-3

Benzo(b,j,k)fluoranthene in PM10 (air+aerosol)
type: Concept
notation: Benzo(b,j,k)fluorantheneInPM1
definition: Benzo(b,j,k)fluorantheneInPM1 - recommended unit: ng/m3
status: valid
status modified: 2013-09-20
accepted date: 2013-09-20
in scheme: AQD - Air Quality Pollutants
alternative label: Benzo(b,j,k)fluorantheneInPM1
scope note: Reciprocal exchange
recommended unit: ng.m-3

Benzo(k+j)fluoranthene in PM10 (air+aerosol)
type: Concept
notation: Benzo(k+j)fluoranthene
definition: Benzo(k+j)fluoranthene in PM10 - recommended unit: ng/m3
status: valid
status modified: 2022-04-22
accepted date: 2022-04-22
in scheme: AQD - Air Quality Pollutants
recommended unit: ng.m-3

Dibenzo(ai)pyrene (precip)
type: Concept
notation: Dibenzo(ai)pyrene
definition: Dibenzo(ai)pyrene - recommended unit: ng/l
status: valid
status modified: 2013-09-20
accepted date: 2013-09-20
in scheme: AQD - Air Quality Pollutants
alternative label: Dibenzo(ai)pyrene
scope note: Reciprocal exchange
recommended unit: ng.l-1

Cobalt (aerosol)
type: Concept
notation: Co
definition: Co - recommended unit: ng/m3
status: valid
status modified: 2013-09-20
accepted date: 2013-09-20
in scheme: AQD - Air Quality Pollutants
alternative label: Co
scope note: Reciprocal exchange
recommended unit: ng.m-3

dieldrin (air+aerosol)
type: Concept
notation: Dieldrin
definition: Dieldrin - recommended unit: pg/m3
status: valid
status modified: 2013-09-20
accepted date: 2013-09-20
in scheme: AQD - Air Quality Pollutants
alternative label: Dieldrin
scope note: Reciprocal exchange
recommended unit: pg.m-3

Volatile PM10
type: Concept
notation: VPM10
definition: The volatile fraction of PM10 - recommended units ug/m3
status: valid
status modified: 2015-08-11
in scheme: AQD - Air Quality Pollutants
recommended unit: ug.m-3

Non-volatile PM10
type: Concept
notation: NVPM10
definition: The non-volatile fraction of a PM10 measurement - recommended units ug/m3
status: valid
status modified: 2015-08-11
in scheme: AQD - Air Quality Pollutants
recommended unit: ug.m-3

dieldrin (precip)
type: Concept
notation: Dieldrin
definition: Dieldrin - recommended unit: ng/l
status: valid
status modified: 2013-09-20
accepted date: 2013-09-20
in scheme: AQD - Air Quality Pollutants
alternative label: Dieldrin
scope note: Reciprocal exchange
recommended unit: ng.l-1

Volatile PM2.5
type: Concept
notation: VPM2.5
definition: The volatile fraction of a PM2.5 measurememt - recommended units ug/m3
status: valid
status modified: 2015-08-11
in scheme: AQD - Air Quality Pollutants
recommended unit: ug.m-3

Non-volatile PM2.5
type: Concept
notation: NVPM2.5
definition: The non-volatile fraction of a PM2.5 measurement - recommended units ug/m3
status: valid
status modified: 2015-08-11
in scheme: AQD - Air Quality Pollutants
recommended unit: ug.m-3

Volatile PM1
type: Concept
notation: VPM1
definition: The volitile fraction of a PM1 measurement - recommended units ug/m3
status: valid
status modified: 2015-08-11
in scheme: AQD - Air Quality Pollutants
recommended unit: ug.m-3

Non-volatile PM1
type: Concept
notation: NVPM1
definition: The non-volatile fraction of a PM1 measurement - recommended units ug/m3
status: valid
status modified: 2015-08-11
in scheme: AQD - Air Quality Pollutants
recommended unit: ug.m-3

fluoranthene (air+aerosol)
type: Concept
notation: Fluoranthene
definition: Fluoranthene - recommended unit: ng/m3
status: valid
status modified: 2013-09-20
accepted date: 2013-09-20
in scheme: AQD - Air Quality Pollutants
alternative label: Fluoranthene
scope note: Reciprocal exchange
recommended unit: ng.m-3

fluoranthene (precip)
type: Concept
notation: Fluoranthene
definition: Fluoranthene - recommended unit: ng/l
status: valid
status modified: 2013-09-20
accepted date: 2013-09-20
in scheme: AQD - Air Quality Pollutants
alternative label: Fluoranthene
scope note: Reciprocal exchange
recommended unit: ng.l-1

fluoranthene (precip+dry_dep)
type: Concept
notation: Fluoranthene
definition: Fluoranthene - recommended unit: µg/m2/day
status: valid
status modified: 2013-09-20
accepted date: 2013-09-20
in scheme: AQD - Air Quality Pollutants
alternative label: Fluoranthene
scope note: Reciprocal exchange
recommended unit: ug.m-2.day-1

acidity(H+) (precip)
type: Concept
notation: H+
definition: H+ - recommended unit: ue H/l
status: valid
status modified: 2013-09-20
accepted date: 2013-09-20
in scheme: AQD - Air Quality Pollutants
alternative label: H+
scope note: Reciprocal exchange
recommended unit: ueH.l-1

HCB (air+aerosol)
type: Concept
notation: HCB
definition: HCB - recommended unit: pg/m3
status: valid
status modified: 2013-09-20
accepted date: 2013-09-20
in scheme: AQD - Air Quality Pollutants
alternative label: HCB
scope note: Reciprocal exchange
recommended unit: pg.m-3

Iron (aerosol)
type: Concept
notation: Fe
definition: Fe - recommended unit: ng/m3
status: valid
status modified: 2013-09-20
accepted date: 2013-09-20
in scheme: AQD - Air Quality Pollutants
alternative label: Fe
scope note: Reciprocal exchange
recommended unit: ng.m-3

HCB (precip)
type: Concept
notation: HCB
definition: HCB - recommended unit: ng/l
status: valid
status modified: 2013-09-20
accepted date: 2013-09-20
in scheme: AQD - Air Quality Pollutants
alternative label: HCB
scope note: Reciprocal exchange
recommended unit: ng.l-1

heptachlor_epoxide (precip)
type: Concept
notation: Heptachlor Epoxide
definition: Heptachlor Epoxide - recommended unit: ng/l
status: valid
status modified: 2013-09-20
accepted date: 2013-09-20
in scheme: AQD - Air Quality Pollutants
alternative label: Heptachlor Epoxide
scope note: Reciprocal exchange
recommended unit: ng.l-1

reactive_mercury (air+aerosol)
type: Concept
notation: Hg-reactive
definition: Hg-reactive - recommended unit: ng/m3
status: valid
status modified: 2013-09-20
accepted date: 2013-09-20
in scheme: AQD - Air Quality Pollutants
alternative label: Hg-reactive
scope note: 2011/850/EU
recommended unit: ng.m-3

indeno_123cd_pyrene (air+aerosol)
type: Concept
notation: Indeno-(1,2,3-cd)pyrene
definition: Indeno-(1,2,3-cd)pyrene - recommended unit: ng/m3
status: valid
status modified: 2013-09-20
accepted date: 2013-09-20
in scheme: AQD - Air Quality Pollutants
alternative label: Indeno-(1,2,3-cd)pyrene
scope note: Reciprocal exchange
recommended unit: ng.m-3

indeno_123cd_pyrene (precip)
type: Concept
notation: Indeno-(1,2,3-cd)pyrene
definition: Indeno-(1,2,3-cd)pyrene - recommended unit: ng/l
status: valid
status modified: 2013-09-20
accepted date: 2013-09-20
in scheme: AQD - Air Quality Pollutants
alternative label: Indeno-(1,2,3-cd)pyrene
scope note: Reciprocal exchange
recommended unit: ng.l-1

indeno_123cd_pyrene (precip+dry_dep)
type: Concept
notation: Indeno-(1,2,3-cd)pyrene
definition: Indeno-(1,2,3-cd)pyrene - recommended unit: µg/m2/day
status: valid
status modified: 2013-09-20
accepted date: 2013-09-20
in scheme: AQD - Air Quality Pollutants
alternative label: Indeno-(1,2,3-cd)pyrene
scope note: 2011/850/EU
recommended unit: ug.m-2.day-1

potassium (aerosol)
type: Concept
notation: K+
definition: K+ - recommended unit: µg/m3
status: valid
status modified: 2013-09-20
accepted date: 2013-09-20
in scheme: AQD - Air Quality Pollutants
alternative label: K+
scope note: Reciprocal exchange
recommended unit: ug.m-3

potassium (precip)
type: Concept
notation: K+
definition: K+ - recommended unit: mg/l
status: valid
status modified: 2013-09-20
accepted date: 2013-09-20
in scheme: AQD - Air Quality Pollutants
alternative label: K+
scope note: Reciprocal exchange
recommended unit: mg.l-1

magnesium (aerosol)
type: Concept
notation: Mg++
definition: Mg++ - recommended unit: µg/m3
status: valid
status modified: 2013-09-20
accepted date: 2013-09-20
in scheme: AQD - Air Quality Pollutants
alternative label: Mg++
scope note: Reciprocal exchange
recommended unit: ug.m-3

Back scattering ()
type: Concept
notation: Back scattering
definition: Back scattering - recommended unit: m-1
status: valid
status modified: 2013-09-20
accepted date: 2013-09-20
in scheme: AQD - Air Quality Pollutants
alternative label: Back scattering
scope note: Reciprocal exchange
recommended unit: m-1

magnesium (precip)
type: Concept
notation: Mg++
definition: Mg++ - recommended unit: mg/l
status: valid
status modified: 2013-09-20
accepted date: 2013-09-20
in scheme: AQD - Air Quality Pollutants
alternative label: Mg++
scope note: Reciprocal exchange
recommended unit: mg.l-1

molybdenum (aerosol)
type: Concept
notation: Mo
definition: Mo - recommended unit: ng/m3
status: valid
status modified: 2013-09-20
accepted date: 2013-09-20
in scheme: AQD - Air Quality Pollutants
alternative label: Mo
scope note: Reciprocal exchange
recommended unit: ng.m-3

ammonium (precip)
type: Concept
notation: NH4+
definition: NH4+ - recommended unit: mg N/l
status: valid
status modified: 2013-09-20
accepted date: 2013-09-20
in scheme: AQD - Air Quality Pollutants
alternative label: NH4+ @bg
scope note: Reciprocal exchange
recommended unit: mgN.l-1

nitrate (precip)
type: Concept
notation: NO3-
definition: NO3- - recommended unit: mg N/l
status: valid
status modified: 2013-09-20
accepted date: 2013-09-20
in scheme: AQD - Air Quality Pollutants
alternative label: NO3- @bg
scope note: Reciprocal exchange
recommended unit: mgN.l-1

Kjeldahl nitrogen (precip)
type: Concept
notation: Kj-N
definition: Kj-N in precipitation - recommended unit: mg N/l
status: valid
status modified: 2020-03-27
in scheme: AQD - Air Quality Pollutants
recommended unit: mgN.l-1

sodium (aerosol)
type: Concept
notation: Na+
definition: Na+ - recommended unit: µg/m3
status: valid
status modified: 2013-09-20
accepted date: 2013-09-20
in scheme: AQD - Air Quality Pollutants
alternative label: Na+
scope note: Reciprocal exchange
recommended unit: ug.m-3

sodium (precip)
type: Concept
notation: Na+
definition: Na+ - recommended unit: mg/l
status: valid
status modified: 2013-09-20
accepted date: 2013-09-20
in scheme: AQD - Air Quality Pollutants
alternative label: Na+
scope note: Reciprocal exchange
recommended unit: mg.l-1

Total nitrate (air+aerosol)
type: Concept
notation: HNO3+NO3
definition: HNO3+NO3 - recommended unit: µg N/m3
status: valid
status modified: 2013-09-20
accepted date: 2013-09-20
in scheme: AQD - Air Quality Pollutants
alternative label: HNO3+NO3
scope note: Reciprocal exchange
recommended unit: ugN.m-3

PCB_101 (air+aerosol)
type: Concept
notation: PCB-101
definition: PCB-101 - recommended unit: pg/m3
status: valid
status modified: 2013-09-20
accepted date: 2013-09-20
in scheme: AQD - Air Quality Pollutants
alternative label: PCB-101
scope note: Reciprocal exchange
recommended unit: pg.m-3

PCB_101 (precip)
type: Concept
notation: PCB-101
definition: PCB-101 - recommended unit: ng/l
status: valid
status modified: 2013-09-20
accepted date: 2013-09-20
in scheme: AQD - Air Quality Pollutants
alternative label: PCB-101
scope note: Reciprocal exchange
recommended unit: ng.l-1

PCB_101 (precip+dry_dep)
type: Concept
notation: PCB-101
definition: PCB-101 - recommended unit: ng/m2/day
status: valid
status modified: 2013-09-20
accepted date: 2013-09-20
in scheme: AQD - Air Quality Pollutants
alternative label: PCB-101
scope note: Reciprocal exchange
recommended unit: ng.m-2.day-1

PCB_114 (air+aerosol)
type: Concept
notation: PCB-114
definition: PCB-114 - recommended unit: pg/m3
status: valid
status modified: 2013-09-20
accepted date: 2013-09-20
in scheme: AQD - Air Quality Pollutants
alternative label: PCB-114
scope note: Reciprocal exchange
recommended unit: pg.m-3

PCB_118 (air+aerosol)
type: Concept
notation: PCB-118
definition: PCB-118 - recommended unit: pg/m3
status: valid
status modified: 2013-09-20
accepted date: 2013-09-20
in scheme: AQD - Air Quality Pollutants
alternative label: PCB-118
scope note: Reciprocal exchange
recommended unit: pg.m-3

PCB_118 (precip)
type: Concept
notation: PCB-118
definition: PCB-118 - recommended unit: ng/l
status: valid
status modified: 2013-09-20
accepted date: 2013-09-20
in scheme: AQD - Air Quality Pollutants
alternative label: PCB-118
scope note: Reciprocal exchange
recommended unit: ng.l-1

PCB_118 (precip+dry_dep)
type: Concept
notation: PCB-118
definition: PCB-118 - recommended unit: ng/m2/day
status: valid
status modified: 2013-09-20
accepted date: 2013-09-20
in scheme: AQD - Air Quality Pollutants
alternative label: PCB-118
scope note: Reciprocal exchange
recommended unit: ng.m-2.day-1

PCB_138 (air+aerosol)
type: Concept
notation: PCB-138
definition: PCB-138 - recommended unit: pg/m3
status: valid
status modified: 2013-09-20
accepted date: 2013-09-20
in scheme: AQD - Air Quality Pollutants
alternative label: PCB-138
scope note: Reciprocal exchange
recommended unit: pg.m-3

PCB_138 (precip+dry_dep)
type: Concept
notation: PCB-138
definition: PCB-138 - recommended unit: ng/m2/day
status: valid
status modified: 2013-09-20
accepted date: 2013-09-20
in scheme: AQD - Air Quality Pollutants
alternative label: PCB-138
scope note: Reciprocal exchange
recommended unit: ng.m-2.day-1

PCB_141 (air+aerosol)
type: Concept
notation: PCB-141
definition: PCB-141 - recommended unit: pg/m3
status: valid
status modified: 2013-09-20
accepted date: 2013-09-20
in scheme: AQD - Air Quality Pollutants
alternative label: PCB-141
scope note: Reciprocal exchange
recommended unit: pg.m-3

Total ammonium (air+aerosol)
type: Concept
notation: NH3+NH4
definition: NH3+NH4 - recommended unit: µg N/m3
status: valid
status modified: 2013-09-20
accepted date: 2013-09-20
in scheme: AQD - Air Quality Pollutants
alternative label: NH3+NH4
scope note: Reciprocal exchange
recommended unit: ugN.m-3

PCB_153 (air+aerosol)
type: Concept
notation: PCB-153
definition: PCB-153 - recommended unit: pg/m3
status: valid
status modified: 2013-09-20
accepted date: 2013-09-20
in scheme: AQD - Air Quality Pollutants
alternative label: PCB-153
scope note: Reciprocal exchange
recommended unit: pg.m-3

PCB_153 (precip)
type: Concept
notation: PCB-153
definition: PCB-153 - recommended unit: ng/l
status: valid
status modified: 2013-09-20
accepted date: 2013-09-20
in scheme: AQD - Air Quality Pollutants
alternative label: PCB-153
scope note: Reciprocal exchange
recommended unit: ng.l-1

PCB_153 (precip+dry_dep)
type: Concept
notation: PCB-153
definition: PCB-153 - recommended unit: ng/m2/day
status: valid
status modified: 2013-09-20
accepted date: 2013-09-20
in scheme: AQD - Air Quality Pollutants
alternative label: PCB-153
scope note: Reciprocal exchange
recommended unit: ng.m-2.day-1

PCB_157 (air+aerosol)
type: Concept
notation: PCB-157
definition: PCB-157 - recommended unit: pg/m3
status: valid
status modified: 2013-09-20
accepted date: 2013-09-20
in scheme: AQD - Air Quality Pollutants
alternative label: PCB-157
scope note: Reciprocal exchange
recommended unit: pg.m-3

PCB_167 (air+aerosol)
type: Concept
notation: PCB-167
definition: PCB-167 - recommended unit: pg/m3
status: valid
status modified: 2013-09-20
accepted date: 2013-09-20
in scheme: AQD - Air Quality Pollutants
alternative label: PCB-167
scope note: Reciprocal exchange
recommended unit: pg.m-3

PCB_170 (air+aerosol)
type: Concept
notation: PCB-170
definition: PCB-170 - recommended unit: pg/m3
status: valid
status modified: 2013-09-20
accepted date: 2013-09-20
in scheme: AQD - Air Quality Pollutants
alternative label: PCB-170
scope note: Reciprocal exchange
recommended unit: pg.m-3

PCB_180 (air+aerosol)
type: Concept
notation: PCB-180
definition: PCB-180 - recommended unit: pg/m3
status: valid
status modified: 2013-09-20
accepted date: 2013-09-20
in scheme: AQD - Air Quality Pollutants
alternative label: PCB-180
scope note: Reciprocal exchange
recommended unit: pg.m-3

PCB_180 (precip)
type: Concept
notation: PCB-180
definition: PCB-180 - recommended unit: ng/l
status: valid
status modified: 2013-09-20
accepted date: 2013-09-20
in scheme: AQD - Air Quality Pollutants
alternative label: PCB-180
scope note: Reciprocal exchange
recommended unit: ng.l-1

PCB_180 (precip+dry_dep)
type: Concept
notation: PCB-180
definition: PCB-180 - recommended unit: ng/m2/day
status: valid
status modified: 2013-09-20
accepted date: 2013-09-20
in scheme: AQD - Air Quality Pollutants
alternative label: PCB-180
scope note: Reciprocal exchange
recommended unit: ng.m-2.day-1

PCB_183 (air+aerosol)
type: Concept
notation: PCB-183
definition: PCB-183 - recommended unit: pg/m3
status: valid
status modified: 2013-09-20
accepted date: 2013-09-20
in scheme: AQD - Air Quality Pollutants
alternative label: PCB-183
scope note: Reciprocal exchange
recommended unit: pg.m-3

Radioactivity ()
type: Concept
notation: Radioactivity
definition: Radioactivity - recommended unit:
status: valid
status modified: 2013-09-20
accepted date: 2013-09-20
in scheme: AQD - Air Quality Pollutants
alternative label: Radioactivity @bg
scope note: Reciprocal exchange

PCB_187 (air+aerosol)
type: Concept
notation: PCB-187
definition: PCB-187 - recommended unit: pg/m3
status: valid
status modified: 2013-09-20
accepted date: 2013-09-20
in scheme: AQD - Air Quality Pollutants
alternative label: PCB-187
scope note: Reciprocal exchange
recommended unit: pg.m-3

PCB_189 (air+aerosol)
type: Concept
notation: PCB-189
definition: PCB-189 - recommended unit: pg/m3
status: valid
status modified: 2013-09-20
accepted date: 2013-09-20
in scheme: AQD - Air Quality Pollutants
alternative label: PCB-189
scope note: Reciprocal exchange
recommended unit: pg.m-3

PCB_194 (air+aerosol)
type: Concept
notation: PCB-194
definition: PCB-194 - recommended unit: pg/m3
status: valid
status modified: 2013-09-20
accepted date: 2013-09-20
in scheme: AQD - Air Quality Pollutants
alternative label: PCB-194
scope note: Reciprocal exchange
recommended unit: pg.m-3

PCB_206 (air+aerosol)
type: Concept
notation: PCB-206
definition: PCB-206 - recommended unit: pg/m3
status: valid
status modified: 2013-09-20
accepted date: 2013-09-20
in scheme: AQD - Air Quality Pollutants
alternative label: PCB-206
scope note: Reciprocal exchange
recommended unit: pg.m-3

PCB_209 (air+aerosol)
type: Concept
notation: PCB-209
definition: PCB-209 - recommended unit: pg/m3
status: valid
status modified: 2013-09-20
accepted date: 2013-09-20
in scheme: AQD - Air Quality Pollutants
alternative label: PCB-209
scope note: Reciprocal exchange
recommended unit: pg.m-3

PCB_28 (air+aerosol)
type: Concept
notation: PCB-28
definition: PCB-28 - recommended unit: pg/m3
status: valid
status modified: 2013-09-20
accepted date: 2013-09-20
in scheme: AQD - Air Quality Pollutants
alternative label: PCB-28
scope note: Reciprocal exchange
recommended unit: pg.m-3

PCB_28 (precip)
type: Concept
notation: PCB-28
definition: PCB-28 - recommended unit: ng/l
status: valid
status modified: 2013-09-20
accepted date: 2013-09-20
in scheme: AQD - Air Quality Pollutants
alternative label: PCB-28
scope note: Reciprocal exchange
recommended unit: ng.l-1

PCB_28 (precip+dry_dep)
type: Concept
notation: PCB-28
definition: PCB-28 - recommended unit: ng/m2/day
status: valid
status modified: 2013-09-20
accepted date: 2013-09-20
in scheme: AQD - Air Quality Pollutants
alternative label: PCB-28
scope note: Reciprocal exchange
recommended unit: ng.m-2.day-1

PCB_33 (air+aerosol)
type: Concept
notation: PCB-33
definition: PCB-33 - recommended unit: pg/m3
status: valid
status modified: 2013-09-20
accepted date: 2013-09-20
in scheme: AQD - Air Quality Pollutants
alternative label: PCB-33
scope note: Reciprocal exchange
recommended unit: pg.m-3

PCB_37 (air+aerosol)
type: Concept
notation: PCB-37
definition: PCB-37 - recommended unit: pg/m3
status: valid
status modified: 2013-09-20
accepted date: 2013-09-20
in scheme: AQD - Air Quality Pollutants
alternative label: PCB-37
scope note: Reciprocal exchange
recommended unit: pg.m-3

Ozone (air)
type: Concept
notation: O3
definition: O3 - recommended unit: µg/m3
status: valid
status modified: 2013-09-20
accepted date: 2013-09-20
in scheme: AQD - Air Quality Pollutants
alternative label: O3 @bg
scope note: 2011/850/EU
recommended unit: ug.m-3
measurement equipment: Teledyne API 400 UV photometric O3 analyser
measurement equipment: Teledyne API 400A UV photometric O3 analyser
measurement equipment: Teledyne API 400E UV photometric O3 analyser
measurement equipment: Teledyne API M400E UV photometric O3 analyser
measurement equipment: Teledyne API T400 UV photometric O3 analyser
measurement equipment: DKK-TOA_Gu-X-113E
measurement equipment: Dasibi 1003-AH Air Water Ozone Concentration PPM Measurement Analyzer Monitor
measurement equipment: Envea O342e - UV Photometric Ozone Analyzer (replaces enviroO342E)
measurement equipment: Environnement S.A. Model 1003-RS O3
measurement equipment: Monitor Labs model 2010 O3 analyser
measurement equipment: Monitor Labs model 8810 O3 analyser
measurement equipment: Monitor Labs model 9810 O3 analyser
measurement equipment: Monitor Labs model 9810A O3 analyser
measurement equipment: Monitor Labs model 9810B O3 analyser
measurement equipment: Monitor Labs model 9811 O3 analyser
measurement equipment: Monitor Labs model 9812 O3 analyser
measurement equipment: SIR S-5014
measurement equipment: Serinus 10 O3
measurement equipment: THERMO49iq
measurement equipment: Aeris AE2010U
measurement equipment: airpointer
measurement equipment: DASIBI 1003 O3 analyser
measurement equipment: DASIBI 1003-PC O3 analyser
measurement equipment: DASIBI 1003-RS O3 analyser
measurement equipment: DASIBI 1008 O3 analyser
measurement equipment: DASIBI 1008-AH O3 analyser
measurement equipment: DASIBI 1008-PC O3 analyser
measurement equipment: DASIBI 1008-RS O3 analyser
measurement equipment: DASIBI 1108 O3 analyser
measurement equipment: Environnement S.A. Model O341M UV Ozone Analyzer
measurement equipment: Environnement S.A. Model O342E UV Ozone Analyzer (superseded by EnveaO342e)
measurement equipment: Environnement S.A. Model O342M UV Ozone Analyze
measurement equipment: Horiba model APOA 300 O3 analyser
measurement equipment: Horiba model APOA 350 O3 analyser
measurement equipment: Horiba model APOA 350E O3 analyser
measurement equipment: Horiba model APOA 360 O3 analyser
measurement equipment: Horiba model APOA 370 O3 analyser
measurement equipment: Opsis AR500 Open path monitor with ER 110
measurement equipment: Opsis AR500 Open path monitor with ER 120
measurement equipment: Opsis AR500 Open path monitor with ER 150
measurement equipment: PHILIPS K50094 API 400
measurement equipment: PHILIPS K50110/00 UV Photometric O3 analyser
measurement equipment: philipsPW9771
measurement equipment: Thermo model 49 O3 analyser
measurement equipment: Thermo model 49c O3 analyser
measurement equipment: Thermo 49 CPS Ozone Primary Standard
measurement equipment: Thermo model 49i O3 analyser
measurement equipment: Thermo model 49w O3 analyser
has protection target: Vegetation
has protection target: Health
mandatory unit: ug.m-3

PCB_47 (air+aerosol)
type: Concept
notation: PCB-47
definition: PCB-47 - recommended unit: pg/m3
status: valid
status modified: 2013-09-20
accepted date: 2013-09-20
in scheme: AQD - Air Quality Pollutants
alternative label: PCB-47
scope note: Reciprocal exchange
recommended unit: pg.m-3

PCB_52 (air+aerosol)
type: Concept
notation: PCB-52
definition: PCB-52 - recommended unit: pg/m3
status: valid
status modified: 2013-09-20
accepted date: 2013-09-20
in scheme: AQD - Air Quality Pollutants
alternative label: PCB-52
scope note: Reciprocal exchange
recommended unit: pg.m-3

Lead (precip+dry_dep)
type: Concept
notation: Pb
definition: Pb - recommended unit: µg/m2/day
status: valid
status modified: 2013-09-20
accepted date: 2013-09-20
in scheme: AQD - Air Quality Pollutants
alternative label: Pb
scope note: 2011/850/EU
recommended unit: ug.m-2.day-1

Mercury (precip+dry_dep)
type: Concept
notation: Hg
definition: Hg - recommended unit: µg/m2/day
status: valid
status modified: 2013-09-20
accepted date: 2013-09-20
in scheme: AQD - Air Quality Pollutants
alternative label: Hg
scope note: 2011/850/EU
recommended unit: ug.m-2.day-1

Cadmium (precip+dry_dep)
type: Concept
notation: Cd
definition: Cd - recommended unit: µg/m2/day
status: valid
status modified: 2013-09-20
accepted date: 2013-09-20
in scheme: AQD - Air Quality Pollutants
alternative label: Cd
scope note: 2011/850/EU
recommended unit: ug.m-2.day-1

Nickel (precip+dry_dep)
type: Concept
notation: Ni
definition: Ni - recommended unit: µg/m2/day
status: valid
status modified: 2013-09-20
accepted date: 2013-09-20
in scheme: AQD - Air Quality Pollutants
alternative label: Ni
scope note: 2011/850/EU
recommended unit: ug.m-2.day-1

Chromium (precip+dry_dep)
type: Concept
notation: Cr
definition: Cr - recommended unit: µg/m2/day
status: valid
status modified: 2016-03-29
in scheme: AQD - Air Quality Pollutants
recommended unit: ug.m-2.day-1

Arsenic (precip+dry_dep)
type: Concept
notation: As
definition: As - recommended unit: µg/m2/day
status: valid
status modified: 2013-09-20
accepted date: 2013-09-20
in scheme: AQD - Air Quality Pollutants
alternative label: As
scope note: 2011/850/EU
recommended unit: ug.m-2.day-1

PCB_52 (precip)
type: Concept
notation: PCB-52
definition: PCB-52 - recommended unit: ng/l
status: valid
status modified: 2013-09-20
accepted date: 2013-09-20
in scheme: AQD - Air Quality Pollutants
alternative label: PCB-52
scope note: Reciprocal exchange
recommended unit: ng.l-1

Benzo(a)pyrene (precip+dry_dep)
type: Concept
notation: BaP
definition: BaP - recommended unit: µg/m2/day
status: valid
status modified: 2013-09-20
accepted date: 2013-09-20
in scheme: AQD - Air Quality Pollutants
alternative label: BaP
scope note: 2011/850/EU
recommended unit: ug.m-2.day-1

PCB_52 (precip+dry_dep)
type: Concept
notation: PCB-52
definition: PCB-52 - recommended unit: ng/m2/day
status: valid
status modified: 2013-09-20
accepted date: 2013-09-20
in scheme: AQD - Air Quality Pollutants
alternative label: PCB-52
scope note: Reciprocal exchange
recommended unit: ng.m-2.day-1

PCB_60 (air+aerosol)
type: Concept
notation: PCB-60
definition: PCB-60 - recommended unit: pg/m3
status: valid
status modified: 2013-09-20
accepted date: 2013-09-20
in scheme: AQD - Air Quality Pollutants
alternative label: PCB-60
scope note: Reciprocal exchange
recommended unit: pg.m-3

PCB_66 (air+aerosol)
type: Concept
notation: PCB-66
definition: PCB-66 - recommended unit: pg/m3
status: valid
status modified: 2013-09-20
accepted date: 2013-09-20
in scheme: AQD - Air Quality Pollutants
alternative label: PCB-66
scope note: Reciprocal exchange
recommended unit: pg.m-3

PCB_74 (air+aerosol)
type: Concept
notation: PCB-74
definition: PCB-74 - recommended unit: pg/m3
status: valid
status modified: 2013-09-20
accepted date: 2013-09-20
in scheme: AQD - Air Quality Pollutants
alternative label: PCB-74
scope note: Reciprocal exchange
recommended unit: pg.m-3

Zinc (precip+dry_dep)
type: Concept
notation: Zn
definition: Zn - recommended unit: µg/m2/day
status: valid
status modified: 2016-03-29
in scheme: AQD - Air Quality Pollutants
recommended unit: ug.m-2.day-1

PCB_99 (air+aerosol)
type: Concept
notation: PCB-99
definition: PCB-99 - recommended unit: pg/m3
status: valid
status modified: 2013-09-20
accepted date: 2013-09-20
in scheme: AQD - Air Quality Pollutants
alternative label: PCB-99
scope note: Reciprocal exchange
recommended unit: pg.m-3

Cooper (precip+dry_dep)
type: Concept
notation: Cu
definition: Cu - recommended unit: µg/m2/day
status: valid
status modified: 2016-03-17
in scheme: AQD - Air Quality Pollutants
recommended unit: ug.m-2.day-1

PCB_122 (air+aerosol)
type: Concept
notation: PCB_122
definition: PCB_122 - recommended unit: pg/m3
status: valid
status modified: 2013-09-20
accepted date: 2013-09-20
in scheme: AQD - Air Quality Pollutants
alternative label: PCB_122
scope note: Reciprocal exchange
recommended unit: pg.m-3

PCB_123 (air+aerosol)
type: Concept
notation: PCB_123
definition: PCB_123 - recommended unit: pg/m3
status: valid
status modified: 2013-09-20
accepted date: 2013-09-20
in scheme: AQD - Air Quality Pollutants
alternative label: PCB_123
scope note: Reciprocal exchange
recommended unit: pg.m-3

Carbon dioxide (air)
type: Concept
notation: CO2
definition: CO2 - recommended unit: ppmv
status: valid
status modified: 2013-09-20
accepted date: 2013-09-20
in scheme: AQD - Air Quality Pollutants
alternative label: CO2
scope note: Reciprocal exchange
recommended unit: ppmv
measurement equipment: Picarro G2301 Gas Concentration Analyzer
measurement equipment: thermo41h

PCB_128 (air+aerosol)
type: Concept
notation: PCB_128
definition: PCB_128 - recommended unit: pg/m3
status: valid
status modified: 2013-09-20
accepted date: 2013-09-20
in scheme: AQD - Air Quality Pollutants
alternative label: PCB_128
scope note: Reciprocal exchange
recommended unit: pg.m-3

PCB_138 (precip)
type: Concept
notation: PCB_138
definition: PCB_138 - recommended unit: ng/l
status: valid
status modified: 2013-09-20
accepted date: 2013-09-20
in scheme: AQD - Air Quality Pollutants
alternative label: PCB_138
scope note: Reciprocal exchange
recommended unit: ng.l-1

phenanthrene (air+aerosol)
type: Concept
notation: Phenanthrene
definition: Phenanthrene - recommended unit: ng/m3
status: valid
status modified: 2013-09-20
accepted date: 2013-09-20
in scheme: AQD - Air Quality Pollutants
alternative label: Phenanthrene
scope note: Reciprocal exchange
recommended unit: ng.m-3

phenanthrene (precip)
type: Concept
notation: Phenanthrene
definition: Phenanthrene - recommended unit: ng/l
status: valid
status modified: 2013-09-20
accepted date: 2013-09-20
in scheme: AQD - Air Quality Pollutants
alternative label: Phenanthrene
scope note: Reciprocal exchange
recommended unit: ng.l-1

phenanthrene (precip+dry_dep)
type: Concept
notation: Phenanthrene
definition: Phenanthrene - recommended unit: µg/m2/day
status: valid
status modified: 2013-09-20
accepted date: 2013-09-20
in scheme: AQD - Air Quality Pollutants
alternative label: Phenanthrene
scope note: Reciprocal exchange
recommended unit: ug.m-2.day-1

pyrene (air+aerosol)
type: Concept
notation: Pyrene
definition: Pyrene - recommended unit: ng/m3
status: valid
status modified: 2013-09-20
accepted date: 2013-09-20
in scheme: AQD - Air Quality Pollutants
alternative label: Pyrene
scope note: Reciprocal exchange
recommended unit: ng.m-3

pyrene (precip)
type: Concept
notation: Pyrene
definition: Pyrene - recommended unit: ng/l
status: valid
status modified: 2013-09-20
accepted date: 2013-09-20
in scheme: AQD - Air Quality Pollutants
alternative label: Pyrene
scope note: Reciprocal exchange
recommended unit: ng.l-1

pyrene (precip+dry_dep)
type: Concept
notation: Pyrene
definition: Pyrene - recommended unit: µg/m2/day
status: valid
status modified: 2013-09-20
accepted date: 2013-09-20
in scheme: AQD - Air Quality Pollutants
alternative label: Pyrene
scope note: Reciprocal exchange
recommended unit: ug.m-2.day-1

sulphate (precip)
type: Concept
notation: SO4--
definition: SO4-- - recommended unit: mg S/l
status: valid
status modified: 2013-09-20
accepted date: 2013-09-20
in scheme: AQD - Air Quality Pollutants
alternative label: SO4-- @bg
scope note: Reciprocal exchange
recommended unit: mgS.l-1

sulphate_corrected (precip)
type: Concept
notation: SO4-- corr
definition: SO4-- corr - recommended unit: mg S/l
status: valid
status modified: 2013-09-20
accepted date: 2013-09-20
in scheme: AQD - Air Quality Pollutants
alternative label: SO4-- corr
scope note: Reciprocal exchange
recommended unit: mgS.m-1

titanium (precip)
type: Concept
notation: TI
definition: TI - recommended unit: µg/l
status: valid
status modified: 2013-09-20
accepted date: 2013-09-20
in scheme: AQD - Air Quality Pollutants
alternative label: TI
scope note: Reciprocal exchange
recommended unit: ug.l-1

vanadium (precip)
type: Concept
notation: Vanadium
definition: Vanadium - recommended unit: µg/l
status: valid
status modified: 2013-09-20
accepted date: 2013-09-20
in scheme: AQD - Air Quality Pollutants
alternative label: Vanadium
scope note: Reciprocal exchange
recommended unit: ug.l-1

alpha_HCH (air+aerosol)
type: Concept
notation: alpha-HCH
definition: alpha-HCH - recommended unit: pg/m3
status: valid
status modified: 2013-09-20
accepted date: 2013-09-20
in scheme: AQD - Air Quality Pollutants
alternative label: alpha-HCH
scope note: Reciprocal exchange
recommended unit: pg.m-3

Copper (aerosol)
type: Concept
notation: Cu
definition: Cu - recommended unit: ng/m3
status: valid
status modified: 2013-09-20
accepted date: 2013-09-20
in scheme: AQD - Air Quality Pollutants
alternative label: Cu
scope note: Reciprocal exchange
recommended unit: ng.m-3

alpha_HCH (precip)
type: Concept
notation: alpha-HCH
definition: alpha-HCH - recommended unit: ng/l
status: valid
status modified: 2013-09-20
accepted date: 2013-09-20
in scheme: AQD - Air Quality Pollutants
alternative label: alpha-HCH
scope note: Reciprocal exchange
recommended unit: ng.l-1

1-Methyl anthracene (precip+dry_dep)
type: Concept
notation: 1-Methyl anthracene
definition: 1-Methyl anthracene - recommended unit: µg/m2/day
status: valid
status modified: 2014-07-31
accepted date: 2014-07-31
in scheme: AQD - Air Quality Pollutants
recommended unit: ug.m-2.day-1

1-Methyl Naphthalene (precip+dry_dep)
type: Concept
notation: 1-Methyl Naphthalene
definition: 1-Methyl Naphthalene - recommended unit: µg/m2/day
status: valid
status modified: 2014-07-31
accepted date: 2014-07-31
in scheme: AQD - Air Quality Pollutants
recommended unit: ug.m-2.day-1

alpha_HCH (precip+dry_dep)
type: Concept
notation: alpha-HCH
definition: alpha-HCH - recommended unit: ng.m-2.day-1
status: valid
status modified: 2013-09-20
accepted date: 2013-09-20
in scheme: AQD - Air Quality Pollutants
alternative label: alpha-HCH @bg
scope note: Reciprocal exchange
recommended unit: ng.m-2.day-1

1-Methyl phenanthrene (precip+dry_dep)
type: Concept
notation: 1-Methyl phenanthrene
definition: 1-Methyl phenanthrene - recommended unit: µg/m2/day
status: valid
status modified: 2014-07-31
accepted date: 2014-07-31
in scheme: AQD - Air Quality Pollutants
recommended unit: ug.m-2.day-1

2-Methyl anthracene (precip+dry_dep)
type: Concept
notation: 2-Methyl anthracene
definition: 2-Methyl anthracene - recommended unit: µg/m2/day
status: valid
status modified: 2014-07-31
accepted date: 2014-07-31
in scheme: AQD - Air Quality Pollutants
recommended unit: ug.m-2.day-1

2-Methyl Naphthalene (precip+dry_dep)
type: Concept
notation: 2-Methyl Naphthalene
definition: 2-Methyl Naphthalene - recommended unit: µg/m2/day
status: valid
status modified: 2014-07-31
accepted date: 2014-07-31
in scheme: AQD - Air Quality Pollutants
recommended unit: ug.m-2.day-1

2-Methyl phenanthrene (precip+dry_dep)
type: Concept
notation: 2-Methyl phenanthrene
definition: 2-Methyl phenanthrene - recommended unit: µg/m2/day
status: valid
status modified: 2014-07-31
accepted date: 2014-07-31
in scheme: AQD - Air Quality Pollutants
recommended unit: ug.m-2.day-1

beta_HCH (air+aerosol)
type: Concept
notation: beta-HCH
definition: beta-HCH - recommended unit: pg/m3
status: valid
status modified: 2013-09-20
accepted date: 2013-09-20
in scheme: AQD - Air Quality Pollutants
alternative label: beta-HCH
scope note: Reciprocal exchange
recommended unit: pg.m-3

beta_HCH (precip)
type: Concept
notation: beta-HCH
definition: beta-HCH - recommended unit: ng/l
status: valid
status modified: 2013-09-20
accepted date: 2013-09-20
in scheme: AQD - Air Quality Pollutants
alternative label: beta-HCH
scope note: Reciprocal exchange
recommended unit: ng.l-1

cis_CD (air+aerosol)
type: Concept
notation: cis-CD
definition: cis-CD - recommended unit: pg/m3
status: valid
status modified: 2013-09-20
accepted date: 2013-09-20
in scheme: AQD - Air Quality Pollutants
alternative label: cis-CD
scope note: Reciprocal exchange
recommended unit: pg.m-3

cis_CD (precip)
type: Concept
notation: cis-CD
definition: cis-CD - recommended unit: ng/l
status: valid
status modified: 2013-09-20
accepted date: 2013-09-20
in scheme: AQD - Air Quality Pollutants
alternative label: cis-CD
scope note: Reciprocal exchange
recommended unit: ng.l-1

Acenaphthene (precip+dry_dep)
type: Concept
notation: Acenaphthene
definition: Acenaphthene - recommended unit: µg/m2/day
status: valid
status modified: 2014-07-31
accepted date: 2014-07-31
in scheme: AQD - Air Quality Pollutants
recommended unit: ug.m-2.day-1

Acenaphthylene (precip+dry_dep)
type: Concept
notation: Acenaphthylene
definition: Acenaphthylene - recommended unit: µg/m2/day
status: valid
status modified: 2014-07-31
accepted date: 2014-07-31
in scheme: AQD - Air Quality Pollutants
recommended unit: ug.m-2.day-1

cis_NO (air+aerosol)
type: Concept
notation: cis-NO
definition: cis-NO - recommended unit: pg/m3
status: valid
status modified: 2013-09-20
accepted date: 2013-09-20
in scheme: AQD - Air Quality Pollutants
alternative label: cis-NO
scope note: Reciprocal exchange
recommended unit: pg.m-3

Anthanthrene (precip+dry_dep)
type: Concept
notation: Anthanthrene
definition: Anthanthrene - recommended unit: µg/m2/day
status: valid
status modified: 2014-07-31
accepted date: 2014-07-31
in scheme: AQD - Air Quality Pollutants
recommended unit: ug.m-2.day-1

lindane (air+aerosol)
type: Concept
notation: gamma-HCH
definition: gamma-HCH - recommended unit: pg/m3
status: valid
status modified: 2013-09-20
accepted date: 2013-09-20
in scheme: AQD - Air Quality Pollutants
alternative label: gamma-HCH
scope note: Reciprocal exchange
recommended unit: pg.m-3

lindane (precip+dry_dep)
type: Concept
notation: gamma-HCH
definition: gamma-HCH - recommended unit: ng.m-2.day-1
status: valid
status modified: 2013-09-20
accepted date: 2013-09-20
in scheme: AQD - Air Quality Pollutants
alternative label: gamma-HCH @bg
scope note: Reciprocal exchange
recommended unit: ng.m-2.day-1

Benzo(b,j,k)fluoranthene (precip+dry_dep)
type: Concept
notation: Benzo(b,j,k)fluoranthene
definition: Benzo(b,j,k)fluoranthene - recommended unit: µg/m2/day
status: valid
status modified: 2013-09-20
accepted date: 2013-09-20
in scheme: AQD - Air Quality Pollutants
alternative label: Benzo(b,j,k)fluoranthene
scope note: Reciprocal exchange
recommended unit: ug.m-2.day-1

Benzo(e)pyrene (precip+dry_dep)
type: Concept
notation: Benzo(e)pyrene
definition: Benzo(e)pyrene - recommended unit: µg/m2/day
status: valid
status modified: 2014-07-31
accepted date: 2014-07-31
in scheme: AQD - Air Quality Pollutants
recommended unit: ug.m-2.day-1

Benzo(k+j)fluoranthene (precip+dry_dep)
type: Concept
notation: Benzo(k+j)fluoranthene
definition: Benzo(k+j)fluoranthene - recommended unit: µg/m2/day
status: valid
status modified: 2022-04-22
accepted date: 2022-04-22
in scheme: AQD - Air Quality Pollutants
recommended unit: ug.m-2.day-1

lindane (precip)
type: Concept
notation: gamma-HCH
definition: gamma-HCH - recommended unit: ng/l
status: valid
status modified: 2013-09-20
accepted date: 2013-09-20
in scheme: AQD - Air Quality Pollutants
alternative label: gamma-HCH
scope note: Reciprocal exchange
recommended unit: ng.l-1

Biphenyl (precip+dry_dep)
type: Concept
notation: Biphenyl
definition: Biphenyl - recommended unit: µg/m2/day
status: valid
status modified: 2014-07-31
accepted date: 2014-07-31
in scheme: AQD - Air Quality Pollutants
recommended unit: ug.m-2.day-1

Chrysene (precip+dry_dep)
type: Concept
notation: Chrysene
definition: Chrysene - recommended unit: µg/m2/day
status: valid
status modified: 2014-07-31
accepted date: 2014-07-31
in scheme: AQD - Air Quality Pollutants
recommended unit: ug.m-2.day-1

chrysene_triphenylene (precip+dry_dep)
type: Concept
notation: Chrysene + Triphenylene
definition: Chrysene + Triphenylene - recommended unit: µg/m2/day
status: valid
status modified: 2013-09-20
accepted date: 2013-09-20
in scheme: AQD - Air Quality Pollutants
alternative label: Chrysene + Triphenylene
scope note: Reciprocal exchange
recommended unit: ug.m-2.day-1

op_DDD (precip)
type: Concept
notation: o,p'-DDD
definition: o,p'-DDD - recommended unit: ng/l
status: valid
status modified: 2013-09-20
accepted date: 2013-09-20
in scheme: AQD - Air Quality Pollutants
alternative label: o,p'-DDD
scope note: Reciprocal exchange
recommended unit: ng.l-1

Coronene (precip+dry_dep)
type: Concept
notation: Coronene
definition: Coronene - recommended unit: µg/m2/day
status: valid
status modified: 2014-07-31
accepted date: 2014-07-31
in scheme: AQD - Air Quality Pollutants
recommended unit: ug.m-2.day-1

Cyclopenta(c,d)pyrene
type: Concept
notation: Cyclopenta(c,d)pyrene
definition: Cyclopenta(c,d)pyrene - recommended unit: µg/m2/day
status: valid
status modified: 2014-07-31
accepted date: 2014-07-31
in scheme: AQD - Air Quality Pollutants
recommended unit: ug.m-2.day-1

Dibenzo(ac+ah)anthracenes (precip+dry_dep)
type: Concept
notation: Dibenzo(ah+ac)anthracene
definition: Dibenzo(ac+ah)anthracenes - recommended unit: µg/m2/day
status: valid
status modified: 2014-07-30
accepted date: 2014-07-30
in scheme: AQD - Air Quality Pollutants
recommended unit: ug.m-2.day-1

Dibenzo(ah)anthracene (precip+dry_dep)
type: Concept
notation: Dibenzo(ah)anthracene
definition: Dibenzo(ah)anthracene - recommended unit: µg/m2/day
status: valid
status modified: 2013-09-20
accepted date: 2013-09-20
in scheme: AQD - Air Quality Pollutants
alternative label: Dibenzo(ah)anthracene
scope note: 2011/850/EU
recommended unit: ug.m-2.day-1

op_DDE (precip)
type: Concept
notation: o,p'-DDE
definition: o,p'-DDE - recommended unit: ng/l
status: valid
status modified: 2013-09-20
accepted date: 2013-09-20
in scheme: AQD - Air Quality Pollutants
alternative label: o,p'-DDE
scope note: Reciprocal exchange
recommended unit: ng.l-1

op_DDT (precip)
type: Concept
notation: o,p'-DDT
definition: o,p'-DDT - recommended unit: ng/l
status: valid
status modified: 2013-09-20
accepted date: 2013-09-20
in scheme: AQD - Air Quality Pollutants
alternative label: o,p'-DDT
scope note: Reciprocal exchange
recommended unit: ng.l-1

Fluorene (precip+dry_dep)
type: Concept
notation: Fluorene
definition: Fluorene - recommended unit: µg/m2/day
status: valid
status modified: 2014-07-31
accepted date: 2014-07-31
in scheme: AQD - Air Quality Pollutants
recommended unit: ug.m-2.day-1

op_DDD (air+aerosol)
type: Concept
notation: o,p'-DDD
definition: o,p'-DDD - recommended unit: pg/m3
status: valid
status modified: 2013-09-20
accepted date: 2013-09-20
in scheme: AQD - Air Quality Pollutants
alternative label: o,p'-DDD
scope note: Reciprocal exchange
recommended unit: pg.m-3

op_DDE (air+aerosol)
type: Concept
notation: o,p'-DDE
definition: o,p'-DDE - recommended unit: pg/m3
status: valid
status modified: 2013-09-20
accepted date: 2013-09-20
in scheme: AQD - Air Quality Pollutants
alternative label: o,p'-DDE
scope note: Reciprocal exchange
recommended unit: pg.m-3

op_DDT (air+aerosol)
type: Concept
notation: o,p'-DDT
definition: o,p'-DDT - recommended unit: pg/m3
status: valid
status modified: 2013-09-20
accepted date: 2013-09-20
in scheme: AQD - Air Quality Pollutants
alternative label: o,p'-DDT
scope note: Reciprocal exchange
recommended unit: pg.m-3

Naphthalene (precip+dry_dep)
type: Concept
notation: Naphthalene
definition: Naphthalene - recommended unit: µg/m2/day
status: valid
status modified: 2014-07-31
accepted date: 2014-07-31
in scheme: AQD - Air Quality Pollutants
recommended unit: ug.m-2.day-1

pp_DDD (precip)
type: Concept
notation: p,p'-DDD
definition: p,p'-DDD - recommended unit: ng/l
status: valid
status modified: 2013-09-20
accepted date: 2013-09-20
in scheme: AQD - Air Quality Pollutants
alternative label: p,p'-DDD
scope note: Reciprocal exchange
recommended unit: ng.l-1

pp_DDE (precip)
type: Concept
notation: p,p'-DDE
definition: p,p'-DDE - recommended unit: ng/l
status: valid
status modified: 2013-09-20
accepted date: 2013-09-20
in scheme: AQD - Air Quality Pollutants
alternative label: p,p'-DDE
scope note: Reciprocal exchange
recommended unit: ng.l-1

Benzo(b,j)fluoranthene (precip+dry_dep)
type: Concept
notation: Benzo(b+j)fluoranthene
definition: Benzo(b,j)fluoranthene - recommended unit: µg/m2/day
status: valid
status modified: 2014-07-30
accepted date: 2014-07-30
in scheme: AQD - Air Quality Pollutants
recommended unit: ug.m-2.day-1

Perylene (precip+dry_dep)
type: Concept
notation: Perylene
definition: Perylene - recommended unit: µg/m2/day
status: valid
status modified: 2014-07-31
accepted date: 2014-07-31
in scheme: AQD - Air Quality Pollutants
recommended unit: ug.m-2.day-1

pp_DDT (precip)
type: Concept
notation: p,p'-DDT
definition: p,p'-DDT - recommended unit: ng/l
status: valid
status modified: 2013-09-20
accepted date: 2013-09-20
in scheme: AQD - Air Quality Pollutants
alternative label: p,p'-DDT
scope note: Reciprocal exchange
recommended unit: ng.l-1

pp_DDD (air+aerosol)
type: Concept
notation: p,p'-DDD
definition: p,p'-DDD - recommended unit: pg/m3
status: valid
status modified: 2013-09-20
accepted date: 2013-09-20
in scheme: AQD - Air Quality Pollutants
alternative label: p,p'-DDD
scope note: Reciprocal exchange
recommended unit: pg.m-3

pp_DDE (air+aerosol)
type: Concept
notation: p,p'-DDE
definition: p,p'-DDE - recommended unit: pg/m3
status: valid
status modified: 2013-09-20
accepted date: 2013-09-20
in scheme: AQD - Air Quality Pollutants
alternative label: p,p'-DDE
scope note: Reciprocal exchange
recommended unit: pg.m-3

pp_DDT (air+aerosol)
type: Concept
notation: p,p'-DDT
definition: p,p'-DDT - recommended unit: pg/m3
status: valid
status modified: 2013-09-20
accepted date: 2013-09-20
in scheme: AQD - Air Quality Pollutants
alternative label: p,p'-DDT
scope note: Reciprocal exchange
recommended unit: pg.m-3

4.5-Methylene phenanthrene (precip+dry_dep)
type: Concept
notation: 4.5-Methylene phenanthrene
definition: 4.5-Methylene phenanthrene - recommended unit: µg/m2/day
status: valid
status modified: 2014-07-31
accepted date: 2014-07-31
in scheme: AQD - Air Quality Pollutants
recommended unit: ug.m-2.day-1

5-Methyl Chrysene (precip+dry_dep)
type: Concept
notation: 5-Methyl Chrysene
definition: 5-Methyl Chrysene - recommended unit: µg/m2/day
status: valid
status modified: 2014-07-31
accepted date: 2014-07-31
in scheme: AQD - Air Quality Pollutants
recommended unit: ug.m-2.day-1

9-Methyl anthracene (precip+dry_dep)
type: Concept
notation: 9-Methyl anthracene
definition: 9-Methyl anthracene - recommended unit: µg/m2/day
status: valid
status modified: 2014-07-31
accepted date: 2014-07-31
in scheme: AQD - Air Quality Pollutants
recommended unit: ug.m-2.day-1

Benzo(b)naphtho(2,1-d)thiophene (precip+dry_dep)
type: Concept
notation: Benzo(b)naphtho(2,1-d)thiophene
definition: Benzo(b)naphtho(2,1-d)thiophene - recommended unit: µg/m2/day
status: valid
status modified: 2014-07-31
accepted date: 2014-07-31
in scheme: AQD - Air Quality Pollutants
recommended unit: ug.m-2.day-1

Benzo(c)phenanthrene (precip+dry_dep)
type: Concept
notation: Benzo(c)phenanthrene
definition: Benzo(c)phenanthrene - recommended unit: µg/m2/day
status: valid
status modified: 2014-07-31
accepted date: 2014-07-31
in scheme: AQD - Air Quality Pollutants
recommended unit: ug.m-2.day-1

Cholanthrene (precip+dry_dep)
type: Concept
notation: Cholanthrene
definition: Cholanthrene - recommended unit: µg/m2/day
status: valid
status modified: 2014-07-31
accepted date: 2014-07-31
in scheme: AQD - Air Quality Pollutants
recommended unit: ug.m-2.day-1

Dibenzo(ac)anthracene (precip+dry_dep)
type: Concept
notation: Dibenzo(ac)anthracene
definition: Dibenzo(ac)anthracene - recommended unit: µg/m2/day
status: valid
status modified: 2014-07-31
accepted date: 2014-07-31
in scheme: AQD - Air Quality Pollutants
recommended unit: ug.m-2.day-1

Dibenzo(al)pyrene (precip+dry_dep)
type: Concept
notation: Dibenzo(al)pyrene
definition: Dibenzo(al)pyrene - recommended unit: µg/m2/day
status: valid
status modified: 2014-07-31
accepted date: 2014-07-31
in scheme: AQD - Air Quality Pollutants
recommended unit: ug.m-2.day-1

precipitation_amount (precip)
type: Concept
notation: precip_amount
definition: precip_amount - recommended unit: mm
status: valid
status modified: 2013-09-20
accepted date: 2013-09-20
in scheme: AQD - Air Quality Pollutants
alternative label: precip_amount
scope note: Reciprocal exchange
recommended unit: mm

precipitation_amount_off (precip)
type: Concept
notation: precip_amount_off
definition: precip_amount_off - recommended unit: mm
status: valid
status modified: 2013-09-20
accepted date: 2013-09-20
in scheme: AQD - Air Quality Pollutants
alternative label: precip_amount_off
scope note: Reciprocal exchange
recommended unit: mm

trans_CD (air+aerosol)
type: Concept
notation: trans-CD
definition: trans-CD - recommended unit: pg/m3
status: valid
status modified: 2013-09-20
accepted date: 2013-09-20
in scheme: AQD - Air Quality Pollutants
alternative label: trans-CD
scope note: Reciprocal exchange
recommended unit: pg.m-3

trans_CD (precip)
type: Concept
notation: trans-CD
definition: trans-CD - recommended unit: ng/l
status: valid
status modified: 2013-09-20
accepted date: 2013-09-20
in scheme: AQD - Air Quality Pollutants
alternative label: trans-CD
scope note: Reciprocal exchange
recommended unit: ng.l-1

trans_NO (air+aerosol)
type: Concept
notation: trans-NO
definition: trans-NO - recommended unit: pg/m3
status: valid
status modified: 2013-09-20
accepted date: 2013-09-20
in scheme: AQD - Air Quality Pollutants
alternative label: trans-NO
scope note: Reciprocal exchange
recommended unit: pg.m-3

trans_NO (precip)
type: Concept
notation: trans_NO
definition: trans_NO - recommended unit: ng/l
status: valid
status modified: 2013-09-20
accepted date: 2013-09-20
in scheme: AQD - Air Quality Pollutants
alternative label: trans_NO
scope note: Reciprocal exchange
recommended unit: ng.l-1

Benzo(j)fluoranthene (precip)
type: Concept
notation: Benzo(j)fluoranthene
definition: Benzo(j)fluoranthene - recommended unit: ng/l
status: valid
status modified: 2013-09-20
accepted date: 2013-09-20
in scheme: AQD - Air Quality Pollutants
alternative label: Benzo(j)fluoranthene
scope note: Reciprocal exchange
recommended unit: ng.l-1

Benzo(j)fluoranthene (precip+dry_dep)
type: Concept
notation: Benzo(j)fluoranthene
definition: Benzo(j)fluoranthene - recommended unit: µg/m2/day
status: valid
status modified: 2013-09-20
accepted date: 2013-09-20
in scheme: AQD - Air Quality Pollutants
alternative label: Benzo(j)fluoranthene
scope note: 2011/850/EU
recommended unit: ug.m-2.day-1

Benzo(j)fluorene (air+aerosol)
type: Concept
notation: Benzo(j)fluorene
definition: Benzo(j)fluorene - recommended unit: ng/m3
status: valid
status modified: 2013-09-20
accepted date: 2013-09-20
in scheme: AQD - Air Quality Pollutants
alternative label: Benzo(j)fluorene
scope note: Reciprocal exchange
recommended unit: ng.m-3

Benzo(j)fluoranthene (air+aerosol)
type: Concept
notation: Benzo(j)fluoranthene
definition: Benzo(j)fluoranthene - recommended unit: ng/m3
status: valid
status modified: 2013-09-20
accepted date: 2013-09-20
in scheme: AQD - Air Quality Pollutants
alternative label: Benzo(j)fluoranthene
scope note: Reciprocal exchange
recommended unit: ng.m-3

Dibenzo(ah)anthracene (air+aerosol)
type: Concept
notation: Dibenzo(ah)anthracene
definition: Dibenzo(ah)anthracene - recommended unit: ng/m3
status: valid
status modified: 2013-09-20
accepted date: 2013-09-20
in scheme: AQD - Air Quality Pollutants
alternative label: Dibenzo(ah)anthracene
scope note: Reciprocal exchange
recommended unit: ng.m-3

Dibenzo(ae)pyrene (precip+dry_dep)
type: Concept
notation: Dibenzo(ae)pyrene
definition: Dibenzo(ae)pyrene - recommended unit: µg/m2/day
status: valid
status modified: 2014-07-31
accepted date: 2014-07-31
in scheme: AQD - Air Quality Pollutants
recommended unit: ug.m-2.day-1

Dibenzo(ah)pyrene (precip+dry_dep)
type: Concept
notation: Dibenzo(ah)pyrene
definition: Dibenzo(ah)pyrene - recommended unit: µg/m2/day
status: valid
status modified: 2014-07-31
accepted date: 2014-07-31
in scheme: AQD - Air Quality Pollutants
recommended unit: ug.m-2.day-1

Dibenzo(ai)pyrene (precip+dry_dep)
type: Concept
notation: Dibenzo(ai)pyrene
definition: Dibenzo(ai)pyrene - recommended unit: µg/m2/day
status: valid
status modified: 2014-07-31
accepted date: 2014-07-31
in scheme: AQD - Air Quality Pollutants
recommended unit: ug.m-2.day-1

Dieldrin (precip+dry_dep)
type: Concept
notation: Dieldrin
definition: Dieldrin - recommended unit: ng.m-2.day-1
status: valid
status modified: 2018-12-13
accepted date: 2018-12-13
in scheme: AQD - Air Quality Pollutants
alternative label: Dieldrin
scope note: Reciprocal exchange
recommended unit: ng.m-2.day-1

Elemental carbon (aerosol)
type: Concept
notation: EC
definition: EC - recommended unit: µg/m3
status: valid
status modified: 2013-09-20
accepted date: 2013-09-20
in scheme: AQD - Air Quality Pollutants
alternative label: EC
scope note: Reciprocal exchange
recommended unit: ug.m-3
measurement equipment: RUPPRECHT & PATASHNICK, SERIES 5400 CARBON MONITOR

Organic carbon (aerosol)
type: Concept
notation: OC
definition: OC - recommended unit: µg/m3
status: valid
status modified: 2013-09-20
accepted date: 2013-09-20
in scheme: AQD - Air Quality Pollutants
alternative label: OC
scope note: Reciprocal exchange
recommended unit: ug.m-3
measurement equipment: RUPPRECHT & PATASHNICK, SERIES 5400 CARBON MONITOR

alpha-Endosulfan (air+aerosol)
type: Concept
notation: alpha-Endosulfan
definition: alpha-Endosulfan - recommended unit: pg.m-3
status: valid
status modified: 2018-12-13
accepted date: 2018-12-13
in scheme: AQD - Air Quality Pollutants
alternative label: alpha-Endosulfan
scope note: Reciprocal exchange
recommended unit: pg.m-3

cis-CD (precip+dry_dep)
type: Concept
notation: cis-CD
definition: cis-CD - recommended unit: ng.m-2.day-1
status: valid
status modified: 2018-12-13
accepted date: 2018-12-13
in scheme: AQD - Air Quality Pollutants
alternative label: cis-CD
scope note: Reciprocal exchange
recommended unit: ng.m-2.day-1

beta-Endosulfan (air+aerosol)
type: Concept
notation: beta-Endosulfan
definition: beta-Endosulfan - recommended unit: pg.m-3
status: valid
status modified: 2018-12-13
accepted date: 2018-12-13
in scheme: AQD - Air Quality Pollutants
alternative label: beta-Endosulfan
scope note: Reciprocal exchange
recommended unit: pg.m-3

Endosulfan sulfate (air+aerosol)
type: Concept
notation: Endosulfan sulfate
definition: Endosulfan sulfate - recommended unit: pg.m-3
status: valid
status modified: 2018-12-13
accepted date: 2018-12-13
in scheme: AQD - Air Quality Pollutants
alternative label: Endosulfan sulfate
scope note: Reciprocal exchange
recommended unit: pg.m-3

p,p'-DDD (precip+dry_dep)
type: Concept
notation: p,p'-DDD
definition: p,p'-DDD - recommended unit: ng.m-2.day-1
status: valid
status modified: 2018-12-13
accepted date: 2018-12-13
in scheme: AQD - Air Quality Pollutants
alternative label: p,p'-DDD
scope note: Reciprocal exchange
recommended unit: ng.m-2.day-1

p,p'-DDE (precip+dry_dep)
type: Concept
notation: p,p'-DDE
definition: p,p'-DDE - recommended unit: ng.m-2.day-1
status: valid
status modified: 2018-12-13
accepted date: 2018-12-13
in scheme: AQD - Air Quality Pollutants
alternative label: p,p'-DDE
scope note: Reciprocal exchange
recommended unit: ng.m-2.day-1

p,p'-DDT (precip+dry_dep)
type: Concept
notation: p,p'-DDT
definition: p,p'-DDT - recommended unit: ng.m-2.day-1
status: valid
status modified: 2018-12-13
accepted date: 2018-12-13
in scheme: AQD - Air Quality Pollutants
alternative label: p,p'-DDT
scope note: Reciprocal exchange
recommended unit: ng.m-2.day-1

trans-CD (precip+dry_dep)
type: Concept
notation: trans-CD
definition: trans-CD - recommended unit: ng.m-2.day-1
status: valid
status modified: 2018-12-13
accepted date: 2018-12-13
in scheme: AQD - Air Quality Pollutants
alternative label: trans-CD
scope note: Reciprocal exchange
recommended unit: ng.m-2.day-1

trans-NO (precip+dry_dep)
type: Concept
notation: trans-NO
definition: trans-NO - recommended unit: ng.m-2.day-1
status: valid
status modified: 2018-12-13
accepted date: 2018-12-13
in scheme: AQD - Air Quality Pollutants
alternative label: trans-NO
scope note: Reciprocal exchange
recommended unit: ng.m-2.day-1

DCMU (air+aerosol)
type: Concept
notation: DCMU
definition: DCMU - recommended unit: pg.m-3
status: valid
status modified: 2018-12-13
accepted date: 2018-12-13
in scheme: AQD - Air Quality Pollutants
alternative label: DCMU
scope note: Reciprocal exchange
recommended unit: pg.m-3

Atrazine (air+aerosol)
type: Concept
notation: Atrazine
definition: Atrazine - recommended unit: pg.m-3
status: valid
status modified: 2018-12-13
accepted date: 2018-12-13
in scheme: AQD - Air Quality Pollutants
alternative label: Atrazine
scope note: Reciprocal exchange
recommended unit: pg.m-3

alpha-Endosulfan (precip+dry_dep)
type: Concept
notation: alpha-Endosulfan
definition: alpha-Endosulfan - recommended unit: ng.m-2.day-1
status: valid
status modified: 2018-12-13
accepted date: 2018-12-13
in scheme: AQD - Air Quality Pollutants
alternative label: alpha-Endosulfan
scope note: Reciprocal exchange
recommended unit: ng.m-2.day-1

beta-Endosulfan (precip+dry_dep)
type: Concept
notation: beta-Endosulfan
definition: beta-Endosulfan - recommended unit: ng.m-2.day-1
status: valid
status modified: 2018-12-13
accepted date: 2018-12-13
in scheme: AQD - Air Quality Pollutants
alternative label: beta-Endosulfan
scope note: Reciprocal exchange
recommended unit: ng.m-2.day-1

Endosulfan sulfate (precip+dry_dep)
type: Concept
notation: Endosulfan sulfate
definition: Endosulfan sulfate - recommended unit: ng.m-2.day-1
status: valid
status modified: 2018-12-13
accepted date: 2018-12-13
in scheme: AQD - Air Quality Pollutants
alternative label: Endosulfan sulfate
scope note: Reciprocal exchange
recommended unit: ng.m-2.day-1

DCMU (precip+dry_dep)
type: Concept
notation: DCMU
definition: DCMU - recommended unit: ng.m-2.day-1
status: valid
status modified: 2018-12-13
accepted date: 2018-12-13
in scheme: AQD - Air Quality Pollutants
alternative label: DCMU
scope note: Reciprocal exchange
recommended unit: ng.m-2.day-1

Atrazine (precip+dry_dep)
type: Concept
notation: Atrazine
definition: Atrazine - recommended unit: ng.m-2.day-1
status: valid
status modified: 2018-12-13
accepted date: 2018-12-13
in scheme: AQD - Air Quality Pollutants
alternative label: Atrazine
scope note: Reciprocal exchange
recommended unit: ng.m-2.day-1

Isoproturon (precip+dry_dep)
type: Concept
notation: Isoproturon
definition: Isoproturon - recommended unit: ng.m-2.day-1
status: valid
status modified: 2018-12-13
accepted date: 2018-12-13
in scheme: AQD - Air Quality Pollutants
alternative label: Isoproturon
scope note: Reciprocal exchange
recommended unit: ng.m-2.day-1

Heptachlor (precip+dry_dep)
type: Concept
notation: Heptachlor
definition: Heptachlor - recommended unit: ng.m-2.day-1
status: valid
status modified: 2018-12-13
accepted date: 2018-12-13
in scheme: AQD - Air Quality Pollutants
alternative label: Heptachlor
scope note: Reciprocal exchange
recommended unit: ng.m-2.day-1

Isoproturon (air+aerosol)
type: Concept
notation: Isoproturon
definition: Isoproturon - recommended unit: pg.m-3
status: valid
status modified: 2018-12-13
accepted date: 2018-12-13
in scheme: AQD - Air Quality Pollutants
alternative label: Isoproturon
scope note: Reciprocal exchange
recommended unit: pg.m-3

Aldrin (precip+dry_dep)
type: Concept
notation: Aldrin
definition: Aldrin - recommended unit: ng.m-2.day-1
status: valid
status modified: 2018-12-13
accepted date: 2018-12-13
in scheme: AQD - Air Quality Pollutants
alternative label: Aldrin
scope note: Reciprocal exchange
recommended unit: ng.m-2.day-1

HCB (precip+dry_dep)
type: Concept
notation: HCB
definition: HCB - recommended unit: ng.m-2.day-1
status: valid
status modified: 2018-12-13
accepted date: 2018-12-13
in scheme: AQD - Air Quality Pollutants
alternative label: HCB
scope note: Reciprocal exchange
recommended unit: ng.m-2.day-1

Heptachlor (air+aerosol)
type: Concept
notation: Heptachlor
definition: Heptachlor - recommended unit: pg.m-3
status: valid
status modified: 2018-12-13
accepted date: 2018-12-13
in scheme: AQD - Air Quality Pollutants
alternative label: Heptachlor
scope note: Reciprocal exchange
recommended unit: pg.m-3

Xylene (air)
type: Concept
notation: C6H4-(CH3)2
definition: C6H4-(CH3)2 - recommended unit: µg/m3
status: valid
status modified: 2013-09-20
accepted date: 2013-09-20
in scheme: AQD - Air Quality Pollutants
alternative label: C6H4-(CH3)2
recommended unit: ug.m-3

Aldrin (air+aerosol)
type: Concept
notation: Aldrin
definition: Aldrin - recommended unit: pg.m-3
status: valid
status modified: 2018-12-13
accepted date: 2018-12-13
in scheme: AQD - Air Quality Pollutants
alternative label: Aldrin
scope note: Reciprocal exchange
recommended unit: pg.m-3

TCDD (precip+dry_dep)
type: Concept
notation: TCDD
definition: TCDD - recommended unit: pg.m-2.day-1
status: valid
status modified: 2018-12-13
accepted date: 2018-12-13
in scheme: AQD - Air Quality Pollutants
alternative label: TCDD
scope note: Reciprocal exchange
recommended unit: pg.m-2.day-1

CDD1N (precip+dry_dep)
type: Concept
notation: CDD1N
definition: CDD1N - recommended unit: pg.m-2.day-1
status: valid
status modified: 2018-12-13
accepted date: 2018-12-13
in scheme: AQD - Air Quality Pollutants
alternative label: CDD1N
scope note: Reciprocal exchange
recommended unit: pg.m-2.day-1

CDD4X (precip+dry_dep)
type: Concept
notation: CDD4X
definition: CDD4X - recommended unit: pg.m-2.day-1
status: valid
status modified: 2018-12-13
accepted date: 2018-12-13
in scheme: AQD - Air Quality Pollutants
alternative label: CDD4X
scope note: Reciprocal exchange
recommended unit: pg.m-2.day-1

CDD6X (precip+dry_dep)
type: Concept
notation: CDD6X
definition: CDD6X - recommended unit: pg.m-2.day-1
status: valid
status modified: 2018-12-13
accepted date: 2018-12-13
in scheme: AQD - Air Quality Pollutants
alternative label: CDD6X
scope note: Reciprocal exchange
recommended unit: pg.m-2.day-1

CDD9X (precip+dry_dep)
type: Concept
notation: CDD9X
definition: CDD9X - recommended unit: pg.m-2.day-1
status: valid
status modified: 2018-12-13
accepted date: 2018-12-13
in scheme: AQD - Air Quality Pollutants
alternative label: CDD9X
scope note: Reciprocal exchange
recommended unit: pg.m-2.day-1

CDD6P (precip+dry_dep)
type: Concept
notation: CDD6P
definition: CDD6P - recommended unit: pg.m-2.day-1
status: valid
status modified: 2018-12-13
accepted date: 2018-12-13
in scheme: AQD - Air Quality Pollutants
alternative label: CDD6P
scope note: Reciprocal exchange
recommended unit: pg.m-2.day-1

CDDO (precip+dry_dep)
type: Concept
notation: CDDO
definition: CDDO - recommended unit: pg.m-2.day-1
status: valid
status modified: 2018-12-13
accepted date: 2018-12-13
in scheme: AQD - Air Quality Pollutants
alternative label: CDDO
scope note: Reciprocal exchange
recommended unit: pg.m-2.day-1

CDF2T (precip+dry_dep)
type: Concept
notation: CDF2T
definition: CDF2T - recommended unit: pg.m-2.day-1
status: valid
status modified: 2018-12-13
accepted date: 2018-12-13
in scheme: AQD - Air Quality Pollutants
alternative label: CDF2T
scope note: Reciprocal exchange
recommended unit: pg.m-2.day-1

CDFDN (precip+dry_dep)
type: Concept
notation: CDFDN
definition: CDFDN - recommended unit: pg.m-2.day-1
status: valid
status modified: 2018-12-13
accepted date: 2018-12-13
in scheme: AQD - Air Quality Pollutants
alternative label: CDFDN
scope note: Reciprocal exchange
recommended unit: pg.m-2.day-1

CDF2N (precip+dry_dep)
type: Concept
notation: CDF2N
definition: CDF2N - recommended unit: pg.m-2.day-1
status: valid
status modified: 2018-12-13
accepted date: 2018-12-13
in scheme: AQD - Air Quality Pollutants
alternative label: CDF2N
scope note: Reciprocal exchange
recommended unit: pg.m-2.day-1

CDFDX (precip+dry_dep)
type: Concept
notation: CDFDX
definition: CDFDX - recommended unit: pg.m-2.day-1
status: valid
status modified: 2018-12-13
accepted date: 2018-12-13
in scheme: AQD - Air Quality Pollutants
alternative label: CDFDX
scope note: Reciprocal exchange
recommended unit: pg.m-2.day-1

CDF6X (precip+dry_dep)
type: Concept
notation: CDF6X
definition: CDF6X - recommended unit: pg.m-2.day-1
status: valid
status modified: 2018-12-13
accepted date: 2018-12-13
in scheme: AQD - Air Quality Pollutants
alternative label: CDF6X
scope note: Reciprocal exchange
recommended unit: pg.m-2.day-1

CDF9X (precip+dry_dep)
type: Concept
notation: CDF9X
definition: CDF9X - recommended unit: pg.m-2.day-1
status: valid
status modified: 2018-12-13
accepted date: 2018-12-13
in scheme: AQD - Air Quality Pollutants
alternative label: CDF9X
scope note: Reciprocal exchange
recommended unit: pg.m-2.day-1

CDF4X (precip+dry_dep)
type: Concept
notation: CDF4X
definition: CDF4X - recommended unit: pg.m-2.day-1
status: valid
status modified: 2018-12-13
accepted date: 2018-12-13
in scheme: AQD - Air Quality Pollutants
alternative label: CDF4X
scope note: Reciprocal exchange
recommended unit: pg.m-2.day-1

CDF6P (precip+dry_dep)
type: Concept
notation: CDF6P
definition: CDF6P - recommended unit: pg.m-2.day-1
status: valid
status modified: 2018-12-13
accepted date: 2018-12-13
in scheme: AQD - Air Quality Pollutants
alternative label: CDF6P
scope note: Reciprocal exchange
recommended unit: pg.m-2.day-1

CDF9P (precip+dry_dep)
type: Concept
notation: CDF9P
definition: CDF9P - recommended unit: pg.m-2.day-1
status: valid
status modified: 2018-12-13
accepted date: 2018-12-13
in scheme: AQD - Air Quality Pollutants
alternative label: CDF9P
scope note: Reciprocal exchange
recommended unit: pg.m-2.day-1

CDFO (precip+dry_dep)
type: Concept
notation: CDFO
definition: CDFO - recommended unit: pg.m-2.day-1
status: valid
status modified: 2018-12-13
accepted date: 2018-12-13
in scheme: AQD - Air Quality Pollutants
alternative label: CDFO
scope note: Reciprocal exchange
recommended unit: pg.m-2.day-1

CDFX1 (precip+dry_dep)
type: Concept
notation: CDFX1
definition: CDFX1 - recommended unit: pg.m-2.day-1
status: valid
status modified: 2018-12-13
accepted date: 2018-12-13
in scheme: AQD - Air Quality Pollutants
alternative label: CDFX1
scope note: Reciprocal exchange
recommended unit: pg.m-2.day-1

CDFP2 (precip+dry_dep)
type: Concept
notation: CDFP2
definition: CDFP2 - recommended unit: pg.m-2.day-1
status: valid
status modified: 2018-12-13
accepted date: 2018-12-13
in scheme: AQD - Air Quality Pollutants
alternative label: CDFP2
scope note: Reciprocal exchange
recommended unit: pg.m-2.day-1

BDE47 (precip+dry_dep)
type: Concept
notation: BDE47
definition: BDE47 - recommended unit: ng.m-2.day-1
status: valid
status modified: 2018-12-13
accepted date: 2018-12-13
in scheme: AQD - Air Quality Pollutants
alternative label: BDE47
scope note: Reciprocal exchange
recommended unit: ng.m-2.day-1

BDE85 (precip+dry_dep)
type: Concept
notation: BDE85
definition: BDE85 - recommended unit: ng.m-2.day-1
status: valid
status modified: 2018-12-13
accepted date: 2018-12-13
in scheme: AQD - Air Quality Pollutants
alternative label: BDE85
scope note: Reciprocal exchange
recommended unit: ng.m-2.day-1

BDE99 (precip+dry_dep)
type: Concept
notation: BDE99
definition: BDE99 - recommended unit: ng.m-2.day-1
status: valid
status modified: 2018-12-13
accepted date: 2018-12-13
in scheme: AQD - Air Quality Pollutants
alternative label: BDE99
scope note: Reciprocal exchange
recommended unit: ng.m-2.day-1

BDE100 (precip+dry_dep)
type: Concept
notation: BDE100
definition: BDE100 - recommended unit: ng.m-2.day-1
status: valid
status modified: 2018-12-13
accepted date: 2018-12-13
in scheme: AQD - Air Quality Pollutants
alternative label: BDE100
scope note: Reciprocal exchange
recommended unit: ng.m-2.day-1

BDE153 (precip+dry_dep)
type: Concept
notation: BDE153
definition: BDE153 - recommended unit: ng.m-2.day-1
status: valid
status modified: 2018-12-13
accepted date: 2018-12-13
in scheme: AQD - Air Quality Pollutants
alternative label: BDE153
scope note: Reciprocal exchange
recommended unit: ng.m-2.day-1

BDE154 (precip+dry_dep)
type: Concept
notation: BDE154
definition: BDE154 - recommended unit: ng.m-2.day-1
status: valid
status modified: 2018-12-13
accepted date: 2018-12-13
in scheme: AQD - Air Quality Pollutants
alternative label: BDE154
scope note: Reciprocal exchange
recommended unit: ng.m-2.day-1

BDE209 (precip+dry_dep)
type: Concept
notation: BDE209
definition: BDE209 - recommended unit: ng.m-2.day-1
status: valid
status modified: 2018-12-13
accepted date: 2018-12-13
in scheme: AQD - Air Quality Pollutants
alternative label: BDE209
scope note: Reciprocal exchange
recommended unit: ng.m-2.day-1

SCCP (precip+dry_dep)
type: Concept
notation: SCCP
definition: SCCP - recommended unit: ng.m-2.day-1
status: valid
status modified: 2018-12-13
accepted date: 2018-12-13
in scheme: AQD - Air Quality Pollutants
alternative label: SCCP
scope note: Reciprocal exchange
recommended unit: ng.m-2.day-1

MCCP (precip+dry_dep)
type: Concept
notation: MCCP
definition: MCCP - recommended unit: ng.m-2.day-1
status: valid
status modified: 2018-12-13
accepted date: 2018-12-13
in scheme: AQD - Air Quality Pollutants
alternative label: MCCP
scope note: Reciprocal exchange
recommended unit: ng.m-2.day-1

HBCD (precip+dry_dep)
type: Concept
notation: HBCD
definition: HBCD - recommended unit: ng.m-2.day-1
status: valid
status modified: 2018-12-13
accepted date: 2018-12-13
in scheme: AQD - Air Quality Pollutants
alternative label: HBCD
scope note: Reciprocal exchange
recommended unit: ng.m-2.day-1

Nitrogen dioxide (air)
type: Concept
notation: NO2
definition: NO2 - recommended unit: µg/m3
status: valid
status modified: 2013-09-20
accepted date: 2013-09-20
in scheme: AQD - Air Quality Pollutants
alternative label: NO2 @bg
scope note: 2011/850/EU
recommended unit: ug.m-3
measurement equipment: Teledyne API 200 chemiluminescent NOx analyser
measurement equipment: Teledyne API 200A chemiluminescent NOx analyser
measurement equipment: TELEDYNE API 200AU
measurement equipment: Teledyne API 200E chemiluminescent NOx analyser
measurement equipment: Teledyne API 200EU chemiluminescent NOx analyser
measurement equipment: Teledyne API 200EU chemiluminescent NOx analyser - blue light
measurement equipment: Teledyne API 200UP chemiluminescent NOx analyser
measurement equipment: Teledyne API M200E chemiluminescent NOx analyser
measurement equipment: Teledyne API T200 chemiluminescent NOx analyser
measurement equipment: Teledyne API T200U chemiluminescent NOx analyser
measurement equipment: Teledyne API T500U CAPS NO2 Analyzer
measurement equipment: Dasibi 2110A
measurement equipment: Eco Physics CLD 700 AL
measurement equipment: Eco Physics CLD 780 TR
measurement equipment: Envea AC32e - NO/NO2/NOx Analyzer (replaces enviroAC32E)
measurement equipment: MELOY_NA530R
measurement equipment: Monitor Labs model 2041 NOx analyser
measurement equipment: Monitor Labs model 8410 NOx analyser
measurement equipment: Monitor Labs model 8440 NOx analyser
measurement equipment: Monitor Labs model 8841 NOx analyser
measurement equipment: Monitor Labs model 8840 NOx analyser
measurement equipment: Monitor Labs model 8941A NOx analyser
measurement equipment: Monitor Labs model 9840 NOx analyser
measurement equipment: Monitor Labs model 9841 NOx analyser
measurement equipment: Monitor Labs model 9841A NOx analyser
measurement equipment: Monitor Labs model 9841B NOx analyser
measurement equipment: Monitor Labs model 9841T NOx analyser
measurement equipment: SIR S-5012
measurement equipment: Thermo 17i
measurement equipment: Aeris AE2041U
measurement equipment: airpointer
measurement equipment: Bendix/Combustion Engineering Model 8101-C Oxides of Nitrogen Analyze
measurement equipment: Columbia Scientific Industries Models 1600
measurement equipment: Columbia Scientific Industries Models 5600
measurement equipment: DASIBI 2108 NOx analyser
measurement equipment: Environnement S.A. Model AC21M NO2 Analyzer
measurement equipment: Environnement S.A. Model AC30M NO2 Analyzer
measurement equipment: Environnement S.A. Model AC31M NO2 Analyzer
measurement equipment: Environnement S.A. Model AC32M NO2 Analyzer
measurement equipment: Environnement S.A. Model AC32E NO2 Analyzer (superseded by EnveaAC32e)
measurement equipment: Environnement S.A. Model AS32M Nitrogen Dioxide Analyzer
measurement equipment: Horiba model APNA 300 NOx analyser
measurement equipment: Horiba model APNA 300E NOx analyser
measurement equipment: Horiba model APNA 350 NOx analyser
measurement equipment: Horiba model APNA 350E NOx analyser
measurement equipment: Horiba model APNA 360 NOx analyser
measurement equipment: Horiba model APNA 360E NOx analyser
measurement equipment: Horiba model APNA 370 NOx analyser
measurement equipment: Opsis AR500 Open path monitor with ER 110
measurement equipment: Opsis AR500 Open path monitor with ER 120
measurement equipment: Opsis AR500 Open path monitor with ER 150
measurement equipment: PHILIPS K50034 API 200A
measurement equipment: PHILIPS K50102 NO
measurement equipment: PHILIPS K50235/00 NO-NOx-NO2 analyser
measurement equipment: PHILIPS PW9762/00 NO/NO2/NOX Analyser
measurement equipment: serinus 40 Nox
measurement equipment: Thermo model 14B chemiluminescence NO-NO2-Nox
measurement equipment: Thermo model 14B/E chemiluminescence NO-NO2-Nox
measurement equipment: Thermo model 42 NO/Nox analyser
measurement equipment: Thermo model 42c NO/Nox analyser
measurement equipment: Thermo model 42C-TL (Trace level Nox)
measurement equipment: Thermo model 42i NO/Nox analyser
measurement equipment: Thermo model 42i NO/NOx analyser - blue light
measurement equipment: Thermo model 42i-TL (Trace level Nox)
measurement equipment: Thermo model 42s NO/Nox analyser
measurement equipment: Thermo model 42w NO/Nox analyser

p-Xylene (air)
type: Concept
notation: p-C6H4(CH3)2
definition: p-C6H4(CH3)2 - recommended unit: µg/m3
status: valid
status modified: 2013-09-20
accepted date: 2013-09-20
in scheme: AQD - Air Quality Pollutants
alternative label: p-C6H4(CH3)2
recommended unit: ug.m-3
measurement equipment: Chromatotec AirTOXIC BTX PID - A73022
measurement equipment: Chromatotec GC866
measurement equipment: SYNTECH SPECTRAS GC 955-601
measurement equipment: SRI8610-C
measurement equipment: Environnement VOC72M

m-Xylene (air)
type: Concept
notation: m-C6H4-(CH3)2
definition: m-C6H4-(CH3)2 - recommended unit: µg/m3
status: valid
status modified: 2013-09-20
accepted date: 2013-09-20
in scheme: AQD - Air Quality Pollutants
alternative label: m-C6H4-(CH3)2
recommended unit: ug.m-3
measurement equipment: Chromatotec AirTOXIC BTX PID - A73022
measurement equipment: Environnement VOC72M

trans-2-Pentene (air)
type: Concept
notation: trans-H3C-HC=CH-CH2-CH3
definition: trans-H3C-HC=CH-CH2-CH3 - recommended unit: µg/m3
status: valid
status modified: 2013-09-20
accepted date: 2013-09-20
in scheme: AQD - Air Quality Pollutants
alternative label: trans-H3C-HC=CH-CH2-CH3
recommended unit: ug.m-3

cis-2-Pentene (air)
type: Concept
notation: cis-H3C-HC=CH-CH2-CH3
definition: cis-H3C-HC=CH-CH2-CH3 - recommended unit: µg/m3
status: valid
status modified: 2013-09-20
accepted date: 2013-09-20
in scheme: AQD - Air Quality Pollutants
alternative label: cis-H3C-HC=CH-CH2-CH3
recommended unit: ug.m-3

Nitrogen oxides (air)
type: Concept
notation: NOX as NO2
definition: NOX as NO2 - recommended unit: µg/m3
status: valid
status modified: 2013-09-20
accepted date: 2013-09-20
in scheme: AQD - Air Quality Pollutants
alternative label: NOX @bg
scope note: 2011/850/EU
recommended unit: ug.m-3
measurement equipment: Teledyne API 200 chemiluminescent NOx analyser
measurement equipment: Teledyne API 200A chemiluminescent NOx analyser
measurement equipment: TELEDYNE API 200AU
measurement equipment: Teledyne API 200E chemiluminescent NOx analyser
measurement equipment: Teledyne API 200EU chemiluminescent NOx analyser
measurement equipment: Teledyne API 200EU chemiluminescent NOx analyser - blue light
measurement equipment: Teledyne API 200UP chemiluminescent NOx analyser
measurement equipment: Teledyne API M200E chemiluminescent NOx analyser
measurement equipment: Teledyne API T200 chemiluminescent NOx analyser
measurement equipment: Teledyne API T200U chemiluminescent NOx analyser
measurement equipment: Teledyne API T500U CAPS NO2 Analyzer
measurement equipment: Dasibi 2110A
measurement equipment: Eco Physics CLD 700 AL
measurement equipment: Eco Physics CLD 780 TR
measurement equipment: Envea AC32e - NO/NO2/NOx Analyzer (replaces enviroAC32E)
measurement equipment: MELOY_NA530R
measurement equipment: Monitor Labs model 2041 NOx analyser
measurement equipment: Monitor Labs model 8410 NOx analyser
measurement equipment: Monitor Labs model 8440 NOx analyser
measurement equipment: Monitor Labs model 8841 NOx analyser
measurement equipment: Monitor Labs model 8840 NOx analyser
measurement equipment: Monitor Labs model 8941A NOx analyser
measurement equipment: Monitor Labs model 9840 NOx analyser
measurement equipment: Monitor Labs model 9841 NOx analyser
measurement equipment: Monitor Labs model 9841A NOx analyser
measurement equipment: Monitor Labs model 9841B NOx analyser
measurement equipment: Monitor Labs model 9841T NOx analyser
measurement equipment: SIR S-5012
measurement equipment: Thermo 17i
measurement equipment: Aeris AE2041U
measurement equipment: airpointer
measurement equipment: Bendix/Combustion Engineering Model 8101-C Oxides of Nitrogen Analyze
measurement equipment: Columbia Scientific Industries Models 1600
measurement equipment: Columbia Scientific Industries Models 5600
measurement equipment: DASIBI 2108 NOx analyser
measurement equipment: Environnement S.A. Model AC21M NO2 Analyzer
measurement equipment: Environnement S.A. Model AC30M NO2 Analyzer
measurement equipment: Environnement S.A. Model AC31M NO2 Analyzer
measurement equipment: Environnement S.A. Model AC32M NO2 Analyzer
measurement equipment: Environnement S.A. Model AC32E NO2 Analyzer (superseded by EnveaAC32e)
measurement equipment: Environnement S.A. Model AS32M Nitrogen Dioxide Analyzer
measurement equipment: Horiba model APNA 300 NOx analyser
measurement equipment: Horiba model APNA 300E NOx analyser
measurement equipment: Horiba model APNA 350 NOx analyser
measurement equipment: Horiba model APNA 350E NOx analyser
measurement equipment: Horiba model APNA 360 NOx analyser
measurement equipment: Horiba model APNA 360E NOx analyser
measurement equipment: Horiba model APNA 370 NOx analyser
measurement equipment: Opsis AR500 Open path monitor with ER 150
measurement equipment: PHILIPS K50034 API 200A
measurement equipment: PHILIPS K50102 NO
measurement equipment: PHILIPS K50235/00 NO-NOx-NO2 analyser
measurement equipment: PHILIPS PW9762/00 NO/NO2/NOX Analyser
measurement equipment: serinus 40 Nox
measurement equipment: Thermo model 14B chemiluminescence NO-NO2-Nox
measurement equipment: Thermo model 14B/E chemiluminescence NO-NO2-Nox
measurement equipment: Thermo model 42 NO/Nox analyser
measurement equipment: Thermo model 42c NO/Nox analyser
measurement equipment: Thermo model 42C-TL (Trace level Nox)
measurement equipment: Thermo model 42i NO/Nox analyser
measurement equipment: Thermo model 42i NO/NOx analyser - blue light
measurement equipment: Thermo model 42i-TL (Trace level Nox)
measurement equipment: Thermo model 42s NO/Nox analyser
measurement equipment: Thermo model 42w NO/Nox analyser
has protection target: Vegetation
mandatory unit: ug.m-3

AQD - Primary Observations Time
type: ConceptScheme
notation: primaryObservation
is part of: Air Quality Directive e-Reporting
registration status: Released
user modified: targajau
date modified: 2017-02-13 14:47:07.0
vocabulary type: Common
is numeric concept identifiers: false
is notations equal identifiers: false

Daily average/mean
type: Concept
notation: day
definition: The daily average or daily mean derived from a sample period of one day.
status: valid
status modified: 2013-03-22
accepted date: 2013-03-22
in scheme: AQD - Primary Observations Time

Data Capture
type: Concept
notation: dc
definition: The data capture associated with a primary observation. This primary observation parameter is the percentage of the time envelope defined by its start and end time for which a sample or observation has been made or taken. It is essential for sampler based measurements where (i) random measurements operate over the time envelope defined, (ii) where samples are frequently not taken for the complete sampling envelope and (ii) for samples bulked for analysis. In these cases time weight concentrations estimates are calculated using the value domain of the "dc" field. For automatic measurements the value will frequently not be stored in local systems as hourly means derived from <75% dc are discarded. At best the dc rate will be known to >=75% (as a valid hourly mean for example). For automatic measurements return -99 or -999 for the value domain of the "dc" field.
status: valid
status modified: 2014-06-09
accepted date: 2014-06-09
in scheme: AQD - Primary Observations Time

Fortnightly average/mean
type: Concept
notation: fortnight
definition: The average or mean derived from a sample over the period of 2-weeks. The duration will be defined by the startTime & endTime components of the data array.
status: valid
status modified: 2013-12-31
accepted date: 2013-12-31
in scheme: AQD - Primary Observations Time

Hourly average/mean
type: Concept
notation: hour
definition: The hourly average or hour mean is the average of all valid minute values for an hour. An hourly average is calculated if at least 45 valid minutes values are available.
status: valid
status modified: 2013-03-22
accepted date: 2013-03-22
in scheme: AQD - Primary Observations Time

Monthly average/mean
type: Concept
notation: month
definition: The monthly average or mean derived from a sample period of one month.
status: valid
status modified: 2013-10-09
accepted date: 2013-10-09
in scheme: AQD - Primary Observations Time

n hourly average/mean
type: Concept
notation: n-hour
definition: The n-hourly average or n-hour mean is the average of all valid minute values for n-hour. An n-hourly average is calculated if at least 75% are available. Note: n must be equal to 2, 3, 4, 6 in order to be able to correctly aggregate the data.
status: valid
status modified: 2017-02-09
in scheme: AQD - Primary Observations Time

Quarterly average/mean
type: Concept
notation: quarter
definition: The average or mean derived from a sample(s) taken over a 3-month period. The duration will be defined by the startTime & endTime components of the data array.
status: valid
status modified: 2013-12-31
accepted date: 2013-12-31
in scheme: AQD - Primary Observations Time

Variable sample
type: Concept
notation: var
definition: The average or mean derived from a sample of variable temporal duration. The duration will be defined by the startTime & endTime components of the data array.
status: valid
status modified: 2013-10-09
accepted date: 2013-10-09
in scheme: AQD - Primary Observations Time

Weekly average/mean
type: Concept
notation: week
definition: The weekly average or mean derived from a sample period of one week.
status: valid
status modified: 2013-10-09
accepted date: 2013-10-09
in scheme: AQD - Primary Observations Time

Yearly average/mean
type: Concept
notation: year
definition: The yearly average or mean derived from a sample period of one year - PRIMARY DATA
status: valid
status modified: 2014-11-10
accepted date: 2014-11-10
in scheme: AQD - Primary Observations Time

AQD - Primary observation range
type: ConceptScheme
notation: primaryObservationRange
is part of: Air Quality Directive e-Reporting
registration status: Public draft
user modified: targajau
date modified: 2020-08-11 12:06:44.0
vocabulary type: Common
is numeric concept identifiers: true
is notations equal identifiers: true
label: AQD - primary Observation Range - Country specific (temporary)
notation: primaryObservationRangeCountry
date modified: 2020-08-11 12:18:35.0

Range for pollutant 1 for day in ug.m-3
type: Concept
notation: 1
status: valid
status modified: 2016-11-17
accepted date: 2016-11-17
in scheme: AQD - Primary observation range
recommended unit: ug.m-3
related pollutant: Sulphur dioxide (air)
primary observation time: Daily average/mean
minimum value: -10
maximum value: 337.5

Range for pollutant 5 for hour in ug.m-3
type: Concept
notation: 10
status: valid
status modified: 2016-11-17
accepted date: 2016-11-17
in scheme: AQD - Primary observation range
recommended unit: ug.m-3
related pollutant: Particulate matter < 10 µm (aerosol)
primary observation time: Hourly average/mean
minimum value: -10
maximum value: 700

Range for pollutant 38 for hour in ug.m-3
type: Concept
notation: 100
status: valid
status modified: 2016-11-17
accepted date: 2016-11-17
in scheme: AQD - Primary observation range
recommended unit: ug.m-3
related pollutant: Nitrogen monoxide (air)
primary observation time: Hourly average/mean
minimum value: -10
maximum value: 900

Range for pollutant 39 for hour in ug.m-3
type: Concept
notation: 101
status: valid
status modified: 2016-11-17
accepted date: 2016-11-17
in scheme: AQD - Primary observation range
recommended unit: ug.m-3
related pollutant: Hydrogen chloride (air)
primary observation time: Hourly average/mean
minimum value: -10
maximum value: 900

Range for pollutant 40 for day in ug.m-3
type: Concept
notation: 102
status: valid
status modified: 2016-11-17
accepted date: 2016-11-17
in scheme: AQD - Primary observation range
recommended unit: ug.m-3
related pollutant: Hydrogen fluoride (air)
primary observation time: Daily average/mean
minimum value: 0
maximum value: 4

Range for pollutant 41 for day in ug.m-3
type: Concept
notation: 103
status: valid
status modified: 2016-11-17
accepted date: 2016-11-17
in scheme: AQD - Primary observation range
recommended unit: ug.m-3
related pollutant: Methane (air)
primary observation time: Daily average/mean
minimum value: -10
maximum value: 2000

Range for pollutant 41 for hour in ug.m-3
type: Concept
notation: 104
status: valid
status modified: 2016-11-17
accepted date: 2016-11-17
in scheme: AQD - Primary observation range
recommended unit: ug.m-3
related pollutant: Methane (air)
primary observation time: Hourly average/mean
minimum value: -10
maximum value: 2400

Range for pollutant 45 for day in ug.m-3
type: Concept
notation: 105
status: valid
status modified: 2016-11-17
accepted date: 2016-11-17
in scheme: AQD - Primary observation range
recommended unit: ug.m-3
related pollutant: Particulate ammonium (aerosol)
primary observation time: Daily average/mean
minimum value: -10
maximum value: 20

Range for pollutant 46 for day in ug.m-3
type: Concept
notation: 106
status: valid
status modified: 2016-11-17
accepted date: 2016-11-17
in scheme: AQD - Primary observation range
recommended unit: ug.m-3
related pollutant: Particulate nitrate (aerosol)
primary observation time: Daily average/mean
minimum value: -10
maximum value: 60

Range for pollutant 47 for day in ug.m-3
type: Concept
notation: 107
status: valid
status modified: 2016-11-17
accepted date: 2016-11-17
in scheme: AQD - Primary observation range
recommended unit: ug.m-3
related pollutant: Particulate sulphate (aerosol)
primary observation time: Daily average/mean
minimum value: -10
maximum value: 30

Range for pollutant 47 for hour in ug.m-3
type: Concept
notation: 108
status: valid
status modified: 2016-11-17
accepted date: 2016-11-17
in scheme: AQD - Primary observation range
recommended unit: ug.m-3
related pollutant: Particulate sulphate (aerosol)
primary observation time: Hourly average/mean
minimum value: -5
maximum value: 30

Range for pollutant 47 for week in ug.m-3
type: Concept
notation: 109
status: valid
status modified: 2016-11-17
accepted date: 2016-11-17
in scheme: AQD - Primary observation range
recommended unit: ug.m-3
related pollutant: Particulate sulphate (aerosol)
primary observation time: Weekly average/mean
minimum value: -10
maximum value: 30

Range for pollutant 5 for var in ug.m-3
type: Concept
notation: 11
status: valid
status modified: 2016-11-17
accepted date: 2016-11-17
in scheme: AQD - Primary observation range
recommended unit: ug.m-3
related pollutant: Particulate matter < 10 µm (aerosol)
primary observation time: Variable sample
minimum value: -10
maximum value: 700

Range for pollutant 48 for day in ng.m-3
type: Concept
notation: 110
status: valid
status modified: 2016-11-17
accepted date: 2016-11-17
in scheme: AQD - Primary observation range
recommended unit: ng.m-3
related pollutant: Selenium (aerosol)
primary observation time: Daily average/mean
minimum value: 0
maximum value: 5

Range for pollutant 49 for day in ng.m-3
type: Concept
notation: 111
status: valid
status modified: 2016-11-17
accepted date: 2016-11-17
in scheme: AQD - Primary observation range
recommended unit: ng.m-3
related pollutant: Vanadium (aerosol)
primary observation time: Daily average/mean
minimum value: 0
maximum value: 10

Range for pollutant 51 for hour in ug.m-3
type: Concept
notation: 112
status: valid
status modified: 2016-11-17
accepted date: 2016-11-17
in scheme: AQD - Primary observation range
recommended unit: ug.m-3
related pollutant: HC C2-C6(excl. AROM. & CHLH) (air+aerosol)
primary observation time: Hourly average/mean
minimum value: 0
maximum value: 200

Range for pollutant 63 for day in ng.m-3
type: Concept
notation: 113
status: valid
status modified: 2016-11-17
accepted date: 2016-11-17
in scheme: AQD - Primary observation range
recommended unit: ng.m-3
related pollutant: Zinc (aerosol)
primary observation time: Daily average/mean
minimum value: -10
maximum value: 500

Range for pollutant 65 for day in ng.m-3
type: Concept
notation: 114
status: valid
status modified: 2016-11-17
accepted date: 2016-11-17
in scheme: AQD - Primary observation range
recommended unit: ng.m-3
related pollutant: Iron (aerosol)
primary observation time: Daily average/mean
minimum value: 0
maximum value: 200

Range for pollutant 67 for day in ugN.m-3
type: Concept
notation: 115
status: valid
status modified: 2016-11-17
accepted date: 2016-11-17
in scheme: AQD - Primary observation range
recommended unit: ugN.m-3
related pollutant: Total nitrate (air+aerosol)
primary observation time: Daily average/mean
minimum value: -10
maximum value: 80

Range for pollutant 67 for var in ugN.m-3
type: Concept
notation: 116
status: valid
status modified: 2016-11-17
accepted date: 2016-11-17
in scheme: AQD - Primary observation range
recommended unit: ugN.m-3
related pollutant: Total nitrate (air+aerosol)
primary observation time: Variable sample
minimum value: -10
maximum value: 80

Range for pollutant 67 for week in ugN.m-3
type: Concept
notation: 117
status: valid
status modified: 2016-11-17
accepted date: 2016-11-17
in scheme: AQD - Primary observation range
recommended unit: ugN.m-3
related pollutant: Total nitrate (air+aerosol)
primary observation time: Weekly average/mean
minimum value: -10
maximum value: 80

Range for pollutant 68 for day in ugN.m-3
type: Concept
notation: 118
status: valid
status modified: 2016-11-17
accepted date: 2016-11-17
in scheme: AQD - Primary observation range
recommended unit: ugN.m-3
related pollutant: Total ammonium (air+aerosol)
primary observation time: Daily average/mean
minimum value: -10
maximum value: 100

Range for pollutant 68 for var in ugN.m-3
type: Concept
notation: 119
status: valid
status modified: 2016-11-17
accepted date: 2016-11-17
in scheme: AQD - Primary observation range
recommended unit: ugN.m-3
related pollutant: Total ammonium (air+aerosol)
primary observation time: Variable sample
minimum value: -10
maximum value: 100

Range for pollutant 5 for week in ug.m-3
type: Concept
notation: 12
status: valid
status modified: 2016-11-17
accepted date: 2016-11-17
in scheme: AQD - Primary observation range
recommended unit: ug.m-3
related pollutant: Particulate matter < 10 µm (aerosol)
primary observation time: Weekly average/mean
minimum value: -10
maximum value: 525

Range for pollutant 68 for week in ugN.m-3
type: Concept
notation: 120
status: valid
status modified: 2016-11-17
accepted date: 2016-11-17
in scheme: AQD - Primary observation range
recommended unit: ugN.m-3
related pollutant: Total ammonium (air+aerosol)
primary observation time: Weekly average/mean
minimum value: -10
maximum value: 100

Range for pollutant 69 for hour in
type: Concept
notation: 121
status: valid
status modified: 2016-11-17
accepted date: 2016-11-17
in scheme: AQD - Primary observation range
related pollutant: Radioactivity ()
primary observation time: Hourly average/mean
minimum value: 0
maximum value: 1000

Range for pollutant 71 for hour in ppmv
type: Concept
notation: 122
status: valid
status modified: 2016-11-17
accepted date: 2016-11-17
in scheme: AQD - Primary observation range
recommended unit: ppmv
related pollutant: Carbon dioxide (air)
primary observation time: Hourly average/mean
minimum value: 0
maximum value: 650

Range for pollutant 73 for day in ng.m-3
type: Concept
notation: 123
status: valid
status modified: 2016-11-17
accepted date: 2016-11-17
in scheme: AQD - Primary observation range
recommended unit: ng.m-3
related pollutant: Copper (aerosol)
primary observation time: Daily average/mean
minimum value: -0.5
maximum value: 8

Range for pollutant 78 for var in ug.m-3
type: Concept
notation: 124
status: valid
status modified: 2016-11-17
accepted date: 2016-11-17
in scheme: AQD - Primary observation range
recommended unit: ug.m-3
related pollutant: Xylene (air)
primary observation time: Variable sample
minimum value: -10
maximum value: 8

Range for pollutant 83 for hour in ug.m-3
type: Concept
notation: 125
status: valid
status modified: 2016-11-17
accepted date: 2016-11-17
in scheme: AQD - Primary observation range
recommended unit: ug.m-3
related pollutant: cis-2-Pentene (air)
primary observation time: Hourly average/mean
minimum value: 0
maximum value: 3

Range for pollutant 316 for day in ug.m-3
type: Concept
notation: 126
status: valid
status modified: 2016-11-17
accepted date: 2016-11-17
in scheme: AQD - Primary observation range
recommended unit: ug.m-3
related pollutant: i-Hexane (2-methylpentane) (air)
primary observation time: Daily average/mean
minimum value: -10
maximum value: 10

Range for pollutant 316 for hour in ug.m-3
type: Concept
notation: 127
status: valid
status modified: 2016-11-17
accepted date: 2016-11-17
in scheme: AQD - Primary observation range
recommended unit: ug.m-3
related pollutant: i-Hexane (2-methylpentane) (air)
primary observation time: Hourly average/mean
minimum value: -1
maximum value: 70

Range for pollutant 316 for month in ug.m-3
type: Concept
notation: 128
status: valid
status modified: 2016-11-17
accepted date: 2016-11-17
in scheme: AQD - Primary observation range
recommended unit: ug.m-3
related pollutant: i-Hexane (2-methylpentane) (air)
primary observation time: Monthly average/mean
minimum value: -10
maximum value: 70

Range for pollutant 316 for year in ug.m-3
type: Concept
notation: 129
status: valid
status modified: 2016-11-17
accepted date: 2016-11-17
in scheme: AQD - Primary observation range
recommended unit: ug.m-3
related pollutant: i-Hexane (2-methylpentane) (air)
primary observation time: Yearly average/mean
minimum value: -10
maximum value: 70

Range for pollutant 6 for day in ug.m-3
type: Concept
notation: 13
status: valid
status modified: 2016-11-17
accepted date: 2016-11-17
in scheme: AQD - Primary observation range
recommended unit: ug.m-3
related pollutant: Black smoke (air)
primary observation time: Daily average/mean
minimum value: -10
maximum value: 525

Range for pollutant 323 for month in pptv
type: Concept
notation: 130
status: valid
status modified: 2016-11-17
accepted date: 2016-11-17
in scheme: AQD - Primary observation range
recommended unit: pptv
related pollutant: N3methylpentane (air)
primary observation time: Monthly average/mean
minimum value: 0
maximum value: 8

Range for pollutant 351 for day in ng.m-3
type: Concept
notation: 131
status: valid
status modified: 2016-11-17
accepted date: 2016-11-17
in scheme: AQD - Primary observation range
recommended unit: ng.m-3
related pollutant: acenaphthene (air+aerosol)
primary observation time: Daily average/mean
minimum value: 0
maximum value: 2

Range for pollutant 351 for var in ng.m-3
type: Concept
notation: 132
status: valid
status modified: 2016-11-17
accepted date: 2016-11-17
in scheme: AQD - Primary observation range
recommended unit: ng.m-3
related pollutant: acenaphthene (air+aerosol)
primary observation time: Variable sample
minimum value: 0
maximum value: 2

Range for pollutant 351 for year in ng.m-3
type: Concept
notation: 133
status: valid
status modified: 2016-11-17
accepted date: 2016-11-17
in scheme: AQD - Primary observation range
recommended unit: ng.m-3
related pollutant: acenaphthene (air+aerosol)
primary observation time: Yearly average/mean
minimum value: 0
maximum value: 2

Range for pollutant 352 for day in ng.m-3
type: Concept
notation: 134
status: valid
status modified: 2016-11-17
accepted date: 2016-11-17
in scheme: AQD - Primary observation range
recommended unit: ng.m-3
related pollutant: acenaphtylene (air+aerosol)
primary observation time: Daily average/mean
minimum value: 0
maximum value: 2

Range for pollutant 380 for var in ng.m-3
type: Concept
notation: 135
status: valid
status modified: 2016-11-17
accepted date: 2016-11-17
in scheme: AQD - Primary observation range
recommended unit: ng.m-3
related pollutant: Benzo(b+j+k)fluoranthenes (air+aerosol)
primary observation time: Variable sample
minimum value: 0
maximum value: 3

Range for pollutant 381 for day in ng.m-3
type: Concept
notation: 136
status: valid
status modified: 2016-11-17
accepted date: 2016-11-17
in scheme: AQD - Primary observation range
recommended unit: ng.m-3
related pollutant: Benzo(e)pyrene (air+aerosol)
primary observation time: Daily average/mean
minimum value: -0.5
maximum value: 3

Range for pollutant 391 for day in ug.m-3
type: Concept
notation: 137
status: valid
status modified: 2016-11-17
accepted date: 2016-11-17
in scheme: AQD - Primary observation range
recommended unit: ug.m-3
related pollutant: black_carbon (aerosol)
primary observation time: Daily average/mean
minimum value: 0
maximum value: 10

Range for pollutant 394 for day in ug.m-3
type: Concept
notation: 138
status: valid
status modified: 2016-11-17
accepted date: 2016-11-17
in scheme: AQD - Primary observation range
recommended unit: ug.m-3
related pollutant: n-Butane (air)
primary observation time: Daily average/mean
minimum value: -10
maximum value: 150

Range for pollutant 394 for hour in ug.m-3
type: Concept
notation: 139
status: valid
status modified: 2016-11-17
accepted date: 2016-11-17
in scheme: AQD - Primary observation range
recommended unit: ug.m-3
related pollutant: n-Butane (air)
primary observation time: Hourly average/mean
minimum value: -10
maximum value: 200

Range for pollutant 6 for hour in ug.m-3
type: Concept
notation: 14
status: valid
status modified: 2016-11-17
accepted date: 2016-11-17
in scheme: AQD - Primary observation range
recommended unit: ug.m-3
related pollutant: Black smoke (air)
primary observation time: Hourly average/mean
minimum value: -10
maximum value: 650

Range for pollutant 394 for month in ug.m-3
type: Concept
notation: 140
status: valid
status modified: 2016-11-17
accepted date: 2016-11-17
in scheme: AQD - Primary observation range
recommended unit: ug.m-3
related pollutant: n-Butane (air)
primary observation time: Monthly average/mean
minimum value: -10
maximum value: 200

Range for pollutant 394 for year in ug.m-3
type: Concept
notation: 141
status: valid
status modified: 2016-11-17
accepted date: 2016-11-17
in scheme: AQD - Primary observation range
recommended unit: ug.m-3
related pollutant: n-Butane (air)
primary observation time: Yearly average/mean
minimum value: -10
maximum value: 200

Range for pollutant 412 for day in uS.cm-1
type: Concept
notation: 142
status: valid
status modified: 2016-11-17
accepted date: 2016-11-17
in scheme: AQD - Primary observation range
recommended unit: uS.cm-1
related pollutant: conductivity (precip)
primary observation time: Daily average/mean
minimum value: -10
maximum value: 200

Range for pollutant 416 for hour in pptv
type: Concept
notation: 143
status: valid
status modified: 2016-11-17
accepted date: 2016-11-17
in scheme: AQD - Primary observation range
recommended unit: pptv
related pollutant: cyclohexane (air)
primary observation time: Hourly average/mean
minimum value: -10
maximum value: 3

Range for pollutant 419 for var in ng.l-1
type: Concept
notation: 144
status: valid
status modified: 2016-11-17
accepted date: 2016-11-17
in scheme: AQD - Primary observation range
recommended unit: ng.l-1
related pollutant: Dibenzo(ah)anthracene (precip)
primary observation time: Variable sample
minimum value: 0
maximum value: 0.5

Range for pollutant 425 for hour in ppbv
type: Concept
notation: 145
status: valid
status modified: 2016-11-17
accepted date: 2016-11-17
in scheme: AQD - Primary observation range
recommended unit: ppbv
related pollutant: dinitrogenoxide (air)
primary observation time: Hourly average/mean
minimum value: 0
maximum value: 350

Range for pollutant 428 for day in ug.m-3
type: Concept
notation: 146
status: valid
status modified: 2016-11-17
accepted date: 2016-11-17
in scheme: AQD - Primary observation range
recommended unit: ug.m-3
related pollutant: Ethane (air)
primary observation time: Daily average/mean
minimum value: -10
maximum value: 100

Range for pollutant 428 for hour in ug.m-3
type: Concept
notation: 147
status: valid
status modified: 2016-11-17
accepted date: 2016-11-17
in scheme: AQD - Primary observation range
recommended unit: ug.m-3
related pollutant: Ethane (air)
primary observation time: Hourly average/mean
minimum value: -10
maximum value: 100

Range for pollutant 428 for month in ug.m-3
type: Concept
notation: 148
status: valid
status modified: 2016-11-17
accepted date: 2016-11-17
in scheme: AQD - Primary observation range
recommended unit: ug.m-3
related pollutant: Ethane (air)
primary observation time: Monthly average/mean
minimum value: -10
maximum value: 100

Range for pollutant 428 for year in ug.m-3
type: Concept
notation: 149
status: valid
status modified: 2016-11-17
accepted date: 2016-11-17
in scheme: AQD - Primary observation range
recommended unit: ug.m-3
related pollutant: Ethane (air)
primary observation time: Yearly average/mean
minimum value: -10
maximum value: 100

Range for pollutant 7 for day in ug.m-3
type: Concept
notation: 15
status: valid
status modified: 2016-11-17
accepted date: 2016-11-17
in scheme: AQD - Primary observation range
recommended unit: ug.m-3
related pollutant: Ozone (air)
primary observation time: Daily average/mean
minimum value: -10
maximum value: 300

Range for pollutant 430 for day in ug.m-3
type: Concept
notation: 150
status: valid
status modified: 2016-11-17
accepted date: 2016-11-17
in scheme: AQD - Primary observation range
recommended unit: ug.m-3
related pollutant: Ethene (Ethylene) (air)
primary observation time: Daily average/mean
minimum value: -10
maximum value: 4000

Range for pollutant 430 for hour in ug.m-3
type: Concept
notation: 151
status: valid
status modified: 2016-11-17
accepted date: 2016-11-17
in scheme: AQD - Primary observation range
recommended unit: ug.m-3
related pollutant: Ethene (Ethylene) (air)
primary observation time: Hourly average/mean
minimum value: -10
maximum value: 6000

Range for pollutant 431 for day in ug.m-3
type: Concept
notation: 152
status: valid
status modified: 2016-11-17
accepted date: 2016-11-17
in scheme: AQD - Primary observation range
recommended unit: ug.m-3
related pollutant: Ethyl benzene (air)
primary observation time: Daily average/mean
minimum value: -10
maximum value: 3

Range for pollutant 431 for hour in ug.m-3
type: Concept
notation: 153
status: valid
status modified: 2016-11-17
accepted date: 2016-11-17
in scheme: AQD - Primary observation range
recommended unit: ug.m-3
related pollutant: Ethyl benzene (air)
primary observation time: Hourly average/mean
minimum value: -10
maximum value: 30

Range for pollutant 431 for month in ug.m-3
type: Concept
notation: 154
status: valid
status modified: 2016-11-17
accepted date: 2016-11-17
in scheme: AQD - Primary observation range
recommended unit: ug.m-3
related pollutant: Ethyl benzene (air)
primary observation time: Monthly average/mean
minimum value: -10
maximum value: 3

Range for pollutant 431 for var in ug.m-3
type: Concept
notation: 155
status: valid
status modified: 2016-11-17
accepted date: 2016-11-17
in scheme: AQD - Primary observation range
recommended unit: ug.m-3
related pollutant: Ethyl benzene (air)
primary observation time: Variable sample
minimum value: -10
maximum value: 3

Range for pollutant 431 for week in ug.m-3
type: Concept
notation: 156
status: valid
status modified: 2016-11-17
accepted date: 2016-11-17
in scheme: AQD - Primary observation range
recommended unit: ug.m-3
related pollutant: Ethyl benzene (air)
primary observation time: Weekly average/mean
minimum value: -10
maximum value: 3

Range for pollutant 431 for year in ug.m-3
type: Concept
notation: 157
status: valid
status modified: 2016-11-17
accepted date: 2016-11-17
in scheme: AQD - Primary observation range
recommended unit: ug.m-3
related pollutant: Ethyl benzene (air)
primary observation time: Yearly average/mean
minimum value: 0
maximum value: 3

Range for pollutant 432 for day in ug.m-3
type: Concept
notation: 158
status: valid
status modified: 2016-11-17
accepted date: 2016-11-17
in scheme: AQD - Primary observation range
recommended unit: ug.m-3
related pollutant: Ethyne (Acetylene) (air)
primary observation time: Daily average/mean
minimum value: -10
maximum value: 80

Range for pollutant 432 for hour in ug.m-3
type: Concept
notation: 159
status: valid
status modified: 2016-11-17
accepted date: 2016-11-17
in scheme: AQD - Primary observation range
recommended unit: ug.m-3
related pollutant: Ethyne (Acetylene) (air)
primary observation time: Hourly average/mean
minimum value: -10
maximum value: 100

Range for pollutant 7 for hour in ug.m-3
type: Concept
notation: 16
status: valid
status modified: 2016-11-17
accepted date: 2016-11-17
in scheme: AQD - Primary observation range
recommended unit: ug.m-3
related pollutant: Ozone (air)
primary observation time: Hourly average/mean
minimum value: -10
maximum value: 400

Range for pollutant 432 for month in ug.m-3
type: Concept
notation: 160
status: valid
status modified: 2016-11-17
accepted date: 2016-11-17
in scheme: AQD - Primary observation range
recommended unit: ug.m-3
related pollutant: Ethyne (Acetylene) (air)
primary observation time: Monthly average/mean
minimum value: -10
maximum value: 100

Range for pollutant 432 for year in ug.m-3
type: Concept
notation: 161
status: valid
status modified: 2016-11-17
accepted date: 2016-11-17
in scheme: AQD - Primary observation range
recommended unit: ug.m-3
related pollutant: Ethyne (Acetylene) (air)
primary observation time: Yearly average/mean
minimum value: -10
maximum value: 100

Range for pollutant 435 for day in ng.m-3
type: Concept
notation: 162
status: valid
status modified: 2016-11-17
accepted date: 2016-11-17
in scheme: AQD - Primary observation range
recommended unit: ng.m-3
related pollutant: fluorene (air+aerosol)
primary observation time: Daily average/mean
minimum value: 0
maximum value: 7

Range for pollutant 435 for var in ng.m-3
type: Concept
notation: 163
status: valid
status modified: 2016-11-17
accepted date: 2016-11-17
in scheme: AQD - Primary observation range
recommended unit: ng.m-3
related pollutant: fluorene (air+aerosol)
primary observation time: Variable sample
minimum value: 0
maximum value: 7

Range for pollutant 435 for year in ng.m-3
type: Concept
notation: 164
status: valid
status modified: 2016-11-17
accepted date: 2016-11-17
in scheme: AQD - Primary observation range
recommended unit: ng.m-3
related pollutant: fluorene (air+aerosol)
primary observation time: Yearly average/mean
minimum value: 0
maximum value: 7

Range for pollutant 441 for day in ug.m-3
type: Concept
notation: 165
status: valid
status modified: 2016-11-17
accepted date: 2016-11-17
in scheme: AQD - Primary observation range
recommended unit: ug.m-3
related pollutant: n-Heptane (air)
primary observation time: Daily average/mean
minimum value: -10
maximum value: 3

Range for pollutant 441 for hour in ug.m-3
type: Concept
notation: 166
status: valid
status modified: 2016-11-17
accepted date: 2016-11-17
in scheme: AQD - Primary observation range
recommended unit: ug.m-3
related pollutant: n-Heptane (air)
primary observation time: Hourly average/mean
minimum value: -10
maximum value: 3

Range for pollutant 441 for month in ug.m-3
type: Concept
notation: 167
status: valid
status modified: 2016-11-17
accepted date: 2016-11-17
in scheme: AQD - Primary observation range
recommended unit: ug.m-3
related pollutant: n-Heptane (air)
primary observation time: Monthly average/mean
minimum value: -10
maximum value: 3

Range for pollutant 441 for var in ug.m-3
type: Concept
notation: 168
status: valid
status modified: 2016-11-17
accepted date: 2016-11-17
in scheme: AQD - Primary observation range
recommended unit: ug.m-3
related pollutant: n-Heptane (air)
primary observation time: Variable sample
minimum value: -10
maximum value: 3

Range for pollutant 441 for week in ug.m-3
type: Concept
notation: 169
status: valid
status modified: 2016-11-17
accepted date: 2016-11-17
in scheme: AQD - Primary observation range
recommended unit: ug.m-3
related pollutant: n-Heptane (air)
primary observation time: Weekly average/mean
minimum value: -10
maximum value: 3

Range for pollutant 8 for day in ug.m-3
type: Concept
notation: 17
status: valid
status modified: 2016-11-17
accepted date: 2016-11-17
in scheme: AQD - Primary observation range
recommended unit: ug.m-3
related pollutant: Nitrogen dioxide (air)
primary observation time: Daily average/mean
minimum value: -10
maximum value: 337.5

Range for pollutant 443 for day in ug.m-3
type: Concept
notation: 170
status: valid
status modified: 2016-11-17
accepted date: 2016-11-17
in scheme: AQD - Primary observation range
recommended unit: ug.m-3
related pollutant: n-Hexane (air)
primary observation time: Daily average/mean
minimum value: -10
maximum value: 3

Range for pollutant 443 for hour in ug.m-3
type: Concept
notation: 171
status: valid
status modified: 2016-11-17
accepted date: 2016-11-17
in scheme: AQD - Primary observation range
recommended unit: ug.m-3
related pollutant: n-Hexane (air)
primary observation time: Hourly average/mean
minimum value: -10
maximum value: 3

Range for pollutant 443 for month in ug.m-3
type: Concept
notation: 172
status: valid
status modified: 2016-11-17
accepted date: 2016-11-17
in scheme: AQD - Primary observation range
recommended unit: ug.m-3
related pollutant: n-Hexane (air)
primary observation time: Monthly average/mean
minimum value: -10
maximum value: 3

Range for pollutant 443 for var in ug.m-3
type: Concept
notation: 173
status: valid
status modified: 2016-11-17
accepted date: 2016-11-17
in scheme: AQD - Primary observation range
recommended unit: ug.m-3
related pollutant: n-Hexane (air)
primary observation time: Variable sample
minimum value: -10
maximum value: 3

Range for pollutant 443 for week in ug.m-3
type: Concept
notation: 174
status: valid
status modified: 2016-11-17
accepted date: 2016-11-17
in scheme: AQD - Primary observation range
recommended unit: ug.m-3
related pollutant: n-Hexane (air)
primary observation time: Weekly average/mean
minimum value: -10
maximum value: 3

Range for pollutant 443 for year in ug.m-3
type: Concept
notation: 175
status: valid
status modified: 2016-11-17
accepted date: 2016-11-17
in scheme: AQD - Primary observation range
recommended unit: ug.m-3
related pollutant: n-Hexane (air)
primary observation time: Yearly average/mean
minimum value: -10
maximum value: 3

Range for pollutant 447 for day in ug.m-3
type: Concept
notation: 176
status: valid
status modified: 2016-11-17
accepted date: 2016-11-17
in scheme: AQD - Primary observation range
recommended unit: ug.m-3
related pollutant: i-Butane (2-methylpropane) (air)
primary observation time: Daily average/mean
minimum value: -10
maximum value: 80

Range for pollutant 447 for hour in ug.m-3
type: Concept
notation: 177
status: valid
status modified: 2016-11-17
accepted date: 2016-11-17
in scheme: AQD - Primary observation range
recommended unit: ug.m-3
related pollutant: i-Butane (2-methylpropane) (air)
primary observation time: Hourly average/mean
minimum value: -10
maximum value: 100

Range for pollutant 447 for year in ug.m-3
type: Concept
notation: 178
status: valid
status modified: 2016-11-17
accepted date: 2016-11-17
in scheme: AQD - Primary observation range
recommended unit: ug.m-3
related pollutant: i-Butane (2-methylpropane) (air)
primary observation time: Yearly average/mean
minimum value: -10
maximum value: 100

Range for pollutant 449 for day in ug.m-3
type: Concept
notation: 179
status: valid
status modified: 2016-11-17
accepted date: 2016-11-17
in scheme: AQD - Primary observation range
recommended unit: ug.m-3
related pollutant: i-Octane (2,2,4-trimethylpentane) (air)
primary observation time: Daily average/mean
minimum value: -10
maximum value: 3

Range for pollutant 8 for hour in ug.m-3
type: Concept
notation: 18
status: valid
status modified: 2016-11-17
accepted date: 2016-11-17
in scheme: AQD - Primary observation range
recommended unit: ug.m-3
related pollutant: Nitrogen dioxide (air)
primary observation time: Hourly average/mean
minimum value: -10
maximum value: 450

Range for pollutant 449 for hour in ug.m-3
type: Concept
notation: 180
status: valid
status modified: 2016-11-17
accepted date: 2016-11-17
in scheme: AQD - Primary observation range
recommended unit: ug.m-3
related pollutant: i-Octane (2,2,4-trimethylpentane) (air)
primary observation time: Hourly average/mean
minimum value: -10
maximum value: 10

Range for pollutant 449 for var in ug.m-3
type: Concept
notation: 181
status: valid
status modified: 2016-11-17
accepted date: 2016-11-17
in scheme: AQD - Primary observation range
recommended unit: ug.m-3
related pollutant: i-Octane (2,2,4-trimethylpentane) (air)
primary observation time: Variable sample
minimum value: -10
maximum value: 10

Range for pollutant 449 for week in ug.m-3
type: Concept
notation: 182
status: valid
status modified: 2016-11-17
accepted date: 2016-11-17
in scheme: AQD - Primary observation range
recommended unit: ug.m-3
related pollutant: i-Octane (2,2,4-trimethylpentane) (air)
primary observation time: Weekly average/mean
minimum value: 0
maximum value: 3

Range for pollutant 450 for day in ug.m-3
type: Concept
notation: 183
status: valid
status modified: 2016-11-17
accepted date: 2016-11-17
in scheme: AQD - Primary observation range
recommended unit: ug.m-3
related pollutant: i-Pentane (2-methylbutane) (air)
primary observation time: Daily average/mean
minimum value: -10
maximum value: 30

Range for pollutant 450 for hour in ug.m-3
type: Concept
notation: 184
status: valid
status modified: 2016-11-17
accepted date: 2016-11-17
in scheme: AQD - Primary observation range
recommended unit: ug.m-3
related pollutant: i-Pentane (2-methylbutane) (air)
primary observation time: Hourly average/mean
minimum value: -10
maximum value: 100

Range for pollutant 450 for month in ug.m-3
type: Concept
notation: 185
status: valid
status modified: 2016-11-17
accepted date: 2016-11-17
in scheme: AQD - Primary observation range
recommended unit: ug.m-3
related pollutant: i-Pentane (2-methylbutane) (air)
primary observation time: Monthly average/mean
minimum value: -10
maximum value: 100

Range for pollutant 450 for var in ug.m-3
type: Concept
notation: 186
status: valid
status modified: 2016-11-17
accepted date: 2016-11-17
in scheme: AQD - Primary observation range
recommended unit: ug.m-3
related pollutant: i-Pentane (2-methylbutane) (air)
primary observation time: Variable sample
minimum value: -10
maximum value: 100

Range for pollutant 450 for week in ug.m-3
type: Concept
notation: 187
status: valid
status modified: 2016-11-17
accepted date: 2016-11-17
in scheme: AQD - Primary observation range
recommended unit: ug.m-3
related pollutant: i-Pentane (2-methylbutane) (air)
primary observation time: Weekly average/mean
minimum value: 0
maximum value: 20

Range for pollutant 450 for year in ug.m-3
type: Concept
notation: 188
status: valid
status modified: 2016-11-17
accepted date: 2016-11-17
in scheme: AQD - Primary observation range
recommended unit: ug.m-3
related pollutant: i-Pentane (2-methylbutane) (air)
primary observation time: Yearly average/mean
minimum value: -10
maximum value: 100

Range for pollutant 451 for day in ug.m-3
type: Concept
notation: 189
status: valid
status modified: 2016-11-17
accepted date: 2016-11-17
in scheme: AQD - Primary observation range
recommended unit: ug.m-3
related pollutant: Isoprene (2-methyl-1,3-butadiene) (air)
primary observation time: Daily average/mean
minimum value: 0
maximum value: 4

Range for pollutant 8 for month in ug.m-3
type: Concept
notation: 19
status: valid
status modified: 2016-11-17
accepted date: 2016-11-17
in scheme: AQD - Primary observation range
recommended unit: ug.m-3
related pollutant: Nitrogen dioxide (air)
primary observation time: Monthly average/mean
minimum value: 0
maximum value: 200

Range for pollutant 451 for hour in ug.m-3
type: Concept
notation: 190
status: valid
status modified: 2016-11-17
accepted date: 2016-11-17
in scheme: AQD - Primary observation range
recommended unit: ug.m-3
related pollutant: Isoprene (2-methyl-1,3-butadiene) (air)
primary observation time: Hourly average/mean
minimum value: 0
maximum value: 5

Range for pollutant 451 for var in ug.m-3
type: Concept
notation: 191
status: valid
status modified: 2016-11-17
accepted date: 2016-11-17
in scheme: AQD - Primary observation range
recommended unit: ug.m-3
related pollutant: Isoprene (2-methyl-1,3-butadiene) (air)
primary observation time: Variable sample
minimum value: 0
maximum value: 5

Range for pollutant 451 for week in ug.m-3
type: Concept
notation: 192
status: valid
status modified: 2016-11-17
accepted date: 2016-11-17
in scheme: AQD - Primary observation range
recommended unit: ug.m-3
related pollutant: Isoprene (2-methyl-1,3-butadiene) (air)
primary observation time: Weekly average/mean
minimum value: 0
maximum value: 3

Range for pollutant 464 for day in ug.m-3
type: Concept
notation: 193
status: valid
status modified: 2016-11-17
accepted date: 2016-11-17
in scheme: AQD - Primary observation range
recommended unit: ug.m-3
related pollutant: m,p-Xylene (air)
primary observation time: Daily average/mean
minimum value: -10
maximum value: 10

Range for pollutant 464 for hour in ug.m-3
type: Concept
notation: 194
status: valid
status modified: 2016-11-17
accepted date: 2016-11-17
in scheme: AQD - Primary observation range
recommended unit: ug.m-3
related pollutant: m,p-Xylene (air)
primary observation time: Hourly average/mean
minimum value: -10
maximum value: 100

Range for pollutant 464 for month in ug.m-3
type: Concept
notation: 195
status: valid
status modified: 2016-11-17
accepted date: 2016-11-17
in scheme: AQD - Primary observation range
recommended unit: ug.m-3
related pollutant: m,p-Xylene (air)
primary observation time: Monthly average/mean
minimum value: -5
maximum value: 100

Range for pollutant 464 for var in ug.m-3
type: Concept
notation: 196
status: valid
status modified: 2016-11-17
accepted date: 2016-11-17
in scheme: AQD - Primary observation range
recommended unit: ug.m-3
related pollutant: m,p-Xylene (air)
primary observation time: Variable sample
minimum value: -5
maximum value: 100

Range for pollutant 464 for week in ug.m-3
type: Concept
notation: 197
status: valid
status modified: 2016-11-17
accepted date: 2016-11-17
in scheme: AQD - Primary observation range
recommended unit: ug.m-3
related pollutant: m,p-Xylene (air)
primary observation time: Weekly average/mean
minimum value: -10
maximum value: 10

Range for pollutant 464 for year in ug.m-3
type: Concept
notation: 198
status: valid
status modified: 2016-11-17
accepted date: 2016-11-17
in scheme: AQD - Primary observation range
recommended unit: ug.m-3
related pollutant: m,p-Xylene (air)
primary observation time: Yearly average/mean
minimum value: -5
maximum value: 100

Range for pollutant 465 for day in ng.m-3
type: Concept
notation: 199
status: valid
status modified: 2016-11-17
accepted date: 2016-11-17
in scheme: AQD - Primary observation range
recommended unit: ng.m-3
related pollutant: naphtalene (air+aerosol)
primary observation time: Daily average/mean
minimum value: 0
maximum value: 2

Range for pollutant 1 for hour in ug.m-3
type: Concept
notation: 2
status: valid
status modified: 2016-11-17
accepted date: 2016-11-17
in scheme: AQD - Primary observation range
recommended unit: ug.m-3
related pollutant: Sulphur dioxide (air)
primary observation time: Hourly average/mean
minimum value: -10
maximum value: 450

Range for pollutant 8 for var in ug.m-3
type: Concept
notation: 20
status: valid
status modified: 2016-11-17
accepted date: 2016-11-17
in scheme: AQD - Primary observation range
recommended unit: ug.m-3
related pollutant: Nitrogen dioxide (air)
primary observation time: Variable sample
minimum value: -5
maximum value: 337.5

Range for pollutant 465 for year in ng.m-3
type: Concept
notation: 200
status: valid
status modified: 2016-11-17
accepted date: 2016-11-17
in scheme: AQD - Primary observation range
recommended unit: ng.m-3
related pollutant: naphtalene (air+aerosol)
primary observation time: Yearly average/mean
minimum value: 0
maximum value: 2

Range for pollutant 475 for day in ug.m-3
type: Concept
notation: 201
status: valid
status modified: 2016-11-17
accepted date: 2016-11-17
in scheme: AQD - Primary observation range
recommended unit: ug.m-3
related pollutant: n-Octane (air)
primary observation time: Daily average/mean
minimum value: -10
maximum value: 3

Range for pollutant 475 for hour in ug.m-3
type: Concept
notation: 202
status: valid
status modified: 2016-11-17
accepted date: 2016-11-17
in scheme: AQD - Primary observation range
recommended unit: ug.m-3
related pollutant: n-Octane (air)
primary observation time: Hourly average/mean
minimum value: -10
maximum value: 3

Range for pollutant 475 for var in ug.m-3
type: Concept
notation: 203
status: valid
status modified: 2016-11-17
accepted date: 2016-11-17
in scheme: AQD - Primary observation range
recommended unit: ug.m-3
related pollutant: n-Octane (air)
primary observation time: Variable sample
minimum value: -10
maximum value: 3

Range for pollutant 475 for week in ug.m-3
type: Concept
notation: 204
status: valid
status modified: 2016-11-17
accepted date: 2016-11-17
in scheme: AQD - Primary observation range
recommended unit: ug.m-3
related pollutant: n-Octane (air)
primary observation time: Weekly average/mean
minimum value: -10
maximum value: 3

Range for pollutant 482 for day in ug.m-3
type: Concept
notation: 205
status: valid
status modified: 2016-11-17
accepted date: 2016-11-17
in scheme: AQD - Primary observation range
recommended unit: ug.m-3
related pollutant: o-Xylene (air)
primary observation time: Daily average/mean
minimum value: -10
maximum value: 3

Range for pollutant 482 for hour in ug.m-3
type: Concept
notation: 206
status: valid
status modified: 2016-11-17
accepted date: 2016-11-17
in scheme: AQD - Primary observation range
recommended unit: ug.m-3
related pollutant: o-Xylene (air)
primary observation time: Hourly average/mean
minimum value: -10
maximum value: 9

Range for pollutant 482 for month in ug.m-3
type: Concept
notation: 207
status: valid
status modified: 2016-11-17
accepted date: 2016-11-17
in scheme: AQD - Primary observation range
recommended unit: ug.m-3
related pollutant: o-Xylene (air)
primary observation time: Monthly average/mean
minimum value: -10
maximum value: 9

Range for pollutant 482 for var in ug.m-3
type: Concept
notation: 208
status: valid
status modified: 2016-11-17
accepted date: 2016-11-17
in scheme: AQD - Primary observation range
recommended unit: ug.m-3
related pollutant: o-Xylene (air)
primary observation time: Variable sample
minimum value: -5
maximum value: 9

Range for pollutant 482 for week in ug.m-3
type: Concept
notation: 209
status: valid
status modified: 2016-11-17
accepted date: 2016-11-17
in scheme: AQD - Primary observation range
recommended unit: ug.m-3
related pollutant: o-Xylene (air)
primary observation time: Weekly average/mean
minimum value: -10
maximum value: 3

Range for pollutant 8 for week in ug.m-3
type: Concept
notation: 21
status: valid
status modified: 2016-11-17
accepted date: 2016-11-17
in scheme: AQD - Primary observation range
recommended unit: ug.m-3
related pollutant: Nitrogen dioxide (air)
primary observation time: Weekly average/mean
minimum value: -5
maximum value: 337.5

Range for pollutant 482 for year in ug.m-3
type: Concept
notation: 210
status: valid
status modified: 2016-11-17
accepted date: 2016-11-17
in scheme: AQD - Primary observation range
recommended unit: ug.m-3
related pollutant: o-Xylene (air)
primary observation time: Yearly average/mean
minimum value: -5
maximum value: 9

Range for pollutant 486 for day in ug.m-3
type: Concept
notation: 211
status: valid
status modified: 2016-11-17
accepted date: 2016-11-17
in scheme: AQD - Primary observation range
recommended unit: ug.m-3
related pollutant: n-Pentane (air)
primary observation time: Daily average/mean
minimum value: -10
maximum value: 3

Range for pollutant 486 for hour in ug.m-3
type: Concept
notation: 212
status: valid
status modified: 2016-11-17
accepted date: 2016-11-17
in scheme: AQD - Primary observation range
recommended unit: ug.m-3
related pollutant: n-Pentane (air)
primary observation time: Hourly average/mean
minimum value: -10
maximum value: 3

Range for pollutant 486 for month in ug.m-3
type: Concept
notation: 213
status: valid
status modified: 2016-11-17
accepted date: 2016-11-17
in scheme: AQD - Primary observation range
recommended unit: ug.m-3
related pollutant: n-Pentane (air)
primary observation time: Monthly average/mean
minimum value: -10
maximum value: 3

Range for pollutant 486 for var in ug.m-3
type: Concept
notation: 214
status: valid
status modified: 2016-11-17
accepted date: 2016-11-17
in scheme: AQD - Primary observation range
recommended unit: ug.m-3
related pollutant: n-Pentane (air)
primary observation time: Variable sample
minimum value: -10
maximum value: 3

Range for pollutant 486 for week in ug.m-3
type: Concept
notation: 215
status: valid
status modified: 2016-11-17
accepted date: 2016-11-17
in scheme: AQD - Primary observation range
recommended unit: ug.m-3
related pollutant: n-Pentane (air)
primary observation time: Weekly average/mean
minimum value: 0
maximum value: 2

Range for pollutant 486 for year in ug.m-3
type: Concept
notation: 216
status: valid
status modified: 2016-11-17
accepted date: 2016-11-17
in scheme: AQD - Primary observation range
recommended unit: ug.m-3
related pollutant: n-Pentane (air)
primary observation time: Yearly average/mean
minimum value: -10
maximum value: 3

Range for pollutant 503 for day in ug.m-3
type: Concept
notation: 217
status: valid
status modified: 2016-11-17
accepted date: 2016-11-17
in scheme: AQD - Primary observation range
recommended unit: ug.m-3
related pollutant: Propane (air)
primary observation time: Daily average/mean
minimum value: -10
maximum value: 12

Range for pollutant 503 for hour in ug.m-3
type: Concept
notation: 218
status: valid
status modified: 2016-11-17
accepted date: 2016-11-17
in scheme: AQD - Primary observation range
recommended unit: ug.m-3
related pollutant: Propane (air)
primary observation time: Hourly average/mean
minimum value: -10
maximum value: 12

Range for pollutant 503 for month in ug.m-3
type: Concept
notation: 219
status: valid
status modified: 2016-11-17
accepted date: 2016-11-17
in scheme: AQD - Primary observation range
recommended unit: ug.m-3
related pollutant: Propane (air)
primary observation time: Monthly average/mean
minimum value: -10
maximum value: 12

Range for pollutant 8 for year in ug.m-3
type: Concept
notation: 22
status: valid
status modified: 2016-11-17
accepted date: 2016-11-17
in scheme: AQD - Primary observation range
recommended unit: ug.m-3
related pollutant: Nitrogen dioxide (air)
primary observation time: Yearly average/mean
minimum value: 0
maximum value: 120

Range for pollutant 503 for year in ug.m-3
type: Concept
notation: 220
status: valid
status modified: 2016-11-17
accepted date: 2016-11-17
in scheme: AQD - Primary observation range
recommended unit: ug.m-3
related pollutant: Propane (air)
primary observation time: Yearly average/mean
minimum value: -10
maximum value: 12

Range for pollutant 505 for day in ug.m-3
type: Concept
notation: 221
status: valid
status modified: 2016-11-17
accepted date: 2016-11-17
in scheme: AQD - Primary observation range
recommended unit: ug.m-3
related pollutant: Propene (air)
primary observation time: Daily average/mean
minimum value: -10
maximum value: 12

Range for pollutant 505 for hour in ug.m-3
type: Concept
notation: 222
status: valid
status modified: 2016-11-17
accepted date: 2016-11-17
in scheme: AQD - Primary observation range
recommended unit: ug.m-3
related pollutant: Propene (air)
primary observation time: Hourly average/mean
minimum value: -10
maximum value: 5

Range for pollutant 505 for month in ug.m-3
type: Concept
notation: 223
status: valid
status modified: 2016-11-17
accepted date: 2016-11-17
in scheme: AQD - Primary observation range
recommended unit: ug.m-3
related pollutant: Propene (air)
primary observation time: Monthly average/mean
minimum value: -10
maximum value: 12

Range for pollutant 505 for year in ug.m-3
type: Concept
notation: 224
status: valid
status modified: 2016-11-17
accepted date: 2016-11-17
in scheme: AQD - Primary observation range
recommended unit: ug.m-3
related pollutant: Propene (air)
primary observation time: Yearly average/mean
minimum value: -10
maximum value: 12

Range for pollutant 520 for day in ugS.m-3
type: Concept
notation: 225
status: valid
status modified: 2016-11-17
accepted date: 2016-11-17
in scheme: AQD - Primary observation range
recommended unit: ugS.m-3
related pollutant: sum_sulph_diox_sulphate (air+aerosol)
primary observation time: Daily average/mean
minimum value: -10
maximum value: 150

Range for pollutant 520 for var in ugS.m-3
type: Concept
notation: 226
status: valid
status modified: 2016-11-17
accepted date: 2016-11-17
in scheme: AQD - Primary observation range
recommended unit: ugS.m-3
related pollutant: sum_sulph_diox_sulphate (air+aerosol)
primary observation time: Variable sample
minimum value: -10
maximum value: 150

Range for pollutant 520 for week in ugS.m-3
type: Concept
notation: 227
status: valid
status modified: 2016-11-17
accepted date: 2016-11-17
in scheme: AQD - Primary observation range
recommended unit: ugS.m-3
related pollutant: sum_sulph_diox_sulphate (air+aerosol)
primary observation time: Weekly average/mean
minimum value: -10
maximum value: 150

Range for pollutant 604 for day in ng.m-3
type: Concept
notation: 228
status: valid
status modified: 2016-11-17
accepted date: 2016-11-17
in scheme: AQD - Primary observation range
recommended unit: ng.m-3
related pollutant: aluminium (aerosol)
primary observation time: Daily average/mean
minimum value: 0
maximum value: 2500

Range for pollutant 606 for day in ng.m-3
type: Concept
notation: 229
status: valid
status modified: 2016-11-17
accepted date: 2016-11-17
in scheme: AQD - Primary observation range
recommended unit: ng.m-3
related pollutant: anthracene (air+aerosol)
primary observation time: Daily average/mean
minimum value: 0
maximum value: 5

Range for pollutant 9 for day in ug.m-3
type: Concept
notation: 23
status: valid
status modified: 2016-11-17
accepted date: 2016-11-17
in scheme: AQD - Primary observation range
recommended unit: ug.m-3
related pollutant: Nitrogen oxides (air)
primary observation time: Daily average/mean
minimum value: -10
maximum value: 1125

Range for pollutant 606 for var in ng.m-3
type: Concept
notation: 230
status: valid
status modified: 2016-11-17
accepted date: 2016-11-17
in scheme: AQD - Primary observation range
recommended unit: ng.m-3
related pollutant: anthracene (air+aerosol)
primary observation time: Variable sample
minimum value: 0
maximum value: 3

Range for pollutant 606 for year in ng.m-3
type: Concept
notation: 231
status: valid
status modified: 2016-11-17
accepted date: 2016-11-17
in scheme: AQD - Primary observation range
recommended unit: ng.m-3
related pollutant: anthracene (air+aerosol)
primary observation time: Yearly average/mean
minimum value: -0.5
maximum value: 5

Range for pollutant 608 for month in ug.m-2.day-1
type: Concept
notation: 232
status: valid
status modified: 2016-11-17
accepted date: 2016-11-17
in scheme: AQD - Primary observation range
recommended unit: ug.m-2.day-1
related pollutant: anthracene (precip+dry_dep)
primary observation time: Monthly average/mean
minimum value: 0
maximum value: 0.5

Range for pollutant 609 for day in ng.m-3
type: Concept
notation: 233
status: valid
status modified: 2016-11-17
accepted date: 2016-11-17
in scheme: AQD - Primary observation range
recommended unit: ng.m-3
related pollutant: Benzo(a)anthracene (air+aerosol)
primary observation time: Daily average/mean
minimum value: -0.5
maximum value: 6

Range for pollutant 609 for month in ng.m-3
type: Concept
notation: 234
status: valid
status modified: 2016-11-17
accepted date: 2016-11-17
in scheme: AQD - Primary observation range
recommended unit: ng.m-3
related pollutant: Benzo(a)anthracene (air+aerosol)
primary observation time: Monthly average/mean
minimum value: -0.5
maximum value: 6

Range for pollutant 609 for var in ng.m-3
type: Concept
notation: 235
status: valid
status modified: 2016-11-17
accepted date: 2016-11-17
in scheme: AQD - Primary observation range
recommended unit: ng.m-3
related pollutant: Benzo(a)anthracene (air+aerosol)
primary observation time: Variable sample
minimum value: -0.5
maximum value: 6

Range for pollutant 609 for year in ng.m-3
type: Concept
notation: 236
status: valid
status modified: 2016-11-17
accepted date: 2016-11-17
in scheme: AQD - Primary observation range
recommended unit: ng.m-3
related pollutant: Benzo(a)anthracene (air+aerosol)
primary observation time: Yearly average/mean
minimum value: -0.5
maximum value: 6

Range for pollutant 611 for day in ug.m-2.day-1
type: Concept
notation: 237
status: valid
status modified: 2016-11-17
accepted date: 2016-11-17
in scheme: AQD - Primary observation range
recommended unit: ug.m-2.day-1
related pollutant: Benzo(a)anthracene (precip+dry_dep)
primary observation time: Daily average/mean
minimum value: 0
maximum value: 0.06

Range for pollutant 611 for month in ug.m-2.day-1
type: Concept
notation: 238
status: valid
status modified: 2016-11-17
accepted date: 2016-11-17
in scheme: AQD - Primary observation range
recommended unit: ug.m-2.day-1
related pollutant: Benzo(a)anthracene (precip+dry_dep)
primary observation time: Monthly average/mean
minimum value: 0
maximum value: 0.06

Range for pollutant 611 for var in ug.m-2.day-1
type: Concept
notation: 239
status: valid
status modified: 2016-11-17
accepted date: 2016-11-17
in scheme: AQD - Primary observation range
recommended unit: ug.m-2.day-1
related pollutant: Benzo(a)anthracene (precip+dry_dep)
primary observation time: Variable sample
minimum value: 0
maximum value: 0.06

Range for pollutant 9 for hour in ug.m-3
type: Concept
notation: 24
status: valid
status modified: 2016-11-17
accepted date: 2016-11-17
in scheme: AQD - Primary observation range
recommended unit: ug.m-3
related pollutant: Nitrogen oxides (air)
primary observation time: Hourly average/mean
minimum value: -10
maximum value: 1500

Range for pollutant 611 for week in ug.m-2.day-1
type: Concept
notation: 240
status: valid
status modified: 2016-11-17
accepted date: 2016-11-17
in scheme: AQD - Primary observation range
recommended unit: ug.m-2.day-1
related pollutant: Benzo(a)anthracene (precip+dry_dep)
primary observation time: Weekly average/mean
minimum value: 0
maximum value: 0.06

Range for pollutant 611 for year in ug.m-2.day-1
type: Concept
notation: 241
status: valid
status modified: 2016-11-17
accepted date: 2016-11-17
in scheme: AQD - Primary observation range
recommended unit: ug.m-2.day-1
related pollutant: Benzo(a)anthracene (precip+dry_dep)
primary observation time: Yearly average/mean
minimum value: 0
maximum value: 0.06

Range for pollutant 616 for month in ng.m-3
type: Concept
notation: 242
status: valid
status modified: 2016-11-17
accepted date: 2016-11-17
in scheme: AQD - Primary observation range
recommended unit: ng.m-3
related pollutant: Benzo(b)fluoranthene (air+aerosol)
primary observation time: Monthly average/mean
minimum value: 0
maximum value: 2.5

Range for pollutant 616 for year in ng.m-3
type: Concept
notation: 243
status: valid
status modified: 2016-11-17
accepted date: 2016-11-17
in scheme: AQD - Primary observation range
recommended unit: ng.m-3
related pollutant: Benzo(b)fluoranthene (air+aerosol)
primary observation time: Yearly average/mean
minimum value: -0.5
maximum value: 3

Range for pollutant 618 for day in ug.m-2.day-1
type: Concept
notation: 244
status: valid
status modified: 2016-11-17
accepted date: 2016-11-17
in scheme: AQD - Primary observation range
recommended unit: ug.m-2.day-1
related pollutant: Benzo(b)fluoranthene (precip+dry_dep)
primary observation time: Daily average/mean
minimum value: 0
maximum value: 0.03

Range for pollutant 618 for month in ug.m-2.day-1
type: Concept
notation: 245
status: valid
status modified: 2016-11-17
accepted date: 2016-11-17
in scheme: AQD - Primary observation range
recommended unit: ug.m-2.day-1
related pollutant: Benzo(b)fluoranthene (precip+dry_dep)
primary observation time: Monthly average/mean
minimum value: 0
maximum value: 0.025

Range for pollutant 618 for var in ug.m-2.day-1
type: Concept
notation: 246
status: valid
status modified: 2016-11-17
accepted date: 2016-11-17
in scheme: AQD - Primary observation range
recommended unit: ug.m-2.day-1
related pollutant: Benzo(b)fluoranthene (precip+dry_dep)
primary observation time: Variable sample
minimum value: 0
maximum value: 0.03

Range for pollutant 622 for day in ng.m-3
type: Concept
notation: 247
status: valid
status modified: 2016-11-17
accepted date: 2016-11-17
in scheme: AQD - Primary observation range
recommended unit: ng.m-3
related pollutant: Benzo(ghi)perylene (air+aerosol)
primary observation time: Daily average/mean
minimum value: -0.5
maximum value: 3

Range for pollutant 622 for var in ng.m-3
type: Concept
notation: 248
status: valid
status modified: 2016-11-17
accepted date: 2016-11-17
in scheme: AQD - Primary observation range
recommended unit: ng.m-3
related pollutant: Benzo(ghi)perylene (air+aerosol)
primary observation time: Variable sample
minimum value: -0.5
maximum value: 3

Range for pollutant 622 for year in ng.m-3
type: Concept
notation: 249
status: valid
status modified: 2016-11-17
accepted date: 2016-11-17
in scheme: AQD - Primary observation range
recommended unit: ng.m-3
related pollutant: Benzo(ghi)perylene (air+aerosol)
primary observation time: Yearly average/mean
minimum value: -0.5
maximum value: 3

Range for pollutant 10 for day in mg.m-3
type: Concept
notation: 25
status: valid
status modified: 2016-11-17
accepted date: 2016-11-17
in scheme: AQD - Primary observation range
recommended unit: mg.m-3
related pollutant: Carbon monoxide (air)
primary observation time: Daily average/mean
minimum value: -10
maximum value: 15

Range for pollutant 624 for month in ug.m-2.day-1
type: Concept
notation: 250
status: valid
status modified: 2016-11-17
accepted date: 2016-11-17
in scheme: AQD - Primary observation range
recommended unit: ug.m-2.day-1
related pollutant: Benzo(ghi)perylene (precip+dry_dep)
primary observation time: Monthly average/mean
minimum value: 0
maximum value: 0.5

Range for pollutant 625 for month in ng.m-3
type: Concept
notation: 251
status: valid
status modified: 2016-11-17
accepted date: 2016-11-17
in scheme: AQD - Primary observation range
recommended unit: ng.m-3
related pollutant: Benzo(k)fluoranthene (air+aerosol)
primary observation time: Monthly average/mean
minimum value: -0.5
maximum value: 3

Range for pollutant 625 for var in ng.m-3
type: Concept
notation: 252
status: valid
status modified: 2016-11-17
accepted date: 2016-11-17
in scheme: AQD - Primary observation range
recommended unit: ng.m-3
related pollutant: Benzo(k)fluoranthene (air+aerosol)
primary observation time: Variable sample
minimum value: -0.5
maximum value: 3

Range for pollutant 625 for year in ng.m-3
type: Concept
notation: 253
status: valid
status modified: 2016-11-17
accepted date: 2016-11-17
in scheme: AQD - Primary observation range
recommended unit: ng.m-3
related pollutant: Benzo(k)fluoranthene (air+aerosol)
primary observation time: Yearly average/mean
minimum value: -0.5
maximum value: 3

Range for pollutant 627 for day in ug.m-2.day-1
type: Concept
notation: 254
status: valid
status modified: 2016-11-17
accepted date: 2016-11-17
in scheme: AQD - Primary observation range
recommended unit: ug.m-2.day-1
related pollutant: Benzo(k)fluoranthene (precip+dry_dep)
primary observation time: Daily average/mean
minimum value: 0
maximum value: 0.02

Range for pollutant 627 for month in ug.m-2.day-1
type: Concept
notation: 255
status: valid
status modified: 2016-11-17
accepted date: 2016-11-17
in scheme: AQD - Primary observation range
recommended unit: ug.m-2.day-1
related pollutant: Benzo(k)fluoranthene (precip+dry_dep)
primary observation time: Monthly average/mean
minimum value: 0
maximum value: 0.02

Range for pollutant 627 for var in ug.m-2.day-1
type: Concept
notation: 256
status: valid
status modified: 2016-11-17
accepted date: 2016-11-17
in scheme: AQD - Primary observation range
recommended unit: ug.m-2.day-1
related pollutant: Benzo(k)fluoranthene (precip+dry_dep)
primary observation time: Variable sample
minimum value: 0
maximum value: 0.02

Range for pollutant 627 for year in ug.m-2.day-1
type: Concept
notation: 257
status: valid
status modified: 2016-11-17
accepted date: 2016-11-17
in scheme: AQD - Primary observation range
recommended unit: ug.m-2.day-1
related pollutant: Benzo(k)fluoranthene (precip+dry_dep)
primary observation time: Yearly average/mean
minimum value: 0
maximum value: 0.02

Range for pollutant 629 for day in ug.m-3
type: Concept
notation: 258
status: valid
status modified: 2016-11-17
accepted date: 2016-11-17
in scheme: AQD - Primary observation range
recommended unit: ug.m-3
related pollutant: calcium (aerosol)
primary observation time: Daily average/mean
minimum value: -10
maximum value: 1

Range for pollutant 630 for day in mg.l-1
type: Concept
notation: 259
status: valid
status modified: 2016-11-17
accepted date: 2016-11-17
in scheme: AQD - Primary observation range
related pollutant: calcium (precip)
primary observation time: Daily average/mean
minimum value: -10
maximum value: 20

Range for pollutant 10 for hour in mg.m-3
type: Concept
notation: 26
status: valid
status modified: 2016-11-17
accepted date: 2016-11-17
in scheme: AQD - Primary observation range
recommended unit: mg.m-3
related pollutant: Carbon monoxide (air)
primary observation time: Hourly average/mean
minimum value: -10
maximum value: 20

Range for pollutant 631 for day in ug.m-3
type: Concept
notation: 260
status: valid
status modified: 2016-11-17
accepted date: 2016-11-17
in scheme: AQD - Primary observation range
recommended unit: ug.m-3
related pollutant: chloride (aerosol)
primary observation time: Daily average/mean
minimum value: -10
maximum value: 10

Range for pollutant 632 for day in mg.l-1
type: Concept
notation: 261
status: valid
status modified: 2016-11-17
accepted date: 2016-11-17
in scheme: AQD - Primary observation range
related pollutant: chloride (precip)
primary observation time: Daily average/mean
minimum value: -10
maximum value: 200

Range for pollutant 633 for year in ng.m-3
type: Concept
notation: 262
status: valid
status modified: 2016-11-17
accepted date: 2016-11-17
in scheme: AQD - Primary observation range
recommended unit: ng.m-3
related pollutant: Dibenz(ac+ah)anthracenes (air+aerosol)
primary observation time: Yearly average/mean
minimum value: 0
maximum value: 2

Range for pollutant 643 for day in ng.m-3
type: Concept
notation: 263
status: valid
status modified: 2016-11-17
accepted date: 2016-11-17
in scheme: AQD - Primary observation range
recommended unit: ng.m-3
related pollutant: fluoranthene (air+aerosol)
primary observation time: Daily average/mean
minimum value: 0
maximum value: 10

Range for pollutant 643 for month in ng.m-3
type: Concept
notation: 264
status: valid
status modified: 2016-11-17
accepted date: 2016-11-17
in scheme: AQD - Primary observation range
recommended unit: ng.m-3
related pollutant: fluoranthene (air+aerosol)
primary observation time: Monthly average/mean
minimum value: -0.5
maximum value: 16

Range for pollutant 643 for var in ng.m-3
type: Concept
notation: 265
status: valid
status modified: 2016-11-17
accepted date: 2016-11-17
in scheme: AQD - Primary observation range
recommended unit: ng.m-3
related pollutant: fluoranthene (air+aerosol)
primary observation time: Variable sample
minimum value: 0
maximum value: 7

Range for pollutant 643 for year in ng.m-3
type: Concept
notation: 266
status: valid
status modified: 2016-11-17
accepted date: 2016-11-17
in scheme: AQD - Primary observation range
recommended unit: ng.m-3
related pollutant: fluoranthene (air+aerosol)
primary observation time: Yearly average/mean
minimum value: -0.5
maximum value: 5

Range for pollutant 645 for month in ug.m-2.day-1
type: Concept
notation: 267
status: valid
status modified: 2016-11-17
accepted date: 2016-11-17
in scheme: AQD - Primary observation range
recommended unit: ug.m-2.day-1
related pollutant: fluoranthene (precip+dry_dep)
primary observation time: Monthly average/mean
minimum value: 0
maximum value: 0.2

Range for pollutant 648 for day in ueH.l-1
type: Concept
notation: 268
status: valid
status modified: 2016-11-17
accepted date: 2016-11-17
in scheme: AQD - Primary observation range
recommended unit: ueH.l-1
related pollutant: acidity(H+) (precip)
primary observation time: Daily average/mean
minimum value: -250
maximum value: 20

Range for pollutant 653 for day in ng.m-3
type: Concept
notation: 269
status: valid
status modified: 2016-11-17
accepted date: 2016-11-17
in scheme: AQD - Primary observation range
recommended unit: ng.m-3
related pollutant: reactive_mercury (air+aerosol)
primary observation time: Daily average/mean
minimum value: 0
maximum value: 2

Range for pollutant 11 for day in ug.m-3
type: Concept
notation: 27
status: valid
status modified: 2016-11-17
accepted date: 2016-11-17
in scheme: AQD - Primary observation range
recommended unit: ug.m-3
related pollutant: Hydrogen sulphide (air)
primary observation time: Daily average/mean
minimum value: -10
maximum value: 25

Range for pollutant 653 for var in ng.m-3
type: Concept
notation: 270
status: valid
status modified: 2016-11-17
accepted date: 2016-11-17
in scheme: AQD - Primary observation range
recommended unit: ng.m-3
related pollutant: reactive_mercury (air+aerosol)
primary observation time: Variable sample
minimum value: 0
maximum value: 2

Range for pollutant 654 for month in ng.m-3
type: Concept
notation: 271
status: valid
status modified: 2016-11-17
accepted date: 2016-11-17
in scheme: AQD - Primary observation range
recommended unit: ng.m-3
related pollutant: indeno_123cd_pyrene (air+aerosol)
primary observation time: Monthly average/mean
minimum value: 0
maximum value: 2

Range for pollutant 654 for var in ng.m-3
type: Concept
notation: 272
status: valid
status modified: 2016-11-17
accepted date: 2016-11-17
in scheme: AQD - Primary observation range
recommended unit: ng.m-3
related pollutant: indeno_123cd_pyrene (air+aerosol)
primary observation time: Variable sample
minimum value: 0
maximum value: 1

Range for pollutant 654 for year in ng.m-3
type: Concept
notation: 273
status: valid
status modified: 2016-11-17
accepted date: 2016-11-17
in scheme: AQD - Primary observation range
recommended unit: ng.m-3
related pollutant: indeno_123cd_pyrene (air+aerosol)
primary observation time: Yearly average/mean
minimum value: 0
maximum value: 2

Range for pollutant 656 for day in ug.m-2.day-1
type: Concept
notation: 274
status: valid
status modified: 2016-11-17
accepted date: 2016-11-17
in scheme: AQD - Primary observation range
recommended unit: ug.m-2.day-1
related pollutant: indeno_123cd_pyrene (precip+dry_dep)
primary observation time: Daily average/mean
minimum value: 0
maximum value: 1

Range for pollutant 656 for month in ug.m-2.day-1
type: Concept
notation: 275
status: valid
status modified: 2016-11-17
accepted date: 2016-11-17
in scheme: AQD - Primary observation range
recommended unit: ug.m-2.day-1
related pollutant: indeno_123cd_pyrene (precip+dry_dep)
primary observation time: Monthly average/mean
minimum value: 0
maximum value: 1

Range for pollutant 656 for var in ug.m-2.day-1
type: Concept
notation: 276
status: valid
status modified: 2016-11-17
accepted date: 2016-11-17
in scheme: AQD - Primary observation range
recommended unit: ug.m-2.day-1
related pollutant: indeno_123cd_pyrene (precip+dry_dep)
primary observation time: Variable sample
minimum value: 0
maximum value: 1

Range for pollutant 656 for week in ug.m-2.day-1
type: Concept
notation: 277
status: valid
status modified: 2016-11-17
accepted date: 2016-11-17
in scheme: AQD - Primary observation range
recommended unit: ug.m-2.day-1
related pollutant: indeno_123cd_pyrene (precip+dry_dep)
primary observation time: Weekly average/mean
minimum value: 0
maximum value: 1

Range for pollutant 656 for year in ug.m-2.day-1
type: Concept
notation: 278
status: valid
status modified: 2016-11-17
accepted date: 2016-11-17
in scheme: AQD - Primary observation range
recommended unit: ug.m-2.day-1
related pollutant: indeno_123cd_pyrene (precip+dry_dep)
primary observation time: Yearly average/mean
minimum value: 0
maximum value: 1

Range for pollutant 658 for day in mg.l-1
type: Concept
notation: 279
status: valid
status modified: 2016-11-17
accepted date: 2016-11-17
in scheme: AQD - Primary observation range
related pollutant: potassium (precip)
primary observation time: Daily average/mean
minimum value: -10
maximum value: 30

Range for pollutant 11 for hour in ug.m-3
type: Concept
notation: 28
status: valid
status modified: 2016-11-17
accepted date: 2016-11-17
in scheme: AQD - Primary observation range
recommended unit: ug.m-3
related pollutant: Hydrogen sulphide (air)
primary observation time: Hourly average/mean
minimum value: -10
maximum value: 35

Range for pollutant 659 for day in ug.m-3
type: Concept
notation: 280
status: valid
status modified: 2016-11-17
accepted date: 2016-11-17
in scheme: AQD - Primary observation range
recommended unit: ug.m-3
related pollutant: magnesium (aerosol)
primary observation time: Daily average/mean
minimum value: 0
maximum value: 20

Range for pollutant 660 for day in mg.l-1
type: Concept
notation: 281
status: valid
status modified: 2016-11-17
accepted date: 2016-11-17
in scheme: AQD - Primary observation range
related pollutant: magnesium (precip)
primary observation time: Daily average/mean
minimum value: -10
maximum value: 20

Range for pollutant 664 for day in mgH.l-1
type: Concept
notation: 282
status: valid
status modified: 2016-11-17
accepted date: 2016-11-17
in scheme: AQD - Primary observation range
recommended unit: mgH.l-1
related pollutant: ammonium (precip)
primary observation time: Daily average/mean
minimum value: -10
maximum value: 15

Range for pollutant 666 for day in mgH.l-1
type: Concept
notation: 283
status: valid
status modified: 2016-11-17
accepted date: 2016-11-17
in scheme: AQD - Primary observation range
recommended unit: mgH.l-1
related pollutant: nitrate (precip)
primary observation time: Daily average/mean
minimum value: -10
maximum value: 30

Range for pollutant 668 for day in ug.m-3
type: Concept
notation: 284
status: valid
status modified: 2016-11-17
accepted date: 2016-11-17
in scheme: AQD - Primary observation range
recommended unit: ug.m-3
related pollutant: sodium (aerosol)
primary observation time: Daily average/mean
minimum value: 0
maximum value: 4

Range for pollutant 669 for day in mg.l-1
type: Concept
notation: 285
status: valid
status modified: 2016-11-17
accepted date: 2016-11-17
in scheme: AQD - Primary observation range
related pollutant: sodium (precip)
primary observation time: Daily average/mean
minimum value: -10
maximum value: 150

Range for pollutant 673 for var in pg.m-3
type: Concept
notation: 286
status: valid
status modified: 2016-11-17
accepted date: 2016-11-17
in scheme: AQD - Primary observation range
recommended unit: pg.m-3
related pollutant: PCB_114 (air+aerosol)
primary observation time: Variable sample
minimum value: -0.5
maximum value: 0.3

Range for pollutant 674 for var in pg.m-3
type: Concept
notation: 287
status: valid
status modified: 2016-11-17
accepted date: 2016-11-17
in scheme: AQD - Primary observation range
recommended unit: pg.m-3
related pollutant: PCB_118 (air+aerosol)
primary observation time: Variable sample
minimum value: -0.5
maximum value: 15

Range for pollutant 677 for var in pg.m-3
type: Concept
notation: 288
status: valid
status modified: 2016-11-17
accepted date: 2016-11-17
in scheme: AQD - Primary observation range
recommended unit: pg.m-3
related pollutant: PCB_138 (air+aerosol)
primary observation time: Variable sample
minimum value: -0.5
maximum value: 25

Range for pollutant 679 for var in pg.m-3
type: Concept
notation: 289
status: valid
status modified: 2016-11-17
accepted date: 2016-11-17
in scheme: AQD - Primary observation range
recommended unit: pg.m-3
related pollutant: PCB_141 (air+aerosol)
primary observation time: Variable sample
minimum value: -0.5
maximum value: 9

Range for pollutant 12 for day in ug.m-3
type: Concept
notation: 29
status: valid
status modified: 2016-11-17
accepted date: 2016-11-17
in scheme: AQD - Primary observation range
recommended unit: ug.m-3
related pollutant: Lead (aerosol)
primary observation time: Daily average/mean
minimum value: -10
maximum value: 5

Range for pollutant 683 for var in pg.m-3
type: Concept
notation: 290
status: valid
status modified: 2016-11-17
accepted date: 2016-11-17
in scheme: AQD - Primary observation range
recommended unit: pg.m-3
related pollutant: PCB_157 (air+aerosol)
primary observation time: Variable sample
minimum value: -0.5
maximum value: 2

Range for pollutant 684 for var in pg.m-3
type: Concept
notation: 291
status: valid
status modified: 2016-11-17
accepted date: 2016-11-17
in scheme: AQD - Primary observation range
recommended unit: pg.m-3
related pollutant: PCB_167 (air+aerosol)
primary observation time: Variable sample
minimum value: -0.5
maximum value: 1

Range for pollutant 685 for var in pg.m-3
type: Concept
notation: 292
status: valid
status modified: 2016-11-17
accepted date: 2016-11-17
in scheme: AQD - Primary observation range
recommended unit: pg.m-3
related pollutant: PCB_170 (air+aerosol)
primary observation time: Variable sample
minimum value: -0.5
maximum value: 5

Range for pollutant 686 for var in pg.m-3
type: Concept
notation: 293
status: valid
status modified: 2016-11-17
accepted date: 2016-11-17
in scheme: AQD - Primary observation range
recommended unit: pg.m-3
related pollutant: PCB_180 (air+aerosol)
primary observation time: Variable sample
minimum value: -0.5
maximum value: 20

Range for pollutant 689 for var in pg.m-3
type: Concept
notation: 294
status: valid
status modified: 2016-11-17
accepted date: 2016-11-17
in scheme: AQD - Primary observation range
recommended unit: pg.m-3
related pollutant: PCB_183 (air+aerosol)
primary observation time: Variable sample
minimum value: -0.5
maximum value: 10

Range for pollutant 690 for var in pg.m-3
type: Concept
notation: 295
status: valid
status modified: 2016-11-17
accepted date: 2016-11-17
in scheme: AQD - Primary observation range
recommended unit: pg.m-3
related pollutant: PCB_187 (air+aerosol)
primary observation time: Variable sample
minimum value: -0.5
maximum value: 30

Range for pollutant 691 for var in pg.m-3
type: Concept
notation: 296
status: valid
status modified: 2016-11-17
accepted date: 2016-11-17
in scheme: AQD - Primary observation range
recommended unit: pg.m-3
related pollutant: PCB_189 (air+aerosol)
primary observation time: Variable sample
minimum value: -0.5
maximum value: 1

Range for pollutant 692 for var in pg.m-3
type: Concept
notation: 297
status: valid
status modified: 2016-11-17
accepted date: 2016-11-17
in scheme: AQD - Primary observation range
recommended unit: pg.m-3
related pollutant: PCB_194 (air+aerosol)
primary observation time: Variable sample
minimum value: -0.5
maximum value: 3

Range for pollutant 701 for var in pg.m-3
type: Concept
notation: 298
status: valid
status modified: 2016-11-17
accepted date: 2016-11-17
in scheme: AQD - Primary observation range
recommended unit: pg.m-3
related pollutant: PCB_52 (air+aerosol)
primary observation time: Variable sample
minimum value: -0.5
maximum value: 30

Range for pollutant 706 for var in pg.m-3
type: Concept
notation: 299
status: valid
status modified: 2016-11-17
accepted date: 2016-11-17
in scheme: AQD - Primary observation range
recommended unit: pg.m-3
related pollutant: PCB_74 (air+aerosol)
primary observation time: Variable sample
minimum value: -0.5
maximum value: 10

Range for pollutant 1 for month in ug.m-3
type: Concept
notation: 3
status: valid
status modified: 2016-11-17
accepted date: 2016-11-17
in scheme: AQD - Primary observation range
recommended unit: ug.m-3
related pollutant: Sulphur dioxide (air)
primary observation time: Monthly average/mean
minimum value: -10
maximum value: 100

Range for pollutant 12 for hour in ug.m-3
type: Concept
notation: 30
status: valid
status modified: 2016-11-17
accepted date: 2016-11-17
in scheme: AQD - Primary observation range
recommended unit: ug.m-3
related pollutant: Lead (aerosol)
primary observation time: Hourly average/mean
minimum value: -10
maximum value: 5

Range for pollutant 707 for var in pg.m-3
type: Concept
notation: 300
status: valid
status modified: 2016-11-17
accepted date: 2016-11-17
in scheme: AQD - Primary observation range
recommended unit: pg.m-3
related pollutant: PCB_99 (air+aerosol)
primary observation time: Variable sample
minimum value: -0.5
maximum value: 10

Range for pollutant 709 for var in pg.m-3
type: Concept
notation: 301
status: valid
status modified: 2016-11-17
accepted date: 2016-11-17
in scheme: AQD - Primary observation range
recommended unit: pg.m-3
related pollutant: PCB_123 (air+aerosol)
primary observation time: Variable sample
minimum value: -0.5
maximum value: 3

Range for pollutant 712 for day in ng.m-3
type: Concept
notation: 302
status: valid
status modified: 2016-11-17
accepted date: 2016-11-17
in scheme: AQD - Primary observation range
recommended unit: ng.m-3
related pollutant: phenanthrene (air+aerosol)
primary observation time: Daily average/mean
minimum value: -0.5
maximum value: 3

Range for pollutant 712 for var in ng.m-3
type: Concept
notation: 303
status: valid
status modified: 2016-11-17
accepted date: 2016-11-17
in scheme: AQD - Primary observation range
recommended unit: ng.m-3
related pollutant: phenanthrene (air+aerosol)
primary observation time: Variable sample
minimum value: -0.5
maximum value: 3

Range for pollutant 712 for year in ng.m-3
type: Concept
notation: 304
status: valid
status modified: 2016-11-17
accepted date: 2016-11-17
in scheme: AQD - Primary observation range
recommended unit: ng.m-3
related pollutant: phenanthrene (air+aerosol)
primary observation time: Yearly average/mean
minimum value: -0.5
maximum value: 3

Range for pollutant 714 for month in ug.m-2.day-1
type: Concept
notation: 305
status: valid
status modified: 2016-11-17
accepted date: 2016-11-17
in scheme: AQD - Primary observation range
recommended unit: ug.m-2.day-1
related pollutant: phenanthrene (precip+dry_dep)
primary observation time: Monthly average/mean
minimum value: 0
maximum value: 0.4

Range for pollutant 715 for day in ng.m-3
type: Concept
notation: 306
status: valid
status modified: 2016-11-17
accepted date: 2016-11-17
in scheme: AQD - Primary observation range
recommended unit: ng.m-3
related pollutant: pyrene (air+aerosol)
primary observation time: Daily average/mean
minimum value: -0.5
maximum value: 7

Range for pollutant 715 for month in ng.m-3
type: Concept
notation: 307
status: valid
status modified: 2016-11-17
accepted date: 2016-11-17
in scheme: AQD - Primary observation range
recommended unit: ng.m-3
related pollutant: pyrene (air+aerosol)
primary observation time: Monthly average/mean
minimum value: -0.5
maximum value: 7

Range for pollutant 715 for var in ng.m-3
type: Concept
notation: 308
status: valid
status modified: 2016-11-17
accepted date: 2016-11-17
in scheme: AQD - Primary observation range
recommended unit: ng.m-3
related pollutant: pyrene (air+aerosol)
primary observation time: Variable sample
minimum value: -0.5
maximum value: 7

Range for pollutant 715 for year in ng.m-3
type: Concept
notation: 309
status: valid
status modified: 2016-11-17
accepted date: 2016-11-17
in scheme: AQD - Primary observation range
recommended unit: ng.m-3
related pollutant: pyrene (air+aerosol)
primary observation time: Yearly average/mean
minimum value: -0.5
maximum value: 7

Range for pollutant 12 for month in ug.m-3
type: Concept
notation: 31
status: valid
status modified: 2016-11-17
accepted date: 2016-11-17
in scheme: AQD - Primary observation range
recommended unit: ug.m-3
related pollutant: Lead (aerosol)
primary observation time: Monthly average/mean
minimum value: -10
maximum value: 3

Range for pollutant 717 for month in ug.m-2.day-1
type: Concept
notation: 310
status: valid
status modified: 2016-11-17
accepted date: 2016-11-17
in scheme: AQD - Primary observation range
recommended unit: ug.m-2.day-1
related pollutant: pyrene (precip+dry_dep)
primary observation time: Monthly average/mean
minimum value: 0
maximum value: 0

Range for pollutant 719 for day in mgS.m-1
type: Concept
notation: 311
status: valid
status modified: 2016-11-17
accepted date: 2016-11-17
in scheme: AQD - Primary observation range
recommended unit: mgS.m-1
related pollutant: sulphate (precip)
primary observation time: Daily average/mean
minimum value: -10
maximum value: 30

Range for pollutant 728 for var in ug.l-1
type: Concept
notation: 312
status: valid
status modified: 2016-11-17
accepted date: 2016-11-17
in scheme: AQD - Primary observation range
recommended unit: ug.l-1
related pollutant: vanadium (precip)
primary observation time: Variable sample
minimum value: 0
maximum value: 10

Range for pollutant 728 for week in ug.l-1
type: Concept
notation: 313
status: valid
status modified: 2016-11-17
accepted date: 2016-11-17
in scheme: AQD - Primary observation range
recommended unit: ug.l-1
related pollutant: vanadium (precip)
primary observation time: Weekly average/mean
minimum value: 0
maximum value: 10

Range for pollutant 753 for day in mm
type: Concept
notation: 314
status: valid
status modified: 2016-11-17
accepted date: 2016-11-17
in scheme: AQD - Primary observation range
recommended unit: mm
related pollutant: precipitation_amount (precip)
primary observation time: Daily average/mean
minimum value: 0
maximum value: 150

Range for pollutant 753 for var in mm
type: Concept
notation: 315
status: valid
status modified: 2016-11-17
accepted date: 2016-11-17
in scheme: AQD - Primary observation range
recommended unit: mm
related pollutant: precipitation_amount (precip)
primary observation time: Variable sample
minimum value: 0
maximum value: 150

Range for pollutant 753 for week in mm
type: Concept
notation: 316
status: valid
status modified: 2016-11-17
accepted date: 2016-11-17
in scheme: AQD - Primary observation range
recommended unit: mm
related pollutant: precipitation_amount (precip)
primary observation time: Weekly average/mean
minimum value: 0
maximum value: 150

Range for pollutant 759 for var in ng.l-1
type: Concept
notation: 317
status: valid
status modified: 2016-11-17
accepted date: 2016-11-17
in scheme: AQD - Primary observation range
recommended unit: ng.l-1
related pollutant: Benzo(j)fluoranthene (precip)
primary observation time: Variable sample
minimum value: -0.5
maximum value: 3

Range for pollutant 760 for day in ug.m-2.day-1
type: Concept
notation: 318
status: valid
status modified: 2016-11-17
accepted date: 2016-11-17
in scheme: AQD - Primary observation range
recommended unit: ug.m-2.day-1
related pollutant: Benzo(j)fluoranthene (precip+dry_dep)
primary observation time: Daily average/mean
minimum value: 0
maximum value: 0.03

Range for pollutant 760 for month in ug.m-2.day-1
type: Concept
notation: 319
status: valid
status modified: 2016-11-17
accepted date: 2016-11-17
in scheme: AQD - Primary observation range
recommended unit: ug.m-2.day-1
related pollutant: Benzo(j)fluoranthene (precip+dry_dep)
primary observation time: Monthly average/mean
minimum value: 0
maximum value: 0.03

Range for pollutant 12 for var in ug.m-3
type: Concept
notation: 32
status: valid
status modified: 2016-11-17
accepted date: 2016-11-17
in scheme: AQD - Primary observation range
recommended unit: ug.m-3
related pollutant: Lead (aerosol)
primary observation time: Variable sample
minimum value: -10
maximum value: 5

Range for pollutant 760 for var in ug.m-2.day-1
type: Concept
notation: 320
status: valid
status modified: 2016-11-17
accepted date: 2016-11-17
in scheme: AQD - Primary observation range
recommended unit: ug.m-2.day-1
related pollutant: Benzo(j)fluoranthene (precip+dry_dep)
primary observation time: Variable sample
minimum value: 0
maximum value: 0.03

Range for pollutant 762 for day in ng.m-3
type: Concept
notation: 321
status: valid
status modified: 2016-11-17
accepted date: 2016-11-17
in scheme: AQD - Primary observation range
recommended unit: ng.m-3
related pollutant: Benzo(j)fluoranthene (air+aerosol)
primary observation time: Daily average/mean
minimum value: 0
maximum value: 3

Range for pollutant 762 for year in ng.m-3
type: Concept
notation: 322
status: valid
status modified: 2016-11-17
accepted date: 2016-11-17
in scheme: AQD - Primary observation range
recommended unit: ng.m-3
related pollutant: Benzo(j)fluoranthene (air+aerosol)
primary observation time: Yearly average/mean
minimum value: 0
maximum value: 3

Range for pollutant 763 for month in ng.m-3
type: Concept
notation: 323
status: valid
status modified: 2016-11-17
accepted date: 2016-11-17
in scheme: AQD - Primary observation range
recommended unit: ng.m-3
related pollutant: Dibenzo(ah)anthracene (air+aerosol)
primary observation time: Monthly average/mean
minimum value: 0
maximum value: 0.2

Range for pollutant 1012 for day in ug.m-3
type: Concept
notation: 324
status: valid
status modified: 2016-11-17
accepted date: 2016-11-17
in scheme: AQD - Primary observation range
recommended unit: ug.m-3
related pollutant: Lead in PM2.5 (aerosol)
primary observation time: Daily average/mean
minimum value: 0
maximum value: 4

Range for pollutant 1014 for day in ng.m-3
type: Concept
notation: 325
status: valid
status modified: 2016-11-17
accepted date: 2016-11-17
in scheme: AQD - Primary observation range
recommended unit: ng.m-3
related pollutant: Cadmium in PM2.5 (aerosol)
primary observation time: Daily average/mean
minimum value: 0
maximum value: 30

Range for pollutant 1015 for day in ng.m-3
type: Concept
notation: 326
status: valid
status modified: 2016-11-17
accepted date: 2016-11-17
in scheme: AQD - Primary observation range
recommended unit: ng.m-3
related pollutant: Nickel in PM2.5 (aerosol)
primary observation time: Daily average/mean
minimum value: 0
maximum value: 200

Range for pollutant 1018 for day in ug.m-3
type: Concept
notation: 327
status: valid
status modified: 2016-11-17
accepted date: 2016-11-17
in scheme: AQD - Primary observation range
recommended unit: ug.m-3
related pollutant: Arsenic in PM2.5 (aerosol)
primary observation time: Daily average/mean
minimum value: 0
maximum value: 40

Range for pollutant 1029 for day in ng.m-3
type: Concept
notation: 328
status: valid
status modified: 2016-11-17
accepted date: 2016-11-17
in scheme: AQD - Primary observation range
recommended unit: ng.m-3
related pollutant: Benzo(a)pyrene in PM2.5 (aerosol)
primary observation time: Daily average/mean
minimum value: 0
maximum value: 60

Range for pollutant 1045 for day in ug.m-3
type: Concept
notation: 329
status: valid
status modified: 2016-11-17
accepted date: 2016-11-17
in scheme: AQD - Primary observation range
recommended unit: ug.m-3
related pollutant: Ammonium in PM2.5 (aerosol)
primary observation time: Daily average/mean
minimum value: 0
maximum value: 20

Range for pollutant 12 for week in ug.m-3
type: Concept
notation: 33
status: valid
status modified: 2016-11-17
accepted date: 2016-11-17
in scheme: AQD - Primary observation range
recommended unit: ug.m-3
related pollutant: Lead (aerosol)
primary observation time: Weekly average/mean
minimum value: -10
maximum value: 4

Range for pollutant 1045 for hour in ug.m-3
type: Concept
notation: 330
status: valid
status modified: 2016-11-17
accepted date: 2016-11-17
in scheme: AQD - Primary observation range
recommended unit: ug.m-3
related pollutant: Ammonium in PM2.5 (aerosol)
primary observation time: Hourly average/mean
minimum value: 0
maximum value: 20

Range for pollutant 1045 for var in ug.m-3
type: Concept
notation: 331
status: valid
status modified: 2016-11-17
accepted date: 2016-11-17
in scheme: AQD - Primary observation range
recommended unit: ug.m-3
related pollutant: Ammonium in PM2.5 (aerosol)
primary observation time: Variable sample
minimum value: -10
maximum value: 6

Range for pollutant 1045 for week in ug.m-3
type: Concept
notation: 332
status: valid
status modified: 2016-11-17
accepted date: 2016-11-17
in scheme: AQD - Primary observation range
recommended unit: ug.m-3
related pollutant: Ammonium in PM2.5 (aerosol)
primary observation time: Weekly average/mean
minimum value: 0
maximum value: 20

Range for pollutant 1045 for year in ug.m-3
type: Concept
notation: 333
status: valid
status modified: 2016-11-17
accepted date: 2016-11-17
in scheme: AQD - Primary observation range
recommended unit: ug.m-3
related pollutant: Ammonium in PM2.5 (aerosol)
primary observation time: Yearly average/mean
minimum value: 0
maximum value: 10

Range for pollutant 1046 for day in ug.m-3
type: Concept
notation: 334
status: valid
status modified: 2016-11-17
accepted date: 2016-11-17
in scheme: AQD - Primary observation range
recommended unit: ug.m-3
related pollutant: Nitrate in PM2.5 (aerosol)
primary observation time: Daily average/mean
minimum value: 0
maximum value: 30

Range for pollutant 1046 for hour in ug.m-3
type: Concept
notation: 335
status: valid
status modified: 2016-11-17
accepted date: 2016-11-17
in scheme: AQD - Primary observation range
recommended unit: ug.m-3
related pollutant: Nitrate in PM2.5 (aerosol)
primary observation time: Hourly average/mean
minimum value: 0
maximum value: 30

Range for pollutant 1046 for var in ug.m-3
type: Concept
notation: 336
status: valid
status modified: 2016-11-17
accepted date: 2016-11-17
in scheme: AQD - Primary observation range
recommended unit: ug.m-3
related pollutant: Nitrate in PM2.5 (aerosol)
primary observation time: Variable sample
minimum value: -10
maximum value: 30

Range for pollutant 1046 for week in ug.m-3
type: Concept
notation: 337
status: valid
status modified: 2016-11-17
accepted date: 2016-11-17
in scheme: AQD - Primary observation range
recommended unit: ug.m-3
related pollutant: Nitrate in PM2.5 (aerosol)
primary observation time: Weekly average/mean
minimum value: -10
maximum value: 30

Range for pollutant 1046 for year in ug.m-3
type: Concept
notation: 338
status: valid
status modified: 2016-11-17
accepted date: 2016-11-17
in scheme: AQD - Primary observation range
recommended unit: ug.m-3
related pollutant: Nitrate in PM2.5 (aerosol)
primary observation time: Yearly average/mean
minimum value: 0
maximum value: 5

Range for pollutant 1047 for day in ug.m-3
type: Concept
notation: 339
status: valid
status modified: 2016-11-17
accepted date: 2016-11-17
in scheme: AQD - Primary observation range
recommended unit: ug.m-3
related pollutant: sulphate in PM2.5 (aerosol)
primary observation time: Daily average/mean
minimum value: 0
maximum value: 15

Range for pollutant 12 for year in ug.m-3
type: Concept
notation: 34
status: valid
status modified: 2016-11-17
accepted date: 2016-11-17
in scheme: AQD - Primary observation range
recommended unit: ug.m-3
related pollutant: Lead (aerosol)
primary observation time: Yearly average/mean
minimum value: -10
maximum value: 3

Range for pollutant 1047 for hour in ug.m-3
type: Concept
notation: 340
status: valid
status modified: 2016-11-17
accepted date: 2016-11-17
in scheme: AQD - Primary observation range
recommended unit: ug.m-3
related pollutant: sulphate in PM2.5 (aerosol)
primary observation time: Hourly average/mean
minimum value: 0
maximum value: 20

Range for pollutant 1047 for var in ug.m-3
type: Concept
notation: 341
status: valid
status modified: 2016-11-17
accepted date: 2016-11-17
in scheme: AQD - Primary observation range
recommended unit: ug.m-3
related pollutant: sulphate in PM2.5 (aerosol)
primary observation time: Variable sample
minimum value: 0
maximum value: 10

Range for pollutant 1047 for week in ug.m-3
type: Concept
notation: 342
status: valid
status modified: 2016-11-17
accepted date: 2016-11-17
in scheme: AQD - Primary observation range
recommended unit: ug.m-3
related pollutant: sulphate in PM2.5 (aerosol)
primary observation time: Weekly average/mean
minimum value: 0
maximum value: 10

Range for pollutant 1047 for year in ug.m-3
type: Concept
notation: 343
status: valid
status modified: 2016-11-17
accepted date: 2016-11-17
in scheme: AQD - Primary observation range
recommended unit: ug.m-3
related pollutant: sulphate in PM2.5 (aerosol)
primary observation time: Yearly average/mean
minimum value: 0
maximum value: 5

Range for pollutant 1063 for day in ng.m-3
type: Concept
notation: 344
status: valid
status modified: 2016-11-17
accepted date: 2016-11-17
in scheme: AQD - Primary observation range
recommended unit: ng.m-3
related pollutant: Zinc in PM2.5 (aerosol)
primary observation time: Daily average/mean
minimum value: -5
maximum value: 500

Range for pollutant 1629 for day in ug.m-3
type: Concept
notation: 345
status: valid
status modified: 2016-11-17
accepted date: 2016-11-17
in scheme: AQD - Primary observation range
recommended unit: ug.m-3
related pollutant: calcium in PM2.5 (aerosol)
primary observation time: Daily average/mean
minimum value: 0
maximum value: 0.4

Range for pollutant 1629 for hour in ug.m-3
type: Concept
notation: 346
status: valid
status modified: 2016-11-17
accepted date: 2016-11-17
in scheme: AQD - Primary observation range
recommended unit: ug.m-3
related pollutant: calcium in PM2.5 (aerosol)
primary observation time: Hourly average/mean
minimum value: 0
maximum value: 0.4

Range for pollutant 1629 for var in ug.m-3
type: Concept
notation: 347
status: valid
status modified: 2016-11-17
accepted date: 2016-11-17
in scheme: AQD - Primary observation range
recommended unit: ug.m-3
related pollutant: calcium in PM2.5 (aerosol)
primary observation time: Variable sample
minimum value: 0
maximum value: 0.4

Range for pollutant 1629 for week in ug.m-3
type: Concept
notation: 348
status: valid
status modified: 2016-11-17
accepted date: 2016-11-17
in scheme: AQD - Primary observation range
recommended unit: ug.m-3
related pollutant: calcium in PM2.5 (aerosol)
primary observation time: Weekly average/mean
minimum value: 0
maximum value: 0.4

Range for pollutant 1629 for year in ug.m-3
type: Concept
notation: 349
status: valid
status modified: 2016-11-17
accepted date: 2016-11-17
in scheme: AQD - Primary observation range
recommended unit: ug.m-3
related pollutant: calcium in PM2.5 (aerosol)
primary observation time: Yearly average/mean
minimum value: 0
maximum value: 0.4

Range for pollutant 13 for day in ng.m-3
type: Concept
notation: 35
status: valid
status modified: 2016-11-17
accepted date: 2016-11-17
in scheme: AQD - Primary observation range
recommended unit: ng.m-3
related pollutant: Mercury (aerosol)
primary observation time: Daily average/mean
minimum value: -10
maximum value: 10

Range for pollutant 1631 for day in ug.m-3
type: Concept
notation: 350
status: valid
status modified: 2016-11-17
accepted date: 2016-11-17
in scheme: AQD - Primary observation range
recommended unit: ug.m-3
related pollutant: chloride in PM2.5 (aerosol)
primary observation time: Daily average/mean
minimum value: 0
maximum value: 3

Range for pollutant 1631 for hour in ug.m-3
type: Concept
notation: 351
status: valid
status modified: 2016-11-17
accepted date: 2016-11-17
in scheme: AQD - Primary observation range
recommended unit: ug.m-3
related pollutant: chloride in PM2.5 (aerosol)
primary observation time: Hourly average/mean
minimum value: 0
maximum value: 3

Range for pollutant 1631 for var in ug.m-3
type: Concept
notation: 352
status: valid
status modified: 2016-11-17
accepted date: 2016-11-17
in scheme: AQD - Primary observation range
recommended unit: ug.m-3
related pollutant: chloride in PM2.5 (aerosol)
primary observation time: Variable sample
minimum value: 0
maximum value: 3

Range for pollutant 1631 for week in ug.m-3
type: Concept
notation: 353
status: valid
status modified: 2016-11-17
accepted date: 2016-11-17
in scheme: AQD - Primary observation range
recommended unit: ug.m-3
related pollutant: chloride in PM2.5 (aerosol)
primary observation time: Weekly average/mean
minimum value: 0
maximum value: 3

Range for pollutant 1631 for year in ug.m-3
type: Concept
notation: 354
status: valid
status modified: 2016-11-17
accepted date: 2016-11-17
in scheme: AQD - Primary observation range
recommended unit: ug.m-3
related pollutant: chloride in PM2.5 (aerosol)
primary observation time: Yearly average/mean
minimum value: 0
maximum value: 3

Range for pollutant 1657 for day in ug.m-3
type: Concept
notation: 355
status: valid
status modified: 2016-11-17
accepted date: 2016-11-17
in scheme: AQD - Primary observation range
recommended unit: ug.m-3
related pollutant: potassium in PM2.5 (aerosol)
primary observation time: Daily average/mean
minimum value: -10
maximum value: 30

Range for pollutant 1657 for hour in ug.m-3
type: Concept
notation: 356
status: valid
status modified: 2016-11-17
accepted date: 2016-11-17
in scheme: AQD - Primary observation range
recommended unit: ug.m-3
related pollutant: potassium in PM2.5 (aerosol)
primary observation time: Hourly average/mean
minimum value: -10
maximum value: 30

Range for pollutant 1657 for var in ug.m-3
type: Concept
notation: 357
status: valid
status modified: 2016-11-17
accepted date: 2016-11-17
in scheme: AQD - Primary observation range
recommended unit: ug.m-3
related pollutant: potassium in PM2.5 (aerosol)
primary observation time: Variable sample
minimum value: -10
maximum value: 30

Range for pollutant 1657 for week in ug.m-3
type: Concept
notation: 358
status: valid
status modified: 2016-11-17
accepted date: 2016-11-17
in scheme: AQD - Primary observation range
recommended unit: ug.m-3
related pollutant: potassium in PM2.5 (aerosol)
primary observation time: Weekly average/mean
minimum value: -10
maximum value: 30

Range for pollutant 1657 for year in ug.m-3
type: Concept
notation: 359
status: valid
status modified: 2016-11-17
accepted date: 2016-11-17
in scheme: AQD - Primary observation range
recommended unit: ug.m-3
related pollutant: potassium in PM2.5 (aerosol)
primary observation time: Yearly average/mean
minimum value: 0
maximum value: 10

Range for pollutant 13 for hour in ng.m-3
type: Concept
notation: 36
status: valid
status modified: 2016-11-17
accepted date: 2016-11-17
in scheme: AQD - Primary observation range
recommended unit: ng.m-3
related pollutant: Mercury (aerosol)
primary observation time: Hourly average/mean
minimum value: -10
maximum value: 10

Range for pollutant 1659 for day in ug.m-3
type: Concept
notation: 360
status: valid
status modified: 2016-11-17
accepted date: 2016-11-17
in scheme: AQD - Primary observation range
recommended unit: ug.m-3
related pollutant: magnesium in PM2.5 (aerosol)
primary observation time: Daily average/mean
minimum value: -10
maximum value: 20

Range for pollutant 1659 for hour in ug.m-3
type: Concept
notation: 361
status: valid
status modified: 2016-11-17
accepted date: 2016-11-17
in scheme: AQD - Primary observation range
recommended unit: ug.m-3
related pollutant: magnesium in PM2.5 (aerosol)
primary observation time: Hourly average/mean
minimum value: -10
maximum value: 20

Range for pollutant 1659 for var in ug.m-3
type: Concept
notation: 362
status: valid
status modified: 2016-11-17
accepted date: 2016-11-17
in scheme: AQD - Primary observation range
recommended unit: ug.m-3
related pollutant: magnesium in PM2.5 (aerosol)
primary observation time: Variable sample
minimum value: -10
maximum value: 20

Range for pollutant 1659 for week in ug.m-3
type: Concept
notation: 363
status: valid
status modified: 2016-11-17
accepted date: 2016-11-17
in scheme: AQD - Primary observation range
recommended unit: ug.m-3
related pollutant: magnesium in PM2.5 (aerosol)
primary observation time: Weekly average/mean
minimum value: -10
maximum value: 20

Range for pollutant 1659 for year in ug.m-3
type: Concept
notation: 364
status: valid
status modified: 2016-11-17
accepted date: 2016-11-17
in scheme: AQD - Primary observation range
recommended unit: ug.m-3
related pollutant: magnesium in PM2.5 (aerosol)
primary observation time: Yearly average/mean
minimum value: 0
maximum value: 20

Range for pollutant 1668 for day in ug.m-3
type: Concept
notation: 365
status: valid
status modified: 2016-11-17
accepted date: 2016-11-17
in scheme: AQD - Primary observation range
recommended unit: ug.m-3
related pollutant: sodium in PM2.5 (aerosol)
primary observation time: Daily average/mean
minimum value: 0
maximum value: 2

Range for pollutant 1668 for hour in ug.m-3
type: Concept
notation: 366
status: valid
status modified: 2016-11-17
accepted date: 2016-11-17
in scheme: AQD - Primary observation range
recommended unit: ug.m-3
related pollutant: sodium in PM2.5 (aerosol)
primary observation time: Hourly average/mean
minimum value: 0
maximum value: 2

Range for pollutant 1668 for var in ug.m-3
type: Concept
notation: 367
status: valid
status modified: 2016-11-17
accepted date: 2016-11-17
in scheme: AQD - Primary observation range
recommended unit: ug.m-3
related pollutant: sodium in PM2.5 (aerosol)
primary observation time: Variable sample
minimum value: 0
maximum value: 2

Range for pollutant 1668 for week in ug.m-3
type: Concept
notation: 368
status: valid
status modified: 2016-11-17
accepted date: 2016-11-17
in scheme: AQD - Primary observation range
recommended unit: ug.m-3
related pollutant: sodium in PM2.5 (aerosol)
primary observation time: Weekly average/mean
minimum value: 0
maximum value: 2

Range for pollutant 1668 for year in ug.m-3
type: Concept
notation: 369
status: valid
status modified: 2016-11-17
accepted date: 2016-11-17
in scheme: AQD - Primary observation range
recommended unit: ug.m-3
related pollutant: sodium in PM2.5 (aerosol)
primary observation time: Yearly average/mean
minimum value: 0
maximum value: 2

Range for pollutant 13 for month in ng.m-3
type: Concept
notation: 37
status: valid
status modified: 2016-11-17
accepted date: 2016-11-17
in scheme: AQD - Primary observation range
recommended unit: ng.m-3
related pollutant: Mercury (aerosol)
primary observation time: Monthly average/mean
minimum value: -10
maximum value: 3

Range for pollutant 1771 for day in ug.m-3
type: Concept
notation: 370
status: valid
status modified: 2016-11-17
accepted date: 2016-11-17
in scheme: AQD - Primary observation range
recommended unit: ug.m-3
related pollutant: Elemental carbon in PM2.5 (aerosol)
primary observation time: Daily average/mean
minimum value: 0
maximum value: 10

Range for pollutant 1771 for var in ug.m-3
type: Concept
notation: 371
status: valid
status modified: 2016-11-17
accepted date: 2016-11-17
in scheme: AQD - Primary observation range
recommended unit: ug.m-3
related pollutant: Elemental carbon in PM2.5 (aerosol)
primary observation time: Variable sample
minimum value: 0
maximum value: 10

Range for pollutant 1771 for week in ug.m-3
type: Concept
notation: 372
status: valid
status modified: 2016-11-17
accepted date: 2016-11-17
in scheme: AQD - Primary observation range
recommended unit: ug.m-3
related pollutant: Elemental carbon in PM2.5 (aerosol)
primary observation time: Weekly average/mean
minimum value: 0
maximum value: 10

Range for pollutant 1771 for year in ug.m-3
type: Concept
notation: 373
status: valid
status modified: 2016-11-17
accepted date: 2016-11-17
in scheme: AQD - Primary observation range
recommended unit: ug.m-3
related pollutant: Elemental carbon in PM2.5 (aerosol)
primary observation time: Yearly average/mean
minimum value: 0
maximum value: 3

Range for pollutant 1772 for day in ug.m-3
type: Concept
notation: 374
status: valid
status modified: 2016-11-17
accepted date: 2016-11-17
in scheme: AQD - Primary observation range
recommended unit: ug.m-3
related pollutant: Organic carbon in PM2.5 (aerosol)
primary observation time: Daily average/mean
minimum value: 0
maximum value: 20

Range for pollutant 1772 for var in ug.m-3
type: Concept
notation: 375
status: valid
status modified: 2016-11-17
accepted date: 2016-11-17
in scheme: AQD - Primary observation range
recommended unit: ug.m-3
related pollutant: Organic carbon in PM2.5 (aerosol)
primary observation time: Variable sample
minimum value: 0
maximum value: 20

Range for pollutant 1772 for week in ug.m-3
type: Concept
notation: 376
status: valid
status modified: 2016-11-17
accepted date: 2016-11-17
in scheme: AQD - Primary observation range
recommended unit: ug.m-3
related pollutant: Organic carbon in PM2.5 (aerosol)
primary observation time: Weekly average/mean
minimum value: 0
maximum value: 20

Range for pollutant 1772 for year in ug.m-3
type: Concept
notation: 377
status: valid
status modified: 2016-11-17
accepted date: 2016-11-17
in scheme: AQD - Primary observation range
recommended unit: ug.m-3
related pollutant: Organic carbon in PM2.5 (aerosol)
primary observation time: Yearly average/mean
minimum value: 0
maximum value: 7

Range for pollutant 2012 for var in ug.l-1
type: Concept
notation: 378
status: valid
status modified: 2016-11-17
accepted date: 2016-11-17
in scheme: AQD - Primary observation range
recommended unit: ug.l-1
related pollutant: Lead (precip)
primary observation time: Variable sample
minimum value: 0
maximum value: 1

Range for pollutant 2012 for week in ug.l-1
type: Concept
notation: 379
status: valid
status modified: 2016-11-17
accepted date: 2016-11-17
in scheme: AQD - Primary observation range
recommended unit: ug.l-1
related pollutant: Lead (precip)
primary observation time: Weekly average/mean
minimum value: -5
maximum value: 10

Range for pollutant 13 for var in ng.m-3
type: Concept
notation: 38
status: valid
status modified: 2016-11-17
accepted date: 2016-11-17
in scheme: AQD - Primary observation range
recommended unit: ng.m-3
related pollutant: Mercury (aerosol)
primary observation time: Variable sample
minimum value: -10
maximum value: 10

Range for pollutant 2013 for week in ng.l-1
type: Concept
notation: 380
status: valid
status modified: 2016-11-17
accepted date: 2016-11-17
in scheme: AQD - Primary observation range
recommended unit: ng.l-1
related pollutant: Mercury (precip)
primary observation time: Weekly average/mean
minimum value: -10
maximum value: 10

Range for pollutant 2014 for month in ug.l-1
type: Concept
notation: 381
status: valid
status modified: 2016-11-17
accepted date: 2016-11-17
in scheme: AQD - Primary observation range
recommended unit: ug.l-1
related pollutant: Cadmium (precip)
primary observation time: Monthly average/mean
minimum value: -5
maximum value: 1

Range for pollutant 2014 for var in ug.l-1
type: Concept
notation: 382
status: valid
status modified: 2016-11-17
accepted date: 2016-11-17
in scheme: AQD - Primary observation range
recommended unit: ug.l-1
related pollutant: Cadmium (precip)
primary observation time: Variable sample
minimum value: -5
maximum value: 1

Range for pollutant 2014 for week in ug.l-1
type: Concept
notation: 383
status: valid
status modified: 2016-11-17
accepted date: 2016-11-17
in scheme: AQD - Primary observation range
recommended unit: ug.l-1
related pollutant: Cadmium (precip)
primary observation time: Weekly average/mean
minimum value: -5
maximum value: 1

Range for pollutant 2015 for month in ug.l-1
type: Concept
notation: 384
status: valid
status modified: 2016-11-17
accepted date: 2016-11-17
in scheme: AQD - Primary observation range
recommended unit: ug.l-1
related pollutant: Nickel (precip)
primary observation time: Monthly average/mean
minimum value: 0
maximum value: 2

Range for pollutant 2015 for var in ug.l-1
type: Concept
notation: 385
status: valid
status modified: 2016-11-17
accepted date: 2016-11-17
in scheme: AQD - Primary observation range
recommended unit: ug.l-1
related pollutant: Nickel (precip)
primary observation time: Variable sample
minimum value: 0
maximum value: 2

Range for pollutant 2015 for week in ug.l-1
type: Concept
notation: 386
status: valid
status modified: 2016-11-17
accepted date: 2016-11-17
in scheme: AQD - Primary observation range
recommended unit: ug.l-1
related pollutant: Nickel (precip)
primary observation time: Weekly average/mean
minimum value: 0
maximum value: 2

Range for pollutant 2016 for var in ug.l-1
type: Concept
notation: 387
status: valid
status modified: 2016-11-17
accepted date: 2016-11-17
in scheme: AQD - Primary observation range
recommended unit: ug.l-1
related pollutant: Chromium (precip)
primary observation time: Variable sample
minimum value: 0
maximum value: 1

Range for pollutant 2016 for week in ug.l-1
type: Concept
notation: 388
status: valid
status modified: 2016-11-17
accepted date: 2016-11-17
in scheme: AQD - Primary observation range
recommended unit: ug.l-1
related pollutant: Chromium (precip)
primary observation time: Weekly average/mean
minimum value: 0
maximum value: 2

Range for pollutant 2018 for month in ug.l-1
type: Concept
notation: 389
status: valid
status modified: 2016-11-17
accepted date: 2016-11-17
in scheme: AQD - Primary observation range
recommended unit: ug.l-1
related pollutant: Arsenic (precip)
primary observation time: Monthly average/mean
minimum value: -0.5
maximum value: 1

Range for pollutant 13 for year in ng.m-3
type: Concept
notation: 39
status: valid
status modified: 2016-11-17
accepted date: 2016-11-17
in scheme: AQD - Primary observation range
recommended unit: ng.m-3
related pollutant: Mercury (aerosol)
primary observation time: Yearly average/mean
minimum value: -10
maximum value: 10

Range for pollutant 2018 for var in ug.l-1
type: Concept
notation: 390
status: valid
status modified: 2016-11-17
accepted date: 2016-11-17
in scheme: AQD - Primary observation range
recommended unit: ug.l-1
related pollutant: Arsenic (precip)
primary observation time: Variable sample
minimum value: -0.5
maximum value: 1

Range for pollutant 2018 for week in ug.l-1
type: Concept
notation: 391
status: valid
status modified: 2016-11-17
accepted date: 2016-11-17
in scheme: AQD - Primary observation range
recommended unit: ug.l-1
related pollutant: Arsenic (precip)
primary observation time: Weekly average/mean
minimum value: -0.5
maximum value: 1

Range for pollutant 2063 for var in ug.l-1
type: Concept
notation: 392
status: valid
status modified: 2016-11-17
accepted date: 2016-11-17
in scheme: AQD - Primary observation range
recommended unit: ug.l-1
related pollutant: Zinc (precip)
primary observation time: Variable sample
minimum value: 0
maximum value: 20

Range for pollutant 2063 for week in ug.l-1
type: Concept
notation: 393
status: valid
status modified: 2016-11-17
accepted date: 2016-11-17
in scheme: AQD - Primary observation range
recommended unit: ug.l-1
related pollutant: Zinc (precip)
primary observation time: Weekly average/mean
minimum value: -5
maximum value: 20

Range for pollutant 2064 for var in ug.l-1
type: Concept
notation: 394
status: valid
status modified: 2016-11-17
accepted date: 2016-11-17
in scheme: AQD - Primary observation range
recommended unit: ug.l-1
related pollutant: Cobalt (precip)
primary observation time: Variable sample
minimum value: 0
maximum value: 0.5

Range for pollutant 2064 for week in ug.l-1
type: Concept
notation: 395
status: valid
status modified: 2016-11-17
accepted date: 2016-11-17
in scheme: AQD - Primary observation range
recommended unit: ug.l-1
related pollutant: Cobalt (precip)
primary observation time: Weekly average/mean
minimum value: 0
maximum value: 0.5

Range for pollutant 2065 for var in ug.l-1
type: Concept
notation: 396
status: valid
status modified: 2016-11-17
accepted date: 2016-11-17
in scheme: AQD - Primary observation range
recommended unit: ug.l-1
related pollutant: Iron (precip)
primary observation time: Variable sample
minimum value: 0
maximum value: 20

Range for pollutant 2065 for week in ug.l-1
type: Concept
notation: 397
status: valid
status modified: 2016-11-17
accepted date: 2016-11-17
in scheme: AQD - Primary observation range
recommended unit: ug.l-1
related pollutant: Iron (precip)
primary observation time: Weekly average/mean
minimum value: -5
maximum value: 500

Range for pollutant 2073 for var in ug.l-1
type: Concept
notation: 398
status: valid
status modified: 2016-11-17
accepted date: 2016-11-17
in scheme: AQD - Primary observation range
recommended unit: ug.l-1
related pollutant: Copper (precip)
primary observation time: Variable sample
minimum value: 0
maximum value: 5

Range for pollutant 2073 for week in ug.l-1
type: Concept
notation: 399
status: valid
status modified: 2016-11-17
accepted date: 2016-11-17
in scheme: AQD - Primary observation range
recommended unit: ug.l-1
related pollutant: Copper (precip)
primary observation time: Weekly average/mean
minimum value: -5
maximum value: 5

Range for pollutant 1 for var in ug.m-3
type: Concept
notation: 4
status: valid
status modified: 2016-11-17
accepted date: 2016-11-17
in scheme: AQD - Primary observation range
recommended unit: ug.m-3
related pollutant: Sulphur dioxide (air)
primary observation time: Variable sample
minimum value: -10
maximum value: 450

Range for pollutant 14 for day in ng.m-3
type: Concept
notation: 40
status: valid
status modified: 2016-11-17
accepted date: 2016-11-17
in scheme: AQD - Primary observation range
recommended unit: ng.m-3
related pollutant: Cadmium (aerosol)
primary observation time: Daily average/mean
minimum value: -10
maximum value: 50

Range for pollutant 2076 for day in pH
type: Concept
notation: 400
status: valid
status modified: 2016-11-17
accepted date: 2016-11-17
in scheme: AQD - Primary observation range
recommended unit: pH
related pollutant: acidity(pH) (precip)
primary observation time: Daily average/mean
minimum value: 0
maximum value: 14

Range for pollutant 3012 for day in ug.m-3
type: Concept
notation: 401
status: valid
status modified: 2016-11-17
accepted date: 2016-11-17
in scheme: AQD - Primary observation range
recommended unit: ug.m-3
related pollutant: Lead in TSP (aerosol)
primary observation time: Daily average/mean
minimum value: 0
maximum value: 5

Range for pollutant 3014 for day in ng.m-3
type: Concept
notation: 402
status: valid
status modified: 2016-11-17
accepted date: 2016-11-17
in scheme: AQD - Primary observation range
recommended unit: ng.m-3
related pollutant: Cadmium in TSP (aerosol)
primary observation time: Daily average/mean
minimum value: 0
maximum value: 100

Range for pollutant 3015 for day in ng.m-3
type: Concept
notation: 403
status: valid
status modified: 2016-11-17
accepted date: 2016-11-17
in scheme: AQD - Primary observation range
recommended unit: ng.m-3
related pollutant: Nickel in TSP (aerosol)
primary observation time: Daily average/mean
minimum value: 0
maximum value: 400

Range for pollutant 3018 for day in ng.m-3
type: Concept
notation: 404
status: valid
status modified: 2016-11-17
accepted date: 2016-11-17
in scheme: AQD - Primary observation range
recommended unit: ng.m-3
related pollutant: Arsenic in TSP (aerosol)
primary observation time: Daily average/mean
minimum value: 0
maximum value: 120

Range for pollutant 4013 for day in ng.m-3
type: Concept
notation: 405
status: valid
status modified: 2016-11-17
accepted date: 2016-11-17
in scheme: AQD - Primary observation range
recommended unit: ng.m-3
related pollutant: Elemental Gaseous Mercury (air+aerosol)
primary observation time: Daily average/mean
minimum value: -10
maximum value: 10

Range for pollutant 4013 for hour in ng.m-3
type: Concept
notation: 406
status: valid
status modified: 2016-11-17
accepted date: 2016-11-17
in scheme: AQD - Primary observation range
recommended unit: ng.m-3
related pollutant: Elemental Gaseous Mercury (air+aerosol)
primary observation time: Hourly average/mean
minimum value: -10
maximum value: 10

Range for pollutant 4013 for var in ng.m-3
type: Concept
notation: 407
status: valid
status modified: 2016-11-17
accepted date: 2016-11-17
in scheme: AQD - Primary observation range
recommended unit: ng.m-3
related pollutant: Elemental Gaseous Mercury (air+aerosol)
primary observation time: Variable sample
minimum value: -10
maximum value: 10

Range for pollutant 4013 for year in ng.m-3
type: Concept
notation: 408
status: valid
status modified: 2016-11-17
accepted date: 2016-11-17
in scheme: AQD - Primary observation range
recommended unit: ng.m-3
related pollutant: Elemental Gaseous Mercury (air+aerosol)
primary observation time: Yearly average/mean
minimum value: -10
maximum value: 10

Range for pollutant 4330 for var in pg.m-3
type: Concept
notation: 409
status: valid
status modified: 2016-11-17
accepted date: 2016-11-17
in scheme: AQD - Primary observation range
recommended unit: pg.m-3
related pollutant: PCB_105 (air+aerosol)
primary observation time: Variable sample
minimum value: -0.5
maximum value: 5

Range for pollutant 14 for month in ng.m-3
type: Concept
notation: 41
status: valid
status modified: 2016-11-17
accepted date: 2016-11-17
in scheme: AQD - Primary observation range
recommended unit: ng.m-3
related pollutant: Cadmium (aerosol)
primary observation time: Monthly average/mean
minimum value: -10
maximum value: 30

Range for pollutant 4336 for var in pg.m-3
type: Concept
notation: 410
status: valid
status modified: 2016-11-17
accepted date: 2016-11-17
in scheme: AQD - Primary observation range
recommended unit: pg.m-3
related pollutant: PCB_149 (air+aerosol)
primary observation time: Variable sample
minimum value: -0.5
maximum value: 30

Range for pollutant 4339 for var in pg.m-3
type: Concept
notation: 411
status: valid
status modified: 2016-11-17
accepted date: 2016-11-17
in scheme: AQD - Primary observation range
recommended unit: pg.m-3
related pollutant: PCB_156 (air+aerosol)
primary observation time: Variable sample
minimum value: -0.5
maximum value: 2

Range for pollutant 4341 for var in pg.m-3
type: Concept
notation: 412
status: valid
status modified: 2016-11-17
accepted date: 2016-11-17
in scheme: AQD - Primary observation range
recommended unit: pg.m-3
related pollutant: PCB_18 (air+aerosol)
primary observation time: Variable sample
minimum value: -0.5
maximum value: 30

Range for pollutant 4406 for day in ng.m-3
type: Concept
notation: 413
status: valid
status modified: 2016-11-17
accepted date: 2016-11-17
in scheme: AQD - Primary observation range
recommended unit: ng.m-3
related pollutant: chrysene (air+aerosol)
primary observation time: Daily average/mean
minimum value: 0
maximum value: 2

Range for pollutant 4406 for month in ng.m-3
type: Concept
notation: 414
status: valid
status modified: 2016-11-17
accepted date: 2016-11-17
in scheme: AQD - Primary observation range
recommended unit: ng.m-3
related pollutant: chrysene (air+aerosol)
primary observation time: Monthly average/mean
minimum value: -0.5
maximum value: 2

Range for pollutant 4406 for var in ng.m-3
type: Concept
notation: 415
status: valid
status modified: 2016-11-17
accepted date: 2016-11-17
in scheme: AQD - Primary observation range
recommended unit: ng.m-3
related pollutant: chrysene (air+aerosol)
primary observation time: Variable sample
minimum value: 0
maximum value: 2

Range for pollutant 4406 for year in ng.m-3
type: Concept
notation: 416
status: valid
status modified: 2016-11-17
accepted date: 2016-11-17
in scheme: AQD - Primary observation range
recommended unit: ng.m-3
related pollutant: chrysene (air+aerosol)
primary observation time: Yearly average/mean
minimum value: 0
maximum value: 2

Range for pollutant 4813 for day in ng.m-3
type: Concept
notation: 417
status: valid
status modified: 2016-11-17
accepted date: 2016-11-17
in scheme: AQD - Primary observation range
recommended unit: ng.m-3
related pollutant: Total gaseous mercury (air+aerosol)
primary observation time: Daily average/mean
minimum value: -10
maximum value: 10

Range for pollutant 4813 for hour in ng.m-3
type: Concept
notation: 418
status: valid
status modified: 2016-11-17
accepted date: 2016-11-17
in scheme: AQD - Primary observation range
recommended unit: ng.m-3
related pollutant: Total gaseous mercury (air+aerosol)
primary observation time: Hourly average/mean
minimum value: -10
maximum value: 10

Range for pollutant 4813 for var in ng.m-3
type: Concept
notation: 419
status: valid
status modified: 2016-11-17
accepted date: 2016-11-17
in scheme: AQD - Primary observation range
recommended unit: ng.m-3
related pollutant: Total gaseous mercury (air+aerosol)
primary observation time: Variable sample
minimum value: -10
maximum value: 10

Range for pollutant 14 for var in ng.m-3
type: Concept
notation: 42
status: valid
status modified: 2016-11-17
accepted date: 2016-11-17
in scheme: AQD - Primary observation range
recommended unit: ng.m-3
related pollutant: Cadmium (aerosol)
primary observation time: Variable sample
minimum value: -10
maximum value: 50

Range for pollutant 4813 for year in ng.m-3
type: Concept
notation: 420
status: valid
status modified: 2016-11-17
accepted date: 2016-11-17
in scheme: AQD - Primary observation range
recommended unit: ng.m-3
related pollutant: Total gaseous mercury (air+aerosol)
primary observation time: Yearly average/mean
minimum value: -10
maximum value: 10

Range for pollutant 5012 for day in ug.m-3
type: Concept
notation: 421
status: valid
status modified: 2016-11-17
accepted date: 2016-11-17
in scheme: AQD - Primary observation range
recommended unit: ug.m-3
related pollutant: Lead in PM10 (aerosol)
primary observation time: Daily average/mean
minimum value: -10
maximum value: 5

Range for pollutant 5012 for month in ug.m-3
type: Concept
notation: 422
status: valid
status modified: 2016-11-17
accepted date: 2016-11-17
in scheme: AQD - Primary observation range
recommended unit: ug.m-3
related pollutant: Lead in PM10 (aerosol)
primary observation time: Monthly average/mean
minimum value: -10
maximum value: 5

Range for pollutant 5012 for var in ug.m-3
type: Concept
notation: 423
status: valid
status modified: 2016-11-17
accepted date: 2016-11-17
in scheme: AQD - Primary observation range
recommended unit: ug.m-3
related pollutant: Lead in PM10 (aerosol)
primary observation time: Variable sample
minimum value: -10
maximum value: 5

Range for pollutant 5012 for week in ug.m-3
type: Concept
notation: 424
status: valid
status modified: 2016-11-17
accepted date: 2016-11-17
in scheme: AQD - Primary observation range
recommended unit: ug.m-3
related pollutant: Lead in PM10 (aerosol)
primary observation time: Weekly average/mean
minimum value: -10
maximum value: 5

Range for pollutant 5012 for year in ug.m-3
type: Concept
notation: 425
status: valid
status modified: 2016-11-17
accepted date: 2016-11-17
in scheme: AQD - Primary observation range
recommended unit: ug.m-3
related pollutant: Lead in PM10 (aerosol)
primary observation time: Yearly average/mean
minimum value: -10
maximum value: 5

Range for pollutant 5013 for day in ng.m-3
type: Concept
notation: 426
status: valid
status modified: 2016-11-17
accepted date: 2016-11-17
in scheme: AQD - Primary observation range
recommended unit: ng.m-3
related pollutant: Mercury in PM10 (aerosol)
primary observation time: Daily average/mean
minimum value: 0
maximum value: 10

Range for pollutant 5014 for day in ng.m-3
type: Concept
notation: 427
status: valid
status modified: 2016-11-17
accepted date: 2016-11-17
in scheme: AQD - Primary observation range
recommended unit: ng.m-3
related pollutant: Cadmium in PM10 (aerosol)
primary observation time: Daily average/mean
minimum value: -10
maximum value: 50

Range for pollutant 5014 for month in ng.m-3
type: Concept
notation: 428
status: valid
status modified: 2016-11-17
accepted date: 2016-11-17
in scheme: AQD - Primary observation range
recommended unit: ng.m-3
related pollutant: Cadmium in PM10 (aerosol)
primary observation time: Monthly average/mean
minimum value: -10
maximum value: 50

Range for pollutant 5014 for var in ng.m-3
type: Concept
notation: 429
status: valid
status modified: 2016-11-17
accepted date: 2016-11-17
in scheme: AQD - Primary observation range
recommended unit: ng.m-3
related pollutant: Cadmium in PM10 (aerosol)
primary observation time: Variable sample
minimum value: -10
maximum value: 50

Range for pollutant 14 for week in ng.m-3
type: Concept
notation: 43
status: valid
status modified: 2016-11-17
accepted date: 2016-11-17
in scheme: AQD - Primary observation range
recommended unit: ng.m-3
related pollutant: Cadmium (aerosol)
primary observation time: Weekly average/mean
minimum value: -10
maximum value: 50

Range for pollutant 5014 for week in ng.m-3
type: Concept
notation: 430
status: valid
status modified: 2016-11-17
accepted date: 2016-11-17
in scheme: AQD - Primary observation range
recommended unit: ng.m-3
related pollutant: Cadmium in PM10 (aerosol)
primary observation time: Weekly average/mean
minimum value: -10
maximum value: 50

Range for pollutant 5014 for year in ng.m-3
type: Concept
notation: 431
status: valid
status modified: 2016-11-17
accepted date: 2016-11-17
in scheme: AQD - Primary observation range
recommended unit: ng.m-3
related pollutant: Cadmium in PM10 (aerosol)
primary observation time: Yearly average/mean
minimum value: -10
maximum value: 50

Range for pollutant 5015 for day in ng.m-3
type: Concept
notation: 432
status: valid
status modified: 2016-11-17
accepted date: 2016-11-17
in scheme: AQD - Primary observation range
recommended unit: ng.m-3
related pollutant: Nickel in PM10 (aerosol)
primary observation time: Daily average/mean
minimum value: 0
maximum value: 300

Range for pollutant 5015 for month in ng.m-3
type: Concept
notation: 433
status: valid
status modified: 2016-11-17
accepted date: 2016-11-17
in scheme: AQD - Primary observation range
recommended unit: ng.m-3
related pollutant: Nickel in PM10 (aerosol)
primary observation time: Monthly average/mean
minimum value: -10
maximum value: 200

Range for pollutant 5015 for var in ng.m-3
type: Concept
notation: 434
status: valid
status modified: 2016-11-17
accepted date: 2016-11-17
in scheme: AQD - Primary observation range
recommended unit: ng.m-3
related pollutant: Nickel in PM10 (aerosol)
primary observation time: Variable sample
minimum value: -10
maximum value: 200

Range for pollutant 5015 for week in ng.m-3
type: Concept
notation: 435
status: valid
status modified: 2016-11-17
accepted date: 2016-11-17
in scheme: AQD - Primary observation range
recommended unit: ng.m-3
related pollutant: Nickel in PM10 (aerosol)
primary observation time: Weekly average/mean
minimum value: -10
maximum value: 200

Range for pollutant 5015 for year in ng.m-3
type: Concept
notation: 436
status: valid
status modified: 2016-11-17
accepted date: 2016-11-17
in scheme: AQD - Primary observation range
recommended unit: ng.m-3
related pollutant: Nickel in PM10 (aerosol)
primary observation time: Yearly average/mean
minimum value: -10
maximum value: 200

Range for pollutant 5016 for day in ng.m-3
type: Concept
notation: 437
status: valid
status modified: 2016-11-17
accepted date: 2016-11-17
in scheme: AQD - Primary observation range
recommended unit: ng.m-3
related pollutant: Chromium in PM10 (aerosol)
primary observation time: Daily average/mean
minimum value: 0
maximum value: 20

Range for pollutant 5018 for day in ng.m-3
type: Concept
notation: 438
status: valid
status modified: 2016-11-17
accepted date: 2016-11-17
in scheme: AQD - Primary observation range
recommended unit: ng.m-3
related pollutant: Arsenic in PM10 (aerosol)
primary observation time: Daily average/mean
minimum value: -10
maximum value: 60

Range for pollutant 5018 for month in ng.m-3
type: Concept
notation: 439
status: valid
status modified: 2016-11-17
accepted date: 2016-11-17
in scheme: AQD - Primary observation range
recommended unit: ng.m-3
related pollutant: Arsenic in PM10 (aerosol)
primary observation time: Monthly average/mean
minimum value: -10
maximum value: 40

Range for pollutant 14 for year in ng.m-3
type: Concept
notation: 44
status: valid
status modified: 2016-11-17
accepted date: 2016-11-17
in scheme: AQD - Primary observation range
recommended unit: ng.m-3
related pollutant: Cadmium (aerosol)
primary observation time: Yearly average/mean
minimum value: -10
maximum value: 30

Range for pollutant 5018 for var in ng.m-3
type: Concept
notation: 440
status: valid
status modified: 2016-11-17
accepted date: 2016-11-17
in scheme: AQD - Primary observation range
recommended unit: ng.m-3
related pollutant: Arsenic in PM10 (aerosol)
primary observation time: Variable sample
minimum value: -10
maximum value: 60

Range for pollutant 5018 for week in ng.m-3
type: Concept
notation: 441
status: valid
status modified: 2016-11-17
accepted date: 2016-11-17
in scheme: AQD - Primary observation range
recommended unit: ng.m-3
related pollutant: Arsenic in PM10 (aerosol)
primary observation time: Weekly average/mean
minimum value: -10
maximum value: 60

Range for pollutant 5018 for year in ng.m-3
type: Concept
notation: 442
status: valid
status modified: 2016-11-17
accepted date: 2016-11-17
in scheme: AQD - Primary observation range
recommended unit: ng.m-3
related pollutant: Arsenic in PM10 (aerosol)
primary observation time: Yearly average/mean
minimum value: -10
maximum value: 60

Range for pollutant 5029 for day in ng.m-3
type: Concept
notation: 443
status: valid
status modified: 2016-11-17
accepted date: 2016-11-17
in scheme: AQD - Primary observation range
recommended unit: ng.m-3
related pollutant: Benzo(a)pyrene in PM10 (aerosol)
primary observation time: Daily average/mean
minimum value: 0
maximum value: 60

Range for pollutant 5029 for hour in ng.m-3
type: Concept
notation: 444
status: valid
status modified: 2016-11-17
accepted date: 2016-11-17
in scheme: AQD - Primary observation range
recommended unit: ng.m-3
related pollutant: Benzo(a)pyrene in PM10 (aerosol)
primary observation time: Hourly average/mean
minimum value: 0
maximum value: 60

Range for pollutant 5029 for month in ng.m-3
type: Concept
notation: 445
status: valid
status modified: 2016-11-17
accepted date: 2016-11-17
in scheme: AQD - Primary observation range
recommended unit: ng.m-3
related pollutant: Benzo(a)pyrene in PM10 (aerosol)
primary observation time: Monthly average/mean
minimum value: 0
maximum value: 60

Range for pollutant 5029 for var in ng.m-3
type: Concept
notation: 446
status: valid
status modified: 2016-11-17
accepted date: 2016-11-17
in scheme: AQD - Primary observation range
recommended unit: ng.m-3
related pollutant: Benzo(a)pyrene in PM10 (aerosol)
primary observation time: Variable sample
minimum value: 0
maximum value: 60

Range for pollutant 5029 for week in ng.m-3
type: Concept
notation: 447
status: valid
status modified: 2016-11-17
accepted date: 2016-11-17
in scheme: AQD - Primary observation range
recommended unit: ng.m-3
related pollutant: Benzo(a)pyrene in PM10 (aerosol)
primary observation time: Weekly average/mean
minimum value: 0
maximum value: 60

Range for pollutant 5029 for year in ng.m-3
type: Concept
notation: 448
status: valid
status modified: 2016-11-17
accepted date: 2016-11-17
in scheme: AQD - Primary observation range
recommended unit: ng.m-3
related pollutant: Benzo(a)pyrene in PM10 (aerosol)
primary observation time: Yearly average/mean
minimum value: 0
maximum value: 100

Range for pollutant 5045 for day in ug.m-3
type: Concept
notation: 449
status: valid
status modified: 2016-11-17
accepted date: 2016-11-17
in scheme: AQD - Primary observation range
recommended unit: ug.m-3
related pollutant: Ammonium in PM10 (aerosol)
primary observation time: Daily average/mean
minimum value: 0
maximum value: 20

Range for pollutant 15 for day in ng.m-3
type: Concept
notation: 45
status: valid
status modified: 2016-11-17
accepted date: 2016-11-17
in scheme: AQD - Primary observation range
recommended unit: ng.m-3
related pollutant: Nickel (aerosol)
primary observation time: Daily average/mean
minimum value: -10
maximum value: 200

Range for pollutant 5046 for day in ug.m-3
type: Concept
notation: 450
status: valid
status modified: 2016-11-17
accepted date: 2016-11-17
in scheme: AQD - Primary observation range
recommended unit: ug.m-3
related pollutant: Nitrate in PM10 (aerosol)
primary observation time: Daily average/mean
minimum value: 0
maximum value: 25

Range for pollutant 5047 for day in ug.m-3
type: Concept
notation: 451
status: valid
status modified: 2016-11-17
accepted date: 2016-11-17
in scheme: AQD - Primary observation range
recommended unit: ug.m-3
related pollutant: sulphate in PM10 (aerosol)
primary observation time: Daily average/mean
minimum value: 0
maximum value: 15

Range for pollutant 5129 for day in ng.m-3
type: Concept
notation: 452
status: valid
status modified: 2016-11-17
accepted date: 2016-11-17
in scheme: AQD - Primary observation range
recommended unit: ng.m-3
related pollutant: Benzo(a)pyrene in PM10 (air+aerosol)
primary observation time: Daily average/mean
minimum value: 0
maximum value: 60

Range for pollutant 5129 for month in ng.m-3
type: Concept
notation: 453
status: valid
status modified: 2016-11-17
accepted date: 2016-11-17
in scheme: AQD - Primary observation range
recommended unit: ng.m-3
related pollutant: Benzo(a)pyrene in PM10 (air+aerosol)
primary observation time: Monthly average/mean
minimum value: 0
maximum value: 60

Range for pollutant 5129 for year in ng.m-3
type: Concept
notation: 454
status: valid
status modified: 2016-11-17
accepted date: 2016-11-17
in scheme: AQD - Primary observation range
recommended unit: ng.m-3
related pollutant: Benzo(a)pyrene in PM10 (air+aerosol)
primary observation time: Yearly average/mean
minimum value: 0
maximum value: 10

Range for pollutant 5380 for day in ng.m-3
type: Concept
notation: 455
status: valid
status modified: 2016-11-17
accepted date: 2016-11-17
in scheme: AQD - Primary observation range
recommended unit: ng.m-3
related pollutant: Benzo(b,j,k)fluoranthene in PM10 (aerosol)
primary observation time: Daily average/mean
minimum value: 0
maximum value: 4

Range for pollutant 5380 for month in ng.m-3
type: Concept
notation: 456
status: valid
status modified: 2016-11-17
accepted date: 2016-11-17
in scheme: AQD - Primary observation range
recommended unit: ng.m-3
related pollutant: Benzo(b,j,k)fluoranthene in PM10 (aerosol)
primary observation time: Monthly average/mean
minimum value: 0
maximum value: 3

Range for pollutant 5380 for var in ng.m-3
type: Concept
notation: 457
status: valid
status modified: 2016-11-17
accepted date: 2016-11-17
in scheme: AQD - Primary observation range
recommended unit: ng.m-3
related pollutant: Benzo(b,j,k)fluoranthene in PM10 (aerosol)
primary observation time: Variable sample
minimum value: 0
maximum value: 3

Range for pollutant 5419 for day in ng.m-3
type: Concept
notation: 458
status: valid
status modified: 2016-11-17
accepted date: 2016-11-17
in scheme: AQD - Primary observation range
recommended unit: ng.m-3
related pollutant: Dibenzo(ah)anthracene in PM10 (aerosol)
primary observation time: Daily average/mean
minimum value: 0
maximum value: 1

Range for pollutant 5419 for month in ng.m-3
type: Concept
notation: 459
status: valid
status modified: 2016-11-17
accepted date: 2016-11-17
in scheme: AQD - Primary observation range
recommended unit: ng.m-3
related pollutant: Dibenzo(ah)anthracene in PM10 (aerosol)
primary observation time: Monthly average/mean
minimum value: 0
maximum value: 0.2

Range for pollutant 15 for month in ng.m-3
type: Concept
notation: 46
status: valid
status modified: 2016-11-17
accepted date: 2016-11-17
in scheme: AQD - Primary observation range
recommended unit: ng.m-3
related pollutant: Nickel (aerosol)
primary observation time: Monthly average/mean
minimum value: -10
maximum value: 150

Range for pollutant 5419 for var in ng.m-3
type: Concept
notation: 460
status: valid
status modified: 2016-11-17
accepted date: 2016-11-17
in scheme: AQD - Primary observation range
recommended unit: ng.m-3
related pollutant: Dibenzo(ah)anthracene in PM10 (aerosol)
primary observation time: Variable sample
minimum value: 0
maximum value: 1

Range for pollutant 5419 for week in ng.m-3
type: Concept
notation: 461
status: valid
status modified: 2016-11-17
accepted date: 2016-11-17
in scheme: AQD - Primary observation range
recommended unit: ng.m-3
related pollutant: Dibenzo(ah)anthracene in PM10 (aerosol)
primary observation time: Weekly average/mean
minimum value: 0
maximum value: 1

Range for pollutant 5419 for year in ng.m-3
type: Concept
notation: 462
status: valid
status modified: 2016-11-17
accepted date: 2016-11-17
in scheme: AQD - Primary observation range
recommended unit: ng.m-3
related pollutant: Dibenzo(ah)anthracene in PM10 (aerosol)
primary observation time: Yearly average/mean
minimum value: 0
maximum value: 0.2

Range for pollutant 5609 for day in ng.m-3
type: Concept
notation: 463
status: valid
status modified: 2016-11-17
accepted date: 2016-11-17
in scheme: AQD - Primary observation range
recommended unit: ng.m-3
related pollutant: Benzo(a)anthracene in PM10 (air+aerosol)
primary observation time: Daily average/mean
minimum value: -0.5
maximum value: 6

Range for pollutant 5609 for month in ng.m-3
type: Concept
notation: 464
status: valid
status modified: 2016-11-17
accepted date: 2016-11-17
in scheme: AQD - Primary observation range
recommended unit: ng.m-3
related pollutant: Benzo(a)anthracene in PM10 (air+aerosol)
primary observation time: Monthly average/mean
minimum value: -0.5
maximum value: 6

Range for pollutant 5609 for var in ng.m-3
type: Concept
notation: 465
status: valid
status modified: 2016-11-17
accepted date: 2016-11-17
in scheme: AQD - Primary observation range
recommended unit: ng.m-3
related pollutant: Benzo(a)anthracene in PM10 (air+aerosol)
primary observation time: Variable sample
minimum value: -0.5
maximum value: 6

Range for pollutant 5609 for year in ng.m-3
type: Concept
notation: 466
status: valid
status modified: 2016-11-17
accepted date: 2016-11-17
in scheme: AQD - Primary observation range
recommended unit: ng.m-3
related pollutant: Benzo(a)anthracene in PM10 (air+aerosol)
primary observation time: Yearly average/mean
minimum value: 0
maximum value: 3

Range for pollutant 5610 for day in ng.m-3
type: Concept
notation: 467
status: valid
status modified: 2016-11-17
accepted date: 2016-11-17
in scheme: AQD - Primary observation range
recommended unit: ng.m-3
related pollutant: Benzo(a)anthracene in PM10 (aerosol)
primary observation time: Daily average/mean
minimum value: -0.5
maximum value: 6

Range for pollutant 5610 for month in ng.m-3
type: Concept
notation: 468
status: valid
status modified: 2016-11-17
accepted date: 2016-11-17
in scheme: AQD - Primary observation range
recommended unit: ng.m-3
related pollutant: Benzo(a)anthracene in PM10 (aerosol)
primary observation time: Monthly average/mean
minimum value: -0.5
maximum value: 6

Range for pollutant 5610 for var in ng.m-3
type: Concept
notation: 469
status: valid
status modified: 2016-11-17
accepted date: 2016-11-17
in scheme: AQD - Primary observation range
recommended unit: ng.m-3
related pollutant: Benzo(a)anthracene in PM10 (aerosol)
primary observation time: Variable sample
minimum value: -0.5
maximum value: 6

Range for pollutant 15 for var in ng.m-3
type: Concept
notation: 47
status: valid
status modified: 2016-11-17
accepted date: 2016-11-17
in scheme: AQD - Primary observation range
recommended unit: ng.m-3
related pollutant: Nickel (aerosol)
primary observation time: Variable sample
minimum value: -10
maximum value: 200

Range for pollutant 5610 for week in ng.m-3
type: Concept
notation: 470
status: valid
status modified: 2016-11-17
accepted date: 2016-11-17
in scheme: AQD - Primary observation range
recommended unit: ng.m-3
related pollutant: Benzo(a)anthracene in PM10 (aerosol)
primary observation time: Weekly average/mean
minimum value: -0.5
maximum value: 6

Range for pollutant 5610 for year in ng.m-3
type: Concept
notation: 471
status: valid
status modified: 2016-11-17
accepted date: 2016-11-17
in scheme: AQD - Primary observation range
recommended unit: ng.m-3
related pollutant: Benzo(a)anthracene in PM10 (aerosol)
primary observation time: Yearly average/mean
minimum value: -0.5
maximum value: 6

Range for pollutant 5616 for day in ng.m-3
type: Concept
notation: 472
status: valid
status modified: 2016-11-17
accepted date: 2016-11-17
in scheme: AQD - Primary observation range
recommended unit: ng.m-3
related pollutant: Benzo(b)fluoranthene in PM10 (air+aerosol)
primary observation time: Daily average/mean
minimum value: 0
maximum value: 3

Range for pollutant 5616 for var in ng.m-3
type: Concept
notation: 473
status: valid
status modified: 2016-11-17
accepted date: 2016-11-17
in scheme: AQD - Primary observation range
recommended unit: ng.m-3
related pollutant: Benzo(b)fluoranthene in PM10 (air+aerosol)
primary observation time: Variable sample
minimum value: 0
maximum value: 3

Range for pollutant 5617 for day in ng.m-3
type: Concept
notation: 474
status: valid
status modified: 2016-11-17
accepted date: 2016-11-17
in scheme: AQD - Primary observation range
recommended unit: ng.m-3
related pollutant: Benzo(b)fluoranthene in PM10 (aerosol)
primary observation time: Daily average/mean
minimum value: 0
maximum value: 3

Range for pollutant 5617 for month in ng.m-3
type: Concept
notation: 475
status: valid
status modified: 2016-11-17
accepted date: 2016-11-17
in scheme: AQD - Primary observation range
recommended unit: ng.m-3
related pollutant: Benzo(b)fluoranthene in PM10 (aerosol)
primary observation time: Monthly average/mean
minimum value: 0
maximum value: 3

Range for pollutant 5617 for var in ng.m-3
type: Concept
notation: 476
status: valid
status modified: 2016-11-17
accepted date: 2016-11-17
in scheme: AQD - Primary observation range
recommended unit: ng.m-3
related pollutant: Benzo(b)fluoranthene in PM10 (aerosol)
primary observation time: Variable sample
minimum value: 0
maximum value: 3

Range for pollutant 5617 for week in ng.m-3
type: Concept
notation: 477
status: valid
status modified: 2016-11-17
accepted date: 2016-11-17
in scheme: AQD - Primary observation range
recommended unit: ng.m-3
related pollutant: Benzo(b)fluoranthene in PM10 (aerosol)
primary observation time: Weekly average/mean
minimum value: 0
maximum value: 3
status modified: 2018-09-14

Range for pollutant 5617 for year in ng.m-3
type: Concept
notation: 478
status: valid
status modified: 2016-11-17
accepted date: 2016-11-17
in scheme: AQD - Primary observation range
recommended unit: ng.m-3
related pollutant: Benzo(b)fluoranthene in PM10 (aerosol)
primary observation time: Yearly average/mean
minimum value: 0
maximum value: 3

Range for pollutant 5625 for day in ng.m-3
type: Concept
notation: 479
status: valid
status modified: 2016-11-17
accepted date: 2016-11-17
in scheme: AQD - Primary observation range
recommended unit: ng.m-3
related pollutant: Benzo(k)fluoranthene in PM10 (air+aerosol)
primary observation time: Daily average/mean
minimum value: -0.5
maximum value: 3

Range for pollutant 15 for week in ng.m-3
type: Concept
notation: 48
status: valid
status modified: 2016-11-17
accepted date: 2016-11-17
in scheme: AQD - Primary observation range
recommended unit: ng.m-3
related pollutant: Nickel (aerosol)
primary observation time: Weekly average/mean
minimum value: -10
maximum value: 200

Range for pollutant 5625 for month in ng.m-3
type: Concept
notation: 480
status: valid
status modified: 2016-11-17
accepted date: 2016-11-17
in scheme: AQD - Primary observation range
recommended unit: ng.m-3
related pollutant: Benzo(k)fluoranthene in PM10 (air+aerosol)
primary observation time: Monthly average/mean
minimum value: -0.5
maximum value: 3

Range for pollutant 5625 for var in ng.m-3
type: Concept
notation: 481
status: valid
status modified: 2016-11-17
accepted date: 2016-11-17
in scheme: AQD - Primary observation range
recommended unit: ng.m-3
related pollutant: Benzo(k)fluoranthene in PM10 (air+aerosol)
primary observation time: Variable sample
minimum value: -0.5
maximum value: 3

Range for pollutant 5625 for year in ng.m-3
type: Concept
notation: 482
status: valid
status modified: 2016-11-17
accepted date: 2016-11-17
in scheme: AQD - Primary observation range
recommended unit: ng.m-3
related pollutant: Benzo(k)fluoranthene in PM10 (air+aerosol)
primary observation time: Yearly average/mean
minimum value: 0
maximum value: 3

Range for pollutant 5626 for day in ng.m-3
type: Concept
notation: 483
status: valid
status modified: 2016-11-17
accepted date: 2016-11-17
in scheme: AQD - Primary observation range
recommended unit: ng.m-3
related pollutant: Benzo(k)fluoranthene in PM10 (aerosol)
primary observation time: Daily average/mean
minimum value: -0.5
maximum value: 3

Range for pollutant 5626 for month in ng.m-3
type: Concept
notation: 484
status: valid
status modified: 2016-11-17
accepted date: 2016-11-17
in scheme: AQD - Primary observation range
recommended unit: ng.m-3
related pollutant: Benzo(k)fluoranthene in PM10 (aerosol)
primary observation time: Monthly average/mean
minimum value: -0.5
maximum value: 3

Range for pollutant 5626 for var in ng.m-3
type: Concept
notation: 485
status: valid
status modified: 2016-11-17
accepted date: 2016-11-17
in scheme: AQD - Primary observation range
recommended unit: ng.m-3
related pollutant: Benzo(k)fluoranthene in PM10 (aerosol)
primary observation time: Variable sample
minimum value: -0.5
maximum value: 3

Range for pollutant 5626 for week in ng.m-3
type: Concept
notation: 486
status: valid
status modified: 2016-11-17
accepted date: 2016-11-17
in scheme: AQD - Primary observation range
recommended unit: ng.m-3
related pollutant: Benzo(k)fluoranthene in PM10 (aerosol)
primary observation time: Weekly average/mean
minimum value: -0.5
maximum value: 3

Range for pollutant 5626 for year in ng.m-3
type: Concept
notation: 487
status: valid
status modified: 2016-11-17
accepted date: 2016-11-17
in scheme: AQD - Primary observation range
recommended unit: ng.m-3
related pollutant: Benzo(k)fluoranthene in PM10 (aerosol)
primary observation time: Yearly average/mean
minimum value: 0
maximum value: 3

Range for pollutant 5629 for day in ug.m-3
type: Concept
notation: 488
status: valid
status modified: 2016-11-17
accepted date: 2016-11-17
in scheme: AQD - Primary observation range
recommended unit: ug.m-3
related pollutant: calcium in PM10 (aerosol)
primary observation time: Daily average/mean
minimum value: 0
maximum value: 0.40000001

Range for pollutant 5631 for day in ug.m-3
type: Concept
notation: 489
status: valid
status modified: 2016-11-17
accepted date: 2016-11-17
in scheme: AQD - Primary observation range
recommended unit: ug.m-3
related pollutant: chloride in PM10 (aerosol)
primary observation time: Daily average/mean
minimum value: 0
maximum value: 3

Range for pollutant 15 for year in ng.m-3
type: Concept
notation: 49
status: valid
status modified: 2016-11-17
accepted date: 2016-11-17
in scheme: AQD - Primary observation range
recommended unit: ng.m-3
related pollutant: Nickel (aerosol)
primary observation time: Yearly average/mean
minimum value: -10
maximum value: 100

Range for pollutant 5654 for day in ng.m-3
type: Concept
notation: 490
status: valid
status modified: 2016-11-17
accepted date: 2016-11-17
in scheme: AQD - Primary observation range
recommended unit: ng.m-3
related pollutant: indeno_123cd_pyrene in PM10 (air+aerosol)
primary observation time: Daily average/mean
minimum value: 0
maximum value: 2

Range for pollutant 5654 for month in ng.m-3
type: Concept
notation: 491
status: valid
status modified: 2016-11-17
accepted date: 2016-11-17
in scheme: AQD - Primary observation range
recommended unit: ng.m-3
related pollutant: indeno_123cd_pyrene in PM10 (air+aerosol)
primary observation time: Monthly average/mean
minimum value: 0
maximum value: 1

Range for pollutant 5654 for var in ng.m-3
type: Concept
notation: 492
status: valid
status modified: 2016-11-17
accepted date: 2016-11-17
in scheme: AQD - Primary observation range
recommended unit: ng.m-3
related pollutant: indeno_123cd_pyrene in PM10 (air+aerosol)
primary observation time: Variable sample
minimum value: 0
maximum value: 2

Range for pollutant 5654 for year in ng.m-3
type: Concept
notation: 493
status: valid
status modified: 2016-11-17
accepted date: 2016-11-17
in scheme: AQD - Primary observation range
recommended unit: ng.m-3
related pollutant: indeno_123cd_pyrene in PM10 (air+aerosol)
primary observation time: Yearly average/mean
minimum value: 0
maximum value: 2

Range for pollutant 5655 for day in ng.m-3
type: Concept
notation: 494
status: valid
status modified: 2016-11-17
accepted date: 2016-11-17
in scheme: AQD - Primary observation range
recommended unit: ng.m-3
related pollutant: indeno_123cd_pyrene in PM10 (aerosol)
primary observation time: Daily average/mean
minimum value: 0
maximum value: 3.5

Range for pollutant 5655 for month in ng.m-3
type: Concept
notation: 495
status: valid
status modified: 2016-11-17
accepted date: 2016-11-17
in scheme: AQD - Primary observation range
recommended unit: ng.m-3
related pollutant: indeno_123cd_pyrene in PM10 (aerosol)
primary observation time: Monthly average/mean
minimum value: 0
maximum value: 2

Range for pollutant 5655 for var in ng.m-3
type: Concept
notation: 496
status: valid
status modified: 2016-11-17
accepted date: 2016-11-17
in scheme: AQD - Primary observation range
recommended unit: ng.m-3
related pollutant: indeno_123cd_pyrene in PM10 (aerosol)
primary observation time: Variable sample
minimum value: 0
maximum value: 2

Range for pollutant 5655 for week in ng.m-3
type: Concept
notation: 497
status: valid
status modified: 2016-11-17
accepted date: 2016-11-17
in scheme: AQD - Primary observation range
recommended unit: ng.m-3
related pollutant: indeno_123cd_pyrene in PM10 (aerosol)
primary observation time: Weekly average/mean
minimum value: 0
maximum value: 2

Range for pollutant 5655 for year in ng.m-3
type: Concept
notation: 498
status: valid
status modified: 2016-11-17
accepted date: 2016-11-17
in scheme: AQD - Primary observation range
recommended unit: ng.m-3
related pollutant: indeno_123cd_pyrene in PM10 (aerosol)
primary observation time: Yearly average/mean
minimum value: 0
maximum value: 1

Range for pollutant 5657 for day in ug.m-3
type: Concept
notation: 499
status: valid
status modified: 2016-11-17
accepted date: 2016-11-17
in scheme: AQD - Primary observation range
recommended unit: ug.m-3
related pollutant: potassium in PM10 (aerosol)
primary observation time: Daily average/mean
minimum value: 0
maximum value: 25

Range for pollutant 1 for week in ug.m-3
type: Concept
notation: 5
status: valid
status modified: 2016-11-17
accepted date: 2016-11-17
in scheme: AQD - Primary observation range
recommended unit: ug.m-3
related pollutant: Sulphur dioxide (air)
primary observation time: Weekly average/mean
minimum value: -10
maximum value: 450

Range for pollutant 16 for day in ng.m-3
type: Concept
notation: 50
status: valid
status modified: 2016-11-17
accepted date: 2016-11-17
in scheme: AQD - Primary observation range
recommended unit: ng.m-3
related pollutant: Chromium (aerosol)
primary observation time: Daily average/mean
minimum value: -0.5
maximum value: 3

Range for pollutant 5659 for day in ug.m-3
type: Concept
notation: 500
status: valid
status modified: 2016-11-17
accepted date: 2016-11-17
in scheme: AQD - Primary observation range
recommended unit: ug.m-3
related pollutant: magnesium in PM10 (aerosol)
primary observation time: Daily average/mean
minimum value: 0
maximum value: 20

Range for pollutant 5668 for day in ug.m-3
type: Concept
notation: 501
status: valid
status modified: 2016-11-17
accepted date: 2016-11-17
in scheme: AQD - Primary observation range
recommended unit: ug.m-3
related pollutant: sodium in PM10 (aerosol)
primary observation time: Daily average/mean
minimum value: 0
maximum value: 3

Range for pollutant 5759 for day in ng.m-3
type: Concept
notation: 502
status: valid
status modified: 2016-11-17
accepted date: 2016-11-17
in scheme: AQD - Primary observation range
recommended unit: ng.m-3
related pollutant: Benzo(j)fluoranthene in PM10 (aerosol)
primary observation time: Daily average/mean
minimum value: -0.5
maximum value: 3

Range for pollutant 5759 for month in ng.m-3
type: Concept
notation: 503
status: valid
status modified: 2016-11-17
accepted date: 2016-11-17
in scheme: AQD - Primary observation range
recommended unit: ng.m-3
related pollutant: Benzo(j)fluoranthene in PM10 (aerosol)
primary observation time: Monthly average/mean
minimum value: -0.5
maximum value: 3

Range for pollutant 5759 for var in ng.m-3
type: Concept
notation: 504
status: valid
status modified: 2016-11-17
accepted date: 2016-11-17
in scheme: AQD - Primary observation range
recommended unit: ng.m-3
related pollutant: Benzo(j)fluoranthene in PM10 (aerosol)
primary observation time: Variable sample
minimum value: -0.5
maximum value: 3

Range for pollutant 5759 for week in ng.m-3
type: Concept
notation: 505
status: valid
status modified: 2016-11-17
accepted date: 2016-11-17
in scheme: AQD - Primary observation range
recommended unit: ng.m-3
related pollutant: Benzo(j)fluoranthene in PM10 (aerosol)
primary observation time: Weekly average/mean
minimum value: 0
maximum value: 3

Range for pollutant 5759 for year in ng.m-3
type: Concept
notation: 506
status: valid
status modified: 2016-11-17
accepted date: 2016-11-17
in scheme: AQD - Primary observation range
recommended unit: ng.m-3
related pollutant: Benzo(j)fluoranthene in PM10 (aerosol)
primary observation time: Yearly average/mean
minimum value: -0.5
maximum value: 3

Range for pollutant 5762 for day in ng.m-3
type: Concept
notation: 507
status: valid
status modified: 2016-11-17
accepted date: 2016-11-17
in scheme: AQD - Primary observation range
recommended unit: ng.m-3
related pollutant: Benzo(j)fluoranthene in PM10 (air+aerosol)
primary observation time: Daily average/mean
minimum value: -0.5
maximum value: 5

Range for pollutant 5762 for month in ng.m-3
type: Concept
notation: 508
status: valid
status modified: 2016-11-17
accepted date: 2016-11-17
in scheme: AQD - Primary observation range
recommended unit: ng.m-3
related pollutant: Benzo(j)fluoranthene in PM10 (air+aerosol)
primary observation time: Monthly average/mean
minimum value: -0.5
maximum value: 5

Range for pollutant 5762 for var in ng.m-3
type: Concept
notation: 509
status: valid
status modified: 2016-11-17
accepted date: 2016-11-17
in scheme: AQD - Primary observation range
recommended unit: ng.m-3
related pollutant: Benzo(j)fluoranthene in PM10 (air+aerosol)
primary observation time: Variable sample
minimum value: -0.5
maximum value: 5

Range for pollutant 17 for day in ng.m-3
type: Concept
notation: 51
status: valid
status modified: 2016-11-17
accepted date: 2016-11-17
in scheme: AQD - Primary observation range
recommended unit: ng.m-3
related pollutant: Manganese (aerosol)
primary observation time: Daily average/mean
minimum value: 0
maximum value: 60

Range for pollutant 5763 for day in ng.m-3
type: Concept
notation: 510
status: valid
status modified: 2016-11-17
accepted date: 2016-11-17
in scheme: AQD - Primary observation range
recommended unit: ng.m-3
related pollutant: Dibenzo(ah)anthracene in PM10 (air+aerosol)
primary observation time: Daily average/mean
minimum value: 0
maximum value: 0.5

Range for pollutant 5763 for var in ng.m-3
type: Concept
notation: 511
status: valid
status modified: 2016-11-17
accepted date: 2016-11-17
in scheme: AQD - Primary observation range
recommended unit: ng.m-3
related pollutant: Dibenzo(ah)anthracene in PM10 (air+aerosol)
primary observation time: Variable sample
minimum value: 0
maximum value: 0.5

Range for pollutant 5771 for day in ug.m-3
type: Concept
notation: 512
status: valid
status modified: 2016-11-17
accepted date: 2016-11-17
in scheme: AQD - Primary observation range
recommended unit: ug.m-3
related pollutant: Elemental carbon in PM10 (aerosol)
primary observation time: Daily average/mean
minimum value: 0
maximum value: 15

Range for pollutant 5772 for day in ug.m-3
type: Concept
notation: 513
status: valid
status modified: 2016-11-17
accepted date: 2016-11-17
in scheme: AQD - Primary observation range
recommended unit: ug.m-3
related pollutant: Organic carbon in PM10 (aerosol)
primary observation time: Daily average/mean
minimum value: 0
maximum value: 20

Range for pollutant 6001 for day in ug.m-3
type: Concept
notation: 514
status: valid
status modified: 2016-11-17
accepted date: 2016-11-17
in scheme: AQD - Primary observation range
recommended unit: ug.m-3
related pollutant: Particulate matter < 2.5 µm (aerosol)
primary observation time: Daily average/mean
minimum value: -10
maximum value: 525

Range for pollutant 6001 for hour in ug.m-3
type: Concept
notation: 515
status: valid
status modified: 2016-11-17
accepted date: 2016-11-17
in scheme: AQD - Primary observation range
recommended unit: ug.m-3
related pollutant: Particulate matter < 2.5 µm (aerosol)
primary observation time: Hourly average/mean
minimum value: -10
maximum value: 700

Range for pollutant 6001 for var in ug.m-3
type: Concept
notation: 516
status: valid
status modified: 2016-11-17
accepted date: 2016-11-17
in scheme: AQD - Primary observation range
recommended unit: ug.m-3
related pollutant: Particulate matter < 2.5 µm (aerosol)
primary observation time: Variable sample
minimum value: -10
maximum value: 525

Range for pollutant 6002 for day in ug.m-3
type: Concept
notation: 517
status: valid
status modified: 2016-11-17
accepted date: 2016-11-17
in scheme: AQD - Primary observation range
recommended unit: ug.m-3
related pollutant: Particulate matter < 1 µm (aerosol)
primary observation time: Daily average/mean
minimum value: -10
maximum value: 525

Range for pollutant 6002 for hour in ug.m-3
type: Concept
notation: 518
status: valid
status modified: 2016-11-17
accepted date: 2016-11-17
in scheme: AQD - Primary observation range
recommended unit: ug.m-3
related pollutant: Particulate matter < 1 µm (aerosol)
primary observation time: Hourly average/mean
minimum value: -10
maximum value: 700

Range for pollutant 6005 for day in ug.m-3
type: Concept
notation: 519
status: valid
status modified: 2016-11-17
accepted date: 2016-11-17
in scheme: AQD - Primary observation range
recommended unit: ug.m-3
related pollutant: 1-Butene (air)
primary observation time: Daily average/mean
minimum value: -10
maximum value: 10

Range for pollutant 18 for day in ng.m-3
type: Concept
notation: 52
status: valid
status modified: 2016-11-17
accepted date: 2016-11-17
in scheme: AQD - Primary observation range
recommended unit: ng.m-3
related pollutant: Arsenic (aerosol)
primary observation time: Daily average/mean
minimum value: -10
maximum value: 60

Range for pollutant 6005 for hour in ug.m-3
type: Concept
notation: 520
status: valid
status modified: 2016-11-17
accepted date: 2016-11-17
in scheme: AQD - Primary observation range
recommended unit: ug.m-3
related pollutant: 1-Butene (air)
primary observation time: Hourly average/mean
minimum value: -10
maximum value: 15

Range for pollutant 6005 for month in ug.m-3
type: Concept
notation: 521
status: valid
status modified: 2016-11-17
accepted date: 2016-11-17
in scheme: AQD - Primary observation range
recommended unit: ug.m-3
related pollutant: 1-Butene (air)
primary observation time: Monthly average/mean
minimum value: -10
maximum value: 15

Range for pollutant 6006 for day in ug.m-3
type: Concept
notation: 522
status: valid
status modified: 2016-11-17
accepted date: 2016-11-17
in scheme: AQD - Primary observation range
recommended unit: ug.m-3
related pollutant: trans-2-Butene (air)
primary observation time: Daily average/mean
minimum value: -10
maximum value: 8

Range for pollutant 6006 for hour in ug.m-3
type: Concept
notation: 523
status: valid
status modified: 2016-11-17
accepted date: 2016-11-17
in scheme: AQD - Primary observation range
recommended unit: ug.m-3
related pollutant: trans-2-Butene (air)
primary observation time: Hourly average/mean
minimum value: -10
maximum value: 8

Range for pollutant 6007 for day in ug.m-3
type: Concept
notation: 524
status: valid
status modified: 2016-11-17
accepted date: 2016-11-17
in scheme: AQD - Primary observation range
recommended unit: ug.m-3
related pollutant: cis-2-Butene (air)
primary observation time: Daily average/mean
minimum value: -10
maximum value: 8

Range for pollutant 6007 for hour in ug.m-3
type: Concept
notation: 525
status: valid
status modified: 2016-11-17
accepted date: 2016-11-17
in scheme: AQD - Primary observation range
recommended unit: ug.m-3
related pollutant: cis-2-Butene (air)
primary observation time: Hourly average/mean
minimum value: -10
maximum value: 8

Range for pollutant 6008 for day in ug.m-3
type: Concept
notation: 526
status: valid
status modified: 2016-11-17
accepted date: 2016-11-17
in scheme: AQD - Primary observation range
recommended unit: ug.m-3
related pollutant: 1-Pentene (air)
primary observation time: Daily average/mean
minimum value: -10
maximum value: 10

Range for pollutant 6008 for hour in ug.m-3
type: Concept
notation: 527
status: valid
status modified: 2016-11-17
accepted date: 2016-11-17
in scheme: AQD - Primary observation range
recommended unit: ug.m-3
related pollutant: 1-Pentene (air)
primary observation time: Hourly average/mean
minimum value: 0
maximum value: 12

Range for pollutant 6008 for var in ug.m-3
type: Concept
notation: 528
status: valid
status modified: 2016-11-17
accepted date: 2016-11-17
in scheme: AQD - Primary observation range
recommended unit: ug.m-3
related pollutant: 1-Pentene (air)
primary observation time: Variable sample
minimum value: -10
maximum value: 12

Range for pollutant 6008 for week in ug.m-3
type: Concept
notation: 529
status: valid
status modified: 2016-11-17
accepted date: 2016-11-17
in scheme: AQD - Primary observation range
recommended unit: ug.m-3
related pollutant: 1-Pentene (air)
primary observation time: Weekly average/mean
minimum value: 0
maximum value: 10

Range for pollutant 18 for month in ng.m-3
type: Concept
notation: 53
status: valid
status modified: 2016-11-17
accepted date: 2016-11-17
in scheme: AQD - Primary observation range
recommended unit: ng.m-3
related pollutant: Arsenic (aerosol)
primary observation time: Monthly average/mean
minimum value: -10
maximum value: 50

Range for pollutant 6009 for day in ug.m-3
type: Concept
notation: 530
status: valid
status modified: 2016-11-17
accepted date: 2016-11-17
in scheme: AQD - Primary observation range
recommended unit: ug.m-3
related pollutant: 2-Pentene (air)
primary observation time: Daily average/mean
minimum value: -10
maximum value: 10

Range for pollutant 6009 for hour in ug.m-3
type: Concept
notation: 531
status: valid
status modified: 2016-11-17
accepted date: 2016-11-17
in scheme: AQD - Primary observation range
recommended unit: ug.m-3
related pollutant: 2-Pentene (air)
primary observation time: Hourly average/mean
minimum value: 0
maximum value: 12

Range for pollutant 6009 for var in ug.m-3
type: Concept
notation: 532
status: valid
status modified: 2016-11-17
accepted date: 2016-11-17
in scheme: AQD - Primary observation range
recommended unit: ug.m-3
related pollutant: 2-Pentene (air)
primary observation time: Variable sample
minimum value: -10
maximum value: 12

Range for pollutant 6009 for week in ug.m-3
type: Concept
notation: 533
status: valid
status modified: 2016-11-17
accepted date: 2016-11-17
in scheme: AQD - Primary observation range
recommended unit: ug.m-3
related pollutant: 2-Pentene (air)
primary observation time: Weekly average/mean
minimum value: 0
maximum value: 8

Range for pollutant 6011 for day in ug.m-3
type: Concept
notation: 534
status: valid
status modified: 2016-11-17
accepted date: 2016-11-17
in scheme: AQD - Primary observation range
recommended unit: ug.m-3
related pollutant: 1,2,4-Trimethylbenzene (air)
primary observation time: Daily average/mean
minimum value: -10
maximum value: 3

Range for pollutant 6011 for hour in ug.m-3
type: Concept
notation: 535
status: valid
status modified: 2016-11-17
accepted date: 2016-11-17
in scheme: AQD - Primary observation range
recommended unit: ug.m-3
related pollutant: 1,2,4-Trimethylbenzene (air)
primary observation time: Hourly average/mean
minimum value: -10
maximum value: 50

Range for pollutant 6011 for var in ug.m-3
type: Concept
notation: 536
status: valid
status modified: 2016-11-17
accepted date: 2016-11-17
in scheme: AQD - Primary observation range
recommended unit: ug.m-3
related pollutant: 1,2,4-Trimethylbenzene (air)
primary observation time: Variable sample
minimum value: -10
maximum value: 50

Range for pollutant 6011 for week in ug.m-3
type: Concept
notation: 537
status: valid
status modified: 2016-11-17
accepted date: 2016-11-17
in scheme: AQD - Primary observation range
recommended unit: ug.m-3
related pollutant: 1,2,4-Trimethylbenzene (air)
primary observation time: Weekly average/mean
minimum value: -10
maximum value: 3

Range for pollutant 6012 for day in ug.m-3
type: Concept
notation: 538
status: valid
status modified: 2016-11-17
accepted date: 2016-11-17
in scheme: AQD - Primary observation range
recommended unit: ug.m-3
related pollutant: 1,2,3-Trimethylbenzene (air)
primary observation time: Daily average/mean
minimum value: -10
maximum value: 3

Range for pollutant 6012 for hour in ug.m-3
type: Concept
notation: 539
status: valid
status modified: 2016-11-17
accepted date: 2016-11-17
in scheme: AQD - Primary observation range
recommended unit: ug.m-3
related pollutant: 1,2,3-Trimethylbenzene (air)
primary observation time: Hourly average/mean
minimum value: -10
maximum value: 5

Range for pollutant 18 for var in ng.m-3
type: Concept
notation: 54
status: valid
status modified: 2016-11-17
accepted date: 2016-11-17
in scheme: AQD - Primary observation range
recommended unit: ng.m-3
related pollutant: Arsenic (aerosol)
primary observation time: Variable sample
minimum value: -10
maximum value: 60

Range for pollutant 6012 for var in ug.m-3
type: Concept
notation: 540
status: valid
status modified: 2016-11-17
accepted date: 2016-11-17
in scheme: AQD - Primary observation range
recommended unit: ug.m-3
related pollutant: 1,2,3-Trimethylbenzene (air)
primary observation time: Variable sample
minimum value: -10
maximum value: 5

Range for pollutant 6012 for week in ug.m-3
type: Concept
notation: 541
status: valid
status modified: 2016-11-17
accepted date: 2016-11-17
in scheme: AQD - Primary observation range
recommended unit: ug.m-3
related pollutant: 1,2,3-Trimethylbenzene (air)
primary observation time: Weekly average/mean
minimum value: -10
maximum value: 3

Range for pollutant 6013 for day in ug.m-3
type: Concept
notation: 542
status: valid
status modified: 2016-11-17
accepted date: 2016-11-17
in scheme: AQD - Primary observation range
recommended unit: ug.m-3
related pollutant: 1,3,5-Trimethylbenzene (air)
primary observation time: Daily average/mean
minimum value: -10
maximum value: 3

Range for pollutant 6013 for hour in ug.m-3
type: Concept
notation: 543
status: valid
status modified: 2016-11-17
accepted date: 2016-11-17
in scheme: AQD - Primary observation range
recommended unit: ug.m-3
related pollutant: 1,3,5-Trimethylbenzene (air)
primary observation time: Hourly average/mean
minimum value: -10
maximum value: 15

Range for pollutant 6013 for var in ug.m-3
type: Concept
notation: 544
status: valid
status modified: 2016-11-17
accepted date: 2016-11-17
in scheme: AQD - Primary observation range
recommended unit: ug.m-3
related pollutant: 1,3,5-Trimethylbenzene (air)
primary observation time: Variable sample
minimum value: -10
maximum value: 15

Range for pollutant 6013 for week in ug.m-3
type: Concept
notation: 545
status: valid
status modified: 2016-11-17
accepted date: 2016-11-17
in scheme: AQD - Primary observation range
recommended unit: ug.m-3
related pollutant: 1,3,5-Trimethylbenzene (air)
primary observation time: Weekly average/mean
minimum value: -10
maximum value: 3

Range for pollutant 6015 for day in ng.m-3
type: Concept
notation: 546
status: valid
status modified: 2016-11-17
accepted date: 2016-11-17
in scheme: AQD - Primary observation range
recommended unit: ng.m-3
related pollutant: Benzo(a)pyrene (air+aerosol)
primary observation time: Daily average/mean
minimum value: 0
maximum value: 60

Range for pollutant 6015 for month in ng.m-3
type: Concept
notation: 547
status: valid
status modified: 2016-11-17
accepted date: 2016-11-17
in scheme: AQD - Primary observation range
recommended unit: ng.m-3
related pollutant: Benzo(a)pyrene (air+aerosol)
primary observation time: Monthly average/mean
minimum value: 0
maximum value: 60

Range for pollutant 6015 for var in ng.m-3
type: Concept
notation: 548
status: valid
status modified: 2016-11-17
accepted date: 2016-11-17
in scheme: AQD - Primary observation range
recommended unit: ng.m-3
related pollutant: Benzo(a)pyrene (air+aerosol)
primary observation time: Variable sample
minimum value: 0
maximum value: 60

Range for pollutant 6015 for year in ng.m-3
type: Concept
notation: 549
status: valid
status modified: 2016-11-17
accepted date: 2016-11-17
in scheme: AQD - Primary observation range
recommended unit: ng.m-3
related pollutant: Benzo(a)pyrene (air+aerosol)
primary observation time: Yearly average/mean
minimum value: -10
maximum value: 20

Range for pollutant 18 for week in ng.m-3
type: Concept
notation: 55
status: valid
status modified: 2016-11-17
accepted date: 2016-11-17
in scheme: AQD - Primary observation range
recommended unit: ng.m-3
related pollutant: Arsenic (aerosol)
primary observation time: Weekly average/mean
minimum value: -10
maximum value: 60

Range for pollutant 6380 for day in ng.m-3
type: Concept
notation: 550
status: valid
status modified: 2016-11-17
accepted date: 2016-11-17
in scheme: AQD - Primary observation range
recommended unit: ng.m-3
related pollutant: Benzo(b,j,k)fluoranthene in PM10 (air+aerosol)
primary observation time: Daily average/mean
minimum value: 0
maximum value: 3

Range for pollutant 7012 for month in ug.m-2.day-1
type: Concept
notation: 551
status: valid
status modified: 2016-11-17
accepted date: 2016-11-17
in scheme: AQD - Primary observation range
recommended unit: ug.m-2.day-1
related pollutant: Lead (precip+dry_dep)
primary observation time: Monthly average/mean
minimum value: 0
maximum value: 3

Range for pollutant 7012 for week in ug.m-2.day-1
type: Concept
notation: 552
status: valid
status modified: 2016-11-17
accepted date: 2016-11-17
in scheme: AQD - Primary observation range
recommended unit: ug.m-2.day-1
related pollutant: Lead (precip+dry_dep)
primary observation time: Weekly average/mean
minimum value: 0
maximum value: 4

Range for pollutant 7012 for year in ug.m-2.day-1
type: Concept
notation: 553
status: valid
status modified: 2016-11-17
accepted date: 2016-11-17
in scheme: AQD - Primary observation range
recommended unit: ug.m-2.day-1
related pollutant: Lead (precip+dry_dep)
primary observation time: Yearly average/mean
minimum value: 0
maximum value: 2

Range for pollutant 7013 for month in ug.m-2.day-1
type: Concept
notation: 554
status: valid
status modified: 2016-11-17
accepted date: 2016-11-17
in scheme: AQD - Primary observation range
recommended unit: ug.m-2.day-1
related pollutant: Mercury (precip+dry_dep)
primary observation time: Monthly average/mean
minimum value: -10
maximum value: 10

Range for pollutant 7013 for var in ug.m-2.day-1
type: Concept
notation: 555
status: valid
status modified: 2016-11-17
accepted date: 2016-11-17
in scheme: AQD - Primary observation range
recommended unit: ug.m-2.day-1
related pollutant: Mercury (precip+dry_dep)
primary observation time: Variable sample
minimum value: -10
maximum value: 10

Range for pollutant 7013 for year in ug.m-2.day-1
type: Concept
notation: 556
status: valid
status modified: 2016-11-17
accepted date: 2016-11-17
in scheme: AQD - Primary observation range
recommended unit: ug.m-2.day-1
related pollutant: Mercury (precip+dry_dep)
primary observation time: Yearly average/mean
minimum value: 0
maximum value: 10

Range for pollutant 7014 for day in ug.m-2.day-1
type: Concept
notation: 557
status: valid
status modified: 2016-11-17
accepted date: 2016-11-17
in scheme: AQD - Primary observation range
recommended unit: ug.m-2.day-1
related pollutant: Cadmium (precip+dry_dep)
primary observation time: Daily average/mean
minimum value: -0.5
maximum value: 3

Range for pollutant 7014 for month in ug.m-2.day-1
type: Concept
notation: 558
status: valid
status modified: 2016-11-17
accepted date: 2016-11-17
in scheme: AQD - Primary observation range
recommended unit: ug.m-2.day-1
related pollutant: Cadmium (precip+dry_dep)
primary observation time: Monthly average/mean
minimum value: -0.5
maximum value: 3

Range for pollutant 7014 for var in ug.m-2.day-1
type: Concept
notation: 559
status: valid
status modified: 2016-11-17
accepted date: 2016-11-17
in scheme: AQD - Primary observation range
recommended unit: ug.m-2.day-1
related pollutant: Cadmium (precip+dry_dep)
primary observation time: Variable sample
minimum value: -0.5
maximum value: 3

Range for pollutant 18 for year in ng.m-3
type: Concept
notation: 56
status: valid
status modified: 2016-11-17
accepted date: 2016-11-17
in scheme: AQD - Primary observation range
recommended unit: ng.m-3
related pollutant: Arsenic (aerosol)
primary observation time: Yearly average/mean
minimum value: -10
maximum value: 40

Range for pollutant 7014 for week in ug.m-2.day-1
type: Concept
notation: 560
status: valid
status modified: 2016-11-17
accepted date: 2016-11-17
in scheme: AQD - Primary observation range
recommended unit: ug.m-2.day-1
related pollutant: Cadmium (precip+dry_dep)
primary observation time: Weekly average/mean
minimum value: -0.5
maximum value: 3

Range for pollutant 7014 for year in ug.m-2.day-1
type: Concept
notation: 561
status: valid
status modified: 2016-11-17
accepted date: 2016-11-17
in scheme: AQD - Primary observation range
recommended unit: ug.m-2.day-1
related pollutant: Cadmium (precip+dry_dep)
primary observation time: Yearly average/mean
minimum value: -0.5
maximum value: 3

Range for pollutant 7015 for day in ug.m-2.day-1
type: Concept
notation: 562
status: valid
status modified: 2016-11-17
accepted date: 2016-11-17
in scheme: AQD - Primary observation range
recommended unit: ug.m-2.day-1
related pollutant: Nickel (precip+dry_dep)
primary observation time: Daily average/mean
minimum value: 0
maximum value: 7

Range for pollutant 7015 for month in ug.m-2.day-1
type: Concept
notation: 563
status: valid
status modified: 2016-11-17
accepted date: 2016-11-17
in scheme: AQD - Primary observation range
recommended unit: ug.m-2.day-1
related pollutant: Nickel (precip+dry_dep)
primary observation time: Monthly average/mean
minimum value: 0
maximum value: 7

Range for pollutant 7015 for var in ug.m-2.day-1
type: Concept
notation: 564
status: valid
status modified: 2016-11-17
accepted date: 2016-11-17
in scheme: AQD - Primary observation range
recommended unit: ug.m-2.day-1
related pollutant: Nickel (precip+dry_dep)
primary observation time: Variable sample
minimum value: 0
maximum value: 5

Range for pollutant 7015 for week in ug.m-2.day-1
type: Concept
notation: 565
status: valid
status modified: 2016-11-17
accepted date: 2016-11-17
in scheme: AQD - Primary observation range
recommended unit: ug.m-2.day-1
related pollutant: Nickel (precip+dry_dep)
primary observation time: Weekly average/mean
minimum value: -0.5
maximum value: 7

Range for pollutant 7015 for year in ug.m-2.day-1
type: Concept
notation: 566
status: valid
status modified: 2016-11-17
accepted date: 2016-11-17
in scheme: AQD - Primary observation range
recommended unit: ug.m-2.day-1
related pollutant: Nickel (precip+dry_dep)
primary observation time: Yearly average/mean
minimum value: 0
maximum value: 5

Range for pollutant 7018 for day in ug.m-2.day-1
type: Concept
notation: 567
status: valid
status modified: 2016-11-17
accepted date: 2016-11-17
in scheme: AQD - Primary observation range
recommended unit: ug.m-2.day-1
related pollutant: Arsenic (precip+dry_dep)
primary observation time: Daily average/mean
minimum value: -0.5
maximum value: 0.6

Range for pollutant 7018 for month in ug.m-2.day-1
type: Concept
notation: 568
status: valid
status modified: 2016-11-17
accepted date: 2016-11-17
in scheme: AQD - Primary observation range
recommended unit: ug.m-2.day-1
related pollutant: Arsenic (precip+dry_dep)
primary observation time: Monthly average/mean
minimum value: -0.5
maximum value: 1.2

Range for pollutant 7018 for var in ug.m-2.day-1
type: Concept
notation: 569
status: valid
status modified: 2016-11-17
accepted date: 2016-11-17
in scheme: AQD - Primary observation range
recommended unit: ug.m-2.day-1
related pollutant: Arsenic (precip+dry_dep)
primary observation time: Variable sample
minimum value: -0.5
maximum value: 0.6

Range for pollutant 19 for hour in ug.m-3
type: Concept
notation: 57
status: valid
status modified: 2016-11-17
accepted date: 2016-11-17
in scheme: AQD - Primary observation range
recommended unit: ug.m-3
related pollutant: Carbon disulphide (air)
primary observation time: Hourly average/mean
minimum value: -10
maximum value: 10

Range for pollutant 7018 for week in ug.m-2.day-1
type: Concept
notation: 570
status: valid
status modified: 2016-11-17
accepted date: 2016-11-17
in scheme: AQD - Primary observation range
recommended unit: ug.m-2.day-1
related pollutant: Arsenic (precip+dry_dep)
primary observation time: Weekly average/mean
minimum value: -0.5
maximum value: 0.6

Range for pollutant 7018 for year in ug.m-2.day-1
type: Concept
notation: 571
status: valid
status modified: 2016-11-17
accepted date: 2016-11-17
in scheme: AQD - Primary observation range
recommended unit: ug.m-2.day-1
related pollutant: Arsenic (precip+dry_dep)
primary observation time: Yearly average/mean
minimum value: -0.5
maximum value: 0.6

Range for pollutant 7029 for day in ug.m-2.day-1
type: Concept
notation: 572
status: valid
status modified: 2016-11-17
accepted date: 2016-11-17
in scheme: AQD - Primary observation range
recommended unit: ug.m-2.day-1
related pollutant: Benzo(a)pyrene (precip+dry_dep)
primary observation time: Daily average/mean
minimum value: 0
maximum value: 60

Range for pollutant 7029 for month in ug.m-2.day-1
type: Concept
notation: 573
status: valid
status modified: 2016-11-17
accepted date: 2016-11-17
in scheme: AQD - Primary observation range
recommended unit: ug.m-2.day-1
related pollutant: Benzo(a)pyrene (precip+dry_dep)
primary observation time: Monthly average/mean
minimum value: 0
maximum value: 60

Range for pollutant 7029 for var in ug.m-2.day-1
type: Concept
notation: 574
status: valid
status modified: 2016-11-17
accepted date: 2016-11-17
in scheme: AQD - Primary observation range
recommended unit: ug.m-2.day-1
related pollutant: Benzo(a)pyrene (precip+dry_dep)
primary observation time: Variable sample
minimum value: 0
maximum value: 60

Range for pollutant 7029 for week in ug.m-2.day-1
type: Concept
notation: 575
status: valid
status modified: 2016-11-17
accepted date: 2016-11-17
in scheme: AQD - Primary observation range
recommended unit: ug.m-2.day-1
related pollutant: Benzo(a)pyrene (precip+dry_dep)
primary observation time: Weekly average/mean
minimum value: 0
maximum value: 60

Range for pollutant 7029 for year in ug.m-2.day-1
type: Concept
notation: 576
status: valid
status modified: 2016-11-17
accepted date: 2016-11-17
in scheme: AQD - Primary observation range
recommended unit: ug.m-2.day-1
related pollutant: Benzo(a)pyrene (precip+dry_dep)
primary observation time: Yearly average/mean
minimum value: 0
maximum value: 60

Range for pollutant 7380 for month in ug.m-2.day-1
type: Concept
notation: 577
status: valid
status modified: 2016-11-17
accepted date: 2016-11-17
in scheme: AQD - Primary observation range
recommended unit: ug.m-2.day-1
related pollutant: Benzo(b,j,k)fluoranthene (precip+dry_dep)
primary observation time: Monthly average/mean
minimum value: 0
maximum value: 3

Range for pollutant 7380 for var in ug.m-2.day-1
type: Concept
notation: 578
status: valid
status modified: 2016-11-17
accepted date: 2016-11-17
in scheme: AQD - Primary observation range
recommended unit: ug.m-2.day-1
related pollutant: Benzo(b,j,k)fluoranthene (precip+dry_dep)
primary observation time: Variable sample
minimum value: 0
maximum value: 3

Range for pollutant 7380 for week in ug.m-2.day-1
type: Concept
notation: 579
status: valid
status modified: 2016-11-17
accepted date: 2016-11-17
in scheme: AQD - Primary observation range
recommended unit: ug.m-2.day-1
related pollutant: Benzo(b,j,k)fluoranthene (precip+dry_dep)
primary observation time: Weekly average/mean
minimum value: 0
maximum value: 3

Range for pollutant 20 for day in ug.m-3
type: Concept
notation: 58
status: valid
status modified: 2016-11-17
accepted date: 2016-11-17
in scheme: AQD - Primary observation range
recommended unit: ug.m-3
related pollutant: Benzene (air)
primary observation time: Daily average/mean
minimum value: -10
maximum value: 35

Range for pollutant 7407 for month in ug.m-2.day-1
type: Concept
notation: 580
status: valid
status modified: 2016-11-17
accepted date: 2016-11-17
in scheme: AQD - Primary observation range
recommended unit: ug.m-2.day-1
related pollutant: chrysene_triphenylene (precip+dry_dep)
primary observation time: Monthly average/mean
minimum value: 0
maximum value: 0.2

Range for pollutant 7419 for day in ug.m-2.day-1
type: Concept
notation: 581
status: valid
status modified: 2016-11-17
accepted date: 2016-11-17
in scheme: AQD - Primary observation range
recommended unit: ug.m-2.day-1
related pollutant: Dibenzo(ah)anthracene (precip+dry_dep)
primary observation time: Daily average/mean
minimum value: 0
maximum value: 4

Range for pollutant 7419 for month in ug.m-2.day-1
type: Concept
notation: 582
status: valid
status modified: 2016-11-17
accepted date: 2016-11-17
in scheme: AQD - Primary observation range
recommended unit: ug.m-2.day-1
related pollutant: Dibenzo(ah)anthracene (precip+dry_dep)
primary observation time: Monthly average/mean
minimum value: 0
maximum value: 4

Range for pollutant 7419 for var in ug.m-2.day-1
type: Concept
notation: 583
status: valid
status modified: 2016-11-17
accepted date: 2016-11-17
in scheme: AQD - Primary observation range
recommended unit: ug.m-2.day-1
related pollutant: Dibenzo(ah)anthracene (precip+dry_dep)
primary observation time: Variable sample
minimum value: 0
maximum value: 4

Range for pollutant 7419 for week in ug.m-2.day-1
type: Concept
notation: 584
status: valid
status modified: 2016-11-17
accepted date: 2016-11-17
in scheme: AQD - Primary observation range
recommended unit: ug.m-2.day-1
related pollutant: Dibenzo(ah)anthracene (precip+dry_dep)
primary observation time: Weekly average/mean
minimum value: 0
maximum value: 4

Range for pollutant 1 for day in ug.m-3 for Austria
type: Concept
notation: 585
status: valid
status modified: 2018-03-22
in scheme: AQD - Primary observation range
recommended unit: ug.m-3
in country: AT
related pollutant: Sulphur dioxide (air)
primary observation time: Daily average/mean
minimum value: -10
maximum value: 337.5
preferred label: Range for pollutant 1 for hour in ug.m-3 specific to AT
status modified: 2018-08-13
accepted date: 2018-08-13
primary observation time: Hourly average/mean
minimum value: -0.1
maximum value: 800

Range for pollutant 20 for hour in ug.m-3
type: Concept
notation: 59
status: valid
status modified: 2016-11-17
accepted date: 2016-11-17
in scheme: AQD - Primary observation range
recommended unit: ug.m-3
related pollutant: Benzene (air)
primary observation time: Hourly average/mean
minimum value: -10
maximum value: 60

Range for pollutant 3 for day in ugSO2.m-3
type: Concept
notation: 6
status: valid
status modified: 2016-11-17
accepted date: 2016-11-17
in scheme: AQD - Primary observation range
recommended unit: ugSO2.m-3
related pollutant: Strong acidity (air)
primary observation time: Daily average/mean
minimum value: -10
maximum value: 337.5

Range for pollutant 20 for month in ug.m-3
type: Concept
notation: 60
status: valid
status modified: 2016-11-17
accepted date: 2016-11-17
in scheme: AQD - Primary observation range
recommended unit: ug.m-3
related pollutant: Benzene (air)
primary observation time: Monthly average/mean
minimum value: -10
maximum value: 20

Range for pollutant 20 for var in ug.m-3
type: Concept
notation: 61
status: valid
status modified: 2016-11-17
accepted date: 2016-11-17
in scheme: AQD - Primary observation range
recommended unit: ug.m-3
related pollutant: Benzene (air)
primary observation time: Variable sample
minimum value: -10
maximum value: 60

Range for pollutant 20 for week in ug.m-3
type: Concept
notation: 62
status: valid
status modified: 2016-11-17
accepted date: 2016-11-17
in scheme: AQD - Primary observation range
recommended unit: ug.m-3
related pollutant: Benzene (air)
primary observation time: Weekly average/mean
minimum value: -10
maximum value: 20

Range for pollutant 20 for year in ug.m-3
type: Concept
notation: 63
status: valid
status modified: 2016-11-17
accepted date: 2016-11-17
in scheme: AQD - Primary observation range
recommended unit: ug.m-3
related pollutant: Benzene (air)
primary observation time: Yearly average/mean
minimum value: -10
maximum value: 20

Range for pollutant 21 for day in ug.m-3
type: Concept
notation: 64
status: valid
status modified: 2016-11-17
accepted date: 2016-11-17
in scheme: AQD - Primary observation range
recommended unit: ug.m-3
related pollutant: Toluene (air)
primary observation time: Daily average/mean
minimum value: -10
maximum value: 150

Range for pollutant 21 for hour in ug.m-3
type: Concept
notation: 65
status: valid
status modified: 2016-11-17
accepted date: 2016-11-17
in scheme: AQD - Primary observation range
recommended unit: ug.m-3
related pollutant: Toluene (air)
primary observation time: Hourly average/mean
minimum value: -10
maximum value: 200

Range for pollutant 21 for month in ug.m-3
type: Concept
notation: 66
status: valid
status modified: 2016-11-17
accepted date: 2016-11-17
in scheme: AQD - Primary observation range
recommended unit: ug.m-3
related pollutant: Toluene (air)
primary observation time: Monthly average/mean
minimum value: -10
maximum value: 150

Range for pollutant 21 for var in ug.m-3
type: Concept
notation: 67
status: valid
status modified: 2016-11-17
accepted date: 2016-11-17
in scheme: AQD - Primary observation range
recommended unit: ug.m-3
related pollutant: Toluene (air)
primary observation time: Variable sample
minimum value: -5
maximum value: 200

Range for pollutant 21 for week in ug.m-3
type: Concept
notation: 68
status: valid
status modified: 2016-11-17
accepted date: 2016-11-17
in scheme: AQD - Primary observation range
recommended unit: ug.m-3
related pollutant: Toluene (air)
primary observation time: Weekly average/mean
minimum value: -10
maximum value: 100

Range for pollutant 21 for year in ug.m-3
type: Concept
notation: 69
status: valid
status modified: 2016-11-17
accepted date: 2016-11-17
in scheme: AQD - Primary observation range
recommended unit: ug.m-3
related pollutant: Toluene (air)
primary observation time: Yearly average/mean
minimum value: -5
maximum value: 200

Range for pollutant 4 for day in ug.m-3
type: Concept
notation: 7
status: valid
status modified: 2016-11-17
accepted date: 2016-11-17
in scheme: AQD - Primary observation range
recommended unit: ug.m-3
related pollutant: Total suspended particulates (aerosol)
primary observation time: Daily average/mean
minimum value: -10
maximum value: 525

Range for pollutant 22 for day in ug.m-3
type: Concept
notation: 70
status: valid
status modified: 2016-11-17
accepted date: 2016-11-17
in scheme: AQD - Primary observation range
recommended unit: ug.m-3
related pollutant: Styrene (air)
primary observation time: Daily average/mean
minimum value: -10
maximum value: 3

Range for pollutant 22 for hour in ug.m-3
type: Concept
notation: 71
status: valid
status modified: 2016-11-17
accepted date: 2016-11-17
in scheme: AQD - Primary observation range
recommended unit: ug.m-3
related pollutant: Styrene (air)
primary observation time: Hourly average/mean
minimum value: -10
maximum value: 3

Range for pollutant 22 for week in ug.m-3
type: Concept
notation: 72
status: valid
status modified: 2016-11-17
accepted date: 2016-11-17
in scheme: AQD - Primary observation range
recommended unit: ug.m-3
related pollutant: Styrene (air)
primary observation time: Weekly average/mean
minimum value: -10
maximum value: 3

Range for pollutant 24 for day in ug.m-3
type: Concept
notation: 73
status: valid
status modified: 2016-11-17
accepted date: 2016-11-17
in scheme: AQD - Primary observation range
recommended unit: ug.m-3
related pollutant: 1.3 Butadiene (air)
primary observation time: Daily average/mean
minimum value: -10
maximum value: 6

Range for pollutant 24 for hour in ug.m-3
type: Concept
notation: 74
status: valid
status modified: 2016-11-17
accepted date: 2016-11-17
in scheme: AQD - Primary observation range
recommended unit: ug.m-3
related pollutant: 1.3 Butadiene (air)
primary observation time: Hourly average/mean
minimum value: -10
maximum value: 9

Range for pollutant 25 for day in ug.m-3
type: Concept
notation: 75
status: valid
status modified: 2016-11-17
accepted date: 2016-11-17
in scheme: AQD - Primary observation range
recommended unit: ug.m-3
related pollutant: Formaldehyde (air)
primary observation time: Daily average/mean
minimum value: -10
maximum value: 75

Range for pollutant 25 for var in ug.m-3
type: Concept
notation: 76
status: valid
status modified: 2016-11-17
accepted date: 2016-11-17
in scheme: AQD - Primary observation range
recommended unit: ug.m-3
related pollutant: Formaldehyde (air)
primary observation time: Variable sample
minimum value: -10
maximum value: 75

Range for pollutant 25 for week in ug.m-3
type: Concept
notation: 77
status: valid
status modified: 2016-11-17
accepted date: 2016-11-17
in scheme: AQD - Primary observation range
recommended unit: ug.m-3
related pollutant: Formaldehyde (air)
primary observation time: Weekly average/mean
minimum value: 0
maximum value: 50

Range for pollutant 26 for day in ug.m-3
type: Concept
notation: 78
status: valid
status modified: 2016-11-17
accepted date: 2016-11-17
in scheme: AQD - Primary observation range
recommended unit: ug.m-3
related pollutant: Trichloroethylene (air)
primary observation time: Daily average/mean
minimum value: -10
maximum value: 3

Range for pollutant 26 for week in ug.m-3
type: Concept
notation: 79
status: valid
status modified: 2016-11-17
accepted date: 2016-11-17
in scheme: AQD - Primary observation range
recommended unit: ug.m-3
related pollutant: Trichloroethylene (air)
primary observation time: Weekly average/mean
minimum value: -10
maximum value: 3

Range for pollutant 4 for hour in ug.m-3
type: Concept
notation: 8
status: valid
status modified: 2016-11-17
accepted date: 2016-11-17
in scheme: AQD - Primary observation range
recommended unit: ug.m-3
related pollutant: Total suspended particulates (aerosol)
primary observation time: Hourly average/mean
minimum value: -10
maximum value: 700

Range for pollutant 27 for day in ug.m-3
type: Concept
notation: 80
status: valid
status modified: 2016-11-17
accepted date: 2016-11-17
in scheme: AQD - Primary observation range
recommended unit: ug.m-3
related pollutant: Tetrachloroethylene (air)
primary observation time: Daily average/mean
minimum value: -10
maximum value: 3

Range for pollutant 27 for week in ug.m-3
type: Concept
notation: 81
status: valid
status modified: 2016-11-17
accepted date: 2016-11-17
in scheme: AQD - Primary observation range
recommended unit: ug.m-3
related pollutant: Tetrachloroethylene (air)
primary observation time: Weekly average/mean
minimum value: -10
maximum value: 3

Range for pollutant 29 for day in ng.l-1
type: Concept
notation: 82
status: valid
status modified: 2016-11-17
accepted date: 2016-11-17
in scheme: AQD - Primary observation range
recommended unit: ng.l-1
related pollutant: Benzo(a)pyrene (precip)
primary observation time: Daily average/mean
minimum value: 0
maximum value: 30

Range for pollutant 29 for hour in ng.l-1
type: Concept
notation: 83
status: valid
status modified: 2016-11-17
accepted date: 2016-11-17
in scheme: AQD - Primary observation range
recommended unit: ng.l-1
related pollutant: Benzo(a)pyrene (precip)
primary observation time: Hourly average/mean
minimum value: 0
maximum value: 30

Range for pollutant 29 for var in ng.l-1
type: Concept
notation: 84
status: valid
status modified: 2016-11-17
accepted date: 2016-11-17
in scheme: AQD - Primary observation range
recommended unit: ng.l-1
related pollutant: Benzo(a)pyrene (precip)
primary observation time: Variable sample
minimum value: 0
maximum value: 20

Range for pollutant 29 for year in ng.l-1
type: Concept
notation: 85
status: valid
status modified: 2016-11-17
accepted date: 2016-11-17
in scheme: AQD - Primary observation range
recommended unit: ng.l-1
related pollutant: Benzo(a)pyrene (precip)
primary observation time: Yearly average/mean
minimum value: 0
maximum value: 20

Range for pollutant 30 for day in ng.m-3
type: Concept
notation: 86
status: valid
status modified: 2016-11-17
accepted date: 2016-11-17
in scheme: AQD - Primary observation range
recommended unit: ng.m-3
related pollutant: Polyaromatic hydrocarbons (air+aerosol)
primary observation time: Daily average/mean
minimum value: 0
maximum value: 60

Range for pollutant 32 for day in ugC.m-3
type: Concept
notation: 87
status: valid
status modified: 2016-11-17
accepted date: 2016-11-17
in scheme: AQD - Primary observation range
recommended unit: ugC.m-3
related pollutant: Total non-methane hydrocarbons (air)
primary observation time: Daily average/mean
minimum value: -10
maximum value: 2000

Range for pollutant 32 for hour in ugC.m-3
type: Concept
notation: 88
status: valid
status modified: 2016-11-17
accepted date: 2016-11-17
in scheme: AQD - Primary observation range
recommended unit: ugC.m-3
related pollutant: Total non-methane hydrocarbons (air)
primary observation time: Hourly average/mean
minimum value: -10
maximum value: 2500

Range for pollutant 33 for day in ug.m-3
type: Concept
notation: 89
status: valid
status modified: 2016-11-17
accepted date: 2016-11-17
in scheme: AQD - Primary observation range
recommended unit: ug.m-3
related pollutant: Total volatile organic compounds (air)
primary observation time: Daily average/mean
minimum value: -10
maximum value: 5000

Range for pollutant 5 for day in ug.m-3
type: Concept
notation: 9
status: valid
status modified: 2016-11-17
accepted date: 2016-11-17
in scheme: AQD - Primary observation range
recommended unit: ug.m-3
related pollutant: Particulate matter < 10 µm (aerosol)
primary observation time: Daily average/mean
minimum value: -10
maximum value: 525

Range for pollutant 33 for hour in ug.m-3
type: Concept
notation: 90
status: valid
status modified: 2016-11-17
accepted date: 2016-11-17
in scheme: AQD - Primary observation range
recommended unit: ug.m-3
related pollutant: Total volatile organic compounds (air)
primary observation time: Hourly average/mean
minimum value: -10
maximum value: 7000

Range for pollutant 34 for hour in ug.m-3
type: Concept
notation: 91
status: valid
status modified: 2016-11-17
accepted date: 2016-11-17
in scheme: AQD - Primary observation range
recommended unit: ug.m-3
related pollutant: Peroxyacetyl nitrate (air)
primary observation time: Hourly average/mean
minimum value: 0
maximum value: 20

Range for pollutant 35 for day in ug.m-3
type: Concept
notation: 92
status: valid
status modified: 2016-11-17
accepted date: 2016-11-17
in scheme: AQD - Primary observation range
recommended unit: ug.m-3
related pollutant: Ammonia (air)
primary observation time: Daily average/mean
minimum value: -10
maximum value: 300

Range for pollutant 35 for hour in ug.m-3
type: Concept
notation: 93
status: valid
status modified: 2016-11-17
accepted date: 2016-11-17
in scheme: AQD - Primary observation range
recommended unit: ug.m-3
related pollutant: Ammonia (air)
primary observation time: Hourly average/mean
minimum value: -10
maximum value: 300

Range for pollutant 35 for var in ug.m-3
type: Concept
notation: 94
status: valid
status modified: 2016-11-17
accepted date: 2016-11-17
in scheme: AQD - Primary observation range
recommended unit: ug.m-3
related pollutant: Ammonia (air)
primary observation time: Variable sample
minimum value: 0
maximum value: 300

Range for pollutant 35 for week in ug.m-3
type: Concept
notation: 95
status: valid
status modified: 2016-11-17
accepted date: 2016-11-17
in scheme: AQD - Primary observation range
recommended unit: ug.m-3
related pollutant: Ammonia (air)
primary observation time: Weekly average/mean
minimum value: 0
maximum value: 300

Range for pollutant 36 for var in mgN.m-2.m-1
type: Concept
notation: 96
status: valid
status modified: 2016-11-17
accepted date: 2016-11-17
in scheme: AQD - Primary observation range
recommended unit: mgN.m-2.m-1
related pollutant: Wet nitrogen deposition (flux)
primary observation time: Variable sample
minimum value: -10
maximum value: 500

Range for pollutant 37 for day in mgS.m-2.m-1
type: Concept
notation: 97
status: valid
status modified: 2016-11-17
accepted date: 2016-11-17
in scheme: AQD - Primary observation range
recommended unit: mgS.m-2.m-1
related pollutant: Wet sulphur deposition (flux)
primary observation time: Daily average/mean
minimum value: -5
maximum value: 500

Range for pollutant 37 for var in mgS.m-2.m-1
type: Concept
notation: 98
status: valid
status modified: 2016-11-17
accepted date: 2016-11-17
in scheme: AQD - Primary observation range
recommended unit: mgS.m-2.m-1
related pollutant: Wet sulphur deposition (flux)
primary observation time: Variable sample
minimum value: -5
maximum value: 500

Range for pollutant 38 for day in ug.m-3
type: Concept
notation: 99
status: valid
status modified: 2016-11-17
accepted date: 2016-11-17
in scheme: AQD - Primary observation range
recommended unit: ug.m-3
related pollutant: Nitrogen monoxide (air)
primary observation time: Daily average/mean
minimum value: -10
maximum value: 675

Range for pollutant 1 for day in ug.m-3 specific to MK
type: Concept
notation: 1000
status: valid
status modified: 2018-08-13
accepted date: 2018-08-13
in scheme: AQD - Primary observation range
recommended unit: ug.m-3
in country: MK
related pollutant: Sulphur dioxide (air)
primary observation time: Daily average/mean
minimum value: -10
maximum value: 600

Range for pollutant 1 for hour in ug.m-3 specific to MK
type: Concept
notation: 1001
status: valid
status modified: 2018-08-13
accepted date: 2018-08-13
in scheme: AQD - Primary observation range
recommended unit: ug.m-3
in country: MK
related pollutant: Sulphur dioxide (air)
primary observation time: Hourly average/mean
minimum value: -10
maximum value: 650

Range for pollutant 5 for hour in ug.m-3 specific to MK
type: Concept
notation: 1002
status: valid
status modified: 2018-08-13
accepted date: 2018-08-13
in scheme: AQD - Primary observation range
recommended unit: ug.m-3
in country: MK
related pollutant: Particulate matter < 10 µm (aerosol)
primary observation time: Hourly average/mean
minimum value: -10
maximum value: 1000

Range for pollutant 20 for hour in ug.m-3 specific to MT
type: Concept
notation: 1003
status: valid
status modified: 2018-08-13
accepted date: 2018-08-13
in scheme: AQD - Primary observation range
recommended unit: ug.m-3
in country: MT
related pollutant: Benzene (air)
primary observation time: Hourly average/mean
minimum value: -10
maximum value: 80

Range for pollutant 21 for hour in ug.m-3 specific to MT
type: Concept
notation: 1004
status: valid
status modified: 2018-08-13
accepted date: 2018-08-13
in scheme: AQD - Primary observation range
recommended unit: ug.m-3
in country: MT
related pollutant: Toluene (air)
primary observation time: Hourly average/mean
minimum value: -10
maximum value: 350

Range for pollutant 431 for hour in ug.m-3 specific to MT
type: Concept
notation: 1005
status: valid
status modified: 2018-08-13
accepted date: 2018-08-13
in scheme: AQD - Primary observation range
recommended unit: ug.m-3
in country: MT
related pollutant: Ethyl benzene (air)
primary observation time: Hourly average/mean
minimum value: -10
maximum value: 80

Range for pollutant 482 for hour in ug.m-3 specific to MT
type: Concept
notation: 1006
status: valid
status modified: 2018-08-13
accepted date: 2018-08-13
in scheme: AQD - Primary observation range
recommended unit: ug.m-3
in country: MT
related pollutant: o-Xylene (air)
primary observation time: Hourly average/mean
minimum value: -10
maximum value: 40

Range for pollutant 1 for day in ug.m-3 specific to NL
type: Concept
notation: 1007
status: valid
status modified: 2018-08-13
accepted date: 2018-08-13
in scheme: AQD - Primary observation range
recommended unit: ug.m-3
in country: NL
related pollutant: Sulphur dioxide (air)
primary observation time: Daily average/mean
minimum value: -5
maximum value: 337.5

Range for pollutant 1 for hour in ug.m-3 specific to NL
type: Concept
notation: 1008
status: valid
status modified: 2018-08-13
accepted date: 2018-08-13
in scheme: AQD - Primary observation range
recommended unit: ug.m-3
in country: NL
related pollutant: Sulphur dioxide (air)
primary observation time: Hourly average/mean
minimum value: -5
maximum value: 450

Range for pollutant 5 for day in ug.m-3 specific to NL
type: Concept
notation: 1009
status: valid
status modified: 2018-08-13
accepted date: 2018-08-13
in scheme: AQD - Primary observation range
recommended unit: ug.m-3
in country: NL
related pollutant: Particulate matter < 10 µm (aerosol)
primary observation time: Daily average/mean
minimum value: -5
maximum value: 525

Range for pollutant 5 for hour in ug.m-3 specific to NL
type: Concept
notation: 1010
status: valid
status modified: 2018-08-13
accepted date: 2018-08-13
in scheme: AQD - Primary observation range
recommended unit: ug.m-3
in country: NL
related pollutant: Particulate matter < 10 µm (aerosol)
primary observation time: Hourly average/mean
minimum value: -5
maximum value: 2000

Range for pollutant 6 for day in ug.m-3 specific to NL
type: Concept
notation: 1011
status: valid
status modified: 2018-08-13
accepted date: 2018-08-13
in scheme: AQD - Primary observation range
recommended unit: ug.m-3
in country: NL
related pollutant: Black smoke (air)
primary observation time: Daily average/mean
minimum value: -5
maximum value: 525

Range for pollutant 7 for day in ug.m-3 specific to NL
type: Concept
notation: 1012
status: valid
status modified: 2018-08-13
accepted date: 2018-08-13
in scheme: AQD - Primary observation range
recommended unit: ug.m-3
in country: NL
related pollutant: Ozone (air)
primary observation time: Daily average/mean
minimum value: -5
maximum value: 300

Range for pollutant 7 for hour in ug.m-3 specific to NL
type: Concept
notation: 1013
status: valid
status modified: 2018-08-13
accepted date: 2018-08-13
in scheme: AQD - Primary observation range
recommended unit: ug.m-3
in country: NL
related pollutant: Ozone (air)
primary observation time: Hourly average/mean
minimum value: -5
maximum value: 400

Range for pollutant 8 for day in ug.m-3 specific to NL
type: Concept
notation: 1014
status: valid
status modified: 2018-08-13
accepted date: 2018-08-13
in scheme: AQD - Primary observation range
recommended unit: ug.m-3
in country: NL
related pollutant: Nitrogen dioxide (air)
primary observation time: Daily average/mean
minimum value: -5
maximum value: 337.5

Range for pollutant 8 for hour in ug.m-3 specific to NL
type: Concept
notation: 1015
status: valid
status modified: 2018-08-13
accepted date: 2018-08-13
in scheme: AQD - Primary observation range
recommended unit: ug.m-3
in country: NL
related pollutant: Nitrogen dioxide (air)
primary observation time: Hourly average/mean
minimum value: -5
maximum value: 450

Range for pollutant 9 for day in ug.m-3 specific to NL
type: Concept
notation: 1016
status: valid
status modified: 2018-08-13
accepted date: 2018-08-13
in scheme: AQD - Primary observation range
recommended unit: ug.m-3
in country: NL
related pollutant: Nitrogen oxides (air)
primary observation time: Daily average/mean
minimum value: -10
maximum value: 1125

Range for pollutant 9 for hour in ug.m-3 specific to NL
type: Concept
notation: 1017
status: valid
status modified: 2018-08-13
accepted date: 2018-08-13
in scheme: AQD - Primary observation range
recommended unit: ug.m-3
in country: NL
related pollutant: Nitrogen oxides (air)
primary observation time: Hourly average/mean
minimum value: -10
maximum value: 2000

Range for pollutant 10 for day in mg.m-3 specific to NL
type: Concept
notation: 1018
status: valid
status modified: 2018-08-13
accepted date: 2018-08-13
in scheme: AQD - Primary observation range
recommended unit: mg.m-3
in country: NL
related pollutant: Carbon monoxide (air)
primary observation time: Daily average/mean
minimum value: -5
maximum value: 15

Range for pollutant 10 for hour in mg.m-3 specific to NL
type: Concept
notation: 1019
status: valid
status modified: 2018-08-13
accepted date: 2018-08-13
in scheme: AQD - Primary observation range
recommended unit: mg.m-3
in country: NL
related pollutant: Carbon monoxide (air)
primary observation time: Hourly average/mean
minimum value: -5
maximum value: 20

Range for pollutant 12 for day in ug.m-3 specific to NL
type: Concept
notation: 1020
status: valid
status modified: 2018-08-13
accepted date: 2018-08-13
in scheme: AQD - Primary observation range
recommended unit: ug.m-3
in country: NL
related pollutant: Lead (aerosol)
primary observation time: Daily average/mean
minimum value: -5
maximum value: 5

Range for pollutant 14 for day in ng.m-3 specific to NL
type: Concept
notation: 1021
status: valid
status modified: 2018-08-13
accepted date: 2018-08-13
in scheme: AQD - Primary observation range
recommended unit: ng.m-3
in country: NL
related pollutant: Cadmium (aerosol)
primary observation time: Daily average/mean
minimum value: -5
maximum value: 50

Range for pollutant 15 for day in ng.m-3 specific to NL
type: Concept
notation: 1022
status: valid
status modified: 2018-08-13
accepted date: 2018-08-13
in scheme: AQD - Primary observation range
recommended unit: ng.m-3
in country: NL
related pollutant: Nickel (aerosol)
primary observation time: Daily average/mean
minimum value: -5
maximum value: 200

Range for pollutant 18 for day in ng.m-3 specific to NL
type: Concept
notation: 1023
status: valid
status modified: 2018-08-13
accepted date: 2018-08-13
in scheme: AQD - Primary observation range
recommended unit: ng.m-3
in country: NL
related pollutant: Arsenic (aerosol)
primary observation time: Daily average/mean
minimum value: -5
maximum value: 60

Range for pollutant 20 for day in ug.m-3 specific to NL
type: Concept
notation: 1024
status: valid
status modified: 2018-08-13
accepted date: 2018-08-13
in scheme: AQD - Primary observation range
recommended unit: ug.m-3
in country: NL
related pollutant: Benzene (air)
primary observation time: Daily average/mean
minimum value: -5
maximum value: 35

Range for pollutant 20 for hour in ug.m-3 specific to NL
type: Concept
notation: 1025
status: valid
status modified: 2018-08-13
accepted date: 2018-08-13
in scheme: AQD - Primary observation range
recommended unit: ug.m-3
in country: NL
related pollutant: Benzene (air)
primary observation time: Hourly average/mean
minimum value: -5
maximum value: 60

Range for pollutant 20 for week in ug.m-3 specific to NL
type: Concept
notation: 1026
status: valid
status modified: 2018-08-13
accepted date: 2018-08-13
in scheme: AQD - Primary observation range
recommended unit: ug.m-3
in country: NL
related pollutant: Benzene (air)
primary observation time: Weekly average/mean
minimum value: -5
maximum value: 20

Range for pollutant 21 for day in ug.m-3 specific to NL
type: Concept
notation: 1027
status: valid
status modified: 2018-08-13
accepted date: 2018-08-13
in scheme: AQD - Primary observation range
recommended unit: ug.m-3
in country: NL
related pollutant: Toluene (air)
primary observation time: Daily average/mean
minimum value: -5
maximum value: 150

Range for pollutant 21 for hour in ug.m-3 specific to NL
type: Concept
notation: 1028
status: valid
status modified: 2018-08-13
accepted date: 2018-08-13
in scheme: AQD - Primary observation range
recommended unit: ug.m-3
in country: NL
related pollutant: Toluene (air)
primary observation time: Hourly average/mean
minimum value: -5
maximum value: 200

Range for pollutant 21 for week in ug.m-3 specific to NL
type: Concept
notation: 1029
status: valid
status modified: 2018-08-13
accepted date: 2018-08-13
in scheme: AQD - Primary observation range
recommended unit: ug.m-3
in country: NL
related pollutant: Toluene (air)
primary observation time: Weekly average/mean
minimum value: -5
maximum value: 100

Range for pollutant 22 for day in ug.m-3 specific to NL
type: Concept
notation: 1030
status: valid
status modified: 2018-08-13
accepted date: 2018-08-13
in scheme: AQD - Primary observation range
recommended unit: ug.m-3
in country: NL
related pollutant: Styrene (air)
primary observation time: Daily average/mean
minimum value: -5
maximum value: 3

Range for pollutant 22 for week in ug.m-3 specific to NL
type: Concept
notation: 1031
status: valid
status modified: 2018-08-13
accepted date: 2018-08-13
in scheme: AQD - Primary observation range
recommended unit: ug.m-3
in country: NL
related pollutant: Styrene (air)
primary observation time: Weekly average/mean
minimum value: -5
maximum value: 3

Range for pollutant 26 for day in ug.m-3 specific to NL
type: Concept
notation: 1032
status: valid
status modified: 2018-08-13
accepted date: 2018-08-13
in scheme: AQD - Primary observation range
recommended unit: ug.m-3
in country: NL
related pollutant: Trichloroethylene (air)
primary observation time: Daily average/mean
minimum value: -5
maximum value: 3

Range for pollutant 26 for week in ug.m-3 specific to NL
type: Concept
notation: 1033
status: valid
status modified: 2018-08-13
accepted date: 2018-08-13
in scheme: AQD - Primary observation range
recommended unit: ug.m-3
in country: NL
related pollutant: Trichloroethylene (air)
primary observation time: Weekly average/mean
minimum value: -5
maximum value: 3

Range for pollutant 27 for day in ug.m-3 specific to NL
type: Concept
notation: 1034
status: valid
status modified: 2018-08-13
accepted date: 2018-08-13
in scheme: AQD - Primary observation range
recommended unit: ug.m-3
in country: NL
related pollutant: Tetrachloroethylene (air)
primary observation time: Daily average/mean
minimum value: -5
maximum value: 5

Range for pollutant 27 for week in ug.m-3 specific to NL
type: Concept
notation: 1035
status: valid
status modified: 2018-08-13
accepted date: 2018-08-13
in scheme: AQD - Primary observation range
recommended unit: ug.m-3
in country: NL
related pollutant: Tetrachloroethylene (air)
primary observation time: Weekly average/mean
minimum value: -5
maximum value: 3

Range for pollutant 35 for day in ug.m-3 specific to NL
type: Concept
notation: 1036
status: valid
status modified: 2018-08-13
accepted date: 2018-08-13
in scheme: AQD - Primary observation range
recommended unit: ug.m-3
in country: NL
related pollutant: Ammonia (air)
primary observation time: Daily average/mean
minimum value: -5
maximum value: 500

Range for pollutant 35 for hour in ug.m-3 specific to NL
type: Concept
notation: 1037
status: valid
status modified: 2018-08-13
accepted date: 2018-08-13
in scheme: AQD - Primary observation range
recommended unit: ug.m-3
in country: NL
related pollutant: Ammonia (air)
primary observation time: Hourly average/mean
minimum value: -5
maximum value: 500

Range for pollutant 36 for 4week in mgN.m-2.m-1 specific to NL
type: Concept
notation: 1038
status: valid
status modified: 2018-08-13
accepted date: 2018-08-13
in scheme: AQD - Primary observation range
recommended unit: mgN.m-2.m-1
in country: NL
related pollutant: Wet nitrogen deposition (flux)
primary observation time: 4week
minimum value: -5
maximum value: 500

Range for pollutant 37 for 4week in mgS.m-2.m-1 specific to NL
type: Concept
notation: 1039
status: valid
status modified: 2018-08-13
accepted date: 2018-08-13
in scheme: AQD - Primary observation range
recommended unit: mgS.m-2.m-1
in country: NL
related pollutant: Wet sulphur deposition (flux)
primary observation time: 4week
minimum value: -5
maximum value: 500

Range for pollutant 38 for day in ug.m-3 specific to NL
type: Concept
notation: 1040
status: valid
status modified: 2018-08-13
accepted date: 2018-08-13
in scheme: AQD - Primary observation range
recommended unit: ug.m-3
in country: NL
related pollutant: Nitrogen monoxide (air)
primary observation time: Daily average/mean
minimum value: -5
maximum value: 675

Range for pollutant 38 for hour in ug.m-3 specific to NL
type: Concept
notation: 1041
status: valid
status modified: 2018-08-13
accepted date: 2018-08-13
in scheme: AQD - Primary observation range
recommended unit: ug.m-3
in country: NL
related pollutant: Nitrogen monoxide (air)
primary observation time: Hourly average/mean
minimum value: -5
maximum value: 900

Range for pollutant 41 for hour in ug.m-3 specific to NL
type: Concept
notation: 1042
status: valid
status modified: 2018-08-13
accepted date: 2018-08-13
in scheme: AQD - Primary observation range
recommended unit: ug.m-3
in country: NL
related pollutant: Methane (air)
primary observation time: Hourly average/mean
minimum value: -5
maximum value: 2500

Range for pollutant 45 for day in ug.m-3 specific to NL
type: Concept
notation: 1043
status: valid
status modified: 2018-08-13
accepted date: 2018-08-13
in scheme: AQD - Primary observation range
recommended unit: ug.m-3
in country: NL
related pollutant: Particulate ammonium (aerosol)
primary observation time: Daily average/mean
minimum value: -5
maximum value: 20

Range for pollutant 46 for day in ug.m-3 specific to NL
type: Concept
notation: 1044
status: valid
status modified: 2018-08-13
accepted date: 2018-08-13
in scheme: AQD - Primary observation range
recommended unit: ug.m-3
in country: NL
related pollutant: Particulate nitrate (aerosol)
primary observation time: Daily average/mean
minimum value: -5
maximum value: 60

Range for pollutant 47 for day in ug.m-3 specific to NL
type: Concept
notation: 1045
status: valid
status modified: 2018-08-13
accepted date: 2018-08-13
in scheme: AQD - Primary observation range
recommended unit: ug.m-3
in country: NL
related pollutant: Particulate sulphate (aerosol)
primary observation time: Daily average/mean
minimum value: -5
maximum value: 30

Range for pollutant 63 for day in ng.m-3 specific to NL
type: Concept
notation: 1046
status: valid
status modified: 2018-08-13
accepted date: 2018-08-13
in scheme: AQD - Primary observation range
recommended unit: ng.m-3
in country: NL
related pollutant: Zinc (aerosol)
primary observation time: Daily average/mean
minimum value: -5
maximum value: 500

Range for pollutant 394 for hour in ug.m-3 specific to NL
type: Concept
notation: 1047
status: valid
status modified: 2018-08-13
accepted date: 2018-08-13
in scheme: AQD - Primary observation range
recommended unit: ug.m-3
in country: NL
related pollutant: n-Butane (air)
primary observation time: Hourly average/mean
minimum value: -5
maximum value: 200

Range for pollutant 412 for day in uS.cm-1 specific to NL
type: Concept
notation: 1048
status: valid
status modified: 2018-08-13
accepted date: 2018-08-13
in scheme: AQD - Primary observation range
recommended unit: uS.cm-1
in country: NL
related pollutant: conductivity (precip)
primary observation time: Daily average/mean
minimum value: -5
maximum value: 200

Range for pollutant 416 for hour in pptv specific to NL
type: Concept
notation: 1049
status: valid
status modified: 2018-08-13
accepted date: 2018-08-13
in scheme: AQD - Primary observation range
recommended unit: pptv
in country: NL
related pollutant: cyclohexane (air)
primary observation time: Hourly average/mean
minimum value: -5
maximum value: 3

Range for pollutant 428 for hour in ug.m-3 specific to NL
type: Concept
notation: 1050
status: valid
status modified: 2018-08-13
accepted date: 2018-08-13
in scheme: AQD - Primary observation range
recommended unit: ug.m-3
in country: NL
related pollutant: Ethane (air)
primary observation time: Hourly average/mean
minimum value: -5
maximum value: 10

Range for pollutant 430 for hour in ug.m-3 specific to NL
type: Concept
notation: 1051
status: valid
status modified: 2018-08-13
accepted date: 2018-08-13
in scheme: AQD - Primary observation range
recommended unit: ug.m-3
in country: NL
related pollutant: Ethene (Ethylene) (air)
primary observation time: Hourly average/mean
minimum value: -5
maximum value: 6000

Range for pollutant 431 for day in ug.m-3 specific to NL
type: Concept
notation: 1052
status: valid
status modified: 2018-08-13
accepted date: 2018-08-13
in scheme: AQD - Primary observation range
recommended unit: ug.m-3
in country: NL
related pollutant: Ethyl benzene (air)
primary observation time: Daily average/mean
minimum value: -5
maximum value: 20

Range for pollutant 431 for hour in ug.m-3 specific to NL
type: Concept
notation: 1053
status: valid
status modified: 2018-08-13
accepted date: 2018-08-13
in scheme: AQD - Primary observation range
recommended unit: ug.m-3
in country: NL
related pollutant: Ethyl benzene (air)
primary observation time: Hourly average/mean
minimum value: -5
maximum value: 5

Range for pollutant 431 for week in ug.m-3 specific to NL
type: Concept
notation: 1054
status: valid
status modified: 2018-08-13
accepted date: 2018-08-13
in scheme: AQD - Primary observation range
recommended unit: ug.m-3
in country: NL
related pollutant: Ethyl benzene (air)
primary observation time: Weekly average/mean
minimum value: -5
maximum value: 5

Range for pollutant 432 for hour in ug.m-3 specific to NL
type: Concept
notation: 1055
status: valid
status modified: 2018-08-13
accepted date: 2018-08-13
in scheme: AQD - Primary observation range
recommended unit: ug.m-3
in country: NL
related pollutant: Ethyne (Acetylene) (air)
primary observation time: Hourly average/mean
minimum value: -5
maximum value: 100

Range for pollutant 441 for day in ug.m-3 specific to NL
type: Concept
notation: 1056
status: valid
status modified: 2018-08-13
accepted date: 2018-08-13
in scheme: AQD - Primary observation range
recommended unit: ug.m-3
in country: NL
related pollutant: n-Heptane (air)
primary observation time: Daily average/mean
minimum value: -5
maximum value: 3

Range for pollutant 441 for hour in ug.m-3 specific to NL
type: Concept
notation: 1057
status: valid
status modified: 2018-08-13
accepted date: 2018-08-13
in scheme: AQD - Primary observation range
recommended unit: ug.m-3
in country: NL
related pollutant: n-Heptane (air)
primary observation time: Hourly average/mean
minimum value: -5
maximum value: 3

Range for pollutant 441 for week in ug.m-3 specific to NL
type: Concept
notation: 1058
status: valid
status modified: 2018-08-13
accepted date: 2018-08-13
in scheme: AQD - Primary observation range
recommended unit: ug.m-3
in country: NL
related pollutant: n-Heptane (air)
primary observation time: Weekly average/mean
minimum value: -5
maximum value: 3

Range for pollutant 443 for day in ug.m-3 specific to NL
type: Concept
notation: 1059
status: valid
status modified: 2018-08-13
accepted date: 2018-08-13
in scheme: AQD - Primary observation range
recommended unit: ug.m-3
in country: NL
related pollutant: n-Hexane (air)
primary observation time: Daily average/mean
minimum value: -5
maximum value: 7

Range for pollutant 443 for hour in ug.m-3 specific to NL
type: Concept
notation: 1060
status: valid
status modified: 2018-08-13
accepted date: 2018-08-13
in scheme: AQD - Primary observation range
recommended unit: ug.m-3
in country: NL
related pollutant: n-Hexane (air)
primary observation time: Hourly average/mean
minimum value: -5
maximum value: 3

Range for pollutant 443 for week in ug.m-3 specific to NL
type: Concept
notation: 1061
status: valid
status modified: 2018-08-13
accepted date: 2018-08-13
in scheme: AQD - Primary observation range
recommended unit: ug.m-3
in country: NL
related pollutant: n-Hexane (air)
primary observation time: Weekly average/mean
minimum value: -5
maximum value: 5

Range for pollutant 464 for day in ug.m-3 specific to NL
type: Concept
notation: 1062
status: valid
status modified: 2018-08-13
accepted date: 2018-08-13
in scheme: AQD - Primary observation range
recommended unit: ug.m-3
in country: NL
related pollutant: m,p-Xylene (air)
primary observation time: Daily average/mean
minimum value: -5
maximum value: 50

Range for pollutant 464 for hour in ug.m-3 specific to NL
type: Concept
notation: 1063
status: valid
status modified: 2018-08-13
accepted date: 2018-08-13
in scheme: AQD - Primary observation range
recommended unit: ug.m-3
in country: NL
related pollutant: m,p-Xylene (air)
primary observation time: Hourly average/mean
minimum value: -5
maximum value: 100

Range for pollutant 464 for week in ug.m-3 specific to NL
type: Concept
notation: 1064
status: valid
status modified: 2018-08-13
accepted date: 2018-08-13
in scheme: AQD - Primary observation range
recommended unit: ug.m-3
in country: NL
related pollutant: m,p-Xylene (air)
primary observation time: Weekly average/mean
minimum value: -5
maximum value: 20

Range for pollutant 475 for day in ug.m-3 specific to NL
type: Concept
notation: 1065
status: valid
status modified: 2018-08-13
accepted date: 2018-08-13
in scheme: AQD - Primary observation range
recommended unit: ug.m-3
in country: NL
related pollutant: n-Octane (air)
primary observation time: Daily average/mean
minimum value: -5
maximum value: 5

Range for pollutant 475 for hour in ug.m-3 specific to NL
type: Concept
notation: 1066
status: valid
status modified: 2018-08-13
accepted date: 2018-08-13
in scheme: AQD - Primary observation range
recommended unit: ug.m-3
in country: NL
related pollutant: n-Octane (air)
primary observation time: Hourly average/mean
minimum value: -5
maximum value: 3

Range for pollutant 475 for week in ug.m-3 specific to NL
type: Concept
notation: 1067
status: valid
status modified: 2018-08-13
accepted date: 2018-08-13
in scheme: AQD - Primary observation range
recommended unit: ug.m-3
in country: NL
related pollutant: n-Octane (air)
primary observation time: Weekly average/mean
minimum value: -5
maximum value: 3

Range for pollutant 482 for day in ug.m-3 specific to NL
type: Concept
notation: 1068
status: valid
status modified: 2018-08-13
accepted date: 2018-08-13
in scheme: AQD - Primary observation range
recommended unit: ug.m-3
in country: NL
related pollutant: o-Xylene (air)
primary observation time: Daily average/mean
minimum value: -5
maximum value: 5

Range for pollutant 482 for hour in ug.m-3 specific to NL
type: Concept
notation: 1069
status: valid
status modified: 2018-08-13
accepted date: 2018-08-13
in scheme: AQD - Primary observation range
recommended unit: ug.m-3
in country: NL
related pollutant: o-Xylene (air)
primary observation time: Hourly average/mean
minimum value: -5
maximum value: 9

Range for pollutant 482 for week in ug.m-3 specific to NL
type: Concept
notation: 1070
status: valid
status modified: 2018-08-13
accepted date: 2018-08-13
in scheme: AQD - Primary observation range
recommended unit: ug.m-3
in country: NL
related pollutant: o-Xylene (air)
primary observation time: Weekly average/mean
minimum value: -5
maximum value: 20

Range for pollutant 486 for hour in ug.m-3 specific to NL
type: Concept
notation: 1071
status: valid
status modified: 2018-08-13
accepted date: 2018-08-13
in scheme: AQD - Primary observation range
recommended unit: ug.m-3
in country: NL
related pollutant: n-Pentane (air)
primary observation time: Hourly average/mean
minimum value: -5
maximum value: 3

Range for pollutant 503 for hour in ug.m-3 specific to NL
type: Concept
notation: 1072
status: valid
status modified: 2018-08-13
accepted date: 2018-08-13
in scheme: AQD - Primary observation range
recommended unit: ug.m-3
in country: NL
related pollutant: Propane (air)
primary observation time: Hourly average/mean
minimum value: -5
maximum value: 12

Range for pollutant 505 for hour in ug.m-3 specific to NL
type: Concept
notation: 1073
status: valid
status modified: 2018-08-13
accepted date: 2018-08-13
in scheme: AQD - Primary observation range
recommended unit: ug.m-3
in country: NL
related pollutant: Propene (air)
primary observation time: Hourly average/mean
minimum value: -5
maximum value: 7

Range for pollutant 629 for day in ug.m-3 specific to NL
type: Concept
notation: 1074
status: valid
status modified: 2018-08-13
accepted date: 2018-08-13
in scheme: AQD - Primary observation range
recommended unit: ug.m-3
in country: NL
related pollutant: calcium (aerosol)
primary observation time: Daily average/mean
minimum value: -5
maximum value: 1

Range for pollutant 630 for day in mg.l-1 specific to NL
type: Concept
notation: 1075
status: valid
status modified: 2018-08-13
accepted date: 2018-08-13
in scheme: AQD - Primary observation range
in country: NL
related pollutant: calcium (precip)
primary observation time: Daily average/mean
minimum value: -5
maximum value: 20

Range for pollutant 631 for day in ug.m-3 specific to NL
type: Concept
notation: 1076
status: valid
status modified: 2018-08-13
accepted date: 2018-08-13
in scheme: AQD - Primary observation range
recommended unit: ug.m-3
in country: NL
related pollutant: chloride (aerosol)
primary observation time: Daily average/mean
minimum value: -5
maximum value: 10

Range for pollutant 632 for day in mg.l-1 specific to NL
type: Concept
notation: 1077
status: valid
status modified: 2018-08-13
accepted date: 2018-08-13
in scheme: AQD - Primary observation range
in country: NL
related pollutant: chloride (precip)
primary observation time: Daily average/mean
minimum value: -5
maximum value: 200

Range for pollutant 648 for day in ueH.l-1 specific to NL
type: Concept
notation: 1078
status: valid
status modified: 2018-08-13
accepted date: 2018-08-13
in scheme: AQD - Primary observation range
recommended unit: ueH.l-1
in country: NL
related pollutant: acidity(H+) (precip)
primary observation time: Daily average/mean
minimum value: -500
maximum value: 200

Range for pollutant 658 for day in mg.l-1 specific to NL
type: Concept
notation: 1079
status: valid
status modified: 2018-08-13
accepted date: 2018-08-13
in scheme: AQD - Primary observation range
in country: NL
related pollutant: potassium (precip)
primary observation time: Daily average/mean
minimum value: -5
maximum value: 30

Range for pollutant 660 for day in mg.l-1 specific to NL
type: Concept
notation: 1080
status: valid
status modified: 2018-08-13
accepted date: 2018-08-13
in scheme: AQD - Primary observation range
in country: NL
related pollutant: magnesium (precip)
primary observation time: Daily average/mean
minimum value: -5
maximum value: 20

Range for pollutant 664 for day in mgH.l-1 specific to NL
type: Concept
notation: 1081
status: valid
status modified: 2018-08-13
accepted date: 2018-08-13
in scheme: AQD - Primary observation range
recommended unit: mgH.l-1
in country: NL
related pollutant: ammonium (precip)
primary observation time: Daily average/mean
minimum value: -5
maximum value: 15

Range for pollutant 666 for day in mgH.l-1 specific to NL
type: Concept
notation: 1082
status: valid
status modified: 2018-08-13
accepted date: 2018-08-13
in scheme: AQD - Primary observation range
recommended unit: mgH.l-1
in country: NL
related pollutant: nitrate (precip)
primary observation time: Daily average/mean
minimum value: -5
maximum value: 30

Range for pollutant 669 for day in mg.l-1 specific to NL
type: Concept
notation: 1083
status: valid
status modified: 2018-08-13
accepted date: 2018-08-13
in scheme: AQD - Primary observation range
in country: NL
related pollutant: sodium (precip)
primary observation time: Daily average/mean
minimum value: -5
maximum value: 150

Range for pollutant 719 for day in mgS.m-1 specific to NL
type: Concept
notation: 1084
status: valid
status modified: 2018-08-13
accepted date: 2018-08-13
in scheme: AQD - Primary observation range
recommended unit: mgS.m-1
in country: NL
related pollutant: sulphate (precip)
primary observation time: Daily average/mean
minimum value: -5
maximum value: 30

Range for pollutant 2012 for 4week in ug.l-1 specific to NL
type: Concept
notation: 1085
status: valid
status modified: 2018-08-13
accepted date: 2018-08-13
in scheme: AQD - Primary observation range
recommended unit: ug.l-1
in country: NL
related pollutant: Lead (precip)
primary observation time: 4week
minimum value: -5
maximum value: 10

Range for pollutant 2012 for var in ug.l-1 specific to NL
type: Concept
notation: 1086
status: valid
status modified: 2018-08-13
accepted date: 2018-08-13
in scheme: AQD - Primary observation range
recommended unit: ug.l-1
in country: NL
related pollutant: Lead (precip)
primary observation time: Variable sample
minimum value: 0
maximum value: 5

Range for pollutant 2013 for week in ng.l-1 specific to NL
type: Concept
notation: 1087
status: valid
status modified: 2018-08-13
accepted date: 2018-08-13
in scheme: AQD - Primary observation range
recommended unit: ng.l-1
in country: NL
related pollutant: Mercury (precip)
primary observation time: Weekly average/mean
minimum value: 0
maximum value: 45

Range for pollutant 2014 for 4week in ug.l-1 specific to NL
type: Concept
notation: 1088
status: valid
status modified: 2018-08-13
accepted date: 2018-08-13
in scheme: AQD - Primary observation range
recommended unit: ug.l-1
in country: NL
related pollutant: Cadmium (precip)
primary observation time: 4week
minimum value: -5
maximum value: 1

Range for pollutant 2063 for 4week in ug.l-1 specific to NL
type: Concept
notation: 1089
status: valid
status modified: 2018-08-13
accepted date: 2018-08-13
in scheme: AQD - Primary observation range
recommended unit: ug.l-1
in country: NL
related pollutant: Zinc (precip)
primary observation time: 4week
minimum value: -5
maximum value: 20

Range for pollutant 2063 for week in ug.l-1 specific to NL
type: Concept
notation: 1090
status: valid
status modified: 2018-08-13
accepted date: 2018-08-13
in scheme: AQD - Primary observation range
recommended unit: ug.l-1
in country: NL
related pollutant: Zinc (precip)
primary observation time: Weekly average/mean
minimum value: -5
maximum value: 40

Range for pollutant 2065 for 4week in ug.l-1 specific to NL
type: Concept
notation: 1091
status: valid
status modified: 2018-08-13
accepted date: 2018-08-13
in scheme: AQD - Primary observation range
recommended unit: ug.l-1
in country: NL
related pollutant: Iron (precip)
primary observation time: 4week
minimum value: -5
maximum value: 500

Range for pollutant 2065 for var in ug.l-1 specific to NL
type: Concept
notation: 1092
status: valid
status modified: 2018-08-13
accepted date: 2018-08-13
in scheme: AQD - Primary observation range
recommended unit: ug.l-1
in country: NL
related pollutant: Iron (precip)
primary observation time: Variable sample
minimum value: 0
maximum value: 100

Range for pollutant 2073 for 4week in ug.l-1 specific to NL
type: Concept
notation: 1093
status: valid
status modified: 2018-08-13
accepted date: 2018-08-13
in scheme: AQD - Primary observation range
recommended unit: ug.l-1
in country: NL
related pollutant: Copper (precip)
primary observation time: 4week
minimum value: -5
maximum value: 5

Range for pollutant 2073 for var in ug.l-1 specific to NL
type: Concept
notation: 1094
status: valid
status modified: 2018-08-13
accepted date: 2018-08-13
in scheme: AQD - Primary observation range
recommended unit: ug.l-1
in country: NL
related pollutant: Copper (precip)
primary observation time: Variable sample
minimum value: 0
maximum value: 10

Range for pollutant 2073 for week in ug.l-1 specific to NL
type: Concept
notation: 1095
status: valid
status modified: 2018-08-13
accepted date: 2018-08-13
in scheme: AQD - Primary observation range
recommended unit: ug.l-1
in country: NL
related pollutant: Copper (precip)
primary observation time: Weekly average/mean
minimum value: -5
maximum value: 6

Range for pollutant 6005 for hour in ug.m-3 specific to NL
type: Concept
notation: 1096
status: valid
status modified: 2018-08-13
accepted date: 2018-08-13
in scheme: AQD - Primary observation range
recommended unit: ug.m-3
in country: NL
related pollutant: 1-Butene (air)
primary observation time: Hourly average/mean
minimum value: -5
maximum value: 5

Range for pollutant 6006 for hour in ug.m-3 specific to NL
type: Concept
notation: 1097
status: valid
status modified: 2018-08-13
accepted date: 2018-08-13
in scheme: AQD - Primary observation range
recommended unit: ug.m-3
in country: NL
related pollutant: trans-2-Butene (air)
primary observation time: Hourly average/mean
minimum value: -5
maximum value: 8

Range for pollutant 6007 for hour in ug.m-3 specific to NL
type: Concept
notation: 1098
status: valid
status modified: 2018-08-13
accepted date: 2018-08-13
in scheme: AQD - Primary observation range
recommended unit: ug.m-3
in country: NL
related pollutant: cis-2-Butene (air)
primary observation time: Hourly average/mean
minimum value: -5
maximum value: 8

Range for pollutant 6011 for day in ug.m-3 specific to NL
type: Concept
notation: 1099
status: valid
status modified: 2018-08-13
accepted date: 2018-08-13
in scheme: AQD - Primary observation range
recommended unit: ug.m-3
in country: NL
related pollutant: 1,2,4-Trimethylbenzene (air)
primary observation time: Daily average/mean
minimum value: -5
maximum value: 10

Range for pollutant 6011 for week in ug.m-3 specific to NL
type: Concept
notation: 1100
status: valid
status modified: 2018-08-13
accepted date: 2018-08-13
in scheme: AQD - Primary observation range
recommended unit: ug.m-3
in country: NL
related pollutant: 1,2,4-Trimethylbenzene (air)
primary observation time: Weekly average/mean
minimum value: -5
maximum value: 5

Range for pollutant 6012 for day in ug.m-3 specific to NL
type: Concept
notation: 1101
status: valid
status modified: 2018-08-13
accepted date: 2018-08-13
in scheme: AQD - Primary observation range
recommended unit: ug.m-3
in country: NL
related pollutant: 1,2,3-Trimethylbenzene (air)
primary observation time: Daily average/mean
minimum value: -5
maximum value: 10

Range for pollutant 6012 for week in ug.m-3 specific to NL
type: Concept
notation: 1102
status: valid
status modified: 2018-08-13
accepted date: 2018-08-13
in scheme: AQD - Primary observation range
recommended unit: ug.m-3
in country: NL
related pollutant: 1,2,3-Trimethylbenzene (air)
primary observation time: Weekly average/mean
minimum value: -5
maximum value: 5

Range for pollutant 6013 for day in ug.m-3 specific to NL
type: Concept
notation: 1103
status: valid
status modified: 2018-08-13
accepted date: 2018-08-13
in scheme: AQD - Primary observation range
recommended unit: ug.m-3
in country: NL
related pollutant: 1,3,5-Trimethylbenzene (air)
primary observation time: Daily average/mean
minimum value: -5
maximum value: 10

Range for pollutant 6013 for week in ug.m-3 specific to NL
type: Concept
notation: 1104
status: valid
status modified: 2018-08-13
accepted date: 2018-08-13
in scheme: AQD - Primary observation range
recommended unit: ug.m-3
in country: NL
related pollutant: 1,3,5-Trimethylbenzene (air)
primary observation time: Weekly average/mean
minimum value: -5
maximum value: 5

Range for pollutant 1 for hour in ug.m-3 specific to NO
type: Concept
notation: 1105
status: valid
status modified: 2018-08-13
accepted date: 2018-08-13
in scheme: AQD - Primary observation range
recommended unit: ug.m-3
in country: NO
related pollutant: Sulphur dioxide (air)
primary observation time: Hourly average/mean
minimum value: -10
maximum value: 1000

Range for pollutant 9 for hour in ug.m-3 specific to NO
type: Concept
notation: 1106
status: valid
status modified: 2018-08-13
accepted date: 2018-08-13
in scheme: AQD - Primary observation range
recommended unit: ug.m-3
in country: NO
related pollutant: Nitrogen oxides (air)
primary observation time: Hourly average/mean
minimum value: -12
maximum value: 3000

Range for pollutant 38 for hour in ug.m-3 specific to NO
type: Concept
notation: 1107
status: valid
status modified: 2018-08-13
accepted date: 2018-08-13
in scheme: AQD - Primary observation range
recommended unit: ug.m-3
in country: NO
related pollutant: Nitrogen monoxide (air)
primary observation time: Hourly average/mean
minimum value: -10
maximum value: 2500

Range for pollutant 6001 for week in ug.m-3 specific to NO
type: Concept
notation: 1108
status: valid
status modified: 2018-08-13
accepted date: 2018-08-13
in scheme: AQD - Primary observation range
recommended unit: ug.m-3
in country: NO
related pollutant: Particulate matter < 2.5 µm (aerosol)
primary observation time: Weekly average/mean
minimum value: -10
maximum value: 700

Range for pollutant 431 for hour in ug.m-3 specific to PT
type: Concept
notation: 1109
status: valid
status modified: 2018-08-13
accepted date: 2018-08-13
in scheme: AQD - Primary observation range
recommended unit: ug.m-3
in country: PT
related pollutant: Ethyl benzene (air)
primary observation time: Hourly average/mean
minimum value: -10
maximum value: 40

Range for pollutant 482 for hour in ug.m-3 specific to PT
type: Concept
notation: 1110
status: valid
status modified: 2018-08-13
accepted date: 2018-08-13
in scheme: AQD - Primary observation range
recommended unit: ug.m-3
in country: PT
related pollutant: o-Xylene (air)
primary observation time: Hourly average/mean
minimum value: -10
maximum value: 30

Range for pollutant 1 for hour in ug.m-3 specific to RO
type: Concept
notation: 1111
status: valid
status modified: 2018-08-13
accepted date: 2018-08-13
in scheme: AQD - Primary observation range
recommended unit: ug.m-3
in country: RO
related pollutant: Sulphur dioxide (air)
primary observation time: Hourly average/mean
minimum value: -10
maximum value: 350

Range for pollutant 5 for day in ug.m-3 specific to RO
type: Concept
notation: 1112
status: valid
status modified: 2018-08-13
accepted date: 2018-08-13
in scheme: AQD - Primary observation range
recommended unit: ug.m-3
in country: RO
related pollutant: Particulate matter < 10 µm (aerosol)
primary observation time: Daily average/mean
minimum value: -10
maximum value: 50

Range for pollutant 7 for hour in ug.m-3 specific to RO
type: Concept
notation: 1113
status: valid
status modified: 2018-08-13
accepted date: 2018-08-13
in scheme: AQD - Primary observation range
recommended unit: ug.m-3
in country: RO
related pollutant: Ozone (air)
primary observation time: Hourly average/mean
minimum value: -10
maximum value: 180

Range for pollutant 8 for hour in ug.m-3 specific to RO
type: Concept
notation: 1114
status: valid
status modified: 2018-08-13
accepted date: 2018-08-13
in scheme: AQD - Primary observation range
recommended unit: ug.m-3
in country: RO
related pollutant: Nitrogen dioxide (air)
primary observation time: Hourly average/mean
minimum value: -10
maximum value: 200

Range for pollutant 9 for hour in ug.m-3 specific to RO
type: Concept
notation: 1115
status: valid
status modified: 2018-08-13
accepted date: 2018-08-13
in scheme: AQD - Primary observation range
recommended unit: ug.m-3
in country: RO
related pollutant: Nitrogen oxides (air)
primary observation time: Hourly average/mean
minimum value: -10
maximum value: 200

Range for pollutant 10 for hour in mg.m-3 specific to RO
type: Concept
notation: 1116
status: valid
status modified: 2018-08-13
accepted date: 2018-08-13
in scheme: AQD - Primary observation range
recommended unit: mg.m-3
in country: RO
related pollutant: Carbon monoxide (air)
primary observation time: Hourly average/mean
minimum value: -10
maximum value: 10

Range for pollutant 12 for day in ug.m-3 specific to RO
type: Concept
notation: 1117
status: valid
status modified: 2018-08-13
accepted date: 2018-08-13
in scheme: AQD - Primary observation range
recommended unit: ug.m-3
in country: RO
related pollutant: Lead (aerosol)
primary observation time: Daily average/mean
minimum value: -10
maximum value: 0.5

Range for pollutant 14 for day in ng.m-3 specific to RO
type: Concept
notation: 1118
status: valid
status modified: 2018-08-13
accepted date: 2018-08-13
in scheme: AQD - Primary observation range
recommended unit: ng.m-3
in country: RO
related pollutant: Cadmium (aerosol)
primary observation time: Daily average/mean
minimum value: -10
maximum value: 5

Range for pollutant 15 for day in ng.m-3 specific to RO
type: Concept
notation: 1119
status: valid
status modified: 2018-08-13
accepted date: 2018-08-13
in scheme: AQD - Primary observation range
recommended unit: ng.m-3
in country: RO
related pollutant: Nickel (aerosol)
primary observation time: Daily average/mean
minimum value: -10
maximum value: 20

Range for pollutant 18 for day in ng.m-3 specific to RO
type: Concept
notation: 1120
status: valid
status modified: 2018-08-13
accepted date: 2018-08-13
in scheme: AQD - Primary observation range
recommended unit: ng.m-3
in country: RO
related pollutant: Arsenic (aerosol)
primary observation time: Daily average/mean
minimum value: -10
maximum value: 6

Range for pollutant 20 for hour in ug.m-3 specific to RO
type: Concept
notation: 1121
status: valid
status modified: 2018-08-13
accepted date: 2018-08-13
in scheme: AQD - Primary observation range
recommended unit: ug.m-3
in country: RO
related pollutant: Benzene (air)
primary observation time: Hourly average/mean
minimum value: -10
maximum value: 5

Range for pollutant 6001 for day in ug.m-3 specific to RO
type: Concept
notation: 1122
status: valid
status modified: 2018-08-13
accepted date: 2018-08-13
in scheme: AQD - Primary observation range
recommended unit: ug.m-3
in country: RO
related pollutant: Particulate matter < 2.5 µm (aerosol)
primary observation time: Daily average/mean
minimum value: -10
maximum value: 25

Range for pollutant 1 for day in ug.m-3 specific to RS
type: Concept
notation: 1123
status: valid
status modified: 2018-08-13
accepted date: 2018-08-13
in scheme: AQD - Primary observation range
recommended unit: ug.m-3
in country: RS
related pollutant: Sulphur dioxide (air)
primary observation time: Daily average/mean
minimum value: -10
maximum value: 1500

Range for pollutant 1 for hour in ug.m-3 specific to RS
type: Concept
notation: 1124
status: valid
status modified: 2018-08-13
accepted date: 2018-08-13
in scheme: AQD - Primary observation range
recommended unit: ug.m-3
in country: RS
related pollutant: Sulphur dioxide (air)
primary observation time: Hourly average/mean
minimum value: -10
maximum value: 3000

Range for pollutant 5 for day in ug.m-3 specific to RS
type: Concept
notation: 1125
status: valid
status modified: 2018-08-13
accepted date: 2018-08-13
in scheme: AQD - Primary observation range
recommended unit: ug.m-3
in country: RS
related pollutant: Particulate matter < 10 µm (aerosol)
primary observation time: Daily average/mean
minimum value: -10
maximum value: 525

Range for pollutant 5 for hour in ug.m-3 specific to RS
type: Concept
notation: 1126
status: valid
status modified: 2018-08-13
accepted date: 2018-08-13
in scheme: AQD - Primary observation range
recommended unit: ug.m-3
in country: RS
related pollutant: Particulate matter < 10 µm (aerosol)
primary observation time: Hourly average/mean
minimum value: -10
maximum value: 1400

Range for pollutant 6 for day in ug.m-3 specific to RS
type: Concept
notation: 1127
status: valid
status modified: 2018-08-13
accepted date: 2018-08-13
in scheme: AQD - Primary observation range
recommended unit: ug.m-3
in country: RS
related pollutant: Black smoke (air)
primary observation time: Daily average/mean
minimum value: -10
maximum value: 525

Range for pollutant 7 for day in ug.m-3 specific to RS
type: Concept
notation: 1128
status: valid
status modified: 2018-08-13
accepted date: 2018-08-13
in scheme: AQD - Primary observation range
recommended unit: ug.m-3
in country: RS
related pollutant: Ozone (air)
primary observation time: Daily average/mean
minimum value: -10
maximum value: 300

Range for pollutant 7 for hour in ug.m-3 specific to RS
type: Concept
notation: 1129
status: valid
status modified: 2018-08-13
accepted date: 2018-08-13
in scheme: AQD - Primary observation range
recommended unit: ug.m-3
in country: RS
related pollutant: Ozone (air)
primary observation time: Hourly average/mean
minimum value: -10
maximum value: 400

Range for pollutant 8 for day in ug.m-3 specific to RS
type: Concept
notation: 1130
status: valid
status modified: 2018-08-13
accepted date: 2018-08-13
in scheme: AQD - Primary observation range
recommended unit: ug.m-3
in country: RS
related pollutant: Nitrogen dioxide (air)
primary observation time: Daily average/mean
minimum value: -10
maximum value: 337.5

Range for pollutant 8 for hour in ug.m-3 specific to RS
type: Concept
notation: 1131
status: valid
status modified: 2018-08-13
accepted date: 2018-08-13
in scheme: AQD - Primary observation range
recommended unit: ug.m-3
in country: RS
related pollutant: Nitrogen dioxide (air)
primary observation time: Hourly average/mean
minimum value: -10
maximum value: 2000

Range for pollutant 9 for day in ug.m-3 specific to RS
type: Concept
notation: 1132
status: valid
status modified: 2018-08-13
accepted date: 2018-08-13
in scheme: AQD - Primary observation range
recommended unit: ug.m-3
in country: RS
related pollutant: Nitrogen oxides (air)
primary observation time: Daily average/mean
minimum value: -10
maximum value: 1125

Range for pollutant 9 for hour in ug.m-3 specific to RS
type: Concept
notation: 1133
status: valid
status modified: 2018-08-13
accepted date: 2018-08-13
in scheme: AQD - Primary observation range
recommended unit: ug.m-3
in country: RS
related pollutant: Nitrogen oxides (air)
primary observation time: Hourly average/mean
minimum value: -10
maximum value: 2500

Range for pollutant 10 for day in mg.m-3 specific to RS
type: Concept
notation: 1134
status: valid
status modified: 2018-08-13
accepted date: 2018-08-13
in scheme: AQD - Primary observation range
recommended unit: mg.m-3
in country: RS
related pollutant: Carbon monoxide (air)
primary observation time: Daily average/mean
minimum value: -10
maximum value: 15

Range for pollutant 10 for hour in mg.m-3 specific to RS
type: Concept
notation: 1135
status: valid
status modified: 2018-08-13
accepted date: 2018-08-13
in scheme: AQD - Primary observation range
recommended unit: mg.m-3
in country: RS
related pollutant: Carbon monoxide (air)
primary observation time: Hourly average/mean
minimum value: -10
maximum value: 30

Range for pollutant 20 for day in ug.m-3 specific to RS
type: Concept
notation: 1136
status: valid
status modified: 2018-08-13
accepted date: 2018-08-13
in scheme: AQD - Primary observation range
recommended unit: ug.m-3
in country: RS
related pollutant: Benzene (air)
primary observation time: Daily average/mean
minimum value: -10
maximum value: 150

Range for pollutant 38 for day in ug.m-3 specific to RS
type: Concept
notation: 1137
status: valid
status modified: 2018-08-13
accepted date: 2018-08-13
in scheme: AQD - Primary observation range
recommended unit: ug.m-3
in country: RS
related pollutant: Nitrogen monoxide (air)
primary observation time: Daily average/mean
minimum value: -10
maximum value: 675

Range for pollutant 38 for hour in ug.m-3 specific to RS
type: Concept
notation: 1138
status: valid
status modified: 2018-08-13
accepted date: 2018-08-13
in scheme: AQD - Primary observation range
recommended unit: ug.m-3
in country: RS
related pollutant: Nitrogen monoxide (air)
primary observation time: Hourly average/mean
minimum value: -10
maximum value: 2500

Range for pollutant 5 for hour in ug.m-3 specific to SE
type: Concept
notation: 1139
status: valid
status modified: 2018-08-13
accepted date: 2018-08-13
in scheme: AQD - Primary observation range
recommended unit: ug.m-3
in country: SE
related pollutant: Particulate matter < 10 µm (aerosol)
primary observation time: Hourly average/mean
minimum value: -10
maximum value: 1250

Range for pollutant 9 for hour in ug.m-3 specific to SE
type: Concept
notation: 1140
status: valid
status modified: 2018-08-13
accepted date: 2018-08-13
in scheme: AQD - Primary observation range
recommended unit: ug.m-3
in country: SE
related pollutant: Nitrogen oxides (air)
primary observation time: Hourly average/mean
minimum value: -10
maximum value: 1600

Range for pollutant 83 for hour in ug.m-3 specific to SE
type: Concept
notation: 1141
status: valid
status modified: 2018-08-13
accepted date: 2018-08-13
in scheme: AQD - Primary observation range
recommended unit: ug.m-3
in country: SE
related pollutant: cis-2-Pentene (air)
primary observation time: Hourly average/mean
minimum value: 0
maximum value: 3

Range for pollutant 432 for hour in ug.m-3 specific to SE
type: Concept
notation: 1142
status: valid
status modified: 2018-08-13
accepted date: 2018-08-13
in scheme: AQD - Primary observation range
recommended unit: ug.m-3
in country: SE
related pollutant: Ethyne (Acetylene) (air)
primary observation time: Hourly average/mean
minimum value: -10
maximum value: 125

Range for pollutant 441 for hour in ug.m-3 specific to SE
type: Concept
notation: 1143
status: valid
status modified: 2018-08-13
accepted date: 2018-08-13
in scheme: AQD - Primary observation range
recommended unit: ug.m-3
in country: SE
related pollutant: n-Heptane (air)
primary observation time: Hourly average/mean
minimum value: -10
maximum value: 15

Range for pollutant 443 for hour in ug.m-3 specific to SE
type: Concept
notation: 1144
status: valid
status modified: 2018-08-13
accepted date: 2018-08-13
in scheme: AQD - Primary observation range
recommended unit: ug.m-3
in country: SE
related pollutant: n-Hexane (air)
primary observation time: Hourly average/mean
minimum value: -10
maximum value: 20

Range for pollutant 475 for hour in ug.m-3 specific to SE
type: Concept
notation: 1145
status: valid
status modified: 2018-08-13
accepted date: 2018-08-13
in scheme: AQD - Primary observation range
recommended unit: ug.m-3
in country: SE
related pollutant: n-Octane (air)
primary observation time: Hourly average/mean
minimum value: -10
maximum value: 5

Range for pollutant 482 for hour in ug.m-3 specific to SE
type: Concept
notation: 1146
status: valid
status modified: 2018-08-13
accepted date: 2018-08-13
in scheme: AQD - Primary observation range
recommended unit: ug.m-3
in country: SE
related pollutant: o-Xylene (air)
primary observation time: Hourly average/mean
minimum value: -10
maximum value: 25

Range for pollutant 486 for hour in ug.m-3 specific to SE
type: Concept
notation: 1147
status: valid
status modified: 2018-08-13
accepted date: 2018-08-13
in scheme: AQD - Primary observation range
recommended unit: ug.m-3
in country: SE
related pollutant: n-Pentane (air)
primary observation time: Hourly average/mean
minimum value: -10
maximum value: 35

Range for pollutant 503 for hour in ug.m-3 specific to SE
type: Concept
notation: 1148
status: valid
status modified: 2018-08-13
accepted date: 2018-08-13
in scheme: AQD - Primary observation range
recommended unit: ug.m-3
in country: SE
related pollutant: Propane (air)
primary observation time: Hourly average/mean
minimum value: -10
maximum value: 130

Range for pollutant 505 for hour in ug.m-3 specific to SE
type: Concept
notation: 1149
status: valid
status modified: 2018-08-13
accepted date: 2018-08-13
in scheme: AQD - Primary observation range
recommended unit: ug.m-3
in country: SE
related pollutant: Propene (air)
primary observation time: Hourly average/mean
minimum value: -10
maximum value: 25

Range for pollutant 6012 for hour in ug.m-3 specific to SE
type: Concept
notation: 1150
status: valid
status modified: 2018-08-13
accepted date: 2018-08-13
in scheme: AQD - Primary observation range
recommended unit: ug.m-3
in country: SE
related pollutant: 1,2,3-Trimethylbenzene (air)
primary observation time: Hourly average/mean
minimum value: -10
maximum value: 32

Range for pollutant 6013 for hour in ug.m-3 specific to SE
type: Concept
notation: 1151
status: valid
status modified: 2018-08-13
accepted date: 2018-08-13
in scheme: AQD - Primary observation range
recommended unit: ug.m-3
in country: SE
related pollutant: 1,3,5-Trimethylbenzene (air)
primary observation time: Hourly average/mean
minimum value: -10
maximum value: 35

Range for pollutant 1 for day in ug.m-3 specific to SI
type: Concept
notation: 1152
status: valid
status modified: 2018-08-13
accepted date: 2018-08-13
in scheme: AQD - Primary observation range
recommended unit: ug.m-3
in country: SI
related pollutant: Sulphur dioxide (air)
primary observation time: Daily average/mean
minimum value: 0
maximum value: 100

Range for pollutant 1 for hour in ug.m-3 specific to SI
type: Concept
notation: 1153
status: valid
status modified: 2018-08-13
accepted date: 2018-08-13
in scheme: AQD - Primary observation range
recommended unit: ug.m-3
in country: SI
related pollutant: Sulphur dioxide (air)
primary observation time: Hourly average/mean
minimum value: -10
maximum value: 5000

Range for pollutant 5 for day in ug.m-3 specific to SI
type: Concept
notation: 1154
status: valid
status modified: 2018-08-13
accepted date: 2018-08-13
in scheme: AQD - Primary observation range
recommended unit: ug.m-3
in country: SI
related pollutant: Particulate matter < 10 µm (aerosol)
primary observation time: Daily average/mean
minimum value: 0
maximum value: 350

Range for pollutant 5 for hour in ug.m-3 specific to SI
type: Concept
notation: 1155
status: valid
status modified: 2018-08-13
accepted date: 2018-08-13
in scheme: AQD - Primary observation range
recommended unit: ug.m-3
in country: SI
related pollutant: Particulate matter < 10 µm (aerosol)
primary observation time: Hourly average/mean
minimum value: -99
maximum value: 700

Range for pollutant 8 for day in ug.m-3 specific to SI
type: Concept
notation: 1156
status: valid
status modified: 2018-08-13
accepted date: 2018-08-13
in scheme: AQD - Primary observation range
recommended unit: ug.m-3
in country: SI
related pollutant: Nitrogen dioxide (air)
primary observation time: Daily average/mean
minimum value: 0
maximum value: 20

Range for pollutant 9 for hour in ug.m-3 specific to SI
type: Concept
notation: 1157
status: valid
status modified: 2018-08-13
accepted date: 2018-08-13
in scheme: AQD - Primary observation range
recommended unit: ug.m-3
in country: SI
related pollutant: Nitrogen oxides (air)
primary observation time: Hourly average/mean
minimum value: -10
maximum value: 1000

Range for pollutant 10 for hour in mg.m-3 specific to SI
type: Concept
notation: 1158
status: valid
status modified: 2018-08-13
accepted date: 2018-08-13
in scheme: AQD - Primary observation range
recommended unit: mg.m-3
in country: SI
related pollutant: Carbon monoxide (air)
primary observation time: Hourly average/mean
minimum value: -1
maximum value: 20

Range for pollutant 12 for day in ug.m-3 specific to SI
type: Concept
notation: 1159
status: valid
status modified: 2018-08-13
accepted date: 2018-08-13
in scheme: AQD - Primary observation range
recommended unit: ug.m-3
in country: SI
related pollutant: Lead (aerosol)
primary observation time: Daily average/mean
minimum value: 0
maximum value: 5

Range for pollutant 14 for day in ng.m-3 specific to SI
type: Concept
notation: 1160
status: valid
status modified: 2018-08-13
accepted date: 2018-08-13
in scheme: AQD - Primary observation range
recommended unit: ng.m-3
in country: SI
related pollutant: Cadmium (aerosol)
primary observation time: Daily average/mean
minimum value: 0
maximum value: 20

Range for pollutant 15 for day in ng.m-3 specific to SI
type: Concept
notation: 1161
status: valid
status modified: 2018-08-13
accepted date: 2018-08-13
in scheme: AQD - Primary observation range
recommended unit: ng.m-3
in country: SI
related pollutant: Nickel (aerosol)
primary observation time: Daily average/mean
minimum value: 0
maximum value: 170

Range for pollutant 18 for day in ng.m-3 specific to SI
type: Concept
notation: 1162
status: valid
status modified: 2018-08-13
accepted date: 2018-08-13
in scheme: AQD - Primary observation range
recommended unit: ng.m-3
in country: SI
related pollutant: Arsenic (aerosol)
primary observation time: Daily average/mean
minimum value: 0
maximum value: 60

Range for pollutant 20 for hour in ug.m-3 specific to SI
type: Concept
notation: 1163
status: valid
status modified: 2018-08-13
accepted date: 2018-08-13
in scheme: AQD - Primary observation range
recommended unit: ug.m-3
in country: SI
related pollutant: Benzene (air)
primary observation time: Hourly average/mean
minimum value: 0
maximum value: 60

Range for pollutant 21 for hour in ug.m-3 specific to SI
type: Concept
notation: 1164
status: valid
status modified: 2018-08-13
accepted date: 2018-08-13
in scheme: AQD - Primary observation range
recommended unit: ug.m-3
in country: SI
related pollutant: Toluene (air)
primary observation time: Hourly average/mean
minimum value: 0
maximum value: 500

Range for pollutant 431 for hour in ug.m-3 specific to SI
type: Concept
notation: 1165
status: valid
status modified: 2018-08-13
accepted date: 2018-08-13
in scheme: AQD - Primary observation range
recommended unit: ug.m-3
in country: SI
related pollutant: Ethyl benzene (air)
primary observation time: Hourly average/mean
minimum value: 0
maximum value: 30

Range for pollutant 464 for hour in ug.m-3 specific to SI
type: Concept
notation: 1166
status: valid
status modified: 2018-08-13
accepted date: 2018-08-13
in scheme: AQD - Primary observation range
recommended unit: ug.m-3
in country: SI
related pollutant: m,p-Xylene (air)
primary observation time: Hourly average/mean
minimum value: 0
maximum value: 100

Range for pollutant 482 for hour in ug.m-3 specific to SI
type: Concept
notation: 1167
status: valid
status modified: 2018-08-13
accepted date: 2018-08-13
in scheme: AQD - Primary observation range
recommended unit: ug.m-3
in country: SI
related pollutant: o-Xylene (air)
primary observation time: Hourly average/mean
minimum value: 0
maximum value: 20

Range for pollutant 611 for week in ug.m-2.day-1 specific to SI
type: Concept
notation: 1168
status: valid
status modified: 2018-08-13
accepted date: 2018-08-13
in scheme: AQD - Primary observation range
recommended unit: ug.m-2.day-1
in country: SI
related pollutant: Benzo(a)anthracene (precip+dry_dep)
primary observation time: Weekly average/mean
minimum value: 0
maximum value: 1000

Range for pollutant 656 for week in ug.m-2.day-1 specific to SI
type: Concept
notation: 1169
status: valid
status modified: 2018-08-13
accepted date: 2018-08-13
in scheme: AQD - Primary observation range
recommended unit: ug.m-2.day-1
in country: SI
related pollutant: indeno_123cd_pyrene (precip+dry_dep)
primary observation time: Weekly average/mean
minimum value: 0
maximum value: 1000

Range for pollutant 2013 for 2week in ng.l-1 specific to SI
type: Concept
notation: 1170
status: valid
status modified: 2018-08-13
accepted date: 2018-08-13
in scheme: AQD - Primary observation range
recommended unit: ng.l-1
in country: SI
related pollutant: Mercury (precip)
primary observation time: 2week
minimum value: 0
maximum value: 200

Range for pollutant 4813 for day in ng.m-3 specific to SI
type: Concept
notation: 1171
status: valid
status modified: 2018-08-13
accepted date: 2018-08-13
in scheme: AQD - Primary observation range
recommended unit: ng.m-3
in country: SI
related pollutant: Total gaseous mercury (air+aerosol)
primary observation time: Daily average/mean
minimum value: 0
maximum value: 10

Range for pollutant 5380 for day in ng.m-3 specific to SI
type: Concept
notation: 1172
status: valid
status modified: 2018-08-13
accepted date: 2018-08-13
in scheme: AQD - Primary observation range
recommended unit: ng.m-3
in country: SI
related pollutant: Benzo(b,j,k)fluoranthene in PM10 (aerosol)
primary observation time: Daily average/mean
minimum value: 0
maximum value: 60

Range for pollutant 5419 for day in ng.m-3 specific to SI
type: Concept
notation: 1173
status: valid
status modified: 2018-08-13
accepted date: 2018-08-13
in scheme: AQD - Primary observation range
recommended unit: ng.m-3
in country: SI
related pollutant: Dibenzo(ah)anthracene in PM10 (aerosol)
primary observation time: Daily average/mean
minimum value: 0
maximum value: 2

Range for pollutant 5610 for day in ng.m-3 specific to SI
type: Concept
notation: 1174
status: valid
status modified: 2018-08-13
accepted date: 2018-08-13
in scheme: AQD - Primary observation range
recommended unit: ng.m-3
in country: SI
related pollutant: Benzo(a)anthracene in PM10 (aerosol)
primary observation time: Daily average/mean
minimum value: 0
maximum value: 100

Range for pollutant 5655 for day in ng.m-3 specific to SI
type: Concept
notation: 1175
status: valid
status modified: 2018-08-13
accepted date: 2018-08-13
in scheme: AQD - Primary observation range
recommended unit: ng.m-3
in country: SI
related pollutant: indeno_123cd_pyrene in PM10 (aerosol)
primary observation time: Daily average/mean
minimum value: 0
maximum value: 20

Range for pollutant 6001 for day in ug.m-3 specific to SI
type: Concept
notation: 1176
status: valid
status modified: 2018-08-13
accepted date: 2018-08-13
in scheme: AQD - Primary observation range
recommended unit: ug.m-3
in country: SI
related pollutant: Particulate matter < 2.5 µm (aerosol)
primary observation time: Daily average/mean
minimum value: 0
maximum value: 200

Range for pollutant 7014 for week in ug.m-2.day-1 specific to SI
type: Concept
notation: 1177
status: valid
status modified: 2018-08-13
accepted date: 2018-08-13
in scheme: AQD - Primary observation range
recommended unit: ug.m-2.day-1
in country: SI
related pollutant: Cadmium (precip+dry_dep)
primary observation time: Weekly average/mean
minimum value: 0
maximum value: 3

Range for pollutant 7015 for week in ug.m-2.day-1 specific to SI
type: Concept
notation: 1178
status: valid
status modified: 2018-08-13
accepted date: 2018-08-13
in scheme: AQD - Primary observation range
recommended unit: ug.m-2.day-1
in country: SI
related pollutant: Nickel (precip+dry_dep)
primary observation time: Weekly average/mean
minimum value: 0
maximum value: 10

Range for pollutant 7018 for week in ug.m-2.day-1 specific to SI
type: Concept
notation: 1179
status: valid
status modified: 2018-08-13
accepted date: 2018-08-13
in scheme: AQD - Primary observation range
recommended unit: ug.m-2.day-1
in country: SI
related pollutant: Arsenic (precip+dry_dep)
primary observation time: Weekly average/mean
minimum value: 0
maximum value: 10

Range for pollutant 7029 for week in ug.m-2.day-1 specific to SI
type: Concept
notation: 1180
status: valid
status modified: 2018-08-13
accepted date: 2018-08-13
in scheme: AQD - Primary observation range
recommended unit: ug.m-2.day-1
in country: SI
related pollutant: Benzo(a)pyrene (precip+dry_dep)
primary observation time: Weekly average/mean
minimum value: 0
maximum value: 1000

Range for pollutant 7380 for week in ug.m-2.day-1 specific to SI
type: Concept
notation: 1181
status: valid
status modified: 2018-08-13
accepted date: 2018-08-13
in scheme: AQD - Primary observation range
recommended unit: ug.m-2.day-1
in country: SI
related pollutant: Benzo(b,j,k)fluoranthene (precip+dry_dep)
primary observation time: Weekly average/mean
minimum value: 0
maximum value: 6000

Range for pollutant 7419 for week in ug.m-2.day-1 specific to SI
type: Concept
notation: 1182
status: valid
status modified: 2018-08-13
accepted date: 2018-08-13
in scheme: AQD - Primary observation range
recommended unit: ug.m-2.day-1
in country: SI
related pollutant: Dibenzo(ah)anthracene (precip+dry_dep)
primary observation time: Weekly average/mean
minimum value: 0
maximum value: 600

Range for pollutant 1 for hour in ug.m-3 specific to SK
type: Concept
notation: 1183
status: valid
status modified: 2018-08-13
accepted date: 2018-08-13
in scheme: AQD - Primary observation range
recommended unit: ug.m-3
in country: SK
related pollutant: Sulphur dioxide (air)
primary observation time: Hourly average/mean
minimum value: -10
maximum value: 700

Range for pollutant 5 for hour in ug.m-3 specific to SK
type: Concept
notation: 1184
status: valid
status modified: 2018-08-13
accepted date: 2018-08-13
in scheme: AQD - Primary observation range
recommended unit: ug.m-3
in country: SK
related pollutant: Particulate matter < 10 µm (aerosol)
primary observation time: Hourly average/mean
minimum value: -10
maximum value: 1500

Range for pollutant 18 for day in ng.m-3 specific to SK
type: Concept
notation: 1185
status: valid
status modified: 2018-08-13
accepted date: 2018-08-13
in scheme: AQD - Primary observation range
recommended unit: ng.m-3
in country: SK
related pollutant: Arsenic (aerosol)
primary observation time: Daily average/mean
minimum value: -10
maximum value: 120

Range for pollutant 1 for hour in ug.m-3 specific to TR
type: Concept
notation: 1186
status: valid
status modified: 2018-08-13
accepted date: 2018-08-13
in scheme: AQD - Primary observation range
recommended unit: ug.m-3
in country: TR
related pollutant: Sulphur dioxide (air)
primary observation time: Hourly average/mean
minimum value: -10
maximum value: 2000

Range for pollutant 5 for hour in ug.m-3 specific to TR
type: Concept
notation: 1187
status: valid
status modified: 2018-08-13
accepted date: 2018-08-13
in scheme: AQD - Primary observation range
recommended unit: ug.m-3
in country: TR
related pollutant: Particulate matter < 10 µm (aerosol)
primary observation time: Hourly average/mean
minimum value: -10
maximum value: 2000

Range for pollutant 1 for var in ug.m-3 specific to FR
type: Concept
notation: 1188
status: valid
status modified: 2019-12-20
in scheme: AQD - Primary observation range
recommended unit: ug.m-3
in country: FR
related pollutant: Sulphur dioxide (air)
primary observation time: Variable sample
minimum value: -4
maximum value: 20

Range for pollutant 5 for day in ug.m-3 specific to AT
type: Concept
notation: 586
status: valid
status modified: 2018-08-13
accepted date: 2018-08-13
in scheme: AQD - Primary observation range
recommended unit: ug.m-3
in country: AT
related pollutant: Particulate matter < 10 µm (aerosol)
primary observation time: Daily average/mean
minimum value: -1
maximum value: 525

Range for pollutant 5 for hour in ug.m-3 specific to AT
type: Concept
notation: 587
status: valid
status modified: 2018-08-13
accepted date: 2018-08-13
in scheme: AQD - Primary observation range
recommended unit: ug.m-3
in country: AT
related pollutant: Particulate matter < 10 µm (aerosol)
primary observation time: Hourly average/mean
minimum value: -5
maximum value: 1000

Range for pollutant 7 for hour in ug.m-3 specific to AT
type: Concept
notation: 588
status: valid
status modified: 2018-08-13
accepted date: 2018-08-13
in scheme: AQD - Primary observation range
recommended unit: ug.m-3
in country: AT
related pollutant: Ozone (air)
primary observation time: Hourly average/mean
minimum value: -0.2
maximum value: 400

Range for pollutant 8 for hour in ug.m-3 specific to AT
type: Concept
notation: 589
status: valid
status modified: 2018-08-13
accepted date: 2018-08-13
in scheme: AQD - Primary observation range
recommended unit: ug.m-3
in country: AT
related pollutant: Nitrogen dioxide (air)
primary observation time: Hourly average/mean
minimum value: -0.1
maximum value: 450

Range for pollutant 10 for hour in mg.m-3 specific to AT
type: Concept
notation: 590
status: valid
status modified: 2018-08-13
accepted date: 2018-08-13
in scheme: AQD - Primary observation range
recommended unit: mg.m-3
in country: AT
related pollutant: Carbon monoxide (air)
primary observation time: Hourly average/mean
minimum value: 0
maximum value: 20

Range for pollutant 12 for day in ug.m-3 specific to AT
type: Concept
notation: 591
status: valid
status modified: 2018-08-13
accepted date: 2018-08-13
in scheme: AQD - Primary observation range
recommended unit: ug.m-3
in country: AT
related pollutant: Lead (aerosol)
primary observation time: Daily average/mean
minimum value: 0
maximum value: 8

Range for pollutant 12 for year in ug.m-3 specific to AT
type: Concept
notation: 592
status: valid
status modified: 2018-08-13
accepted date: 2018-08-13
in scheme: AQD - Primary observation range
recommended unit: ug.m-3
in country: AT
related pollutant: Lead (aerosol)
primary observation time: Yearly average/mean
minimum value: 0
maximum value: 5

Range for pollutant 14 for day in ng.m-3 specific to AT
type: Concept
notation: 593
status: valid
status modified: 2018-08-13
accepted date: 2018-08-13
in scheme: AQD - Primary observation range
recommended unit: ng.m-3
in country: AT
related pollutant: Cadmium (aerosol)
primary observation time: Daily average/mean
minimum value: 0
maximum value: 50

Range for pollutant 14 for year in ng.m-3 specific to AT
type: Concept
notation: 594
status: valid
status modified: 2018-08-13
accepted date: 2018-08-13
in scheme: AQD - Primary observation range
recommended unit: ng.m-3
in country: AT
related pollutant: Cadmium (aerosol)
primary observation time: Yearly average/mean
minimum value: 0
maximum value: 30

Range for pollutant 15 for day in ng.m-3 specific to AT
type: Concept
notation: 595
status: valid
status modified: 2018-08-13
accepted date: 2018-08-13
in scheme: AQD - Primary observation range
recommended unit: ng.m-3
in country: AT
related pollutant: Nickel (aerosol)
primary observation time: Daily average/mean
minimum value: 0
maximum value: 200

Range for pollutant 15 for year in ng.m-3 specific to AT
type: Concept
notation: 596
status: valid
status modified: 2018-08-13
accepted date: 2018-08-13
in scheme: AQD - Primary observation range
recommended unit: ng.m-3
in country: AT
related pollutant: Nickel (aerosol)
primary observation time: Yearly average/mean
minimum value: 0
maximum value: 100

Range for pollutant 18 for day in ng.m-3 specific to AT
type: Concept
notation: 597
status: valid
status modified: 2018-08-13
accepted date: 2018-08-13
in scheme: AQD - Primary observation range
recommended unit: ng.m-3
in country: AT
related pollutant: Arsenic (aerosol)
primary observation time: Daily average/mean
minimum value: 0
maximum value: 60

Range for pollutant 18 for year in ng.m-3 specific to AT
type: Concept
notation: 598
status: valid
status modified: 2018-08-13
accepted date: 2018-08-13
in scheme: AQD - Primary observation range
recommended unit: ng.m-3
in country: AT
related pollutant: Arsenic (aerosol)
primary observation time: Yearly average/mean
minimum value: 0
maximum value: 10

Range for pollutant 20 for day in ug.m-3 specific to AT
type: Concept
notation: 599
status: valid
status modified: 2018-08-13
accepted date: 2018-08-13
in scheme: AQD - Primary observation range
recommended unit: ug.m-3
in country: AT
related pollutant: Benzene (air)
primary observation time: Daily average/mean
minimum value: 0
maximum value: 35

Range for pollutant 20 for hour in ug.m-3 specific to AT
type: Concept
notation: 600
status: valid
status modified: 2018-08-13
accepted date: 2018-08-13
in scheme: AQD - Primary observation range
recommended unit: ug.m-3
in country: AT
related pollutant: Benzene (air)
primary observation time: Hourly average/mean
minimum value: 0
maximum value: 60

Range for pollutant 20 for year in ug.m-3 specific to AT
type: Concept
notation: 601
status: valid
status modified: 2018-08-13
accepted date: 2018-08-13
in scheme: AQD - Primary observation range
recommended unit: ug.m-3
in country: AT
related pollutant: Benzene (air)
primary observation time: Yearly average/mean
minimum value: 0
maximum value: 20

Range for pollutant 21 for day in ug.m-3 specific to AT
type: Concept
notation: 602
status: valid
status modified: 2018-08-13
accepted date: 2018-08-13
in scheme: AQD - Primary observation range
recommended unit: ug.m-3
in country: AT
related pollutant: Toluene (air)
primary observation time: Daily average/mean
minimum value: 0
maximum value: 150

Range for pollutant 38 for hour in ug.m-3 specific to AT
type: Concept
notation: 603
status: valid
status modified: 2018-08-13
accepted date: 2018-08-13
in scheme: AQD - Primary observation range
recommended unit: ug.m-3
in country: AT
related pollutant: Nitrogen monoxide (air)
primary observation time: Hourly average/mean
minimum value: -0.1
maximum value: 1200

Range for pollutant 316 for day in ug.m-3 specific to AT
type: Concept
notation: 604
status: valid
status modified: 2018-08-13
accepted date: 2018-08-13
in scheme: AQD - Primary observation range
recommended unit: ug.m-3
in country: AT
related pollutant: i-Hexane (2-methylpentane) (air)
primary observation time: Daily average/mean
minimum value: 0
maximum value: 12

Range for pollutant 431 for day in ug.m-3 specific to AT
type: Concept
notation: 605
status: valid
status modified: 2018-08-13
accepted date: 2018-08-13
in scheme: AQD - Primary observation range
recommended unit: ug.m-3
in country: AT
related pollutant: Ethyl benzene (air)
primary observation time: Daily average/mean
minimum value: 0
maximum value: 8

Range for pollutant 441 for day in ug.m-3 specific to AT
type: Concept
notation: 606
status: valid
status modified: 2018-08-13
accepted date: 2018-08-13
in scheme: AQD - Primary observation range
recommended unit: ug.m-3
in country: AT
related pollutant: n-Heptane (air)
primary observation time: Daily average/mean
minimum value: 0
maximum value: 5

Range for pollutant 443 for day in ug.m-3 specific to AT
type: Concept
notation: 607
status: valid
status modified: 2018-08-13
accepted date: 2018-08-13
in scheme: AQD - Primary observation range
recommended unit: ug.m-3
in country: AT
related pollutant: n-Hexane (air)
primary observation time: Daily average/mean
minimum value: 0
maximum value: 8

Range for pollutant 449 for day in ug.m-3 specific to AT
type: Concept
notation: 608
status: valid
status modified: 2018-08-13
accepted date: 2018-08-13
in scheme: AQD - Primary observation range
recommended unit: ug.m-3
in country: AT
related pollutant: i-Octane (2,2,4-trimethylpentane) (air)
primary observation time: Daily average/mean
minimum value: 0
maximum value: 5

Range for pollutant 450 for day in ug.m-3 specific to AT
type: Concept
notation: 609
status: valid
status modified: 2018-08-13
accepted date: 2018-08-13
in scheme: AQD - Primary observation range
recommended unit: ug.m-3
in country: AT
related pollutant: i-Pentane (2-methylbutane) (air)
primary observation time: Daily average/mean
minimum value: 0
maximum value: 30

Range for pollutant 464 for day in ug.m-3 specific to AT
type: Concept
notation: 610
status: valid
status modified: 2018-08-13
accepted date: 2018-08-13
in scheme: AQD - Primary observation range
recommended unit: ug.m-3
in country: AT
related pollutant: m,p-Xylene (air)
primary observation time: Daily average/mean
minimum value: 0
maximum value: 20

Range for pollutant 475 for day in ug.m-3 specific to AT
type: Concept
notation: 611
status: valid
status modified: 2018-08-13
accepted date: 2018-08-13
in scheme: AQD - Primary observation range
recommended unit: ug.m-3
in country: AT
related pollutant: n-Octane (air)
primary observation time: Daily average/mean
minimum value: 0
maximum value: 8

Range for pollutant 482 for day in ug.m-3 specific to AT
type: Concept
notation: 612
status: valid
status modified: 2018-08-13
accepted date: 2018-08-13
in scheme: AQD - Primary observation range
recommended unit: ug.m-3
in country: AT
related pollutant: o-Xylene (air)
primary observation time: Daily average/mean
minimum value: 0
maximum value: 8

Range for pollutant 486 for day in ug.m-3 specific to AT
type: Concept
notation: 613
status: valid
status modified: 2018-08-13
accepted date: 2018-08-13
in scheme: AQD - Primary observation range
recommended unit: ug.m-3
in country: AT
related pollutant: n-Pentane (air)
primary observation time: Daily average/mean
minimum value: 0
maximum value: 14

Range for pollutant 616 for year in ng.m-3 specific to AT
type: Concept
notation: 614
status: valid
status modified: 2018-08-13
accepted date: 2018-08-13
in scheme: AQD - Primary observation range
recommended unit: ng.m-3
in country: AT
related pollutant: Benzo(b)fluoranthene (air+aerosol)
primary observation time: Yearly average/mean
minimum value: -0.5
maximum value: 3

Range for pollutant 633 for year in ng.m-3 specific to AT
type: Concept
notation: 615
status: valid
status modified: 2018-08-13
accepted date: 2018-08-13
in scheme: AQD - Primary observation range
recommended unit: ng.m-3
in country: AT
related pollutant: Dibenz(ac+ah)anthracenes (air+aerosol)
primary observation time: Yearly average/mean
minimum value: 0
maximum value: 2

Range for pollutant 762 for year in ng.m-3 specific to AT
type: Concept
notation: 616
status: valid
status modified: 2018-08-13
accepted date: 2018-08-13
in scheme: AQD - Primary observation range
recommended unit: ng.m-3
in country: AT
related pollutant: Benzo(j)fluoranthene (air+aerosol)
primary observation time: Yearly average/mean
minimum value: 0
maximum value: 3

Range for pollutant 6001 for day in ug.m-3 specific to AT
type: Concept
notation: 617
status: valid
status modified: 2018-08-13
accepted date: 2018-08-13
in scheme: AQD - Primary observation range
recommended unit: ug.m-3
in country: AT
related pollutant: Particulate matter < 2.5 µm (aerosol)
primary observation time: Daily average/mean
minimum value: 0
maximum value: 525

Range for pollutant 6002 for day in ug.m-3 specific to AT
type: Concept
notation: 618
status: valid
status modified: 2018-08-13
accepted date: 2018-08-13
in scheme: AQD - Primary observation range
recommended unit: ug.m-3
in country: AT
related pollutant: Particulate matter < 1 µm (aerosol)
primary observation time: Daily average/mean
minimum value: 0
maximum value: 525

Range for pollutant 6008 for day in ug.m-3 specific to AT
type: Concept
notation: 619
status: valid
status modified: 2018-08-13
accepted date: 2018-08-13
in scheme: AQD - Primary observation range
recommended unit: ug.m-3
in country: AT
related pollutant: 1-Pentene (air)
primary observation time: Daily average/mean
minimum value: 0
maximum value: 12

Range for pollutant 6009 for day in ug.m-3 specific to AT
type: Concept
notation: 620
status: valid
status modified: 2018-08-13
accepted date: 2018-08-13
in scheme: AQD - Primary observation range
recommended unit: ug.m-3
in country: AT
related pollutant: 2-Pentene (air)
primary observation time: Daily average/mean
minimum value: 0
maximum value: 12

Range for pollutant 6011 for day in ug.m-3 specific to AT
type: Concept
notation: 621
status: valid
status modified: 2018-08-13
accepted date: 2018-08-13
in scheme: AQD - Primary observation range
recommended unit: ug.m-3
in country: AT
related pollutant: 1,2,4-Trimethylbenzene (air)
primary observation time: Daily average/mean
minimum value: 0
maximum value: 12

Range for pollutant 6012 for day in ug.m-3 specific to AT
type: Concept
notation: 622
status: valid
status modified: 2018-08-13
accepted date: 2018-08-13
in scheme: AQD - Primary observation range
recommended unit: ug.m-3
in country: AT
related pollutant: 1,2,3-Trimethylbenzene (air)
primary observation time: Daily average/mean
minimum value: 0
maximum value: 10

Range for pollutant 6013 for day in ug.m-3 specific to AT
type: Concept
notation: 623
status: valid
status modified: 2018-08-13
accepted date: 2018-08-13
in scheme: AQD - Primary observation range
recommended unit: ug.m-3
in country: AT
related pollutant: 1,3,5-Trimethylbenzene (air)
primary observation time: Daily average/mean
minimum value: 0
maximum value: 5

Range for pollutant 6015 for year in ng.m-3 specific to AT
type: Concept
notation: 624
status: valid
status modified: 2018-08-13
accepted date: 2018-08-13
in scheme: AQD - Primary observation range
recommended unit: ng.m-3
in country: AT
related pollutant: Benzo(a)pyrene (air+aerosol)
primary observation time: Yearly average/mean
minimum value: 0
maximum value: 10

Range for pollutant 1 for hour in ug.m-3 specific to BE
type: Concept
notation: 625
status: valid
status modified: 2018-08-13
accepted date: 2018-08-13
in scheme: AQD - Primary observation range
recommended unit: ug.m-3
in country: BE
related pollutant: Sulphur dioxide (air)
primary observation time: Hourly average/mean
minimum value: -3
maximum value: 450

Range for pollutant 5 for hour in ug.m-3 specific to BE
type: Concept
notation: 626
status: valid
status modified: 2018-08-13
accepted date: 2018-08-13
in scheme: AQD - Primary observation range
recommended unit: ug.m-3
in country: BE
related pollutant: Particulate matter < 10 µm (aerosol)
primary observation time: Hourly average/mean
minimum value: -1
maximum value: 700

Range for pollutant 6 for day in ug.m-3 specific to BE
type: Concept
notation: 627
status: valid
status modified: 2018-08-13
accepted date: 2018-08-13
in scheme: AQD - Primary observation range
recommended unit: ug.m-3
in country: BE
related pollutant: Black smoke (air)
primary observation time: Daily average/mean
minimum value: -0.02
maximum value: 525

Range for pollutant 7 for hour in ug.m-3 specific to BE
type: Concept
notation: 628
status: valid
status modified: 2018-08-13
accepted date: 2018-08-13
in scheme: AQD - Primary observation range
recommended unit: ug.m-3
in country: BE
related pollutant: Ozone (air)
primary observation time: Hourly average/mean
minimum value: 0
maximum value: 300

Range for pollutant 8 for hour in ug.m-3 specific to BE
type: Concept
notation: 629
status: valid
status modified: 2018-08-13
accepted date: 2018-08-13
in scheme: AQD - Primary observation range
recommended unit: ug.m-3
in country: BE
related pollutant: Nitrogen dioxide (air)
primary observation time: Hourly average/mean
minimum value: -2
maximum value: 450

Range for pollutant 10 for hour in mg.m-3 specific to BE
type: Concept
notation: 630
status: valid
status modified: 2018-08-13
accepted date: 2018-08-13
in scheme: AQD - Primary observation range
recommended unit: mg.m-3
in country: BE
related pollutant: Carbon monoxide (air)
primary observation time: Hourly average/mean
minimum value: -0.06
maximum value: 20

Range for pollutant 12 for day in ug.m-3 specific to BE
type: Concept
notation: 631
status: valid
status modified: 2018-08-13
accepted date: 2018-08-13
in scheme: AQD - Primary observation range
recommended unit: ug.m-3
in country: BE
related pollutant: Lead (aerosol)
primary observation time: Daily average/mean
minimum value: 0
maximum value: 5

Range for pollutant 13 for hour in ng.m-3 specific to BE
type: Concept
notation: 632
status: valid
status modified: 2018-08-13
accepted date: 2018-08-13
in scheme: AQD - Primary observation range
recommended unit: ng.m-3
in country: BE
related pollutant: Mercury (aerosol)
primary observation time: Hourly average/mean
minimum value: 0
maximum value: 500

Range for pollutant 14 for day in ng.m-3 specific to BE
type: Concept
notation: 633
status: valid
status modified: 2018-08-13
accepted date: 2018-08-13
in scheme: AQD - Primary observation range
recommended unit: ng.m-3
in country: BE
related pollutant: Cadmium (aerosol)
primary observation time: Daily average/mean
minimum value: 0
maximum value: 100

Range for pollutant 15 for day in ng.m-3 specific to BE
type: Concept
notation: 634
status: valid
status modified: 2018-08-13
accepted date: 2018-08-13
in scheme: AQD - Primary observation range
recommended unit: ng.m-3
in country: BE
related pollutant: Nickel (aerosol)
primary observation time: Daily average/mean
minimum value: 0
maximum value: 400

Range for pollutant 18 for day in ng.m-3 specific to BE
type: Concept
notation: 635
status: valid
status modified: 2018-08-13
accepted date: 2018-08-13
in scheme: AQD - Primary observation range
recommended unit: ng.m-3
in country: BE
related pollutant: Arsenic (aerosol)
primary observation time: Daily average/mean
minimum value: 0
maximum value: 120

Range for pollutant 20 for day in ug.m-3 specific to BE
type: Concept
notation: 636
status: valid
status modified: 2018-08-13
accepted date: 2018-08-13
in scheme: AQD - Primary observation range
recommended unit: ug.m-3
in country: BE
related pollutant: Benzene (air)
primary observation time: Daily average/mean
minimum value: 0
maximum value: 35

Range for pollutant 20 for hour in ug.m-3 specific to BE
type: Concept
notation: 637
status: valid
status modified: 2018-08-13
accepted date: 2018-08-13
in scheme: AQD - Primary observation range
recommended unit: ug.m-3
in country: BE
related pollutant: Benzene (air)
primary observation time: Hourly average/mean
minimum value: 0
maximum value: 60

Range for pollutant 38 for hour in ug.m-3 specific to BE
type: Concept
notation: 638
status: valid
status modified: 2018-08-13
accepted date: 2018-08-13
in scheme: AQD - Primary observation range
recommended unit: ug.m-3
in country: BE
related pollutant: Nitrogen monoxide (air)
primary observation time: Hourly average/mean
minimum value: -1
maximum value: 900

Range for pollutant 2013 for week in ng.l-1 specific to BE
type: Concept
notation: 639
status: valid
status modified: 2018-08-13
accepted date: 2018-08-13
in scheme: AQD - Primary observation range
recommended unit: ng.l-1
in country: BE
related pollutant: Mercury (precip)
primary observation time: Weekly average/mean
minimum value: -10
maximum value: 20

Range for pollutant 3012 for day in ug.m-3 specific to BE
type: Concept
notation: 640
status: valid
status modified: 2018-08-13
accepted date: 2018-08-13
in scheme: AQD - Primary observation range
recommended unit: ug.m-3
in country: BE
related pollutant: Lead in TSP (aerosol)
primary observation time: Daily average/mean
minimum value: 0
maximum value: 5

Range for pollutant 3014 for day in ng.m-3 specific to BE
type: Concept
notation: 641
status: valid
status modified: 2018-08-13
accepted date: 2018-08-13
in scheme: AQD - Primary observation range
recommended unit: ng.m-3
in country: BE
related pollutant: Cadmium in TSP (aerosol)
primary observation time: Daily average/mean
minimum value: 0
maximum value: 100

Range for pollutant 3015 for day in ng.m-3 specific to BE
type: Concept
notation: 642
status: valid
status modified: 2018-08-13
accepted date: 2018-08-13
in scheme: AQD - Primary observation range
recommended unit: ng.m-3
in country: BE
related pollutant: Nickel in TSP (aerosol)
primary observation time: Daily average/mean
minimum value: 0
maximum value: 400

Range for pollutant 3018 for day in ng.m-3 specific to BE
type: Concept
notation: 643
status: valid
status modified: 2018-08-13
accepted date: 2018-08-13
in scheme: AQD - Primary observation range
recommended unit: ng.m-3
in country: BE
related pollutant: Arsenic in TSP (aerosol)
primary observation time: Daily average/mean
minimum value: 0
maximum value: 120

Range for pollutant 5012 for day in ug.m-3 specific to BE
type: Concept
notation: 644
status: valid
status modified: 2018-08-13
accepted date: 2018-08-13
in scheme: AQD - Primary observation range
recommended unit: ug.m-3
in country: BE
related pollutant: Lead in PM10 (aerosol)
primary observation time: Daily average/mean
minimum value: 0
maximum value: 5

Range for pollutant 5014 for day in ng.m-3 specific to BE
type: Concept
notation: 645
status: valid
status modified: 2018-08-13
accepted date: 2018-08-13
in scheme: AQD - Primary observation range
recommended unit: ng.m-3
in country: BE
related pollutant: Cadmium in PM10 (aerosol)
primary observation time: Daily average/mean
minimum value: 0
maximum value: 100

Range for pollutant 5015 for day in ng.m-3 specific to BE
type: Concept
notation: 646
status: valid
status modified: 2018-08-13
accepted date: 2018-08-13
in scheme: AQD - Primary observation range
recommended unit: ng.m-3
in country: BE
related pollutant: Nickel in PM10 (aerosol)
primary observation time: Daily average/mean
minimum value: 0
maximum value: 400

Range for pollutant 5018 for day in ng.m-3 specific to BE
type: Concept
notation: 647
status: valid
status modified: 2018-08-13
accepted date: 2018-08-13
in scheme: AQD - Primary observation range
recommended unit: ng.m-3
in country: BE
related pollutant: Arsenic in PM10 (aerosol)
primary observation time: Daily average/mean
minimum value: 0
maximum value: 120

Range for pollutant 6001 for hour in ug.m-3 specific to BE
type: Concept
notation: 648
status: valid
status modified: 2018-08-13
accepted date: 2018-08-13
in scheme: AQD - Primary observation range
recommended unit: ug.m-3
in country: BE
related pollutant: Particulate matter < 2.5 µm (aerosol)
primary observation time: Hourly average/mean
minimum value: -1
maximum value: 700

Range for pollutant 6015 for day in ng.m-3 specific to BE
type: Concept
notation: 649
status: valid
status modified: 2018-08-13
accepted date: 2018-08-13
in scheme: AQD - Primary observation range
recommended unit: ng.m-3
in country: BE
related pollutant: Benzo(a)pyrene (air+aerosol)
primary observation time: Daily average/mean
minimum value: 0
maximum value: 20

Range for pollutant 1 for hour in ug.m-3 specific to BG
type: Concept
notation: 650
status: valid
status modified: 2018-08-13
accepted date: 2018-08-13
in scheme: AQD - Primary observation range
recommended unit: ug.m-3
in country: BG
related pollutant: Sulphur dioxide (air)
primary observation time: Hourly average/mean
minimum value: -10
maximum value: 1800

Range for pollutant 4 for day in ug.m-3 specific to BG
type: Concept
notation: 651
status: valid
status modified: 2018-08-13
accepted date: 2018-08-13
in scheme: AQD - Primary observation range
recommended unit: ug.m-3
in country: BG
related pollutant: Total suspended particulates (aerosol)
primary observation time: Daily average/mean
minimum value: -10
maximum value: 1200

Range for pollutant 11 for hour in ug.m-3 specific to BG
type: Concept
notation: 652
status: valid
status modified: 2018-08-13
accepted date: 2018-08-13
in scheme: AQD - Primary observation range
recommended unit: ug.m-3
in country: BG
related pollutant: Hydrogen sulphide (air)
primary observation time: Hourly average/mean
minimum value: -10
maximum value: 100

Range for pollutant 35 for hour in ug.m-3 specific to BG
type: Concept
notation: 653
status: valid
status modified: 2018-08-13
accepted date: 2018-08-13
in scheme: AQD - Primary observation range
recommended unit: ug.m-3
in country: BG
related pollutant: Ammonia (air)
primary observation time: Hourly average/mean
minimum value: -10
maximum value: 2100

Range for pollutant 5 for day in ug.m-3 specific to CY
type: Concept
notation: 654
status: valid
status modified: 2018-08-13
accepted date: 2018-08-13
in scheme: AQD - Primary observation range
recommended unit: ug.m-3
in country: CY
related pollutant: Particulate matter < 10 µm (aerosol)
primary observation time: Daily average/mean
minimum value: -10
maximum value: 2000

Range for pollutant 5 for hour in ug.m-3 specific to CY
type: Concept
notation: 655
status: valid
status modified: 2018-08-13
accepted date: 2018-08-13
in scheme: AQD - Primary observation range
recommended unit: ug.m-3
in country: CY
related pollutant: Particulate matter < 10 µm (aerosol)
primary observation time: Hourly average/mean
minimum value: -10
maximum value: 5000

Range for pollutant 15 for day in ng.m-3 specific to CY
type: Concept
notation: 656
status: valid
status modified: 2018-08-13
accepted date: 2018-08-13
in scheme: AQD - Primary observation range
recommended unit: ng.m-3
in country: CY
related pollutant: Nickel (aerosol)
primary observation time: Daily average/mean
minimum value: -10
maximum value: 300

Range for pollutant 16 for day in ng.m-3 specific to CY
type: Concept
notation: 657
status: valid
status modified: 2018-08-13
accepted date: 2018-08-13
in scheme: AQD - Primary observation range
recommended unit: ng.m-3
in country: CY
related pollutant: Chromium (aerosol)
primary observation time: Daily average/mean
minimum value: -0.5
maximum value: 30

Range for pollutant 17 for day in ng.m-3 specific to CY
type: Concept
notation: 658
status: valid
status modified: 2018-08-13
accepted date: 2018-08-13
in scheme: AQD - Primary observation range
recommended unit: ng.m-3
in country: CY
related pollutant: Manganese (aerosol)
primary observation time: Daily average/mean
minimum value: 0
maximum value: 300

Range for pollutant 49 for day in ng.m-3 specific to CY
type: Concept
notation: 659
status: valid
status modified: 2018-08-13
accepted date: 2018-08-13
in scheme: AQD - Primary observation range
recommended unit: ng.m-3
in country: CY
related pollutant: Vanadium (aerosol)
primary observation time: Daily average/mean
minimum value: 0
maximum value: 40

Range for pollutant 63 for day in ng.m-3 specific to CY
type: Concept
notation: 660
status: valid
status modified: 2018-08-13
accepted date: 2018-08-13
in scheme: AQD - Primary observation range
recommended unit: ng.m-3
in country: CY
related pollutant: Zinc (aerosol)
primary observation time: Daily average/mean
minimum value: -10
maximum value: 600

Range for pollutant 65 for day in ng.m-3 specific to CY
type: Concept
notation: 661
status: valid
status modified: 2018-08-13
accepted date: 2018-08-13
in scheme: AQD - Primary observation range
recommended unit: ng.m-3
in country: CY
related pollutant: Iron (aerosol)
primary observation time: Daily average/mean
minimum value: 0
maximum value: 19999

Range for pollutant 73 for day in ng.m-3 specific to CY
type: Concept
notation: 662
status: valid
status modified: 2018-08-13
accepted date: 2018-08-13
in scheme: AQD - Primary observation range
recommended unit: ng.m-3
in country: CY
related pollutant: Copper (aerosol)
primary observation time: Daily average/mean
minimum value: -0.5
maximum value: 50

Range for pollutant 604 for day in ng.m-3 specific to CY
type: Concept
notation: 663
status: valid
status modified: 2018-08-13
accepted date: 2018-08-13
in scheme: AQD - Primary observation range
recommended unit: ng.m-3
in country: CY
related pollutant: aluminium (aerosol)
primary observation time: Daily average/mean
minimum value: -99
maximum value: 40000

Range for pollutant 1047 for day in ug.m-3 specific to CY
type: Concept
notation: 664
status: valid
status modified: 2018-08-13
accepted date: 2018-08-13
in scheme: AQD - Primary observation range
recommended unit: ug.m-3
in country: CY
related pollutant: sulphate in PM2.5 (aerosol)
primary observation time: Daily average/mean
minimum value: 0
maximum value: 20

Range for pollutant 1629 for day in ug.m-3 specific to CY
type: Concept
notation: 665
status: valid
status modified: 2018-08-13
accepted date: 2018-08-13
in scheme: AQD - Primary observation range
recommended unit: ug.m-3
in country: CY
related pollutant: calcium in PM2.5 (aerosol)
primary observation time: Daily average/mean
minimum value: 0
maximum value: 6

Range for pollutant 5654 for day in ng.m-3 specific to CY
type: Concept
notation: 666
status: valid
status modified: 2018-08-13
accepted date: 2018-08-13
in scheme: AQD - Primary observation range
recommended unit: ng.m-3
in country: CY
related pollutant: indeno_123cd_pyrene in PM10 (air+aerosol)
primary observation time: Daily average/mean
minimum value: 0
maximum value: 5

Range for pollutant 6001 for day in ug.m-3 specific to CY
type: Concept
notation: 667
status: valid
status modified: 2018-08-13
accepted date: 2018-08-13
in scheme: AQD - Primary observation range
recommended unit: ug.m-3
in country: CY
related pollutant: Particulate matter < 2.5 µm (aerosol)
primary observation time: Daily average/mean
minimum value: -10
maximum value: 2000

Range for pollutant 1 for hour in ug.m-3 specific to CZ
type: Concept
notation: 668
status: valid
status modified: 2018-08-13
accepted date: 2018-08-13
in scheme: AQD - Primary observation range
recommended unit: ug.m-3
in country: CZ
related pollutant: Sulphur dioxide (air)
primary observation time: Hourly average/mean
minimum value: 0
maximum value: 600

Range for pollutant 5 for day in ug.m-3 specific to CZ
type: Concept
notation: 669
status: valid
status modified: 2018-08-13
accepted date: 2018-08-13
in scheme: AQD - Primary observation range
recommended unit: ug.m-3
in country: CZ
related pollutant: Particulate matter < 10 µm (aerosol)
primary observation time: Daily average/mean
minimum value: 0
maximum value: 525

Range for pollutant 5 for hour in ug.m-3 specific to CZ
type: Concept
notation: 670
status: valid
status modified: 2018-08-13
accepted date: 2018-08-13
in scheme: AQD - Primary observation range
recommended unit: ug.m-3
in country: CZ
related pollutant: Particulate matter < 10 µm (aerosol)
primary observation time: Hourly average/mean
minimum value: 0
maximum value: 800

Range for pollutant 7 for hour in ug.m-3 specific to CZ
type: Concept
notation: 671
status: valid
status modified: 2018-08-13
accepted date: 2018-08-13
in scheme: AQD - Primary observation range
recommended unit: ug.m-3
in country: CZ
related pollutant: Ozone (air)
primary observation time: Hourly average/mean
minimum value: 0
maximum value: 400

Range for pollutant 8 for hour in ug.m-3 specific to CZ
type: Concept
notation: 672
status: valid
status modified: 2018-08-13
accepted date: 2018-08-13
in scheme: AQD - Primary observation range
recommended unit: ug.m-3
in country: CZ
related pollutant: Nitrogen dioxide (air)
primary observation time: Hourly average/mean
minimum value: 0
maximum value: 450

Range for pollutant 9 for hour in ug.m-3 specific to CZ
type: Concept
notation: 673
status: valid
status modified: 2018-08-13
accepted date: 2018-08-13
in scheme: AQD - Primary observation range
recommended unit: ug.m-3
in country: CZ
related pollutant: Nitrogen oxides (air)
primary observation time: Hourly average/mean
minimum value: 0
maximum value: 1500

Range for pollutant 10 for hour in mg.m-3 specific to CZ
type: Concept
notation: 674
status: valid
status modified: 2018-08-13
accepted date: 2018-08-13
in scheme: AQD - Primary observation range
recommended unit: mg.m-3
in country: CZ
related pollutant: Carbon monoxide (air)
primary observation time: Hourly average/mean
minimum value: 0
maximum value: 20

Range for pollutant 12 for day in ug.m-3 specific to CZ
type: Concept
notation: 675
status: valid
status modified: 2018-08-13
accepted date: 2018-08-13
in scheme: AQD - Primary observation range
recommended unit: ug.m-3
in country: CZ
related pollutant: Lead (aerosol)
primary observation time: Daily average/mean
minimum value: 0
maximum value: 5

Range for pollutant 14 for day in ng.m-3 specific to CZ
type: Concept
notation: 676
status: valid
status modified: 2018-08-13
accepted date: 2018-08-13
in scheme: AQD - Primary observation range
recommended unit: ng.m-3
in country: CZ
related pollutant: Cadmium (aerosol)
primary observation time: Daily average/mean
minimum value: 0
maximum value: 50

Range for pollutant 15 for day in ng.m-3 specific to CZ
type: Concept
notation: 677
status: valid
status modified: 2018-08-13
accepted date: 2018-08-13
in scheme: AQD - Primary observation range
recommended unit: ng.m-3
in country: CZ
related pollutant: Nickel (aerosol)
primary observation time: Daily average/mean
minimum value: 0
maximum value: 200

Range for pollutant 18 for day in ng.m-3 specific to CZ
type: Concept
notation: 678
status: valid
status modified: 2018-08-13
accepted date: 2018-08-13
in scheme: AQD - Primary observation range
recommended unit: ng.m-3
in country: CZ
related pollutant: Arsenic (aerosol)
primary observation time: Daily average/mean
minimum value: 0
maximum value: 60

Range for pollutant 20 for day in ug.m-3 specific to CZ
type: Concept
notation: 679
status: valid
status modified: 2018-08-13
accepted date: 2018-08-13
in scheme: AQD - Primary observation range
recommended unit: ug.m-3
in country: CZ
related pollutant: Benzene (air)
primary observation time: Daily average/mean
minimum value: 0
maximum value: 35

Range for pollutant 20 for hour in ug.m-3 specific to CZ
type: Concept
notation: 680
status: valid
status modified: 2018-08-13
accepted date: 2018-08-13
in scheme: AQD - Primary observation range
recommended unit: ug.m-3
in country: CZ
related pollutant: Benzene (air)
primary observation time: Hourly average/mean
minimum value: 0
maximum value: 100

Range for pollutant 38 for hour in ug.m-3 specific to CZ
type: Concept
notation: 681
status: valid
status modified: 2018-08-13
accepted date: 2018-08-13
in scheme: AQD - Primary observation range
recommended unit: ug.m-3
in country: CZ
related pollutant: Nitrogen monoxide (air)
primary observation time: Hourly average/mean
minimum value: 0
maximum value: 900

Range for pollutant 3012 for day in ug.m-3 specific to CZ
type: Concept
notation: 682
status: valid
status modified: 2018-08-13
accepted date: 2018-08-13
in scheme: AQD - Primary observation range
recommended unit: ug.m-3
in country: CZ
related pollutant: Lead in TSP (aerosol)
primary observation time: Daily average/mean
minimum value: 0
maximum value: 5

Range for pollutant 3014 for day in ng.m-3 specific to CZ
type: Concept
notation: 683
status: valid
status modified: 2018-08-13
accepted date: 2018-08-13
in scheme: AQD - Primary observation range
recommended unit: ng.m-3
in country: CZ
related pollutant: Cadmium in TSP (aerosol)
primary observation time: Daily average/mean
minimum value: 0
maximum value: 100

Range for pollutant 3015 for day in ng.m-3 specific to CZ
type: Concept
notation: 684
status: valid
status modified: 2018-08-13
accepted date: 2018-08-13
in scheme: AQD - Primary observation range
recommended unit: ng.m-3
in country: CZ
related pollutant: Nickel in TSP (aerosol)
primary observation time: Daily average/mean
minimum value: 0
maximum value: 400

Range for pollutant 3018 for day in ng.m-3 specific to CZ
type: Concept
notation: 685
status: valid
status modified: 2018-08-13
accepted date: 2018-08-13
in scheme: AQD - Primary observation range
recommended unit: ng.m-3
in country: CZ
related pollutant: Arsenic in TSP (aerosol)
primary observation time: Daily average/mean
minimum value: 0
maximum value: 120

Range for pollutant 6001 for day in ug.m-3 specific to CZ
type: Concept
notation: 686
status: valid
status modified: 2018-08-13
accepted date: 2018-08-13
in scheme: AQD - Primary observation range
recommended unit: ug.m-3
in country: CZ
related pollutant: Particulate matter < 2.5 µm (aerosol)
primary observation time: Daily average/mean
minimum value: 0
maximum value: 525

Range for pollutant 6001 for hour in ug.m-3 specific to CZ
type: Concept
notation: 687
status: valid
status modified: 2018-08-13
accepted date: 2018-08-13
in scheme: AQD - Primary observation range
recommended unit: ug.m-3
in country: CZ
related pollutant: Particulate matter < 2.5 µm (aerosol)
primary observation time: Hourly average/mean
minimum value: 0
maximum value: 700

Range for pollutant 6015 for day in ng.m-3 specific to CZ
type: Concept
notation: 688
status: valid
status modified: 2018-08-13
accepted date: 2018-08-13
in scheme: AQD - Primary observation range
recommended unit: ng.m-3
in country: CZ
related pollutant: Benzo(a)pyrene (air+aerosol)
primary observation time: Daily average/mean
minimum value: 0
maximum value: 60

Range for pollutant 38 for hour in ug.m-3 specific to DK
type: Concept
notation: 689
status: valid
status modified: 2018-08-13
accepted date: 2018-08-13
in scheme: AQD - Primary observation range
recommended unit: ug.m-3
in country: DK
related pollutant: Nitrogen monoxide (air)
primary observation time: Hourly average/mean
minimum value: -10
maximum value: 1000

Range for pollutant 48 for day in ng.m-3 specific to DK
type: Concept
notation: 690
status: valid
status modified: 2018-08-13
accepted date: 2018-08-13
in scheme: AQD - Primary observation range
recommended unit: ng.m-3
in country: DK
related pollutant: Selenium (aerosol)
primary observation time: Daily average/mean
minimum value: 0
maximum value: 5

Range for pollutant 1 for hour in ug.m-3 specific to EE
type: Concept
notation: 691
status: valid
status modified: 2018-08-13
accepted date: 2018-08-13
in scheme: AQD - Primary observation range
recommended unit: ug.m-3
in country: EE
related pollutant: Sulphur dioxide (air)
primary observation time: Hourly average/mean
minimum value: -1
maximum value: 450

Range for pollutant 4 for day in ug.m-3 specific to EE
type: Concept
notation: 692
status: valid
status modified: 2018-08-13
accepted date: 2018-08-13
in scheme: AQD - Primary observation range
recommended unit: ug.m-3
in country: EE
related pollutant: Total suspended particulates (aerosol)
primary observation time: Daily average/mean
minimum value: -10
maximum value: 800

Range for pollutant 5 for day in ug.m-3 specific to EE
type: Concept
notation: 693
status: valid
status modified: 2018-08-13
accepted date: 2018-08-13
in scheme: AQD - Primary observation range
recommended unit: ug.m-3
in country: EE
related pollutant: Particulate matter < 10 µm (aerosol)
primary observation time: Daily average/mean
minimum value: -4
maximum value: 525

Range for pollutant 7 for hour in ug.m-3 specific to EE
type: Concept
notation: 694
status: valid
status modified: 2018-08-13
accepted date: 2018-08-13
in scheme: AQD - Primary observation range
recommended unit: ug.m-3
in country: EE
related pollutant: Ozone (air)
primary observation time: Hourly average/mean
minimum value: 0
maximum value: 400

Range for pollutant 8 for hour in ug.m-3 specific to EE
type: Concept
notation: 695
status: valid
status modified: 2018-08-13
accepted date: 2018-08-13
in scheme: AQD - Primary observation range
recommended unit: ug.m-3
in country: EE
related pollutant: Nitrogen dioxide (air)
primary observation time: Hourly average/mean
minimum value: -1
maximum value: 450

Range for pollutant 9 for hour in ug.m-3 specific to EE
type: Concept
notation: 696
status: valid
status modified: 2018-08-13
accepted date: 2018-08-13
in scheme: AQD - Primary observation range
recommended unit: ug.m-3
in country: EE
related pollutant: Nitrogen oxides (air)
primary observation time: Hourly average/mean
minimum value: -1
maximum value: 1500

Range for pollutant 10 for hour in mg.m-3 specific to EE
type: Concept
notation: 697
status: valid
status modified: 2018-08-13
accepted date: 2018-08-13
in scheme: AQD - Primary observation range
recommended unit: mg.m-3
in country: EE
related pollutant: Carbon monoxide (air)
primary observation time: Hourly average/mean
minimum value: 0
maximum value: 20

Range for pollutant 12 for day in ug.m-3 specific to EE
type: Concept
notation: 698
status: valid
status modified: 2018-08-13
accepted date: 2018-08-13
in scheme: AQD - Primary observation range
recommended unit: ug.m-3
in country: EE
related pollutant: Lead (aerosol)
primary observation time: Daily average/mean
minimum value: 0
maximum value: 15

Range for pollutant 14 for day in ng.m-3 specific to EE
type: Concept
notation: 699
status: valid
status modified: 2018-08-13
accepted date: 2018-08-13
in scheme: AQD - Primary observation range
recommended unit: ng.m-3
in country: EE
related pollutant: Cadmium (aerosol)
primary observation time: Daily average/mean
minimum value: 0
maximum value: 50

Range for pollutant 15 for day in ng.m-3 specific to EE
type: Concept
notation: 700
status: valid
status modified: 2018-08-13
accepted date: 2018-08-13
in scheme: AQD - Primary observation range
recommended unit: ng.m-3
in country: EE
related pollutant: Nickel (aerosol)
primary observation time: Daily average/mean
minimum value: 0
maximum value: 200

Range for pollutant 18 for day in ng.m-3 specific to EE
type: Concept
notation: 701
status: valid
status modified: 2018-08-13
accepted date: 2018-08-13
in scheme: AQD - Primary observation range
recommended unit: ng.m-3
in country: EE
related pollutant: Arsenic (aerosol)
primary observation time: Daily average/mean
minimum value: 0
maximum value: 60

Range for pollutant 20 for day in ug.m-3 specific to EE
type: Concept
notation: 702
status: valid
status modified: 2018-08-13
accepted date: 2018-08-13
in scheme: AQD - Primary observation range
recommended unit: ug.m-3
in country: EE
related pollutant: Benzene (air)
primary observation time: Daily average/mean
minimum value: 0
maximum value: 35

Range for pollutant 5029 for day in ng.m-3 specific to EE
type: Concept
notation: 703
status: valid
status modified: 2018-08-13
accepted date: 2018-08-13
in scheme: AQD - Primary observation range
recommended unit: ng.m-3
in country: EE
related pollutant: Benzo(a)pyrene in PM10 (aerosol)
primary observation time: Daily average/mean
minimum value: 0
maximum value: 100

Range for pollutant 6001 for day in ug.m-3 specific to EE
type: Concept
notation: 704
status: valid
status modified: 2018-08-13
accepted date: 2018-08-13
in scheme: AQD - Primary observation range
recommended unit: ug.m-3
in country: EE
related pollutant: Particulate matter < 2.5 µm (aerosol)
primary observation time: Daily average/mean
minimum value: -4
maximum value: 525

Range for pollutant 25 for var in ug.m-3 specific to ES
type: Concept
notation: 705
status: valid
status modified: 2018-08-13
accepted date: 2018-08-13
in scheme: AQD - Primary observation range
recommended unit: ug.m-3
in country: ES
related pollutant: Formaldehyde (air)
primary observation time: Variable sample
minimum value: -10
maximum value: 75

Range for pollutant 441 for var in ug.m-3 specific to ES
type: Concept
notation: 706
status: valid
status modified: 2018-08-13
accepted date: 2018-08-13
in scheme: AQD - Primary observation range
recommended unit: ug.m-3
in country: ES
related pollutant: n-Heptane (air)
primary observation time: Variable sample
minimum value: -10
maximum value: 3

Range for pollutant 443 for var in ug.m-3 specific to ES
type: Concept
notation: 707
status: valid
status modified: 2018-08-13
accepted date: 2018-08-13
in scheme: AQD - Primary observation range
recommended unit: ug.m-3
in country: ES
related pollutant: n-Hexane (air)
primary observation time: Variable sample
minimum value: -10
maximum value: 3

Range for pollutant 449 for var in ug.m-3 specific to ES
type: Concept
notation: 708
status: valid
status modified: 2018-08-13
accepted date: 2018-08-13
in scheme: AQD - Primary observation range
recommended unit: ug.m-3
in country: ES
related pollutant: i-Octane (2,2,4-trimethylpentane) (air)
primary observation time: Variable sample
minimum value: -10
maximum value: 10

Range for pollutant 450 for var in ug.m-3 specific to ES
type: Concept
notation: 709
status: valid
status modified: 2018-08-13
accepted date: 2018-08-13
in scheme: AQD - Primary observation range
recommended unit: ug.m-3
in country: ES
related pollutant: i-Pentane (2-methylbutane) (air)
primary observation time: Variable sample
minimum value: -10
maximum value: 100

Range for pollutant 451 for var in ug.m-3 specific to ES
type: Concept
notation: 710
status: valid
status modified: 2018-08-13
accepted date: 2018-08-13
in scheme: AQD - Primary observation range
recommended unit: ug.m-3
in country: ES
related pollutant: Isoprene (2-methyl-1,3-butadiene) (air)
primary observation time: Variable sample
minimum value: 0
maximum value: 5

Range for pollutant 475 for var in ug.m-3 specific to ES
type: Concept
notation: 711
status: valid
status modified: 2018-08-13
accepted date: 2018-08-13
in scheme: AQD - Primary observation range
recommended unit: ug.m-3
in country: ES
related pollutant: n-Octane (air)
primary observation time: Variable sample
minimum value: -10
maximum value: 3

Range for pollutant 486 for var in ug.m-3 specific to ES
type: Concept
notation: 712
status: valid
status modified: 2018-08-13
accepted date: 2018-08-13
in scheme: AQD - Primary observation range
recommended unit: ug.m-3
in country: ES
related pollutant: n-Pentane (air)
primary observation time: Variable sample
minimum value: -10
maximum value: 3

Range for pollutant 643 for month in ng.m-3 specific to ES
type: Concept
notation: 713
status: valid
status modified: 2018-08-13
accepted date: 2018-08-13
in scheme: AQD - Primary observation range
recommended unit: ng.m-3
in country: ES
related pollutant: fluoranthene (air+aerosol)
primary observation time: Monthly average/mean
minimum value: -0.5
maximum value: 16

Range for pollutant 715 for month in ng.m-3 specific to ES
type: Concept
notation: 714
status: valid
status modified: 2018-08-13
accepted date: 2018-08-13
in scheme: AQD - Primary observation range
recommended unit: ng.m-3
in country: ES
related pollutant: pyrene (air+aerosol)
primary observation time: Monthly average/mean
minimum value: -0.5
maximum value: 7

Range for pollutant 4406 for month in ng.m-3 specific to ES
type: Concept
notation: 715
status: valid
status modified: 2018-08-13
accepted date: 2018-08-13
in scheme: AQD - Primary observation range
recommended unit: ng.m-3
in country: ES
related pollutant: chrysene (air+aerosol)
primary observation time: Monthly average/mean
minimum value: -0.5
maximum value: 2

Range for pollutant 5045 for day in ug.m-3 specific to ES
type: Concept
notation: 716
status: valid
status modified: 2018-08-13
accepted date: 2018-08-13
in scheme: AQD - Primary observation range
recommended unit: ug.m-3
in country: ES
related pollutant: Ammonium in PM10 (aerosol)
primary observation time: Daily average/mean
minimum value: 0
maximum value: 20

Range for pollutant 5046 for day in ug.m-3 specific to ES
type: Concept
notation: 717
status: valid
status modified: 2018-08-13
accepted date: 2018-08-13
in scheme: AQD - Primary observation range
recommended unit: ug.m-3
in country: ES
related pollutant: Nitrate in PM10 (aerosol)
primary observation time: Daily average/mean
minimum value: 0
maximum value: 25

Range for pollutant 5047 for day in ug.m-3 specific to ES
type: Concept
notation: 718
status: valid
status modified: 2018-08-13
accepted date: 2018-08-13
in scheme: AQD - Primary observation range
recommended unit: ug.m-3
in country: ES
related pollutant: sulphate in PM10 (aerosol)
primary observation time: Daily average/mean
minimum value: 0
maximum value: 15

Range for pollutant 5629 for day in ug.m-3 specific to ES
type: Concept
notation: 719
status: valid
status modified: 2018-08-13
accepted date: 2018-08-13
in scheme: AQD - Primary observation range
recommended unit: ug.m-3
in country: ES
related pollutant: calcium in PM10 (aerosol)
primary observation time: Daily average/mean
minimum value: 0
maximum value: 0.40000001

Range for pollutant 5631 for day in ug.m-3 specific to ES
type: Concept
notation: 720
status: valid
status modified: 2018-08-13
accepted date: 2018-08-13
in scheme: AQD - Primary observation range
recommended unit: ug.m-3
in country: ES
related pollutant: chloride in PM10 (aerosol)
primary observation time: Daily average/mean
minimum value: 0
maximum value: 3

Range for pollutant 5657 for day in ug.m-3 specific to ES
type: Concept
notation: 721
status: valid
status modified: 2018-08-13
accepted date: 2018-08-13
in scheme: AQD - Primary observation range
recommended unit: ug.m-3
in country: ES
related pollutant: potassium in PM10 (aerosol)
primary observation time: Daily average/mean
minimum value: 0
maximum value: 25

Range for pollutant 5659 for day in ug.m-3 specific to ES
type: Concept
notation: 722
status: valid
status modified: 2018-08-13
accepted date: 2018-08-13
in scheme: AQD - Primary observation range
recommended unit: ug.m-3
in country: ES
related pollutant: magnesium in PM10 (aerosol)
primary observation time: Daily average/mean
minimum value: 0
maximum value: 20

Range for pollutant 5668 for day in ug.m-3 specific to ES
type: Concept
notation: 723
status: valid
status modified: 2018-08-13
accepted date: 2018-08-13
in scheme: AQD - Primary observation range
recommended unit: ug.m-3
in country: ES
related pollutant: sodium in PM10 (aerosol)
primary observation time: Daily average/mean
minimum value: 0
maximum value: 3

Range for pollutant 5759 for month in ng.m-3 specific to ES
type: Concept
notation: 724
status: valid
status modified: 2018-08-13
accepted date: 2018-08-13
in scheme: AQD - Primary observation range
recommended unit: ng.m-3
in country: ES
related pollutant: Benzo(j)fluoranthene in PM10 (aerosol)
primary observation time: Monthly average/mean
minimum value: -0.5
maximum value: 3

Range for pollutant 6008 for var in ug.m-3 specific to ES
type: Concept
notation: 725
status: valid
status modified: 2018-08-13
accepted date: 2018-08-13
in scheme: AQD - Primary observation range
recommended unit: ug.m-3
in country: ES
related pollutant: 1-Pentene (air)
primary observation time: Variable sample
minimum value: -10
maximum value: 12

Range for pollutant 6009 for var in ug.m-3 specific to ES
type: Concept
notation: 726
status: valid
status modified: 2018-08-13
accepted date: 2018-08-13
in scheme: AQD - Primary observation range
recommended unit: ug.m-3
in country: ES
related pollutant: 2-Pentene (air)
primary observation time: Variable sample
minimum value: -10
maximum value: 12

Range for pollutant 6011 for var in ug.m-3 specific to ES
type: Concept
notation: 727
status: valid
status modified: 2018-08-13
accepted date: 2018-08-13
in scheme: AQD - Primary observation range
recommended unit: ug.m-3
in country: ES
related pollutant: 1,2,4-Trimethylbenzene (air)
primary observation time: Variable sample
minimum value: -10
maximum value: 50

Range for pollutant 6012 for var in ug.m-3 specific to ES
type: Concept
notation: 728
status: valid
status modified: 2018-08-13
accepted date: 2018-08-13
in scheme: AQD - Primary observation range
recommended unit: ug.m-3
in country: ES
related pollutant: 1,2,3-Trimethylbenzene (air)
primary observation time: Variable sample
minimum value: -10
maximum value: 5

Range for pollutant 6013 for var in ug.m-3 specific to ES
type: Concept
notation: 729
status: valid
status modified: 2018-08-13
accepted date: 2018-08-13
in scheme: AQD - Primary observation range
recommended unit: ug.m-3
in country: ES
related pollutant: 1,3,5-Trimethylbenzene (air)
primary observation time: Variable sample
minimum value: -10
maximum value: 15

Range for pollutant 1 for hour in ug.m-3 specific to FI
type: Concept
notation: 730
status: valid
status modified: 2018-08-13
accepted date: 2018-08-13
in scheme: AQD - Primary observation range
recommended unit: ug.m-3
in country: FI
related pollutant: Sulphur dioxide (air)
primary observation time: Hourly average/mean
minimum value: -2
maximum value: 500

Range for pollutant 4 for day in ug.m-3 specific to FI
type: Concept
notation: 731
status: valid
status modified: 2018-08-13
accepted date: 2018-08-13
in scheme: AQD - Primary observation range
recommended unit: ug.m-3
in country: FI
related pollutant: Total suspended particulates (aerosol)
primary observation time: Daily average/mean
minimum value: 0
maximum value: 525

Range for pollutant 5 for day in ug.m-3 specific to FI
type: Concept
notation: 732
status: valid
status modified: 2018-08-13
accepted date: 2018-08-13
in scheme: AQD - Primary observation range
recommended unit: ug.m-3
in country: FI
related pollutant: Particulate matter < 10 µm (aerosol)
primary observation time: Daily average/mean
minimum value: 0
maximum value: 525

Range for pollutant 5 for hour in ug.m-3 specific to FI
type: Concept
notation: 733
status: valid
status modified: 2018-08-13
accepted date: 2018-08-13
in scheme: AQD - Primary observation range
recommended unit: ug.m-3
in country: FI
related pollutant: Particulate matter < 10 µm (aerosol)
primary observation time: Hourly average/mean
minimum value: -18
maximum value: 1300

Range for pollutant 7 for hour in ug.m-3 specific to FI
type: Concept
notation: 734
status: valid
status modified: 2018-08-13
accepted date: 2018-08-13
in scheme: AQD - Primary observation range
recommended unit: ug.m-3
in country: FI
related pollutant: Ozone (air)
primary observation time: Hourly average/mean
minimum value: -2
maximum value: 400

Range for pollutant 8 for hour in ug.m-3 specific to FI
type: Concept
notation: 735
status: valid
status modified: 2018-08-13
accepted date: 2018-08-13
in scheme: AQD - Primary observation range
recommended unit: ug.m-3
in country: FI
related pollutant: Nitrogen dioxide (air)
primary observation time: Hourly average/mean
minimum value: -2
maximum value: 250

Range for pollutant 9 for hour in ug.m-3 specific to FI
type: Concept
notation: 736
status: valid
status modified: 2018-08-13
accepted date: 2018-08-13
in scheme: AQD - Primary observation range
recommended unit: ug.m-3
in country: FI
related pollutant: Nitrogen oxides (air)
primary observation time: Hourly average/mean
minimum value: -2
maximum value: 1500

Range for pollutant 10 for hour in mg.m-3 specific to FI
type: Concept
notation: 737
status: valid
status modified: 2018-08-13
accepted date: 2018-08-13
in scheme: AQD - Primary observation range
recommended unit: mg.m-3
in country: FI
related pollutant: Carbon monoxide (air)
primary observation time: Hourly average/mean
minimum value: -2
maximum value: 20

Range for pollutant 5018 for month in ng.m-3 specific to FI
type: Concept
notation: 738
status: valid
status modified: 2018-08-13
accepted date: 2018-08-13
in scheme: AQD - Primary observation range
recommended unit: ng.m-3
in country: FI
related pollutant: Arsenic in PM10 (aerosol)
primary observation time: Monthly average/mean
minimum value: -10
maximum value: 80

Range for pollutant 6001 for hour in ug.m-3 specific to FI
type: Concept
notation: 739
status: valid
status modified: 2018-08-13
accepted date: 2018-08-13
in scheme: AQD - Primary observation range
recommended unit: ug.m-3
in country: FI
related pollutant: Particulate matter < 2.5 µm (aerosol)
primary observation time: Hourly average/mean
minimum value: -18
maximum value: 700

Range for pollutant 20 for hour in ug.m-3 specific to FR
type: Concept
notation: 740
status: valid
status modified: 2018-08-13
accepted date: 2018-08-13
in scheme: AQD - Primary observation range
recommended unit: ug.m-3
in country: FR
related pollutant: Benzene (air)
primary observation time: Hourly average/mean
minimum value: 0
maximum value: 20

Range for pollutant 5018 for year in ng.m-3 specific to FR
type: Concept
notation: 741
status: valid
status modified: 2018-08-13
accepted date: 2018-08-13
in scheme: AQD - Primary observation range
recommended unit: ng.m-3
in country: FR
related pollutant: Arsenic in PM10 (aerosol)
primary observation time: Yearly average/mean
minimum value: 0
maximum value: 60

Range for pollutant 6 for day in ug.m-3 specific to GB
type: Concept
notation: 742
status: valid
status modified: 2018-08-13
accepted date: 2018-08-13
in scheme: AQD - Primary observation range
recommended unit: ug.m-3
in country: GB
related pollutant: Black smoke (air)
primary observation time: Daily average/mean
minimum value: 0
maximum value: 525

Range for pollutant 12 for month in ug.m-3 specific to GB
type: Concept
notation: 743
status: valid
status modified: 2018-08-13
accepted date: 2018-08-13
in scheme: AQD - Primary observation range
recommended unit: ug.m-3
in country: GB
related pollutant: Lead (aerosol)
primary observation time: Monthly average/mean
minimum value: 0
maximum value: 3

Range for pollutant 12 for var in ug.m-3 specific to GB
type: Concept
notation: 744
status: valid
status modified: 2018-08-13
accepted date: 2018-08-13
in scheme: AQD - Primary observation range
recommended unit: ug.m-3
in country: GB
related pollutant: Lead (aerosol)
primary observation time: Variable sample
minimum value: 0
maximum value: 5

Range for pollutant 12 for year in ug.m-3 specific to GB
type: Concept
notation: 745
status: valid
status modified: 2018-08-13
accepted date: 2018-08-13
in scheme: AQD - Primary observation range
recommended unit: ug.m-3
in country: GB
related pollutant: Lead (aerosol)
primary observation time: Yearly average/mean
minimum value: 0
maximum value: 3

Range for pollutant 13 for month in ng.m-3 specific to GB
type: Concept
notation: 746
status: valid
status modified: 2018-08-13
accepted date: 2018-08-13
in scheme: AQD - Primary observation range
recommended unit: ng.m-3
in country: GB
related pollutant: Mercury (aerosol)
primary observation time: Monthly average/mean
minimum value: 0
maximum value: 5

Range for pollutant 13 for year in ng.m-3 specific to GB
type: Concept
notation: 747
status: valid
status modified: 2018-08-13
accepted date: 2018-08-13
in scheme: AQD - Primary observation range
recommended unit: ng.m-3
in country: GB
related pollutant: Mercury (aerosol)
primary observation time: Yearly average/mean
minimum value: 0
maximum value: 10

Range for pollutant 14 for month in ng.m-3 specific to GB
type: Concept
notation: 748
status: valid
status modified: 2018-08-13
accepted date: 2018-08-13
in scheme: AQD - Primary observation range
recommended unit: ng.m-3
in country: GB
related pollutant: Cadmium (aerosol)
primary observation time: Monthly average/mean
minimum value: 0
maximum value: 30

Range for pollutant 14 for var in ng.m-3 specific to GB
type: Concept
notation: 749
status: valid
status modified: 2018-08-13
accepted date: 2018-08-13
in scheme: AQD - Primary observation range
recommended unit: ng.m-3
in country: GB
related pollutant: Cadmium (aerosol)
primary observation time: Variable sample
minimum value: 0
maximum value: 50

Range for pollutant 14 for year in ng.m-3 specific to GB
type: Concept
notation: 750
status: valid
status modified: 2018-08-13
accepted date: 2018-08-13
in scheme: AQD - Primary observation range
recommended unit: ng.m-3
in country: GB
related pollutant: Cadmium (aerosol)
primary observation time: Yearly average/mean
minimum value: 0
maximum value: 30

Range for pollutant 15 for month in ng.m-3 specific to GB
type: Concept
notation: 751
status: valid
status modified: 2018-08-13
accepted date: 2018-08-13
in scheme: AQD - Primary observation range
recommended unit: ng.m-3
in country: GB
related pollutant: Nickel (aerosol)
primary observation time: Monthly average/mean
minimum value: 0
maximum value: 150

Range for pollutant 15 for var in ng.m-3 specific to GB
type: Concept
notation: 752
status: valid
status modified: 2018-08-13
accepted date: 2018-08-13
in scheme: AQD - Primary observation range
recommended unit: ng.m-3
in country: GB
related pollutant: Nickel (aerosol)
primary observation time: Variable sample
minimum value: 0
maximum value: 200

Range for pollutant 15 for year in ng.m-3 specific to GB
type: Concept
notation: 753
status: valid
status modified: 2018-08-13
accepted date: 2018-08-13
in scheme: AQD - Primary observation range
recommended unit: ng.m-3
in country: GB
related pollutant: Nickel (aerosol)
primary observation time: Yearly average/mean
minimum value: 0
maximum value: 100

Range for pollutant 18 for month in ng.m-3 specific to GB
type: Concept
notation: 754
status: valid
status modified: 2018-08-13
accepted date: 2018-08-13
in scheme: AQD - Primary observation range
recommended unit: ng.m-3
in country: GB
related pollutant: Arsenic (aerosol)
primary observation time: Monthly average/mean
minimum value: 0
maximum value: 50

Range for pollutant 18 for var in ng.m-3 specific to GB
type: Concept
notation: 755
status: valid
status modified: 2018-08-13
accepted date: 2018-08-13
in scheme: AQD - Primary observation range
recommended unit: ng.m-3
in country: GB
related pollutant: Arsenic (aerosol)
primary observation time: Variable sample
minimum value: 0
maximum value: 60

Range for pollutant 18 for year in ng.m-3 specific to GB
type: Concept
notation: 756
status: valid
status modified: 2018-08-13
accepted date: 2018-08-13
in scheme: AQD - Primary observation range
recommended unit: ng.m-3
in country: GB
related pollutant: Arsenic (aerosol)
primary observation time: Yearly average/mean
minimum value: 0
maximum value: 40

Range for pollutant 20 for hour in ug.m-3 specific to GB
type: Concept
notation: 757
status: valid
status modified: 2018-08-13
accepted date: 2018-08-13
in scheme: AQD - Primary observation range
recommended unit: ug.m-3
in country: GB
related pollutant: Benzene (air)
primary observation time: Hourly average/mean
minimum value: 0
maximum value: 100

Range for pollutant 20 for var in ug.m-3 specific to GB
type: Concept
notation: 758
status: valid
status modified: 2018-08-13
accepted date: 2018-08-13
in scheme: AQD - Primary observation range
recommended unit: ug.m-3
in country: GB
related pollutant: Benzene (air)
primary observation time: Variable sample
minimum value: 0
maximum value: 60

Range for pollutant 21 for hour in ug.m-3 specific to GB
type: Concept
notation: 759
status: valid
status modified: 2018-08-13
accepted date: 2018-08-13
in scheme: AQD - Primary observation range
recommended unit: ug.m-3
in country: GB
related pollutant: Toluene (air)
primary observation time: Hourly average/mean
minimum value: 0
maximum value: 200

Range for pollutant 24 for hour in ug.m-3 specific to GB
type: Concept
notation: 760
status: valid
status modified: 2018-08-13
accepted date: 2018-08-13
in scheme: AQD - Primary observation range
recommended unit: ug.m-3
in country: GB
related pollutant: 1.3 Butadiene (air)
primary observation time: Hourly average/mean
minimum value: 0
maximum value: 9

Range for pollutant 316 for hour in ug.m-3 specific to GB
type: Concept
notation: 761
status: valid
status modified: 2018-08-13
accepted date: 2018-08-13
in scheme: AQD - Primary observation range
recommended unit: ug.m-3
in country: GB
related pollutant: i-Hexane (2-methylpentane) (air)
primary observation time: Hourly average/mean
minimum value: 0
maximum value: 70

Range for pollutant 351 for var in ng.m-3 specific to GB
type: Concept
notation: 762
status: valid
status modified: 2018-08-13
accepted date: 2018-08-13
in scheme: AQD - Primary observation range
recommended unit: ng.m-3
in country: GB
related pollutant: acenaphthene (air+aerosol)
primary observation time: Variable sample
minimum value: 0
maximum value: 100

Range for pollutant 394 for hour in ug.m-3 specific to GB
type: Concept
notation: 763
status: valid
status modified: 2018-08-13
accepted date: 2018-08-13
in scheme: AQD - Primary observation range
recommended unit: ug.m-3
in country: GB
related pollutant: n-Butane (air)
primary observation time: Hourly average/mean
minimum value: 0
maximum value: 200

Range for pollutant 428 for hour in ug.m-3 specific to GB
type: Concept
notation: 764
status: valid
status modified: 2018-08-13
accepted date: 2018-08-13
in scheme: AQD - Primary observation range
recommended unit: ug.m-3
in country: GB
related pollutant: Ethane (air)
primary observation time: Hourly average/mean
minimum value: 0
maximum value: 250

Range for pollutant 430 for hour in ug.m-3 specific to GB
type: Concept
notation: 765
status: valid
status modified: 2018-08-13
accepted date: 2018-08-13
in scheme: AQD - Primary observation range
recommended unit: ug.m-3
in country: GB
related pollutant: Ethene (Ethylene) (air)
primary observation time: Hourly average/mean
minimum value: 0
maximum value: 6000

Range for pollutant 431 for hour in ug.m-3 specific to GB
type: Concept
notation: 766
status: valid
status modified: 2018-08-13
accepted date: 2018-08-13
in scheme: AQD - Primary observation range
recommended unit: ug.m-3
in country: GB
related pollutant: Ethyl benzene (air)
primary observation time: Hourly average/mean
minimum value: 0
maximum value: 100

Range for pollutant 432 for hour in ug.m-3 specific to GB
type: Concept
notation: 767
status: valid
status modified: 2018-08-13
accepted date: 2018-08-13
in scheme: AQD - Primary observation range
recommended unit: ug.m-3
in country: GB
related pollutant: Ethyne (Acetylene) (air)
primary observation time: Hourly average/mean
minimum value: 0
maximum value: 250

Range for pollutant 435 for var in ng.m-3 specific to GB
type: Concept
notation: 768
status: valid
status modified: 2018-08-13
accepted date: 2018-08-13
in scheme: AQD - Primary observation range
recommended unit: ng.m-3
in country: GB
related pollutant: fluorene (air+aerosol)
primary observation time: Variable sample
minimum value: 0
maximum value: 100

Range for pollutant 441 for hour in ug.m-3 specific to GB
type: Concept
notation: 769
status: valid
status modified: 2018-08-13
accepted date: 2018-08-13
in scheme: AQD - Primary observation range
recommended unit: ug.m-3
in country: GB
related pollutant: n-Heptane (air)
primary observation time: Hourly average/mean
minimum value: 0
maximum value: 50

Range for pollutant 443 for hour in ug.m-3 specific to GB
type: Concept
notation: 770
status: valid
status modified: 2018-08-13
accepted date: 2018-08-13
in scheme: AQD - Primary observation range
recommended unit: ug.m-3
in country: GB
related pollutant: n-Hexane (air)
primary observation time: Hourly average/mean
minimum value: 0
maximum value: 50

Range for pollutant 447 for hour in ug.m-3 specific to GB
type: Concept
notation: 771
status: valid
status modified: 2018-08-13
accepted date: 2018-08-13
in scheme: AQD - Primary observation range
recommended unit: ug.m-3
in country: GB
related pollutant: i-Butane (2-methylpropane) (air)
primary observation time: Hourly average/mean
minimum value: 0
maximum value: 100

Range for pollutant 449 for hour in ug.m-3 specific to GB
type: Concept
notation: 772
status: valid
status modified: 2018-08-13
accepted date: 2018-08-13
in scheme: AQD - Primary observation range
recommended unit: ug.m-3
in country: GB
related pollutant: i-Octane (2,2,4-trimethylpentane) (air)
primary observation time: Hourly average/mean
minimum value: 0
maximum value: 50

Range for pollutant 450 for hour in ug.m-3 specific to GB
type: Concept
notation: 773
status: valid
status modified: 2018-08-13
accepted date: 2018-08-13
in scheme: AQD - Primary observation range
recommended unit: ug.m-3
in country: GB
related pollutant: i-Pentane (2-methylbutane) (air)
primary observation time: Hourly average/mean
minimum value: 0
maximum value: 100

Range for pollutant 451 for hour in ug.m-3 specific to GB
type: Concept
notation: 774
status: valid
status modified: 2018-08-13
accepted date: 2018-08-13
in scheme: AQD - Primary observation range
recommended unit: ug.m-3
in country: GB
related pollutant: Isoprene (2-methyl-1,3-butadiene) (air)
primary observation time: Hourly average/mean
minimum value: 0
maximum value: 20

Range for pollutant 464 for hour in ug.m-3 specific to GB
type: Concept
notation: 775
status: valid
status modified: 2018-08-13
accepted date: 2018-08-13
in scheme: AQD - Primary observation range
recommended unit: ug.m-3
in country: GB
related pollutant: m,p-Xylene (air)
primary observation time: Hourly average/mean
minimum value: 0
maximum value: 500

Range for pollutant 475 for hour in ug.m-3 specific to GB
type: Concept
notation: 776
status: valid
status modified: 2018-08-13
accepted date: 2018-08-13
in scheme: AQD - Primary observation range
recommended unit: ug.m-3
in country: GB
related pollutant: n-Octane (air)
primary observation time: Hourly average/mean
minimum value: 0
maximum value: 50

Range for pollutant 482 for hour in ug.m-3 specific to GB
type: Concept
notation: 777
status: valid
status modified: 2018-08-13
accepted date: 2018-08-13
in scheme: AQD - Primary observation range
recommended unit: ug.m-3
in country: GB
related pollutant: o-Xylene (air)
primary observation time: Hourly average/mean
minimum value: 0
maximum value: 100

Range for pollutant 486 for hour in ug.m-3 specific to GB
type: Concept
notation: 778
status: valid
status modified: 2018-08-13
accepted date: 2018-08-13
in scheme: AQD - Primary observation range
recommended unit: ug.m-3
in country: GB
related pollutant: n-Pentane (air)
primary observation time: Hourly average/mean
minimum value: 0
maximum value: 25

Range for pollutant 503 for hour in ug.m-3 specific to GB
type: Concept
notation: 779
status: valid
status modified: 2018-08-13
accepted date: 2018-08-13
in scheme: AQD - Primary observation range
recommended unit: ug.m-3
in country: GB
related pollutant: Propane (air)
primary observation time: Hourly average/mean
minimum value: 0
maximum value: 1000

Range for pollutant 505 for hour in ug.m-3 specific to GB
type: Concept
notation: 780
status: valid
status modified: 2018-08-13
accepted date: 2018-08-13
in scheme: AQD - Primary observation range
recommended unit: ug.m-3
in country: GB
related pollutant: Propene (air)
primary observation time: Hourly average/mean
minimum value: 0
maximum value: 10

Range for pollutant 606 for var in ng.m-3 specific to GB
type: Concept
notation: 781
status: valid
status modified: 2018-08-13
accepted date: 2018-08-13
in scheme: AQD - Primary observation range
recommended unit: ng.m-3
in country: GB
related pollutant: anthracene (air+aerosol)
primary observation time: Variable sample
minimum value: 0
maximum value: 50

Range for pollutant 609 for var in ng.m-3 specific to GB
type: Concept
notation: 782
status: valid
status modified: 2018-08-13
accepted date: 2018-08-13
in scheme: AQD - Primary observation range
recommended unit: ng.m-3
in country: GB
related pollutant: Benzo(a)anthracene (air+aerosol)
primary observation time: Variable sample
minimum value: 0
maximum value: 20

Range for pollutant 622 for var in ng.m-3 specific to GB
type: Concept
notation: 783
status: valid
status modified: 2018-08-13
accepted date: 2018-08-13
in scheme: AQD - Primary observation range
recommended unit: ng.m-3
in country: GB
related pollutant: Benzo(ghi)perylene (air+aerosol)
primary observation time: Variable sample
minimum value: 0
maximum value: 3

Range for pollutant 625 for var in ng.m-3 specific to GB
type: Concept
notation: 784
status: valid
status modified: 2018-08-13
accepted date: 2018-08-13
in scheme: AQD - Primary observation range
recommended unit: ng.m-3
in country: GB
related pollutant: Benzo(k)fluoranthene (air+aerosol)
primary observation time: Variable sample
minimum value: 0
maximum value: 20

Range for pollutant 627 for year in ug.m-2.day-1 specific to GB
type: Concept
notation: 785
status: valid
status modified: 2018-08-13
accepted date: 2018-08-13
in scheme: AQD - Primary observation range
recommended unit: ug.m-2.day-1
in country: GB
related pollutant: Benzo(k)fluoranthene (precip+dry_dep)
primary observation time: Yearly average/mean
minimum value: 0
maximum value: 0.03

Range for pollutant 643 for var in ng.m-3 specific to GB
type: Concept
notation: 786
status: valid
status modified: 2018-08-13
accepted date: 2018-08-13
in scheme: AQD - Primary observation range
recommended unit: ng.m-3
in country: GB
related pollutant: fluoranthene (air+aerosol)
primary observation time: Variable sample
minimum value: 0
maximum value: 50

Range for pollutant 653 for var in ng.m-3 specific to GB
type: Concept
notation: 787
status: valid
status modified: 2018-08-13
accepted date: 2018-08-13
in scheme: AQD - Primary observation range
recommended unit: ng.m-3
in country: GB
related pollutant: reactive_mercury (air+aerosol)
primary observation time: Variable sample
minimum value: 0
maximum value: 2

Range for pollutant 654 for var in ng.m-3 specific to GB
type: Concept
notation: 788
status: valid
status modified: 2018-08-13
accepted date: 2018-08-13
in scheme: AQD - Primary observation range
recommended unit: ng.m-3
in country: GB
related pollutant: indeno_123cd_pyrene (air+aerosol)
primary observation time: Variable sample
minimum value: 0
maximum value: 20

Range for pollutant 673 for var in pg.m-3 specific to GB
type: Concept
notation: 789
status: valid
status modified: 2018-08-13
accepted date: 2018-08-13
in scheme: AQD - Primary observation range
recommended unit: pg.m-3
in country: GB
related pollutant: PCB_114 (air+aerosol)
primary observation time: Variable sample
minimum value: 0
maximum value: 1

Range for pollutant 674 for var in pg.m-3 specific to GB
type: Concept
notation: 790
status: valid
status modified: 2018-08-13
accepted date: 2018-08-13
in scheme: AQD - Primary observation range
recommended unit: pg.m-3
in country: GB
related pollutant: PCB_118 (air+aerosol)
primary observation time: Variable sample
minimum value: 0
maximum value: 15

Range for pollutant 677 for var in pg.m-3 specific to GB
type: Concept
notation: 791
status: valid
status modified: 2018-08-13
accepted date: 2018-08-13
in scheme: AQD - Primary observation range
recommended unit: pg.m-3
in country: GB
related pollutant: PCB_138 (air+aerosol)
primary observation time: Variable sample
minimum value: 0
maximum value: 25

Range for pollutant 679 for var in pg.m-3 specific to GB
type: Concept
notation: 792
status: valid
status modified: 2018-08-13
accepted date: 2018-08-13
in scheme: AQD - Primary observation range
recommended unit: pg.m-3
in country: GB
related pollutant: PCB_141 (air+aerosol)
primary observation time: Variable sample
minimum value: 0
maximum value: 9

Range for pollutant 683 for var in pg.m-3 specific to GB
type: Concept
notation: 793
status: valid
status modified: 2018-08-13
accepted date: 2018-08-13
in scheme: AQD - Primary observation range
recommended unit: pg.m-3
in country: GB
related pollutant: PCB_157 (air+aerosol)
primary observation time: Variable sample
minimum value: 0
maximum value: 2

Range for pollutant 684 for var in pg.m-3 specific to GB
type: Concept
notation: 794
status: valid
status modified: 2018-08-13
accepted date: 2018-08-13
in scheme: AQD - Primary observation range
recommended unit: pg.m-3
in country: GB
related pollutant: PCB_167 (air+aerosol)
primary observation time: Variable sample
minimum value: 0
maximum value: 1

Range for pollutant 685 for var in pg.m-3 specific to GB
type: Concept
notation: 795
status: valid
status modified: 2018-08-13
accepted date: 2018-08-13
in scheme: AQD - Primary observation range
recommended unit: pg.m-3
in country: GB
related pollutant: PCB_170 (air+aerosol)
primary observation time: Variable sample
minimum value: 0
maximum value: 5

Range for pollutant 686 for var in pg.m-3 specific to GB
type: Concept
notation: 796
status: valid
status modified: 2018-08-13
accepted date: 2018-08-13
in scheme: AQD - Primary observation range
recommended unit: pg.m-3
in country: GB
related pollutant: PCB_180 (air+aerosol)
primary observation time: Variable sample
minimum value: 0
maximum value: 20

Range for pollutant 689 for var in pg.m-3 specific to GB
type: Concept
notation: 797
status: valid
status modified: 2018-08-13
accepted date: 2018-08-13
in scheme: AQD - Primary observation range
recommended unit: pg.m-3
in country: GB
related pollutant: PCB_183 (air+aerosol)
primary observation time: Variable sample
minimum value: 0
maximum value: 10

Range for pollutant 690 for var in pg.m-3 specific to GB
type: Concept
notation: 798
status: valid
status modified: 2018-08-13
accepted date: 2018-08-13
in scheme: AQD - Primary observation range
recommended unit: pg.m-3
in country: GB
related pollutant: PCB_187 (air+aerosol)
primary observation time: Variable sample
minimum value: 0
maximum value: 30

Range for pollutant 691 for var in pg.m-3 specific to GB
type: Concept
notation: 799
status: valid
status modified: 2018-08-13
accepted date: 2018-08-13
in scheme: AQD - Primary observation range
recommended unit: pg.m-3
in country: GB
related pollutant: PCB_189 (air+aerosol)
primary observation time: Variable sample
minimum value: 0
maximum value: 1

Range for pollutant 692 for var in pg.m-3 specific to GB
type: Concept
notation: 800
status: valid
status modified: 2018-08-13
accepted date: 2018-08-13
in scheme: AQD - Primary observation range
recommended unit: pg.m-3
in country: GB
related pollutant: PCB_194 (air+aerosol)
primary observation time: Variable sample
minimum value: 0
maximum value: 3

Range for pollutant 701 for var in pg.m-3 specific to GB
type: Concept
notation: 801
status: valid
status modified: 2018-08-13
accepted date: 2018-08-13
in scheme: AQD - Primary observation range
recommended unit: pg.m-3
in country: GB
related pollutant: PCB_52 (air+aerosol)
primary observation time: Variable sample
minimum value: 0
maximum value: 30

Range for pollutant 706 for var in pg.m-3 specific to GB
type: Concept
notation: 802
status: valid
status modified: 2018-08-13
accepted date: 2018-08-13
in scheme: AQD - Primary observation range
recommended unit: pg.m-3
in country: GB
related pollutant: PCB_74 (air+aerosol)
primary observation time: Variable sample
minimum value: 0
maximum value: 10

Range for pollutant 707 for var in pg.m-3 specific to GB
type: Concept
notation: 803
status: valid
status modified: 2018-08-13
accepted date: 2018-08-13
in scheme: AQD - Primary observation range
recommended unit: pg.m-3
in country: GB
related pollutant: PCB_99 (air+aerosol)
primary observation time: Variable sample
minimum value: 0
maximum value: 10

Range for pollutant 709 for var in pg.m-3 specific to GB
type: Concept
notation: 804
status: valid
status modified: 2018-08-13
accepted date: 2018-08-13
in scheme: AQD - Primary observation range
recommended unit: pg.m-3
in country: GB
related pollutant: PCB_123 (air+aerosol)
primary observation time: Variable sample
minimum value: 0
maximum value: 3

Range for pollutant 712 for var in ng.m-3 specific to GB
type: Concept
notation: 805
status: valid
status modified: 2018-08-13
accepted date: 2018-08-13
in scheme: AQD - Primary observation range
recommended unit: ng.m-3
in country: GB
related pollutant: phenanthrene (air+aerosol)
primary observation time: Variable sample
minimum value: 0
maximum value: 9999

Range for pollutant 715 for var in ng.m-3 specific to GB
type: Concept
notation: 806
status: valid
status modified: 2018-08-13
accepted date: 2018-08-13
in scheme: AQD - Primary observation range
recommended unit: ng.m-3
in country: GB
related pollutant: pyrene (air+aerosol)
primary observation time: Variable sample
minimum value: 0
maximum value: 50

Range for pollutant 1629 for hour in ug.m-3 specific to GB
type: Concept
notation: 807
status: valid
status modified: 2018-08-13
accepted date: 2018-08-13
in scheme: AQD - Primary observation range
recommended unit: ug.m-3
in country: GB
related pollutant: calcium in PM2.5 (aerosol)
primary observation time: Hourly average/mean
minimum value: 0
maximum value: 1.2

Range for pollutant 1668 for hour in ug.m-3 specific to GB
type: Concept
notation: 808
status: valid
status modified: 2018-08-13
accepted date: 2018-08-13
in scheme: AQD - Primary observation range
recommended unit: ug.m-3
in country: GB
related pollutant: sodium in PM2.5 (aerosol)
primary observation time: Hourly average/mean
minimum value: 0
maximum value: 6

Range for pollutant 1771 for week in ug.m-3 specific to GB
type: Concept
notation: 809
status: valid
status modified: 2018-08-13
accepted date: 2018-08-13
in scheme: AQD - Primary observation range
recommended unit: ug.m-3
in country: GB
related pollutant: Elemental carbon in PM2.5 (aerosol)
primary observation time: Weekly average/mean
minimum value: 0
maximum value: 10

Range for pollutant 1772 for week in ug.m-3 specific to GB
type: Concept
notation: 810
status: valid
status modified: 2018-08-13
accepted date: 2018-08-13
in scheme: AQD - Primary observation range
recommended unit: ug.m-3
in country: GB
related pollutant: Organic carbon in PM2.5 (aerosol)
primary observation time: Weekly average/mean
minimum value: 0
maximum value: 20

Range for pollutant 4330 for var in pg.m-3 specific to GB
type: Concept
notation: 811
status: valid
status modified: 2018-08-13
accepted date: 2018-08-13
in scheme: AQD - Primary observation range
recommended unit: pg.m-3
in country: GB
related pollutant: PCB_105 (air+aerosol)
primary observation time: Variable sample
minimum value: 0
maximum value: 5

Range for pollutant 4336 for var in pg.m-3 specific to GB
type: Concept
notation: 812
status: valid
status modified: 2018-08-13
accepted date: 2018-08-13
in scheme: AQD - Primary observation range
recommended unit: pg.m-3
in country: GB
related pollutant: PCB_149 (air+aerosol)
primary observation time: Variable sample
minimum value: 0
maximum value: 30

Range for pollutant 4339 for var in pg.m-3 specific to GB
type: Concept
notation: 813
status: valid
status modified: 2018-08-13
accepted date: 2018-08-13
in scheme: AQD - Primary observation range
recommended unit: pg.m-3
in country: GB
related pollutant: PCB_156 (air+aerosol)
primary observation time: Variable sample
minimum value: 0
maximum value: 2

Range for pollutant 4341 for var in pg.m-3 specific to GB
type: Concept
notation: 814
status: valid
status modified: 2018-08-13
accepted date: 2018-08-13
in scheme: AQD - Primary observation range
recommended unit: pg.m-3
in country: GB
related pollutant: PCB_18 (air+aerosol)
primary observation time: Variable sample
minimum value: 0
maximum value: 30

Range for pollutant 4406 for var in ng.m-3 specific to GB
type: Concept
notation: 815
status: valid
status modified: 2018-08-13
accepted date: 2018-08-13
in scheme: AQD - Primary observation range
recommended unit: ng.m-3
in country: GB
related pollutant: chrysene (air+aerosol)
primary observation time: Variable sample
minimum value: 0
maximum value: 50

Range for pollutant 4813 for var in ng.m-3 specific to GB
type: Concept
notation: 816
status: valid
status modified: 2018-08-13
accepted date: 2018-08-13
in scheme: AQD - Primary observation range
recommended unit: ng.m-3
in country: GB
related pollutant: Total gaseous mercury (air+aerosol)
primary observation time: Variable sample
minimum value: -10
maximum value: 25

Range for pollutant 4813 for year in ng.m-3 specific to GB
type: Concept
notation: 817
status: valid
status modified: 2018-08-13
accepted date: 2018-08-13
in scheme: AQD - Primary observation range
recommended unit: ng.m-3
in country: GB
related pollutant: Total gaseous mercury (air+aerosol)
primary observation time: Yearly average/mean
minimum value: -10
maximum value: 25

Range for pollutant 5029 for 3month in ng.m-3 specific to GB
type: Concept
notation: 818
status: valid
status modified: 2018-08-13
accepted date: 2018-08-13
in scheme: AQD - Primary observation range
recommended unit: ng.m-3
in country: GB
related pollutant: Benzo(a)pyrene in PM10 (aerosol)
primary observation time: 3month
minimum value: 0
maximum value: 60

Range for pollutant 5029 for var in ng.m-3 specific to GB
type: Concept
notation: 819
status: valid
status modified: 2018-08-13
accepted date: 2018-08-13
in scheme: AQD - Primary observation range
recommended unit: ng.m-3
in country: GB
related pollutant: Benzo(a)pyrene in PM10 (aerosol)
primary observation time: Variable sample
minimum value: 0
maximum value: 60

Range for pollutant 5419 for year in ng.m-3 specific to GB
type: Concept
notation: 820
status: valid
status modified: 2018-08-13
accepted date: 2018-08-13
in scheme: AQD - Primary observation range
recommended unit: ng.m-3
in country: GB
related pollutant: Dibenzo(ah)anthracene in PM10 (aerosol)
primary observation time: Yearly average/mean
minimum value: 0
maximum value: 1

Range for pollutant 5610 for 3month in ng.m-3 specific to GB
type: Concept
notation: 821
status: valid
status modified: 2018-08-13
accepted date: 2018-08-13
in scheme: AQD - Primary observation range
recommended unit: ng.m-3
in country: GB
related pollutant: Benzo(a)anthracene in PM10 (aerosol)
primary observation time: 3month
minimum value: 0
maximum value: 6

Range for pollutant 5610 for var in ng.m-3 specific to GB
type: Concept
notation: 822
status: valid
status modified: 2018-08-13
accepted date: 2018-08-13
in scheme: AQD - Primary observation range
recommended unit: ng.m-3
in country: GB
related pollutant: Benzo(a)anthracene in PM10 (aerosol)
primary observation time: Variable sample
minimum value: 0
maximum value: 6

Range for pollutant 5617 for year in ng.m-3 specific to GB
type: Concept
notation: 823
status: valid
status modified: 2018-08-13
accepted date: 2018-08-13
in scheme: AQD - Primary observation range
recommended unit: ng.m-3
in country: GB
related pollutant: Benzo(b)fluoranthene in PM10 (aerosol)
primary observation time: Yearly average/mean
minimum value: 0
maximum value: 5

Range for pollutant 5626 for 3month in ng.m-3 specific to GB
type: Concept
notation: 824
status: valid
status modified: 2018-08-13
accepted date: 2018-08-13
in scheme: AQD - Primary observation range
recommended unit: ng.m-3
in country: GB
related pollutant: Benzo(k)fluoranthene in PM10 (aerosol)
primary observation time: 3month
minimum value: 0
maximum value: 3

Range for pollutant 5626 for var in ng.m-3 specific to GB
type: Concept
notation: 825
status: valid
status modified: 2018-08-13
accepted date: 2018-08-13
in scheme: AQD - Primary observation range
recommended unit: ng.m-3
in country: GB
related pollutant: Benzo(k)fluoranthene in PM10 (aerosol)
primary observation time: Variable sample
minimum value: 0
maximum value: 3

Range for pollutant 5655 for 3month in ng.m-3 specific to GB
type: Concept
notation: 826
status: valid
status modified: 2018-08-13
accepted date: 2018-08-13
in scheme: AQD - Primary observation range
recommended unit: ng.m-3
in country: GB
related pollutant: indeno_123cd_pyrene in PM10 (aerosol)
primary observation time: 3month
minimum value: 0
maximum value: 2

Range for pollutant 5655 for month in ng.m-3 specific to GB
type: Concept
notation: 827
status: valid
status modified: 2018-08-13
accepted date: 2018-08-13
in scheme: AQD - Primary observation range
recommended unit: ng.m-3
in country: GB
related pollutant: indeno_123cd_pyrene in PM10 (aerosol)
primary observation time: Monthly average/mean
minimum value: 0
maximum value: 3

Range for pollutant 5655 for var in ng.m-3 specific to GB
type: Concept
notation: 828
status: valid
status modified: 2018-08-13
accepted date: 2018-08-13
in scheme: AQD - Primary observation range
recommended unit: ng.m-3
in country: GB
related pollutant: indeno_123cd_pyrene in PM10 (aerosol)
primary observation time: Variable sample
minimum value: 0
maximum value: 2

Range for pollutant 5655 for year in ng.m-3 specific to GB
type: Concept
notation: 829
status: valid
status modified: 2018-08-13
accepted date: 2018-08-13
in scheme: AQD - Primary observation range
recommended unit: ng.m-3
in country: GB
related pollutant: indeno_123cd_pyrene in PM10 (aerosol)
primary observation time: Yearly average/mean
minimum value: 0
maximum value: 3

Range for pollutant 6005 for hour in ug.m-3 specific to GB
type: Concept
notation: 830
status: valid
status modified: 2018-08-13
accepted date: 2018-08-13
in scheme: AQD - Primary observation range
recommended unit: ug.m-3
in country: GB
related pollutant: 1-Butene (air)
primary observation time: Hourly average/mean
minimum value: 0
maximum value: 15

Range for pollutant 6006 for hour in ug.m-3 specific to GB
type: Concept
notation: 831
status: valid
status modified: 2018-08-13
accepted date: 2018-08-13
in scheme: AQD - Primary observation range
recommended unit: ug.m-3
in country: GB
related pollutant: trans-2-Butene (air)
primary observation time: Hourly average/mean
minimum value: 0
maximum value: 50

Range for pollutant 6007 for hour in ug.m-3 specific to GB
type: Concept
notation: 832
status: valid
status modified: 2018-08-13
accepted date: 2018-08-13
in scheme: AQD - Primary observation range
recommended unit: ug.m-3
in country: GB
related pollutant: cis-2-Butene (air)
primary observation time: Hourly average/mean
minimum value: 0
maximum value: 8

Range for pollutant 6008 for hour in ug.m-3 specific to GB
type: Concept
notation: 833
status: valid
status modified: 2018-08-13
accepted date: 2018-08-13
in scheme: AQD - Primary observation range
recommended unit: ug.m-3
in country: GB
related pollutant: 1-Pentene (air)
primary observation time: Hourly average/mean
minimum value: 0
maximum value: 12

Range for pollutant 6009 for hour in ug.m-3 specific to GB
type: Concept
notation: 834
status: valid
status modified: 2018-08-13
accepted date: 2018-08-13
in scheme: AQD - Primary observation range
recommended unit: ug.m-3
in country: GB
related pollutant: 2-Pentene (air)
primary observation time: Hourly average/mean
minimum value: 0
maximum value: 12

Range for pollutant 6011 for hour in ug.m-3 specific to GB
type: Concept
notation: 835
status: valid
status modified: 2018-08-13
accepted date: 2018-08-13
in scheme: AQD - Primary observation range
recommended unit: ug.m-3
in country: GB
related pollutant: 1,2,4-Trimethylbenzene (air)
primary observation time: Hourly average/mean
minimum value: 0
maximum value: 100

Range for pollutant 6012 for hour in ug.m-3 specific to GB
type: Concept
notation: 836
status: valid
status modified: 2018-08-13
accepted date: 2018-08-13
in scheme: AQD - Primary observation range
recommended unit: ug.m-3
in country: GB
related pollutant: 1,2,3-Trimethylbenzene (air)
primary observation time: Hourly average/mean
minimum value: 0
maximum value: 50

Range for pollutant 6013 for hour in ug.m-3 specific to GB
type: Concept
notation: 837
status: valid
status modified: 2018-08-13
accepted date: 2018-08-13
in scheme: AQD - Primary observation range
recommended unit: ug.m-3
in country: GB
related pollutant: 1,3,5-Trimethylbenzene (air)
primary observation time: Hourly average/mean
minimum value: 0
maximum value: 50

Range for pollutant 6015 for var in ng.m-3 specific to GB
type: Concept
notation: 838
status: valid
status modified: 2018-08-13
accepted date: 2018-08-13
in scheme: AQD - Primary observation range
recommended unit: ng.m-3
in country: GB
related pollutant: Benzo(a)pyrene (air+aerosol)
primary observation time: Variable sample
minimum value: 0
maximum value: 60

Range for pollutant 7012 for year in ug.m-2.day-1 specific to GB
type: Concept
notation: 839
status: valid
status modified: 2018-08-13
accepted date: 2018-08-13
in scheme: AQD - Primary observation range
recommended unit: ug.m-2.day-1
in country: GB
related pollutant: Lead (precip+dry_dep)
primary observation time: Yearly average/mean
minimum value: 0
maximum value: 4

Range for pollutant 1 for hour in ug.m-3 specific to GR
type: Concept
notation: 840
status: valid
status modified: 2018-08-13
accepted date: 2018-08-13
in scheme: AQD - Primary observation range
recommended unit: ug.m-3
in country: GR
related pollutant: Sulphur dioxide (air)
primary observation time: Hourly average/mean
minimum value: -10
maximum value: 600

Range for pollutant 5 for hour in ug.m-3 specific to GR
type: Concept
notation: 841
status: valid
status modified: 2018-08-13
accepted date: 2018-08-13
in scheme: AQD - Primary observation range
recommended unit: ug.m-3
in country: GR
related pollutant: Particulate matter < 10 µm (aerosol)
primary observation time: Hourly average/mean
minimum value: -10
maximum value: 900

Range for pollutant 12 for day in ug.m-3 specific to GR
type: Concept
notation: 842
status: valid
status modified: 2018-08-13
accepted date: 2018-08-13
in scheme: AQD - Primary observation range
recommended unit: ug.m-3
in country: GR
related pollutant: Lead (aerosol)
primary observation time: Daily average/mean
minimum value: -10
maximum value: 20

Range for pollutant 20 for hour in ug.m-3 specific to GR
type: Concept
notation: 843
status: valid
status modified: 2018-08-13
accepted date: 2018-08-13
in scheme: AQD - Primary observation range
recommended unit: ug.m-3
in country: GR
related pollutant: Benzene (air)
primary observation time: Hourly average/mean
minimum value: 0
maximum value: 60

Range for pollutant 21 for hour in ug.m-3 specific to GR
type: Concept
notation: 844
status: valid
status modified: 2018-08-13
accepted date: 2018-08-13
in scheme: AQD - Primary observation range
recommended unit: ug.m-3
in country: GR
related pollutant: Toluene (air)
primary observation time: Hourly average/mean
minimum value: 0
maximum value: 300

Range for pollutant 38 for hour in ug.m-3 specific to GR
type: Concept
notation: 845
status: valid
status modified: 2018-08-13
accepted date: 2018-08-13
in scheme: AQD - Primary observation range
recommended unit: ug.m-3
in country: GR
related pollutant: Nitrogen monoxide (air)
primary observation time: Hourly average/mean
minimum value: -10
maximum value: 1000

Range for pollutant 431 for hour in ug.m-3 specific to GR
type: Concept
notation: 846
status: valid
status modified: 2018-08-13
accepted date: 2018-08-13
in scheme: AQD - Primary observation range
recommended unit: ug.m-3
in country: GR
related pollutant: Ethyl benzene (air)
primary observation time: Hourly average/mean
minimum value: 0
maximum value: 100

Range for pollutant 464 for hour in ug.m-3 specific to GR
type: Concept
notation: 847
status: valid
status modified: 2018-08-13
accepted date: 2018-08-13
in scheme: AQD - Primary observation range
recommended unit: ug.m-3
in country: GR
related pollutant: m,p-Xylene (air)
primary observation time: Hourly average/mean
minimum value: 0
maximum value: 200

Range for pollutant 482 for hour in ug.m-3 specific to GR
type: Concept
notation: 848
status: valid
status modified: 2018-08-13
accepted date: 2018-08-13
in scheme: AQD - Primary observation range
recommended unit: ug.m-3
in country: GR
related pollutant: o-Xylene (air)
primary observation time: Hourly average/mean
minimum value: 0
maximum value: 100

Range for pollutant 1 for day in ug.m-3 specific to HU
type: Concept
notation: 849
status: valid
status modified: 2018-08-13
accepted date: 2018-08-13
in scheme: AQD - Primary observation range
recommended unit: ug.m-3
in country: HU
related pollutant: Sulphur dioxide (air)
primary observation time: Daily average/mean
minimum value: -10
maximum value: 340

Range for pollutant 1 for hour in ug.m-3 specific to HU
type: Concept
notation: 850
status: valid
status modified: 2018-08-13
accepted date: 2018-08-13
in scheme: AQD - Primary observation range
recommended unit: ug.m-3
in country: HU
related pollutant: Sulphur dioxide (air)
primary observation time: Hourly average/mean
minimum value: -10
maximum value: 450

Range for pollutant 5 for day in ug.m-3 specific to HU
type: Concept
notation: 851
status: valid
status modified: 2018-08-13
accepted date: 2018-08-13
in scheme: AQD - Primary observation range
recommended unit: ug.m-3
in country: HU
related pollutant: Particulate matter < 10 µm (aerosol)
primary observation time: Daily average/mean
minimum value: -10
maximum value: 525

Range for pollutant 7 for hour in ug.m-3 specific to HU
type: Concept
notation: 852
status: valid
status modified: 2018-08-13
accepted date: 2018-08-13
in scheme: AQD - Primary observation range
recommended unit: ug.m-3
in country: HU
related pollutant: Ozone (air)
primary observation time: Hourly average/mean
minimum value: -10
maximum value: 400

Range for pollutant 8 for day in ug.m-3 specific to HU
type: Concept
notation: 853
status: valid
status modified: 2018-08-13
accepted date: 2018-08-13
in scheme: AQD - Primary observation range
recommended unit: ug.m-3
in country: HU
related pollutant: Nitrogen dioxide (air)
primary observation time: Daily average/mean
minimum value: -10
maximum value: 340

Range for pollutant 8 for hour in ug.m-3 specific to HU
type: Concept
notation: 854
status: valid
status modified: 2018-08-13
accepted date: 2018-08-13
in scheme: AQD - Primary observation range
recommended unit: ug.m-3
in country: HU
related pollutant: Nitrogen dioxide (air)
primary observation time: Hourly average/mean
minimum value: -10
maximum value: 600

Range for pollutant 9 for hour in ug.m-3 specific to HU
type: Concept
notation: 855
status: valid
status modified: 2018-08-13
accepted date: 2018-08-13
in scheme: AQD - Primary observation range
recommended unit: ug.m-3
in country: HU
related pollutant: Nitrogen oxides (air)
primary observation time: Hourly average/mean
minimum value: -10
maximum value: 1600

Range for pollutant 10 for hour in mg.m-3 specific to HU
type: Concept
notation: 856
status: valid
status modified: 2018-08-13
accepted date: 2018-08-13
in scheme: AQD - Primary observation range
recommended unit: mg.m-3
in country: HU
related pollutant: Carbon monoxide (air)
primary observation time: Hourly average/mean
minimum value: -10
maximum value: 20

Range for pollutant 14 for day in ng.m-3 specific to HU
type: Concept
notation: 857
status: valid
status modified: 2018-08-13
accepted date: 2018-08-13
in scheme: AQD - Primary observation range
recommended unit: ng.m-3
in country: HU
related pollutant: Cadmium (aerosol)
primary observation time: Daily average/mean
minimum value: -10
maximum value: 30

Range for pollutant 15 for day in ng.m-3 specific to HU
type: Concept
notation: 858
status: valid
status modified: 2018-08-13
accepted date: 2018-08-13
in scheme: AQD - Primary observation range
recommended unit: ng.m-3
in country: HU
related pollutant: Nickel (aerosol)
primary observation time: Daily average/mean
minimum value: -10
maximum value: 30

Range for pollutant 18 for day in ng.m-3 specific to HU
type: Concept
notation: 859
status: valid
status modified: 2018-08-13
accepted date: 2018-08-13
in scheme: AQD - Primary observation range
recommended unit: ng.m-3
in country: HU
related pollutant: Arsenic (aerosol)
primary observation time: Daily average/mean
minimum value: -10
maximum value: 40

Range for pollutant 20 for day in ug.m-3 specific to HU
type: Concept
notation: 860
status: valid
status modified: 2018-08-13
accepted date: 2018-08-13
in scheme: AQD - Primary observation range
recommended unit: ug.m-3
in country: HU
related pollutant: Benzene (air)
primary observation time: Daily average/mean
minimum value: -10
maximum value: 50

Range for pollutant 21 for day in ug.m-3 specific to HU
type: Concept
notation: 861
status: valid
status modified: 2018-08-13
accepted date: 2018-08-13
in scheme: AQD - Primary observation range
recommended unit: ug.m-3
in country: HU
related pollutant: Toluene (air)
primary observation time: Daily average/mean
minimum value: -10
maximum value: 150

Range for pollutant 394 for day in ug.m-3 specific to HU
type: Concept
notation: 862
status: valid
status modified: 2018-08-13
accepted date: 2018-08-13
in scheme: AQD - Primary observation range
recommended unit: ug.m-3
in country: HU
related pollutant: n-Butane (air)
primary observation time: Daily average/mean
minimum value: -10
maximum value: 50

Range for pollutant 428 for day in ug.m-3 specific to HU
type: Concept
notation: 863
status: valid
status modified: 2018-08-13
accepted date: 2018-08-13
in scheme: AQD - Primary observation range
recommended unit: ug.m-3
in country: HU
related pollutant: Ethane (air)
primary observation time: Daily average/mean
minimum value: -10
maximum value: 50

Range for pollutant 430 for day in ug.m-3 specific to HU
type: Concept
notation: 864
status: valid
status modified: 2018-08-13
accepted date: 2018-08-13
in scheme: AQD - Primary observation range
recommended unit: ug.m-3
in country: HU
related pollutant: Ethene (Ethylene) (air)
primary observation time: Daily average/mean
minimum value: -10
maximum value: 30

Range for pollutant 431 for day in ug.m-3 specific to HU
type: Concept
notation: 865
status: valid
status modified: 2018-08-13
accepted date: 2018-08-13
in scheme: AQD - Primary observation range
recommended unit: ug.m-3
in country: HU
related pollutant: Ethyl benzene (air)
primary observation time: Daily average/mean
minimum value: -10
maximum value: 40

Range for pollutant 447 for day in ug.m-3 specific to HU
type: Concept
notation: 866
status: valid
status modified: 2018-08-13
accepted date: 2018-08-13
in scheme: AQD - Primary observation range
recommended unit: ug.m-3
in country: HU
related pollutant: i-Butane (2-methylpropane) (air)
primary observation time: Daily average/mean
minimum value: -10
maximum value: 100

Range for pollutant 450 for day in ug.m-3 specific to HU
type: Concept
notation: 867
status: valid
status modified: 2018-08-13
accepted date: 2018-08-13
in scheme: AQD - Primary observation range
recommended unit: ug.m-3
in country: HU
related pollutant: i-Pentane (2-methylbutane) (air)
primary observation time: Daily average/mean
minimum value: -10
maximum value: 100

Range for pollutant 464 for day in ug.m-3 specific to HU
type: Concept
notation: 868
status: valid
status modified: 2018-08-13
accepted date: 2018-08-13
in scheme: AQD - Primary observation range
recommended unit: ug.m-3
in country: HU
related pollutant: m,p-Xylene (air)
primary observation time: Daily average/mean
minimum value: -10
maximum value: 200

Range for pollutant 482 for day in ug.m-3 specific to HU
type: Concept
notation: 869
status: valid
status modified: 2018-08-13
accepted date: 2018-08-13
in scheme: AQD - Primary observation range
recommended unit: ug.m-3
in country: HU
related pollutant: o-Xylene (air)
primary observation time: Daily average/mean
minimum value: -10
maximum value: 60

Range for pollutant 486 for day in ug.m-3 specific to HU
type: Concept
notation: 870
status: valid
status modified: 2018-08-13
accepted date: 2018-08-13
in scheme: AQD - Primary observation range
recommended unit: ug.m-3
in country: HU
related pollutant: n-Pentane (air)
primary observation time: Daily average/mean
minimum value: -10
maximum value: 60

Range for pollutant 503 for day in ug.m-3 specific to HU
type: Concept
notation: 871
status: valid
status modified: 2018-08-13
accepted date: 2018-08-13
in scheme: AQD - Primary observation range
recommended unit: ug.m-3
in country: HU
related pollutant: Propane (air)
primary observation time: Daily average/mean
minimum value: -10
maximum value: 50

Range for pollutant 505 for day in ug.m-3 specific to HU
type: Concept
notation: 872
status: valid
status modified: 2018-08-13
accepted date: 2018-08-13
in scheme: AQD - Primary observation range
recommended unit: ug.m-3
in country: HU
related pollutant: Propene (air)
primary observation time: Daily average/mean
minimum value: -10
maximum value: 40

Range for pollutant 611 for month in ug.m-2.day-1 specific to HU
type: Concept
notation: 873
status: valid
status modified: 2018-08-13
accepted date: 2018-08-13
in scheme: AQD - Primary observation range
recommended unit: ug.m-2.day-1
in country: HU
related pollutant: Benzo(a)anthracene (precip+dry_dep)
primary observation time: Monthly average/mean
minimum value: 0
maximum value: 5

Range for pollutant 656 for month in ug.m-2.day-1 specific to HU
type: Concept
notation: 874
status: valid
status modified: 2018-08-13
accepted date: 2018-08-13
in scheme: AQD - Primary observation range
recommended unit: ug.m-2.day-1
in country: HU
related pollutant: indeno_123cd_pyrene (precip+dry_dep)
primary observation time: Monthly average/mean
minimum value: 0
maximum value: 1

Range for pollutant 5029 for day in ng.m-3 specific to HU
type: Concept
notation: 875
status: valid
status modified: 2018-08-13
accepted date: 2018-08-13
in scheme: AQD - Primary observation range
recommended unit: ng.m-3
in country: HU
related pollutant: Benzo(a)pyrene in PM10 (aerosol)
primary observation time: Daily average/mean
minimum value: 0
maximum value: 60

Range for pollutant 5380 for day in ng.m-3 specific to HU
type: Concept
notation: 876
status: valid
status modified: 2018-08-13
accepted date: 2018-08-13
in scheme: AQD - Primary observation range
recommended unit: ng.m-3
in country: HU
related pollutant: Benzo(b,j,k)fluoranthene in PM10 (aerosol)
primary observation time: Daily average/mean
minimum value: -1
maximum value: 100

Range for pollutant 5419 for day in ng.m-3 specific to HU
type: Concept
notation: 877
status: valid
status modified: 2018-08-13
accepted date: 2018-08-13
in scheme: AQD - Primary observation range
recommended unit: ng.m-3
in country: HU
related pollutant: Dibenzo(ah)anthracene in PM10 (aerosol)
primary observation time: Daily average/mean
minimum value: -1
maximum value: 20

Range for pollutant 5610 for day in ng.m-3 specific to HU
type: Concept
notation: 878
status: valid
status modified: 2018-08-13
accepted date: 2018-08-13
in scheme: AQD - Primary observation range
recommended unit: ng.m-3
in country: HU
related pollutant: Benzo(a)anthracene in PM10 (aerosol)
primary observation time: Daily average/mean
minimum value: -1
maximum value: 40

Range for pollutant 5655 for day in ng.m-3 specific to HU
type: Concept
notation: 879
status: valid
status modified: 2018-08-13
accepted date: 2018-08-13
in scheme: AQD - Primary observation range
recommended unit: ng.m-3
in country: HU
related pollutant: indeno_123cd_pyrene in PM10 (aerosol)
primary observation time: Daily average/mean
minimum value: -1
maximum value: 20

Range for pollutant 6001 for day in ug.m-3 specific to HU
type: Concept
notation: 880
status: valid
status modified: 2018-08-13
accepted date: 2018-08-13
in scheme: AQD - Primary observation range
recommended unit: ug.m-3
in country: HU
related pollutant: Particulate matter < 2.5 µm (aerosol)
primary observation time: Daily average/mean
minimum value: -10
maximum value: 525

Range for pollutant 6005 for day in ug.m-3 specific to HU
type: Concept
notation: 881
status: valid
status modified: 2018-08-13
accepted date: 2018-08-13
in scheme: AQD - Primary observation range
recommended unit: ug.m-3
in country: HU
related pollutant: 1-Butene (air)
primary observation time: Daily average/mean
minimum value: -10
maximum value: 50

Range for pollutant 7013 for month in ug.m-2.day-1 specific to HU
type: Concept
notation: 882
status: valid
status modified: 2018-08-13
accepted date: 2018-08-13
in scheme: AQD - Primary observation range
recommended unit: ug.m-2.day-1
in country: HU
related pollutant: Mercury (precip+dry_dep)
primary observation time: Monthly average/mean
minimum value: -10
maximum value: 10

Range for pollutant 7014 for month in ug.m-2.day-1 specific to HU
type: Concept
notation: 883
status: valid
status modified: 2018-08-13
accepted date: 2018-08-13
in scheme: AQD - Primary observation range
recommended unit: ug.m-2.day-1
in country: HU
related pollutant: Cadmium (precip+dry_dep)
primary observation time: Monthly average/mean
minimum value: -1
maximum value: 3

Range for pollutant 7015 for month in ug.m-2.day-1 specific to HU
type: Concept
notation: 884
status: valid
status modified: 2018-08-13
accepted date: 2018-08-13
in scheme: AQD - Primary observation range
recommended unit: ug.m-2.day-1
in country: HU
related pollutant: Nickel (precip+dry_dep)
primary observation time: Monthly average/mean
minimum value: 0
maximum value: 15

Range for pollutant 7018 for month in ug.m-2.day-1 specific to HU
type: Concept
notation: 885
status: valid
status modified: 2018-08-13
accepted date: 2018-08-13
in scheme: AQD - Primary observation range
recommended unit: ug.m-2.day-1
in country: HU
related pollutant: Arsenic (precip+dry_dep)
primary observation time: Monthly average/mean
minimum value: -1
maximum value: 2

Range for pollutant 7029 for month in ug.m-2.day-1 specific to HU
type: Concept
notation: 886
status: valid
status modified: 2018-08-13
accepted date: 2018-08-13
in scheme: AQD - Primary observation range
recommended unit: ug.m-2.day-1
in country: HU
related pollutant: Benzo(a)pyrene (precip+dry_dep)
primary observation time: Monthly average/mean
minimum value: 0
maximum value: 60

Range for pollutant 7380 for month in ug.m-2.day-1 specific to HU
type: Concept
notation: 887
status: valid
status modified: 2018-08-13
accepted date: 2018-08-13
in scheme: AQD - Primary observation range
recommended unit: ug.m-2.day-1
in country: HU
related pollutant: Benzo(b,j,k)fluoranthene (precip+dry_dep)
primary observation time: Monthly average/mean
minimum value: 0
maximum value: 3

Range for pollutant 7419 for month in ug.m-2.day-1 specific to HU
type: Concept
notation: 888
status: valid
status modified: 2018-08-13
accepted date: 2018-08-13
in scheme: AQD - Primary observation range
recommended unit: ug.m-2.day-1
in country: HU
related pollutant: Dibenzo(ah)anthracene (precip+dry_dep)
primary observation time: Monthly average/mean
minimum value: 0
maximum value: 5

Range for pollutant 352 for year in ng.m-3 specific to IE
type: Concept
notation: 889
status: valid
status modified: 2018-08-13
accepted date: 2018-08-13
in scheme: AQD - Primary observation range
recommended unit: ng.m-3
in country: IE
related pollutant: acenaphtylene (air+aerosol)
primary observation time: Yearly average/mean
minimum value: -0.5
maximum value: 5

Range for pollutant 5626 for year in ng.m-3 specific to IE
type: Concept
notation: 890
status: valid
status modified: 2018-08-13
accepted date: 2018-08-13
in scheme: AQD - Primary observation range
recommended unit: ng.m-3
in country: IE
related pollutant: Benzo(k)fluoranthene in PM10 (aerosol)
primary observation time: Yearly average/mean
minimum value: -0.5
maximum value: 3

Range for pollutant 5 for hour in ug.m-3 specific to IS
type: Concept
notation: 891
status: valid
status modified: 2018-08-13
accepted date: 2018-08-13
in scheme: AQD - Primary observation range
recommended unit: ug.m-3
in country: IS
related pollutant: Particulate matter < 10 µm (aerosol)
primary observation time: Hourly average/mean
minimum value: -20
maximum value: 2000

Range for pollutant 11 for hour in ug.m-3 specific to IS
type: Concept
notation: 892
status: valid
status modified: 2018-08-13
accepted date: 2018-08-13
in scheme: AQD - Primary observation range
recommended unit: ug.m-3
in country: IS
related pollutant: Hydrogen sulphide (air)
primary observation time: Hourly average/mean
minimum value: -10
maximum value: 1000

Range for pollutant 6001 for hour in ug.m-3 specific to IS
type: Concept
notation: 893
status: valid
status modified: 2018-08-13
accepted date: 2018-08-13
in scheme: AQD - Primary observation range
recommended unit: ug.m-3
in country: IS
related pollutant: Particulate matter < 2.5 µm (aerosol)
primary observation time: Hourly average/mean
minimum value: -10
maximum value: 2000

Range for pollutant 1 for hour in ug.m-3 specific to IT
type: Concept
notation: 894
status: valid
status modified: 2018-08-13
accepted date: 2018-08-13
in scheme: AQD - Primary observation range
recommended unit: ug.m-3
in country: IT
related pollutant: Sulphur dioxide (air)
primary observation time: Hourly average/mean
minimum value: 0
maximum value: 2700

Range for pollutant 4 for day in ug.m-3 specific to IT
type: Concept
notation: 895
status: valid
status modified: 2018-08-13
accepted date: 2018-08-13
in scheme: AQD - Primary observation range
recommended unit: ug.m-3
in country: IT
related pollutant: Total suspended particulates (aerosol)
primary observation time: Daily average/mean
minimum value: 0
maximum value: 525

Range for pollutant 5 for day in ug.m-3 specific to IT
type: Concept
notation: 896
status: valid
status modified: 2018-08-13
accepted date: 2018-08-13
in scheme: AQD - Primary observation range
recommended unit: ug.m-3
in country: IT
related pollutant: Particulate matter < 10 µm (aerosol)
primary observation time: Daily average/mean
minimum value: 0
maximum value: 525

Range for pollutant 5 for hour in ug.m-3 specific to IT
type: Concept
notation: 897
status: valid
status modified: 2018-08-13
accepted date: 2018-08-13
in scheme: AQD - Primary observation range
recommended unit: ug.m-3
in country: IT
related pollutant: Particulate matter < 10 µm (aerosol)
primary observation time: Hourly average/mean
minimum value: -10
maximum value: 1000

Range for pollutant 7 for hour in ug.m-3 specific to IT
type: Concept
notation: 898
status: valid
status modified: 2018-08-13
accepted date: 2018-08-13
in scheme: AQD - Primary observation range
recommended unit: ug.m-3
in country: IT
related pollutant: Ozone (air)
primary observation time: Hourly average/mean
minimum value: 0
maximum value: 400

Range for pollutant 8 for hour in ug.m-3 specific to IT
type: Concept
notation: 899
status: valid
status modified: 2018-08-13
accepted date: 2018-08-13
in scheme: AQD - Primary observation range
recommended unit: ug.m-3
in country: IT
related pollutant: Nitrogen dioxide (air)
primary observation time: Hourly average/mean
minimum value: 0
maximum value: 600

Range for pollutant 9 for hour in ug.m-3 specific to IT
type: Concept
notation: 900
status: valid
status modified: 2018-08-13
accepted date: 2018-08-13
in scheme: AQD - Primary observation range
recommended unit: ug.m-3
in country: IT
related pollutant: Nitrogen oxides (air)
primary observation time: Hourly average/mean
minimum value: 0
maximum value: 1900

Range for pollutant 10 for hour in mg.m-3 specific to IT
type: Concept
notation: 901
status: valid
status modified: 2018-08-13
accepted date: 2018-08-13
in scheme: AQD - Primary observation range
recommended unit: mg.m-3
in country: IT
related pollutant: Carbon monoxide (air)
primary observation time: Hourly average/mean
minimum value: 0
maximum value: 30

Range for pollutant 11 for day in ug.m-3 specific to IT
type: Concept
notation: 902
status: valid
status modified: 2018-08-13
accepted date: 2018-08-13
in scheme: AQD - Primary observation range
recommended unit: ug.m-3
in country: IT
related pollutant: Hydrogen sulphide (air)
primary observation time: Daily average/mean
minimum value: 0
maximum value: 2500

Range for pollutant 11 for hour in ug.m-3 specific to IT
type: Concept
notation: 903
status: valid
status modified: 2018-08-13
accepted date: 2018-08-13
in scheme: AQD - Primary observation range
recommended unit: ug.m-3
in country: IT
related pollutant: Hydrogen sulphide (air)
primary observation time: Hourly average/mean
minimum value: -10
maximum value: 400

Range for pollutant 12 for day in ug.m-3 specific to IT
type: Concept
notation: 904
status: valid
status modified: 2018-08-13
accepted date: 2018-08-13
in scheme: AQD - Primary observation range
recommended unit: ug.m-3
in country: IT
related pollutant: Lead (aerosol)
primary observation time: Daily average/mean
minimum value: 0
maximum value: 5

Range for pollutant 14 for day in ng.m-3 specific to IT
type: Concept
notation: 905
status: valid
status modified: 2018-08-13
accepted date: 2018-08-13
in scheme: AQD - Primary observation range
recommended unit: ng.m-3
in country: IT
related pollutant: Cadmium (aerosol)
primary observation time: Daily average/mean
minimum value: 0
maximum value: 50

Range for pollutant 15 for day in ng.m-3 specific to IT
type: Concept
notation: 906
status: valid
status modified: 2018-08-13
accepted date: 2018-08-13
in scheme: AQD - Primary observation range
recommended unit: ng.m-3
in country: IT
related pollutant: Nickel (aerosol)
primary observation time: Daily average/mean
minimum value: 0
maximum value: 200

Range for pollutant 16 for day in ng.m-3 specific to IT
type: Concept
notation: 907
status: valid
status modified: 2018-08-13
accepted date: 2018-08-13
in scheme: AQD - Primary observation range
recommended unit: ng.m-3
in country: IT
related pollutant: Chromium (aerosol)
primary observation time: Daily average/mean
minimum value: 0
maximum value: 80

Range for pollutant 17 for day in ng.m-3 specific to IT
type: Concept
notation: 908
status: valid
status modified: 2018-08-13
accepted date: 2018-08-13
in scheme: AQD - Primary observation range
recommended unit: ng.m-3
in country: IT
related pollutant: Manganese (aerosol)
primary observation time: Daily average/mean
minimum value: 0
maximum value: 60

Range for pollutant 18 for day in ng.m-3 specific to IT
type: Concept
notation: 909
status: valid
status modified: 2018-08-13
accepted date: 2018-08-13
in scheme: AQD - Primary observation range
recommended unit: ng.m-3
in country: IT
related pollutant: Arsenic (aerosol)
primary observation time: Daily average/mean
minimum value: 0
maximum value: 60

Range for pollutant 20 for day in ug.m-3 specific to IT
type: Concept
notation: 910
status: valid
status modified: 2018-08-13
accepted date: 2018-08-13
in scheme: AQD - Primary observation range
recommended unit: ug.m-3
in country: IT
related pollutant: Benzene (air)
primary observation time: Daily average/mean
minimum value: 0
maximum value: 35

Range for pollutant 21 for day in ug.m-3 specific to IT
type: Concept
notation: 911
status: valid
status modified: 2018-08-13
accepted date: 2018-08-13
in scheme: AQD - Primary observation range
recommended unit: ug.m-3
in country: IT
related pollutant: Toluene (air)
primary observation time: Daily average/mean
minimum value: 0
maximum value: 150

Range for pollutant 29 for day in ng.l-1 specific to IT
type: Concept
notation: 912
status: valid
status modified: 2018-08-13
accepted date: 2018-08-13
in scheme: AQD - Primary observation range
recommended unit: ng.l-1
in country: IT
related pollutant: Benzo(a)pyrene (precip)
primary observation time: Daily average/mean
minimum value: 0
maximum value: 30

Range for pollutant 30 for day in ng.m-3 specific to IT
type: Concept
notation: 913
status: valid
status modified: 2018-08-13
accepted date: 2018-08-13
in scheme: AQD - Primary observation range
recommended unit: ng.m-3
in country: IT
related pollutant: Polyaromatic hydrocarbons (air+aerosol)
primary observation time: Daily average/mean
minimum value: 0
maximum value: 150

Range for pollutant 32 for day in ugC.m-3 specific to IT
type: Concept
notation: 914
status: valid
status modified: 2018-08-13
accepted date: 2018-08-13
in scheme: AQD - Primary observation range
recommended unit: ugC.m-3
in country: IT
related pollutant: Total non-methane hydrocarbons (air)
primary observation time: Daily average/mean
minimum value: 0
maximum value: 2500

Range for pollutant 32 for hour in ugC.m-3 specific to IT
type: Concept
notation: 915
status: valid
status modified: 2018-08-13
accepted date: 2018-08-13
in scheme: AQD - Primary observation range
recommended unit: ugC.m-3
in country: IT
related pollutant: Total non-methane hydrocarbons (air)
primary observation time: Hourly average/mean
minimum value: -10
maximum value: 3100

Range for pollutant 33 for day in ug.m-3 specific to IT
type: Concept
notation: 916
status: valid
status modified: 2018-08-13
accepted date: 2018-08-13
in scheme: AQD - Primary observation range
recommended unit: ug.m-3
in country: IT
related pollutant: Total volatile organic compounds (air)
primary observation time: Daily average/mean
minimum value: 0
maximum value: 2500

Range for pollutant 35 for day in ug.m-3 specific to IT
type: Concept
notation: 917
status: valid
status modified: 2018-08-13
accepted date: 2018-08-13
in scheme: AQD - Primary observation range
recommended unit: ug.m-3
in country: IT
related pollutant: Ammonia (air)
primary observation time: Daily average/mean
minimum value: 0
maximum value: 300

Range for pollutant 38 for hour in ug.m-3 specific to IT
type: Concept
notation: 918
status: valid
status modified: 2018-08-13
accepted date: 2018-08-13
in scheme: AQD - Primary observation range
recommended unit: ug.m-3
in country: IT
related pollutant: Nitrogen monoxide (air)
primary observation time: Hourly average/mean
minimum value: 0
maximum value: 1100

Range for pollutant 41 for day in ug.m-3 specific to IT
type: Concept
notation: 919
status: valid
status modified: 2018-08-13
accepted date: 2018-08-13
in scheme: AQD - Primary observation range
recommended unit: ug.m-3
in country: IT
related pollutant: Methane (air)
primary observation time: Daily average/mean
minimum value: 0
maximum value: 2500

Range for pollutant 63 for day in ng.m-3 specific to IT
type: Concept
notation: 920
status: valid
status modified: 2018-08-13
accepted date: 2018-08-13
in scheme: AQD - Primary observation range
recommended unit: ng.m-3
in country: IT
related pollutant: Zinc (aerosol)
primary observation time: Daily average/mean
minimum value: 0
maximum value: 500

Range for pollutant 65 for day in ng.m-3 specific to IT
type: Concept
notation: 921
status: valid
status modified: 2018-08-13
accepted date: 2018-08-13
in scheme: AQD - Primary observation range
recommended unit: ng.m-3
in country: IT
related pollutant: Iron (aerosol)
primary observation time: Daily average/mean
minimum value: 0
maximum value: 500

Range for pollutant 73 for day in ng.m-3 specific to IT
type: Concept
notation: 922
status: valid
status modified: 2018-08-13
accepted date: 2018-08-13
in scheme: AQD - Primary observation range
recommended unit: ng.m-3
in country: IT
related pollutant: Copper (aerosol)
primary observation time: Daily average/mean
minimum value: 0
maximum value: 30

Range for pollutant 431 for day in ug.m-3 specific to IT
type: Concept
notation: 923
status: valid
status modified: 2018-08-13
accepted date: 2018-08-13
in scheme: AQD - Primary observation range
recommended unit: ug.m-3
in country: IT
related pollutant: Ethyl benzene (air)
primary observation time: Daily average/mean
minimum value: 0
maximum value: 10

Range for pollutant 482 for day in ug.m-3 specific to IT
type: Concept
notation: 924
status: valid
status modified: 2018-08-13
accepted date: 2018-08-13
in scheme: AQD - Primary observation range
recommended unit: ug.m-3
in country: IT
related pollutant: o-Xylene (air)
primary observation time: Daily average/mean
minimum value: 0
maximum value: 20

Range for pollutant 5014 for day in ng.m-3 specific to IT
type: Concept
notation: 925
status: valid
status modified: 2018-08-13
accepted date: 2018-08-13
in scheme: AQD - Primary observation range
recommended unit: ng.m-3
in country: IT
related pollutant: Cadmium in PM10 (aerosol)
primary observation time: Daily average/mean
minimum value: 0
maximum value: 50

Range for pollutant 5015 for day in ng.m-3 specific to IT
type: Concept
notation: 926
status: valid
status modified: 2018-08-13
accepted date: 2018-08-13
in scheme: AQD - Primary observation range
recommended unit: ng.m-3
in country: IT
related pollutant: Nickel in PM10 (aerosol)
primary observation time: Daily average/mean
minimum value: 0
maximum value: 200

Range for pollutant 5016 for day in ng.m-3 specific to IT
type: Concept
notation: 927
status: valid
status modified: 2018-08-13
accepted date: 2018-08-13
in scheme: AQD - Primary observation range
recommended unit: ng.m-3
in country: IT
related pollutant: Chromium in PM10 (aerosol)
primary observation time: Daily average/mean
minimum value: 0
maximum value: 20

Range for pollutant 5029 for day in ng.m-3 specific to IT
type: Concept
notation: 928
status: valid
status modified: 2018-08-13
accepted date: 2018-08-13
in scheme: AQD - Primary observation range
recommended unit: ng.m-3
in country: IT
related pollutant: Benzo(a)pyrene in PM10 (aerosol)
primary observation time: Daily average/mean
minimum value: 0
maximum value: 60

Range for pollutant 5029 for hour in ng.m-3 specific to IT
type: Concept
notation: 929
status: valid
status modified: 2018-08-13
accepted date: 2018-08-13
in scheme: AQD - Primary observation range
recommended unit: ng.m-3
in country: IT
related pollutant: Benzo(a)pyrene in PM10 (aerosol)
primary observation time: Hourly average/mean
minimum value: 0
maximum value: 60

Range for pollutant 6001 for day in ug.m-3 specific to IT
type: Concept
notation: 930
status: valid
status modified: 2018-08-13
accepted date: 2018-08-13
in scheme: AQD - Primary observation range
recommended unit: ug.m-3
in country: IT
related pollutant: Particulate matter < 2.5 µm (aerosol)
primary observation time: Daily average/mean
minimum value: 0
maximum value: 525

Range for pollutant 1 for day in ug.m-3 specific to LT
type: Concept
notation: 931
status: valid
status modified: 2018-08-13
accepted date: 2018-08-13
in scheme: AQD - Primary observation range
recommended unit: ug.m-3
in country: LT
related pollutant: Sulphur dioxide (air)
primary observation time: Daily average/mean
minimum value: 0
maximum value: 50

Range for pollutant 1 for hour in ug.m-3 specific to LT
type: Concept
notation: 932
status: valid
status modified: 2018-08-13
accepted date: 2018-08-13
in scheme: AQD - Primary observation range
recommended unit: ug.m-3
in country: LT
related pollutant: Sulphur dioxide (air)
primary observation time: Hourly average/mean
minimum value: -2
maximum value: 450

Range for pollutant 1 for week in ug.m-3 specific to LT
type: Concept
notation: 933
status: valid
status modified: 2018-08-13
accepted date: 2018-08-13
in scheme: AQD - Primary observation range
recommended unit: ug.m-3
in country: LT
related pollutant: Sulphur dioxide (air)
primary observation time: Weekly average/mean
minimum value: 0
maximum value: 450

Range for pollutant 5 for hour in ug.m-3 specific to LT
type: Concept
notation: 934
status: valid
status modified: 2018-08-13
accepted date: 2018-08-13
in scheme: AQD - Primary observation range
recommended unit: ug.m-3
in country: LT
related pollutant: Particulate matter < 10 µm (aerosol)
primary observation time: Hourly average/mean
minimum value: 0
maximum value: 700

Range for pollutant 7 for hour in ug.m-3 specific to LT
type: Concept
notation: 935
status: valid
status modified: 2018-08-13
accepted date: 2018-08-13
in scheme: AQD - Primary observation range
recommended unit: ug.m-3
in country: LT
related pollutant: Ozone (air)
primary observation time: Hourly average/mean
minimum value: -3
maximum value: 400

Range for pollutant 8 for day in ug.m-3 specific to LT
type: Concept
notation: 936
status: valid
status modified: 2018-08-13
accepted date: 2018-08-13
in scheme: AQD - Primary observation range
recommended unit: ug.m-3
in country: LT
related pollutant: Nitrogen dioxide (air)
primary observation time: Daily average/mean
minimum value: 0
maximum value: 50

Range for pollutant 8 for hour in ug.m-3 specific to LT
type: Concept
notation: 937
status: valid
status modified: 2018-08-13
accepted date: 2018-08-13
in scheme: AQD - Primary observation range
recommended unit: ug.m-3
in country: LT
related pollutant: Nitrogen dioxide (air)
primary observation time: Hourly average/mean
minimum value: -2
maximum value: 450

Range for pollutant 8 for week in ug.m-3 specific to LT
type: Concept
notation: 938
status: valid
status modified: 2018-08-13
accepted date: 2018-08-13
in scheme: AQD - Primary observation range
recommended unit: ug.m-3
in country: LT
related pollutant: Nitrogen dioxide (air)
primary observation time: Weekly average/mean
minimum value: 0
maximum value: 50

Range for pollutant 9 for hour in ug.m-3 specific to LT
type: Concept
notation: 939
status: valid
status modified: 2018-08-13
accepted date: 2018-08-13
in scheme: AQD - Primary observation range
recommended unit: ug.m-3
in country: LT
related pollutant: Nitrogen oxides (air)
primary observation time: Hourly average/mean
minimum value: -3
maximum value: 1500

Range for pollutant 10 for hour in mg.m-3 specific to LT
type: Concept
notation: 940
status: valid
status modified: 2018-08-13
accepted date: 2018-08-13
in scheme: AQD - Primary observation range
recommended unit: mg.m-3
in country: LT
related pollutant: Carbon monoxide (air)
primary observation time: Hourly average/mean
minimum value: -1
maximum value: 20

Range for pollutant 20 for hour in ug.m-3 specific to LT
type: Concept
notation: 941
status: valid
status modified: 2018-08-13
accepted date: 2018-08-13
in scheme: AQD - Primary observation range
recommended unit: ug.m-3
in country: LT
related pollutant: Benzene (air)
primary observation time: Hourly average/mean
minimum value: 0
maximum value: 60

Range for pollutant 21 for hour in ug.m-3 specific to LT
type: Concept
notation: 942
status: valid
status modified: 2018-08-13
accepted date: 2018-08-13
in scheme: AQD - Primary observation range
recommended unit: ug.m-3
in country: LT
related pollutant: Toluene (air)
primary observation time: Hourly average/mean
minimum value: 0
maximum value: 200

Range for pollutant 24 for hour in ug.m-3 specific to LT
type: Concept
notation: 943
status: valid
status modified: 2018-08-13
accepted date: 2018-08-13
in scheme: AQD - Primary observation range
recommended unit: ug.m-3
in country: LT
related pollutant: 1.3 Butadiene (air)
primary observation time: Hourly average/mean
minimum value: 0
maximum value: 9

Range for pollutant 67 for day in ugN.m-3 specific to LT
type: Concept
notation: 944
status: valid
status modified: 2018-08-13
accepted date: 2018-08-13
in scheme: AQD - Primary observation range
recommended unit: ugN.m-3
in country: LT
related pollutant: Total nitrate (air+aerosol)
primary observation time: Daily average/mean
minimum value: 0
maximum value: 80

Range for pollutant 67 for week in ugN.m-3 specific to LT
type: Concept
notation: 945
status: valid
status modified: 2018-08-13
accepted date: 2018-08-13
in scheme: AQD - Primary observation range
recommended unit: ugN.m-3
in country: LT
related pollutant: Total nitrate (air+aerosol)
primary observation time: Weekly average/mean
minimum value: 0
maximum value: 80

Range for pollutant 68 for day in ugN.m-3 specific to LT
type: Concept
notation: 946
status: valid
status modified: 2018-08-13
accepted date: 2018-08-13
in scheme: AQD - Primary observation range
recommended unit: ugN.m-3
in country: LT
related pollutant: Total ammonium (air+aerosol)
primary observation time: Daily average/mean
minimum value: 0
maximum value: 100

Range for pollutant 68 for week in ugN.m-3 specific to LT
type: Concept
notation: 947
status: valid
status modified: 2018-08-13
accepted date: 2018-08-13
in scheme: AQD - Primary observation range
recommended unit: ugN.m-3
in country: LT
related pollutant: Total ammonium (air+aerosol)
primary observation time: Weekly average/mean
minimum value: 0
maximum value: 100

Range for pollutant 394 for hour in ug.m-3 specific to LT
type: Concept
notation: 948
status: valid
status modified: 2018-08-13
accepted date: 2018-08-13
in scheme: AQD - Primary observation range
recommended unit: ug.m-3
in country: LT
related pollutant: n-Butane (air)
primary observation time: Hourly average/mean
minimum value: 0
maximum value: 200

Range for pollutant 428 for hour in ug.m-3 specific to LT
type: Concept
notation: 949
status: valid
status modified: 2018-08-13
accepted date: 2018-08-13
in scheme: AQD - Primary observation range
recommended unit: ug.m-3
in country: LT
related pollutant: Ethane (air)
primary observation time: Hourly average/mean
minimum value: 0
maximum value: 100

Range for pollutant 430 for hour in ug.m-3 specific to LT
type: Concept
notation: 950
status: valid
status modified: 2018-08-13
accepted date: 2018-08-13
in scheme: AQD - Primary observation range
recommended unit: ug.m-3
in country: LT
related pollutant: Ethene (Ethylene) (air)
primary observation time: Hourly average/mean
minimum value: -1
maximum value: 6000

Range for pollutant 431 for hour in ug.m-3 specific to LT
type: Concept
notation: 951
status: valid
status modified: 2018-08-13
accepted date: 2018-08-13
in scheme: AQD - Primary observation range
recommended unit: ug.m-3
in country: LT
related pollutant: Ethyl benzene (air)
primary observation time: Hourly average/mean
minimum value: 0
maximum value: 30

Range for pollutant 441 for hour in ug.m-3 specific to LT
type: Concept
notation: 952
status: valid
status modified: 2018-08-13
accepted date: 2018-08-13
in scheme: AQD - Primary observation range
recommended unit: ug.m-3
in country: LT
related pollutant: n-Heptane (air)
primary observation time: Hourly average/mean
minimum value: 0
maximum value: 3

Range for pollutant 443 for hour in ug.m-3 specific to LT
type: Concept
notation: 953
status: valid
status modified: 2018-08-13
accepted date: 2018-08-13
in scheme: AQD - Primary observation range
recommended unit: ug.m-3
in country: LT
related pollutant: n-Hexane (air)
primary observation time: Hourly average/mean
minimum value: 0
maximum value: 3

Range for pollutant 447 for hour in ug.m-3 specific to LT
type: Concept
notation: 954
status: valid
status modified: 2018-08-13
accepted date: 2018-08-13
in scheme: AQD - Primary observation range
recommended unit: ug.m-3
in country: LT
related pollutant: i-Butane (2-methylpropane) (air)
primary observation time: Hourly average/mean
minimum value: 0
maximum value: 100

Range for pollutant 450 for hour in ug.m-3 specific to LT
type: Concept
notation: 955
status: valid
status modified: 2018-08-13
accepted date: 2018-08-13
in scheme: AQD - Primary observation range
recommended unit: ug.m-3
in country: LT
related pollutant: i-Pentane (2-methylbutane) (air)
primary observation time: Hourly average/mean
minimum value: 0
maximum value: 100

Range for pollutant 464 for hour in ug.m-3 specific to LT
type: Concept
notation: 956
status: valid
status modified: 2018-08-13
accepted date: 2018-08-13
in scheme: AQD - Primary observation range
recommended unit: ug.m-3
in country: LT
related pollutant: m,p-Xylene (air)
primary observation time: Hourly average/mean
minimum value: 0
maximum value: 100

Range for pollutant 475 for hour in ug.m-3 specific to LT
type: Concept
notation: 957
status: valid
status modified: 2018-08-13
accepted date: 2018-08-13
in scheme: AQD - Primary observation range
recommended unit: ug.m-3
in country: LT
related pollutant: n-Octane (air)
primary observation time: Hourly average/mean
minimum value: 0
maximum value: 25

Range for pollutant 482 for hour in ug.m-3 specific to LT
type: Concept
notation: 958
status: valid
status modified: 2018-08-13
accepted date: 2018-08-13
in scheme: AQD - Primary observation range
recommended unit: ug.m-3
in country: LT
related pollutant: o-Xylene (air)
primary observation time: Hourly average/mean
minimum value: 0
maximum value: 9

Range for pollutant 486 for hour in ug.m-3 specific to LT
type: Concept
notation: 959
status: valid
status modified: 2018-08-13
accepted date: 2018-08-13
in scheme: AQD - Primary observation range
recommended unit: ug.m-3
in country: LT
related pollutant: n-Pentane (air)
primary observation time: Hourly average/mean
minimum value: 0
maximum value: 20

Range for pollutant 503 for hour in ug.m-3 specific to LT
type: Concept
notation: 960
status: valid
status modified: 2018-08-13
accepted date: 2018-08-13
in scheme: AQD - Primary observation range
recommended unit: ug.m-3
in country: LT
related pollutant: Propane (air)
primary observation time: Hourly average/mean
minimum value: 0
maximum value: 35

Range for pollutant 505 for hour in ug.m-3 specific to LT
type: Concept
notation: 961
status: valid
status modified: 2018-08-13
accepted date: 2018-08-13
in scheme: AQD - Primary observation range
recommended unit: ug.m-3
in country: LT
related pollutant: Propene (air)
primary observation time: Hourly average/mean
minimum value: 0
maximum value: 5

Range for pollutant 520 for day in ugS.m-3 specific to LT
type: Concept
notation: 962
status: valid
status modified: 2018-08-13
accepted date: 2018-08-13
in scheme: AQD - Primary observation range
recommended unit: ugS.m-3
in country: LT
related pollutant: sum_sulph_diox_sulphate (air+aerosol)
primary observation time: Daily average/mean
minimum value: 0
maximum value: 150

Range for pollutant 520 for week in ugS.m-3 specific to LT
type: Concept
notation: 963
status: valid
status modified: 2018-08-13
accepted date: 2018-08-13
in scheme: AQD - Primary observation range
recommended unit: ugS.m-3
in country: LT
related pollutant: sum_sulph_diox_sulphate (air+aerosol)
primary observation time: Weekly average/mean
minimum value: 0
maximum value: 150

Range for pollutant 1046 for week in ug.m-3 specific to LT
type: Concept
notation: 964
status: valid
status modified: 2018-08-13
accepted date: 2018-08-13
in scheme: AQD - Primary observation range
recommended unit: ug.m-3
in country: LT
related pollutant: Nitrate in PM2.5 (aerosol)
primary observation time: Weekly average/mean
minimum value: 0
maximum value: 20

Range for pollutant 1657 for week in ug.m-3 specific to LT
type: Concept
notation: 965
status: valid
status modified: 2018-08-13
accepted date: 2018-08-13
in scheme: AQD - Primary observation range
recommended unit: ug.m-3
in country: LT
related pollutant: potassium in PM2.5 (aerosol)
primary observation time: Weekly average/mean
minimum value: 0
maximum value: 20

Range for pollutant 1659 for week in ug.m-3 specific to LT
type: Concept
notation: 966
status: valid
status modified: 2018-08-13
accepted date: 2018-08-13
in scheme: AQD - Primary observation range
recommended unit: ug.m-3
in country: LT
related pollutant: magnesium in PM2.5 (aerosol)
primary observation time: Weekly average/mean
minimum value: 0
maximum value: 20

Range for pollutant 1771 for week in ug.m-3 specific to LT
type: Concept
notation: 967
status: valid
status modified: 2018-08-13
accepted date: 2018-08-13
in scheme: AQD - Primary observation range
recommended unit: ug.m-3
in country: LT
related pollutant: Elemental carbon in PM2.5 (aerosol)
primary observation time: Weekly average/mean
minimum value: 0
maximum value: 5

Range for pollutant 1772 for week in ug.m-3 specific to LT
type: Concept
notation: 968
status: valid
status modified: 2018-08-13
accepted date: 2018-08-13
in scheme: AQD - Primary observation range
recommended unit: ug.m-3
in country: LT
related pollutant: Organic carbon in PM2.5 (aerosol)
primary observation time: Weekly average/mean
minimum value: 0
maximum value: 20

Range for pollutant 4813 for hour in ng.m-3 specific to LT
type: Concept
notation: 969
status: valid
status modified: 2018-08-13
accepted date: 2018-08-13
in scheme: AQD - Primary observation range
recommended unit: ng.m-3
in country: LT
related pollutant: Total gaseous mercury (air+aerosol)
primary observation time: Hourly average/mean
minimum value: 0
maximum value: 10

Range for pollutant 5012 for month in ug.m-3 specific to LT
type: Concept
notation: 970
status: valid
status modified: 2018-08-13
accepted date: 2018-08-13
in scheme: AQD - Primary observation range
recommended unit: ug.m-3
in country: LT
related pollutant: Lead in PM10 (aerosol)
primary observation time: Monthly average/mean
minimum value: 0
maximum value: 5

Range for pollutant 5014 for month in ng.m-3 specific to LT
type: Concept
notation: 971
status: valid
status modified: 2018-08-13
accepted date: 2018-08-13
in scheme: AQD - Primary observation range
recommended unit: ng.m-3
in country: LT
related pollutant: Cadmium in PM10 (aerosol)
primary observation time: Monthly average/mean
minimum value: 0
maximum value: 50

Range for pollutant 5015 for month in ng.m-3 specific to LT
type: Concept
notation: 972
status: valid
status modified: 2018-08-13
accepted date: 2018-08-13
in scheme: AQD - Primary observation range
recommended unit: ng.m-3
in country: LT
related pollutant: Nickel in PM10 (aerosol)
primary observation time: Monthly average/mean
minimum value: 0
maximum value: 200

Range for pollutant 5018 for month in ng.m-3 specific to LT
type: Concept
notation: 973
status: valid
status modified: 2018-08-13
accepted date: 2018-08-13
in scheme: AQD - Primary observation range
recommended unit: ng.m-3
in country: LT
related pollutant: Arsenic in PM10 (aerosol)
primary observation time: Monthly average/mean
minimum value: 0
maximum value: 40

Range for pollutant 5419 for month in ng.m-3 specific to LT
type: Concept
notation: 974
status: valid
status modified: 2018-08-13
accepted date: 2018-08-13
in scheme: AQD - Primary observation range
recommended unit: ng.m-3
in country: LT
related pollutant: Dibenzo(ah)anthracene in PM10 (aerosol)
primary observation time: Monthly average/mean
minimum value: 0
maximum value: 0.6

Range for pollutant 5610 for month in ng.m-3 specific to LT
type: Concept
notation: 975
status: valid
status modified: 2018-08-13
accepted date: 2018-08-13
in scheme: AQD - Primary observation range
recommended unit: ng.m-3
in country: LT
related pollutant: Benzo(a)anthracene in PM10 (aerosol)
primary observation time: Monthly average/mean
minimum value: 0
maximum value: 10

Range for pollutant 5617 for month in ng.m-3 specific to LT
type: Concept
notation: 976
status: valid
status modified: 2018-08-13
accepted date: 2018-08-13
in scheme: AQD - Primary observation range
recommended unit: ng.m-3
in country: LT
related pollutant: Benzo(b)fluoranthene in PM10 (aerosol)
primary observation time: Monthly average/mean
minimum value: 0
maximum value: 8

Range for pollutant 5626 for month in ng.m-3 specific to LT
type: Concept
notation: 977
status: valid
status modified: 2018-08-13
accepted date: 2018-08-13
in scheme: AQD - Primary observation range
recommended unit: ng.m-3
in country: LT
related pollutant: Benzo(k)fluoranthene in PM10 (aerosol)
primary observation time: Monthly average/mean
minimum value: 0
maximum value: 6

Range for pollutant 5655 for month in ng.m-3 specific to LT
type: Concept
notation: 978
status: valid
status modified: 2018-08-13
accepted date: 2018-08-13
in scheme: AQD - Primary observation range
recommended unit: ng.m-3
in country: LT
related pollutant: indeno_123cd_pyrene in PM10 (aerosol)
primary observation time: Monthly average/mean
minimum value: 0
maximum value: 8

Range for pollutant 6001 for hour in ug.m-3 specific to LT
type: Concept
notation: 979
status: valid
status modified: 2018-08-13
accepted date: 2018-08-13
in scheme: AQD - Primary observation range
recommended unit: ug.m-3
in country: LT
related pollutant: Particulate matter < 2.5 µm (aerosol)
primary observation time: Hourly average/mean
minimum value: 0
maximum value: 700

Range for pollutant 6001 for week in ug.m-3 specific to LT
type: Concept
notation: 980
status: valid
status modified: 2018-08-13
accepted date: 2018-08-13
in scheme: AQD - Primary observation range
recommended unit: ug.m-3
in country: LT
related pollutant: Particulate matter < 2.5 µm (aerosol)
primary observation time: Weekly average/mean
minimum value: 0
maximum value: 500

Range for pollutant 6005 for hour in ug.m-3 specific to LT
type: Concept
notation: 981
status: valid
status modified: 2018-08-13
accepted date: 2018-08-13
in scheme: AQD - Primary observation range
recommended unit: ug.m-3
in country: LT
related pollutant: 1-Butene (air)
primary observation time: Hourly average/mean
minimum value: 0
maximum value: 15

Range for pollutant 6006 for hour in ug.m-3 specific to LT
type: Concept
notation: 982
status: valid
status modified: 2018-08-13
accepted date: 2018-08-13
in scheme: AQD - Primary observation range
recommended unit: ug.m-3
in country: LT
related pollutant: trans-2-Butene (air)
primary observation time: Hourly average/mean
minimum value: 0
maximum value: 8

Range for pollutant 6007 for hour in ug.m-3 specific to LT
type: Concept
notation: 983
status: valid
status modified: 2018-08-13
accepted date: 2018-08-13
in scheme: AQD - Primary observation range
recommended unit: ug.m-3
in country: LT
related pollutant: cis-2-Butene (air)
primary observation time: Hourly average/mean
minimum value: 0
maximum value: 8

Range for pollutant 6011 for hour in ug.m-3 specific to LT
type: Concept
notation: 984
status: valid
status modified: 2018-08-13
accepted date: 2018-08-13
in scheme: AQD - Primary observation range
recommended unit: ug.m-3
in country: LT
related pollutant: 1,2,4-Trimethylbenzene (air)
primary observation time: Hourly average/mean
minimum value: 0
maximum value: 50

Range for pollutant 6012 for hour in ug.m-3 specific to LT
type: Concept
notation: 985
status: valid
status modified: 2018-08-13
accepted date: 2018-08-13
in scheme: AQD - Primary observation range
recommended unit: ug.m-3
in country: LT
related pollutant: 1,2,3-Trimethylbenzene (air)
primary observation time: Hourly average/mean
minimum value: 0
maximum value: 50

Range for pollutant 6013 for hour in ug.m-3 specific to LT
type: Concept
notation: 986
status: valid
status modified: 2018-08-13
accepted date: 2018-08-13
in scheme: AQD - Primary observation range
recommended unit: ug.m-3
in country: LT
related pollutant: 1,3,5-Trimethylbenzene (air)
primary observation time: Hourly average/mean
minimum value: 0
maximum value: 50

Range for pollutant 7013 for month in ug.m-2.day-1 specific to LT
type: Concept
notation: 987
status: valid
status modified: 2018-08-13
accepted date: 2018-08-13
in scheme: AQD - Primary observation range
recommended unit: ug.m-2.day-1
in country: LT
related pollutant: Mercury (precip+dry_dep)
primary observation time: Monthly average/mean
minimum value: 0
maximum value: 10

Range for pollutant 7014 for month in ug.m-2.day-1 specific to LT
type: Concept
notation: 988
status: valid
status modified: 2018-08-13
accepted date: 2018-08-13
in scheme: AQD - Primary observation range
recommended unit: ug.m-2.day-1
in country: LT
related pollutant: Cadmium (precip+dry_dep)
primary observation time: Monthly average/mean
minimum value: 0
maximum value: 3

Range for pollutant 7015 for month in ug.m-2.day-1 specific to LT
type: Concept
notation: 989
status: valid
status modified: 2018-08-13
accepted date: 2018-08-13
in scheme: AQD - Primary observation range
recommended unit: ug.m-2.day-1
in country: LT
related pollutant: Nickel (precip+dry_dep)
primary observation time: Monthly average/mean
minimum value: 0
maximum value: 10

Range for pollutant 7018 for month in ug.m-2.day-1 specific to LT
type: Concept
notation: 990
status: valid
status modified: 2018-08-13
accepted date: 2018-08-13
in scheme: AQD - Primary observation range
recommended unit: ug.m-2.day-1
in country: LT
related pollutant: Arsenic (precip+dry_dep)
primary observation time: Monthly average/mean
minimum value: 0
maximum value: 0.8

Range for pollutant 1629 for week in ug.m-3 specific to LV
type: Concept
notation: 991
status: valid
status modified: 2018-08-13
accepted date: 2018-08-13
in scheme: AQD - Primary observation range
recommended unit: ug.m-3
in country: LV
related pollutant: calcium in PM2.5 (aerosol)
primary observation time: Weekly average/mean
minimum value: 0
maximum value: 2

Range for pollutant 2015 for week in ug.l-1 specific to LV
type: Concept
notation: 992
status: valid
status modified: 2018-08-13
accepted date: 2018-08-13
in scheme: AQD - Primary observation range
recommended unit: ug.l-1
in country: LV
related pollutant: Nickel (precip)
primary observation time: Weekly average/mean
minimum value: 0
maximum value: 2.2

Range for pollutant 2018 for week in ug.l-1 specific to LV
type: Concept
notation: 993
status: valid
status modified: 2018-08-13
accepted date: 2018-08-13
in scheme: AQD - Primary observation range
recommended unit: ug.l-1
in country: LV
related pollutant: Arsenic (precip)
primary observation time: Weekly average/mean
minimum value: -0.5
maximum value: 1.1

Range for pollutant 5610 for week in ng.m-3 specific to LV
type: Concept
notation: 994
status: valid
status modified: 2018-08-13
accepted date: 2018-08-13
in scheme: AQD - Primary observation range
recommended unit: ng.m-3
in country: LV
related pollutant: Benzo(a)anthracene in PM10 (aerosol)
primary observation time: Weekly average/mean
minimum value: -0.5
maximum value: 9

Range for pollutant 5617 for week in ng.m-3 specific to LV
type: Concept
notation: 995
status: valid
status modified: 2018-08-13
accepted date: 2018-08-13
in scheme: AQD - Primary observation range
recommended unit: ng.m-3
in country: LV
related pollutant: Benzo(b)fluoranthene in PM10 (aerosol)
primary observation time: Weekly average/mean
minimum value: 0
maximum value: 4.5

Range for pollutant 5626 for week in ng.m-3 specific to LV
type: Concept
notation: 996
status: valid
status modified: 2018-08-13
accepted date: 2018-08-13
in scheme: AQD - Primary observation range
recommended unit: ng.m-3
in country: LV
related pollutant: Benzo(k)fluoranthene in PM10 (aerosol)
primary observation time: Weekly average/mean
minimum value: -0.5
maximum value: 5.5

Range for pollutant 5655 for week in ng.m-3 specific to LV
type: Concept
notation: 997
status: valid
status modified: 2018-08-13
accepted date: 2018-08-13
in scheme: AQD - Primary observation range
recommended unit: ng.m-3
in country: LV
related pollutant: indeno_123cd_pyrene in PM10 (aerosol)
primary observation time: Weekly average/mean
minimum value: 0
maximum value: 5

Range for pollutant 7015 for month in ug.m-2.day-1 specific to LV
type: Concept
notation: 998
status: valid
status modified: 2018-08-13
accepted date: 2018-08-13
in scheme: AQD - Primary observation range
recommended unit: ug.m-2.day-1
in country: LV
related pollutant: Nickel (precip+dry_dep)
primary observation time: Monthly average/mean
minimum value: 0
maximum value: 18.7

Range for pollutant 7018 for month in ug.m-2.day-1 specific to LV
type: Concept
notation: 999
status: valid
status modified: 2018-08-13
accepted date: 2018-08-13
in scheme: AQD - Primary observation range
recommended unit: ug.m-2.day-1
in country: LV
related pollutant: Arsenic (precip+dry_dep)
primary observation time: Monthly average/mean
minimum value: 0
maximum value: 4.4

Range for pollutant 5610 for var in ng.m-3 specific to FI
type: Concept
notation: 1189
status: valid
status modified: 2020-08-04
in scheme: AQD - Primary observation range
in country: FI
related pollutant: Benzo(a)anthracene in PM10 (aerosol)
primary observation time: Variable sample
maximum value: 20

Range for pollutant 5626 for var in ng.m-3 specific to FI
type: Concept
notation: 1190
status: valid
status modified: 2020-08-11
in scheme: AQD - Primary observation range
recommended unit: ng.m-3
in country: FI
related pollutant: Benzo(k)fluoranthene in PM10 (aerosol)
primary observation time: Variable sample
maximum value: 10

Range for pollutant 5617 for var in ng.m-3 specific to FI
type: Concept
notation: 1191
status: valid
status modified: 2020-08-11
in scheme: AQD - Primary observation range
in country: FI
related pollutant: Benzo(b)fluoranthene in PM10 (aerosol)
primary observation time: Variable sample
maximum value: 10

Range for pollutant 5655 for var in ng.m-3 specific to FI
type: Concept
notation: 1192
status: valid
status modified: 2020-08-11
in scheme: AQD - Primary observation range
recommended unit: ng.m-3
in country: FI
related pollutant: indeno_123cd_pyrene in PM10 (aerosol)
primary observation time: Variable sample
maximum value: 10

Range for pollutant 717 for var in ug/m2/day specific to FI
type: Concept
notation: 1193
status: valid
status modified: 2020-08-11
in scheme: AQD - Primary observation range
recommended unit: ug.m-2.day-1
in country: FI
related pollutant: pyrene (precip+dry_dep)
primary observation time: Variable sample
maximum value: 0.1

AQD - Process Parameter
type: ConceptScheme
notation: processparameter
is part of: Air Quality Directive e-Reporting
registration status: Public draft
user modified: targajau
date modified: 2017-04-12 11:43:15.0
vocabulary type: Common
is numeric concept identifiers: false
is notations equal identifiers: false

Assessment Type
type: Concept
notation: AssessmentType
status: valid
status modified: 2013-03-22
accepted date: 2013-03-22
in scheme: AQD - Process Parameter

EnvironmentalObjective
type: Concept
notation: EO
status: invalid
status modified: 2013-03-22
accepted date: 2013-03-22
not accepted date: 2016-10-01
in scheme: AQD - Process Parameter

SamplingPoint
type: Concept
notation: SamplingPoint
status: valid
status modified: 2013-03-22
accepted date: 2013-03-22
in scheme: AQD - Process Parameter

Monitoring Station
type: Concept
notation: Station
definition: A monitoring facility used to observe air pollution
status: valid
status modified: 2014-05-01
accepted date: 2014-05-01
in scheme: AQD - Process Parameter

Model
type: Concept
notation: model
status: valid
status modified: 2013-03-22
accepted date: 2013-03-22
in scheme: AQD - Process Parameter

Objective Estimation and/or Expert Judgement
type: Concept
notation: objective
status: valid
status modified: 2016-11-04
accepted date: 2014-06-10
in scheme: AQD - Process Parameter

Primary Observation Time
type: Concept
notation: Primary Observation Time
definition: Time/averaging period of primary observation - to be specified when aggregating statistics within om:parameter
status: invalid
status modified: 2013-09-13
accepted date: 2013-09-13
not accepted date: 2016-10-01
in scheme: AQD - Process Parameter

Result encoding parameter
type: Concept
notation: resultencoding
definition: Parameter used in D1b to declare that resultencoding is to be provided in E1b. In E1b, further description of encoding is to be provided via http://dd.eionet.europa.eu/vocabulary/aq/resultencoding
status: valid
status modified: 2017-04-12
in scheme: AQD - Process Parameter

Result format parameter
type: Concept
notation: resultformat
definition: Parameter used in D1b to declare that result format is to be provided in E1b. In E1b, further description of the location is to be provided via http://dd.eionet.europa.eu/vocabulary/aq/resultformat
status: valid
status modified: 2017-04-12
in scheme: AQD - Process Parameter

AQD - ProtectionTarget
type: ConceptScheme
notation: protectiontarget
is part of: Air Quality Directive e-Reporting
registration status: Public draft
user modified: targajau
date modified: 2016-06-07 15:41:31.0
vocabulary type: Common
is numeric concept identifiers: false
is notations equal identifiers: false

Health
type: Concept
notation: H
definition: Protection target of human health
status: valid
status modified: 2013-03-22
accepted date: 2013-03-22
in scheme: AQD - ProtectionTarget

Health (Stage 1)
type: Concept
notation: H-S1
definition: Differentiates between the annual mean Stage 1 & 2 health protection target for PM2.5 both of which use annual mean as the reporting metric.
status: valid
status modified: 2013-06-03
accepted date: 2013-06-03
in scheme: AQD - ProtectionTarget

Health (Stage 2)
type: Concept
notation: H-S2
definition: Differentiates between the annual mean Stage 1 & 2 health protection target for PM2.5 both of which use annual mean as the reporting metric.
status: valid
status modified: 2013-06-03
accepted date: 2013-06-03
in scheme: AQD - ProtectionTarget

Health & Vegetation
type: Concept
notation: HV
definition: Please note that countries should use either H or V separately
status: deprecated
status modified: 2016-06-07
accepted date: 2013-12-18
in scheme: AQD - ProtectionTarget

Not applicable
type: Concept
notation: NA
status: valid
status modified: 2013-03-22
accepted date: 2013-03-22
in scheme: AQD - ProtectionTarget

Vegetation
type: Concept
notation: V
definition: Protection target of vegetation
status: valid
status modified: 2013-03-22
accepted date: 2013-03-22
in scheme: AQD - ProtectionTarget

Reason if measure not used
type: ConceptScheme
notation: reasonifmeasurenotused
is part of: Air Quality Directive e-Reporting
registration status: Public draft
user modified: targajau
date modified: 2025-07-15 13:39:05.0
vocabulary type: Common
is numeric concept identifiers: false
is notations equal identifiers: false

Technically not feasible
type: Concept
notation: technically-not-feasible
definition: No available technology or solution exists to address the issue in the specific context.
status: valid
status modified: 2025-07-15
accepted date: 2025-07-15
in scheme: Reason if measure not used

Economically disproportionate
type: Concept
notation: economically-disproportionate
definition: The cost of the measure would entail disproportionate costs.
status: valid
status modified: 2025-07-15
accepted date: 2025-07-15
in scheme: Reason if measure not used

Not relevant for pollutant(s)
type: Concept
notation: not-relevant-pollutant
definition: Measure not applicable to the pollutants exceeding limit values.
status: valid
status modified: 2025-07-15
accepted date: 2025-07-15
in scheme: Reason if measure not used

Insufficient funding or resources
type: Concept
notation: insufficient-resources
definition: No available budget or staff to support the measure.
status: valid
status modified: 2025-07-15
accepted date: 2025-07-15
in scheme: Reason if measure not used

Not within the competence of the AQ plan authority
type: Concept
notation: outside-competence
definition: The competence authority lies outside the AQ plan authority’s control.
status: valid
status modified: 2025-07-15
accepted date: 2025-07-15
in scheme: Reason if measure not used

Measure already implemented
type: Concept
notation: already-implemented
definition: The measure is already in place; no further action needed.
status: valid
status modified: 2025-07-15
accepted date: 2025-07-15
in scheme: Reason if measure not used

Measure deemed ineffective
type: Concept
notation: ineffective-measure
definition: Past evidence or modelling shows low impact on air quality (applicable for O3).
status: valid
status modified: 2025-07-15
accepted date: 2025-07-15
in scheme: Reason if measure not used

Awaiting outcome of other actions
type: Concept
notation: awaiting-other-actions
definition: Implementation paused pending results from other measures.
status: valid
status modified: 2025-07-15
accepted date: 2025-07-15
in scheme: Reason if measure not used

Lack of legal mandate
type: Concept
notation: no-legal-mandate
definition: Legislation does not permit or enable the implementation.
status: valid
status modified: 2025-07-15
accepted date: 2025-07-15
in scheme: Reason if measure not used

Conflicts with other policies
type: Concept
notation: policy-conflict
definition: The measure contradicts or undermines other existing policies, plans and/or measures.
status: valid
status modified: 2025-07-15
accepted date: 2025-07-15
in scheme: Reason if measure not used

Administrative or procedural delays
type: Concept
notation: procedural-delay
definition: Implementation is delayed due to legal, procurement, or planning processes.
status: valid
status modified: 2025-07-15
accepted date: 2025-07-15
in scheme: Reason if measure not used

Pending revision or update
type: Concept
notation: under-revision
definition: Measure under review or update before potential implementation.
status: valid
status modified: 2025-07-15
accepted date: 2025-07-15
in scheme: Reason if measure not used

Insufficient data or evidence
type: Concept
notation: insufficient-evidence
definition: Scientific or technical data is lacking to support implementation.
status: valid
status modified: 2025-07-15
accepted date: 2025-07-15
in scheme: Reason if measure not used

Low priority
type: Concept
notation: low-priority
definition: The measure is deprioritized in favor of more impactful or urgent actions.
status: valid
status modified: 2025-07-15
accepted date: 2025-07-15
in scheme: Reason if measure not used

Public or stakeholder opposition
type: Concept
notation: stakeholder-opposition
definition: Strong resistance from the public or key stakeholders prevents implementation.
status: valid
status modified: 2025-07-15
accepted date: 2025-07-15
in scheme: Reason if measure not used

AQD - Reporting Level
type: ConceptScheme
notation: reportinglevel
is part of: Air Quality Directive e-Reporting
registration status: Public draft
user modified: targajau
date modified: 2013-05-15 13:47:53.0
vocabulary type: Common
is numeric concept identifiers: false
is notations equal identifiers: false

Local
type: Concept
notation: local
status: valid
status modified: 2013-05-15
accepted date: 2013-05-15
in scheme: AQD - Reporting Level

National (Entire country)
type: Concept
notation: national
status: valid
status modified: 2013-05-15
accepted date: 2013-05-15
in scheme: AQD - Reporting Level

EU
type: Concept
notation: eu
status: valid
status modified: 2013-05-15
accepted date: 2013-05-15
in scheme: AQD - Reporting Level

GMES (Global Monitoring for Environment and Security)
type: Concept
notation: gmes
definition: GMES (Global Monitoring for Environment and Security) is the European Programme for the establishment of a European capacity for Earth Observation.
status: valid
status modified: 2013-05-15
accepted date: 2013-05-15
in scheme: AQD - Reporting Level

OECD (Organisation for Economic Co-operation and Development)
type: Concept
notation: oecd
definition: Organisation for Economic Co-operation and Development (OECD), an international organisation helping governments tackle the economic, social and governance challenges of a globalised economy.
status: valid
status modified: 2013-05-15
accepted date: 2013-05-15
in scheme: AQD - Reporting Level

GAW (The Global Atmosphere Watch)
type: Concept
notation: gaw
definition: The Global Atmosphere Watch (GAW) programme of WMO is a partnership involving 80 countries, which provides reliable scientific data and information on the chemical composition of the atmosphere, its natural and anthropogenic change, and helps to improve the understanding of interactions between the atmosphere, the oceans and the biosphere.
status: valid
status modified: 2013-05-15
accepted date: 2013-05-15
in scheme: AQD - Reporting Level

EMEP (European Monitoring and Evaluation Programme)
type: Concept
notation: emep
definition: EMEP (European Monitoring and Evaluation Programme) is a scientifically based and policy driven programme under the Convention on Long-range Transboundary Air Pollution for international co-operation to solve transboundary air pollution problems.
status: valid
status modified: 2013-05-15
accepted date: 2013-05-15
in scheme: AQD - Reporting Level

Other, please specify
type: Concept
notation: other
status: valid
status modified: 2013-05-15
accepted date: 2013-05-15
in scheme: AQD - Reporting Level

AQD - Reporting Metric *
type: ConceptScheme
notation: reportingmetric
is part of: Air Quality Directive e-Reporting
registration status: Public draft
user modified: colinmar
date modified: 2024-10-29 16:29:32.0
vocabulary type: Common
is numeric concept identifiers: false
is notations equal identifiers: false

Three consecutive hours in exceedance
type: Concept
notation: 3hAbove
definition: Three consecutive hours in exceedance (at locations representative of air quality over at least 100 km 2 or an entire zone or agglomeration, which ever is smaller) ONLY NO2 & SO2 - ALT
status: valid
status modified: 2013-03-22
accepted date: 2013-03-22
in scheme: AQD - Reporting Metric *

The percentile 90.4 for PM10
type: Concept
notation: 90.4th
definition: The percentile 90,4 for PM 10 in the particular case when random measurements are applied instead of continuous measurements
status: valid
status modified: 2013-03-22
accepted date: 2013-03-22
in scheme: AQD - Reporting Metric *

Average Exposure Indicator
type: Concept
notation: AEI
definition: The Average Exposure Indicator expressed in μg/m3 (AEI) shall be based upon measurements in urban background locations in zones and agglomerations throughout the territory of a Member State. It should be assessed as a three-calendar year running annual mean concentration averaged over all sampling points established pursuant to Section B of Annex V of Directive 2008/50/EC.
status: valid
status modified: 2013-03-22
accepted date: 2013-03-22
in scheme: AQD - Reporting Metric *

AOT40 vegetation protection
type: Concept
notation: AOT40c
definition: Accumulated Ozone Exposure 40 (expressed in (μg/m3) ∙ hours) means the sum of the difference between hourly concentrations greater than 80 μg/m3 and 80 μg/m3 between 1 May to 31 July using only the one-hour values measured between 8.00 and 20.00 Central European Time (CET) each day.
status: valid
status modified: 2013-03-22
accepted date: 2013-03-22
in scheme: AQD - Reporting Metric *

AOT40 vegetation protection averaged over 5 years
type: Concept
notation: AOT40c-5yr
definition: AOT40 vegetation protection (AOT40) averaged over 5 years. As per Directive 2008/50/EC, If the three or five year averages cannot be determined on the basis of a full and consecutive set of annual data, the minimum annual data required for checking compliance with the target values will be as follows for the target value for the protection of vegetation: valid data for three years.
status: valid
status modified: 2013-03-22
accepted date: 2013-03-22
in scheme: AQD - Reporting Metric *

AOT 40 forest protection
type: Concept
notation: AOT40f
definition: Accumulated Ozone Exposure 40 (expressed in (μg/m3) ∙ hours) means the sum of the difference between hourly concentrations greater than 80 μg/m3 and 80 μg/m3 between 1 April to 31 September using only the one-hour values measured between 8.00 and 20.00 Central European Time (CET) each day.
status: valid
status modified: 2013-03-22
accepted date: 2013-03-22
in scheme: AQD - Reporting Metric *

Not applicable
type: Concept
notation: NA
definition: NA is to be used when reporting an EnvironmentalObjective that does not have a reporting metric (e.g. When reporting Ozone precursos as Monitoring Objective)
status: valid
status modified: 2013-10-10
accepted date: 2013-10-10
in scheme: AQD - Reporting Metric *

Annual mean / average
type: Concept
notation: aMean
definition: Average between 1st January to 31st December (1/1/year X - 31/12/year X)
status: valid
status modified: 2013-03-22
accepted date: 2013-03-22
in scheme: AQD - Reporting Metric *
alternative label: Calendar year

Days in exceedance in a calendar year
type: Concept
notation: daysAbove
definition: Days in exceedance in a calendar year (i.e. For PM10 and SO2 number of days when daily mean has exceeded the Limit Value in 1 calendar year. For O3 & CO, days when maximum daily 8-h mean exceed the LTO & LV, respectively in 1 calendar year)
status: valid
status modified: 2013-03-22
accepted date: 2013-03-22
in scheme: AQD - Reporting Metric *

Days in exceedance averaged over 3 calendar years
type: Concept
notation: daysAbove-3yr
definition: Days in exceedance averaged over 3 years. Applicable to Ozone Health Target Value as "Days when maximum daily eight- hour mean exceeded the target value averaged over 3 years"
status: valid
status modified: 2013-03-22
accepted date: 2013-03-22
in scheme: AQD - Reporting Metric *

Hours in exceedance in a calendar year
type: Concept
notation: hrsAbove
definition: Number of hours in exceedance in a calendar year
status: valid
status modified: 2013-03-22
accepted date: 2013-03-22
in scheme: AQD - Reporting Metric *

Winter Mean
type: Concept
notation: wMean
definition: Average over winter. Average between 1st October year x-1 to 31st March year X.
status: valid
status modified: 2013-03-22
accepted date: 2013-03-22
in scheme: AQD - Reporting Metric *

Three consecutive days in exceedance
type: Concept
notation: 3dAbove
definition: Three consecutive days in exceedance (at locations representative of air quality over at least 100 km 2 or an entire zone, which ever is smaller) ONLY PM2.5 & PM10 - ALT
status: valid
status modified: 2024-10-29
accepted date: 2024-10-29
in scheme: AQD - Reporting Metric *

AQD - Specific encoding of results provided (inline/external)
type: ConceptScheme
notation: resultencoding
is part of: Air Quality Directive e-Reporting
registration status: Public draft
user modified: targajau
date modified: 2025-04-11 12:49:53.0
vocabulary type: Common
is numeric concept identifiers: false
is notations equal identifiers: false

External - results are provided outside the XML
type: Concept
notation: external
definition: External - results are provided outside the XML
status: valid
status modified: 2016-10-21
in scheme: AQD - Specific encoding of results provided (inline/external)

Inline - results are provided within the XML
type: Concept
notation: inline
definition: Inline - results are provided within the XML
status: valid
status modified: 2016-10-21
in scheme: AQD - Specific encoding of results provided (inline/external)

Zone
type: Concept
notation: zone
definition: Zone
status: valid
status modified: 2025-04-11
accepted date: 2025-04-11
in scheme: AQD - Specific encoding of results provided (inline/external)

AQD - Specific format of results provided
type: ConceptScheme
notation: resultformat
is part of: Air Quality Directive e-Reporting
registration status: Public draft
user modified: targajau
date modified: 2017-04-12 12:10:32.0
vocabulary type: Common
is numeric concept identifiers: false
is notations equal identifiers: false

ASCII grid
type: Concept
notation: ascii-grid
status: valid
status modified: 2016-10-21
in scheme: AQD - Specific format of results provided

ESRI shapefile
type: Concept
notation: esri-shp
status: valid
status modified: 2016-10-21
in scheme: AQD - Specific format of results provided

Geo Tiff
type: Concept
notation: geotiff
status: valid
status modified: 2016-10-21
in scheme: AQD - Specific format of results provided

Rectified grid
type: Concept
notation: rectifiedgrid
definition: Rectified grid
status: valid
status modified: 2016-10-21
in scheme: AQD - Specific format of results provided

SWE:array
type: Concept
notation: swe-array
status: valid
status modified: 2016-10-21
in scheme: AQD - Specific format of results provided

AQD - Sampling Equipment**
type: ConceptScheme
notation: samplingequipment
is part of: Air Quality Directive e-Reporting
registration status: Public draft
user modified: targajau
date modified: 2023-05-19 15:02:13.0
vocabulary type: Common
is numeric concept identifiers: false
is notations equal identifiers: false

AA GBC 932
type: Concept
notation: AA_GBC_932
status: valid
status modified: 2022-12-02
accepted date: 2022-12-02
in scheme: AQD - Sampling Equipment**

AGL instrument
type: Concept
notation: AGL
definition: The AGL is an instrument from the UK for measuring BlackSmoke and acidity. The AGL instrument is used in conjunction with the EEL (Diffusion Systems) Model 43 smoke stain reflectometer. The zero is set with the reflectometer switched off. The instrument is checked for correct functioning using a calibrating tile. The measuring head Is set on the white standard tile and the control adjusted to read 100. The head is then moved to the grey half of the tile which has a calibration marked on it. The instrument should agree with this calibration to ±1.5 divisions. The white tile is now covered by a clean Whatman No. 1 filter paper smooth side uppermost. The instrument Is re-set to 100. Stained papers are assessed on the white tile. The instrument does not use a coloured filter.
status: valid
status modified: 2022-12-02
accepted date: 2022-12-02
in scheme: AQD - Sampling Equipment**

AT101X instrument
type: Concept
notation: AT101X
definition: Instrument for pumping 2m3 air per day through absorbing solution ( in glass container).
status: valid
status modified: 2022-12-02
accepted date: 2022-12-02
in scheme: AQD - Sampling Equipment**

Bulk deposition sampler
type: Concept
notation: BDS
status: valid
status modified: 2022-12-02
accepted date: 2022-12-02
in scheme: AQD - Sampling Equipment**

Bergerhoff sampler
type: Concept
notation: Bergerhoff
definition: Bergerhoff (bulk sampler for deposition of heavy metals and PAHs)
status: valid
status modified: 2022-12-02
accepted date: 2022-12-02
in scheme: AQD - Sampling Equipment**

Digitel DH-77
type: Concept
notation: DigitelDH-77
definition: The Digitel High Volume Sampler DH-77 is a system to sample dust and aerosol particles for later assessment and analysis. The sampler operation range in standard execution is 100 to 1000 litres per minute (6 to 60 cubic metres per hour). The system's usual designation is 'High Volume Sampler'. Air-borne-dust parts in the sampled air are separated onto 150 mm diameter filters
status: valid
status modified: 2022-12-02
accepted date: 2022-12-02
in scheme: AQD - Sampling Equipment**

ETL SX 200
type: Concept
notation: ETL-SX200
status: valid
status modified: 2022-12-02
accepted date: 2022-12-02
in scheme: AQD - Sampling Equipment**

Funnel-bottle bulk collector
type: Concept
notation: FBBC
definition: FBBC
status: valid
status modified: 2022-12-02
accepted date: 2022-12-02
in scheme: AQD - Sampling Equipment**

INTERSCIENCE Finnigan trace GC ultre + trace DSQ
type: Concept
notation: GC-ultre+traceDSQ
status: valid
status modified: 2022-12-02
accepted date: 2022-12-02
in scheme: AQD - Sampling Equipment**

GMW Graseby
type: Concept
notation: GMW-Graseby
status: valid
status modified: 2022-12-02
accepted date: 2022-12-02
in scheme: AQD - Sampling Equipment**

GMW High Volume Air Sampler
type: Concept
notation: GMW-HV-AirSampler
status: valid
status modified: 2022-12-02
accepted date: 2022-12-02
in scheme: AQD - Sampling Equipment**

GMW L-2000
type: Concept
notation: GMW-L-2000
status: valid
status modified: 2022-12-02
accepted date: 2022-12-02
in scheme: AQD - Sampling Equipment**

GPS-1 PUF Sampler
type: Concept
notation: GPS-1PUF-Sampler
status: valid
status modified: 2022-12-02
accepted date: 2022-12-02
in scheme: AQD - Sampling Equipment**

IHE Instrument
type: Concept
notation: IHE Instrument
definition: The IHE instrument is an instrument from Belgium to measure BlackSmoke and acidity. The IHE instrument is used with the Diffusion Systems Reflectometer Mark III Model 11. The instrument is zeroed using a standard black tile and the span (100) by setting the measuring head on the smooth side of a Whatman No. 1 filter paper set on a standard white tile - supplied with the black standard. The smoke stained filter is evaluated on the standard white tile. The reflectometer uses a green filter.
status: valid
status modified: 2022-12-02
accepted date: 2022-12-02
in scheme: AQD - Sampling Equipment**

IND MVS 6.1
type: Concept
notation: IND_MVS6.1
definition: Medium volumen sampler for PM10 and PM2.5
status: valid
status modified: 2022-12-02
accepted date: 2022-12-02
in scheme: AQD - Sampling Equipment**

IVL PModell S 10
type: Concept
notation: IVL-PModellS10
status: valid
status modified: 2022-12-02
accepted date: 2022-12-02
in scheme: AQD - Sampling Equipment**

IVL PModell S 2.5
type: Concept
notation: IVL-PModellS2-5
status: valid
status modified: 2022-12-02
accepted date: 2022-12-02
in scheme: AQD - Sampling Equipment**

IVL Hg bulk
type: Concept
notation: IVLHgbulk
definition: IVL Hg bulk
status: valid
status modified: 2022-12-02
accepted date: 2022-12-02
in scheme: AQD - Sampling Equipment**

IVL Met bulk
type: Concept
notation: IVLMetbulk
definition: IVL Met bulk
status: valid
status modified: 2022-12-02
accepted date: 2022-12-02
in scheme: AQD - Sampling Equipment**

IVL bulk
type: Concept
notation: IVLbulk
definition: IVL bulk
status: valid
status modified: 2022-12-02
accepted date: 2022-12-02
in scheme: AQD - Sampling Equipment**

IVL Bulk sampler model WoF
type: Concept
notation: IVLbulkWoF
definition: IVL Bulk sampler model WoF
status: valid
status modified: 2022-12-02
accepted date: 2022-12-02
in scheme: AQD - Sampling Equipment**

IVL Manual Au-Trap
type: Concept
notation: IVLmanAUtrap
definition: IVL Manual Au-Trap
status: valid
status modified: 2022-12-02
accepted date: 2022-12-02
in scheme: AQD - Sampling Equipment**

LEC02
type: Concept
notation: LEC02
status: valid
status modified: 2022-12-02
accepted date: 2022-12-02
in scheme: AQD - Sampling Equipment**

L.I.B. FILTER
type: Concept
notation: LIB-filter
status: valid
status modified: 2022-12-02
accepted date: 2022-12-02
in scheme: AQD - Sampling Equipment**

LTK 020
type: Concept
notation: LTK020
status: valid
status modified: 2022-12-02
accepted date: 2022-12-02
in scheme: AQD - Sampling Equipment**

Lipinski's aspirator
type: Concept
notation: Lipinski-aspirator
status: valid
status modified: 2022-12-02
accepted date: 2022-12-02
in scheme: AQD - Sampling Equipment**

Lipinski's aspirator AGT24
type: Concept
notation: LipinskiAGT24
status: valid
status modified: 2022-12-02
accepted date: 2022-12-02
in scheme: AQD - Sampling Equipment**

M-type sampler
type: Concept
notation: M-type-sampler
status: valid
status modified: 2022-12-02
accepted date: 2022-12-02
in scheme: AQD - Sampling Equipment**

MCV HVS
type: Concept
notation: MCV-HVS
status: valid
status modified: 2022-12-02
accepted date: 2022-12-02
in scheme: AQD - Sampling Equipment**

MCV TVM - 100
type: Concept
notation: MCV-TVM100
status: valid
status modified: 2022-12-02
accepted date: 2022-12-02
in scheme: AQD - Sampling Equipment**

MCV CAV - A
type: Concept
notation: MCV-cavA
status: valid
status modified: 2022-12-02
accepted date: 2022-12-02
in scheme: AQD - Sampling Equipment**

MCV COLLECTOR CPV80A
type: Concept
notation: MCV-collCPV80A
status: valid
status modified: 2022-12-02
accepted date: 2022-12-02
in scheme: AQD - Sampling Equipment**

MCV CBV-30 DSm
type: Concept
notation: MCV_CBV-30DSm
definition: Low volume sampler for gravimetric determination of the mass concentration PM10 or PM2.5 of particulate matter in suspension, with sample collection on filter and determination in laboratory. With a capacity of up to 30 filters
status: valid
status modified: 2022-12-02
accepted date: 2022-12-02
in scheme: AQD - Sampling Equipment**

MCV CPV-COV
type: Concept
notation: MCV_CPV-COV
definition: System for the collection of samples in absorption tubes for subsequent analysis in the laboratory. The instrument is intended for the collection of volatile organic compounds present in the atmosphere. The collection is carried out in tubes with chemical sorbents, with daily sampling, which allow its collection. The equipment has a sequential module to be able to carry out continuous campaigns of several days
status: valid
status modified: 2022-12-02
accepted date: 2022-12-02
in scheme: AQD - Sampling Equipment**

MCZ-HVS-16
type: Concept
notation: MCZ-HVS-16
definition: High Volume Sampler HVS16. Microcomputer controlled gas collector for the automated dust sampling on membrane filters with a diameter of 140 mm or 150 mm in acc. with EN 12341. Automatic switching to sequentially admit up to 16 filters
status: valid
status modified: 2022-12-02
accepted date: 2022-12-02
in scheme: AQD - Sampling Equipment**

Umwelttechnik MCZ GmbH Micro PNS LVS 16
type: Concept
notation: MCZ-M-PNS-LVS16
status: valid
status modified: 2022-12-02
accepted date: 2022-12-02
in scheme: AQD - Sampling Equipment**

MCZ, PNS-LVS 16 SEQ
type: Concept
notation: MCZ-PNS-LVS16-seq
status: valid
status modified: 2022-12-02
accepted date: 2022-12-02
in scheme: AQD - Sampling Equipment**

Umwelttechnik MCZ GmbH PNS3D15
type: Concept
notation: MCZ-PNS3D15
status: valid
status modified: 2022-12-02
accepted date: 2022-12-02
in scheme: AQD - Sampling Equipment**

MCZ_PNS HVS16 (PM2.5)
type: Concept
notation: MCZ_PNS-HVS16
definition: Collection on 16 filters for the subsequent laboratory analysis in samples.
status: valid
status modified: 2022-12-02
accepted date: 2022-12-02
in scheme: AQD - Sampling Equipment**

MCZ_uPNS (PM10)
type: Concept
notation: MCZ_uPNS
definition: Control system for the automated collection of gases and particles on adsorption tubes, wash-bottles, or filters. The control program has a modular structure and, with an optional sampling switching, can log up to 8 sequential samples (optionally up to 16)
status: valid
status modified: 2022-12-02
accepted date: 2022-12-02
in scheme: AQD - Sampling Equipment**

MVS
type: Concept
notation: MVS
status: valid
status modified: 2022-12-02
accepted date: 2022-12-02
in scheme: AQD - Sampling Equipment**

MicroPNS LVS1
type: Concept
notation: MicroPNS-LVS1
status: valid
status modified: 2022-12-02
accepted date: 2022-12-02
in scheme: AQD - Sampling Equipment**

NET ACIDITY COLLECTOR
type: Concept
notation: NET-acid-coll
status: valid
status modified: 2022-12-02
accepted date: 2022-12-02
in scheme: AQD - Sampling Equipment**

NILU Filter Pack
type: Concept
notation: NILU-FilterPack
status: valid
status modified: 2022-12-02
accepted date: 2022-12-02
in scheme: AQD - Sampling Equipment**

EIGENBRODT (NSA 181 KHT) - WET ONLY SAMPLER
type: Concept
notation: NSA181-KHT
status: valid
status modified: 2022-12-02
accepted date: 2022-12-02
in scheme: AQD - Sampling Equipment**

Eigenbrodt NSA181_KS
type: Concept
notation: NSA181-KS
status: valid
status modified: 2022-12-02
accepted date: 2022-12-02
in scheme: AQD - Sampling Equipment**

Open deposition surface
type: Concept
notation: ODS
definition: Open deposition surface
status: valid
status modified: 2022-12-02
accepted date: 2022-12-02
in scheme: AQD - Sampling Equipment**

OECD
type: Concept
notation: OECD
status: valid
status modified: 2022-12-02
accepted date: 2022-12-02
in scheme: AQD - Sampling Equipment**

OECD BS1747
type: Concept
notation: OECD-BS1747
status: valid
status modified: 2022-12-02
accepted date: 2022-12-02
in scheme: AQD - Sampling Equipment**

OECD BS1747-2
type: Concept
notation: OECD-BS1747-2
status: valid
status modified: 2022-12-02
accepted date: 2022-12-02
in scheme: AQD - Sampling Equipment**

OECD NF-X-43005
type: Concept
notation: OECD-NFX-43005
status: valid
status modified: 2022-12-02
accepted date: 2022-12-02
in scheme: AQD - Sampling Equipment**

ENVIRONNEMENT AUTOMATIC SEQUENTIAL PARTICULATE SAMPLER
type: Concept
notation: PM162M
definition: PM162M is a sequential automatic sampling device for particulate matter in the ambient air. The particles are sampled at constant flow rate (1 m3/h or 2.3 m3/h) and collected on filters for gravimetric weighing and possible physicochemical laboratory analysis
status: valid
status modified: 2022-12-02
accepted date: 2022-12-02
in scheme: AQD - Sampling Equipment**

PNS 3D 15
type: Concept
notation: PNS-3D15
status: valid
status modified: 2022-12-02
accepted date: 2022-12-02
in scheme: AQD - Sampling Equipment**

PTFE TUBE - GF FILTER
type: Concept
notation: PTFE-tube-GF-filter
status: valid
status modified: 2022-12-02
accepted date: 2022-12-02
in scheme: AQD - Sampling Equipment**

Polyurethane foam (PUF) -sampler
type: Concept
notation: PUF-sampler
status: valid
status modified: 2022-12-02
accepted date: 2022-12-02
in scheme: AQD - Sampling Equipment**

Quartz filter + 3 PUF (POPs luft)
type: Concept
notation: QuartzFilter3PUF
definition: Quartz filter + 3 PUF (POPs luft)
status: valid
status modified: 2022-12-02
accepted date: 2022-12-02
in scheme: AQD - Sampling Equipment**

Sigma-Aldrich RAD130
type: Concept
notation: RAD130
definition: Sigma-Aldrich RAD130
status: valid
status modified: 2022-12-02
accepted date: 2022-12-02
in scheme: AQD - Sampling Equipment**

SEQUENTIAL SAMPLER
type: Concept
notation: SAS
status: valid
status modified: 2022-12-02
accepted date: 2022-12-02
in scheme: AQD - Sampling Equipment**

SEQUENTIAL SAMPLER SEQ47/50
type: Concept
notation: SAS-47-50
status: valid
status modified: 2022-12-02
accepted date: 2022-12-02
in scheme: AQD - Sampling Equipment**

Sequential Air Sampler, Type EK, Aerosol filter as for sulphate + oxalic acid im
type: Concept
notation: SAS-EK-Aer-filter
status: valid
status modified: 2022-12-02
accepted date: 2022-12-02
in scheme: AQD - Sampling Equipment**

Sequential Air Sampler, Type EK. KOH-impregnated Whatman 40 filter
type: Concept
notation: SAS-EK-KOH-Whatman
status: valid
status modified: 2022-12-02
accepted date: 2022-12-02
in scheme: AQD - Sampling Equipment**

SEQUENTIAL SAMPLER LVS3
type: Concept
notation: SAS-LVS3
status: valid
status modified: 2022-12-02
accepted date: 2022-12-02
in scheme: AQD - Sampling Equipment**

Sequential Air Sampler, Type SS2000. NaI-impregnated glass sinters
type: Concept
notation: SAS-SS2000
status: valid
status modified: 2022-12-02
accepted date: 2022-12-02
in scheme: AQD - Sampling Equipment**

Savillex openface
type: Concept
notation: Savillex
definition: Savillex openface
status: valid
status modified: 2022-12-02
accepted date: 2022-12-02
in scheme: AQD - Sampling Equipment**

TEOM
type: Concept
notation: TEOM
status: valid
status modified: 2022-12-02
accepted date: 2022-12-02
in scheme: AQD - Sampling Equipment**

TEOM ACCU SAMPLER
type: Concept
notation: TEOMaccusampler
status: valid
status modified: 2022-12-02
accepted date: 2022-12-02
in scheme: AQD - Sampling Equipment**

Wet Only Collector
type: Concept
notation: WOcollector
status: valid
status modified: 2022-12-02
accepted date: 2022-12-02
in scheme: AQD - Sampling Equipment**

WET ONLY SAMPLER
type: Concept
notation: WOsampler
status: valid
status modified: 2022-12-02
accepted date: 2022-12-02
in scheme: AQD - Sampling Equipment**

wet only - SM200
type: Concept
notation: WOsamplerSM200
status: valid
status modified: 2022-12-02
accepted date: 2022-12-02
in scheme: AQD - Sampling Equipment**

XRF MVS
type: Concept
notation: XRF-MVS
status: valid
status modified: 2022-12-02
accepted date: 2022-12-02
in scheme: AQD - Sampling Equipment**

SM200 (ADAM)
type: Concept
notation: adamSM200
status: valid
status modified: 2022-12-02
accepted date: 2022-12-02
in scheme: AQD - Sampling Equipment**

Adsorption tubes
type: Concept
notation: adsorptiontubes
definition: Adsorption tubes
status: valid
status modified: 2022-12-02
accepted date: 2022-12-02
in scheme: AQD - Sampling Equipment**

Agilent 6890N
type: Concept
notation: agilent6890N
status: valid
status modified: 2022-12-02
accepted date: 2022-12-02
in scheme: AQD - Sampling Equipment**

Agilent 7980A
type: Concept
notation: agilent7980A
status: valid
status modified: 2022-12-02
accepted date: 2022-12-02
in scheme: AQD - Sampling Equipment**

ALPHA sampler
type: Concept
notation: alpha
status: valid
status modified: 2022-12-02
accepted date: 2022-12-02
in scheme: AQD - Sampling Equipment**

ANDERSON HVS
type: Concept
notation: andersonHVS
status: valid
status modified: 2022-12-02
accepted date: 2022-12-02
in scheme: AQD - Sampling Equipment**

ANDERSON A-2000 HVS
type: Concept
notation: andersonHVS-A-2000
status: valid
status modified: 2022-12-02
accepted date: 2022-12-02
in scheme: AQD - Sampling Equipment**

Atmoservice LVS 3D
type: Concept
notation: atmoserviceLVS_3D
status: valid
status modified: 2022-12-02
accepted date: 2022-12-02
in scheme: AQD - Sampling Equipment**

ATMOSERVICE PNS3D15
type: Concept
notation: atmoservicePNS3D15
status: valid
status modified: 2022-12-02
accepted date: 2022-12-02
in scheme: AQD - Sampling Equipment**

ATMOSERVICE PP - 8K
type: Concept
notation: atmoservicePP-8K
status: valid
status modified: 2022-12-02
accepted date: 2022-12-02
in scheme: AQD - Sampling Equipment**

Badge diffusive sampler
type: Concept
notation: badge
status: valid
status modified: 2022-12-02
accepted date: 2022-12-02
in scheme: AQD - Sampling Equipment**

BIOLAFFITE COLLECTOR
type: Concept
notation: biolaffite_collector
status: valid
status modified: 2022-12-02
accepted date: 2022-12-02
in scheme: AQD - Sampling Equipment**

Carbopack B
type: Concept
notation: carbopackB
status: valid
status modified: 2022-12-02
accepted date: 2022-12-02
in scheme: AQD - Sampling Equipment**

CARBOTAP TUBE 300
type: Concept
notation: carbotapTUBE300
status: valid
status modified: 2022-12-02
accepted date: 2022-12-02
in scheme: AQD - Sampling Equipment**

Chromosorb 106
type: Concept
notation: chromosorb106
status: valid
status modified: 2022-12-02
accepted date: 2022-12-02
in scheme: AQD - Sampling Equipment**

Chrompack CP9000
type: Concept
notation: chrompackCP9000
status: valid
status modified: 2022-12-02
accepted date: 2022-12-02
in scheme: AQD - Sampling Equipment**

Chrompack VOC-AIR
type: Concept
notation: chrompackVOC-AIR
status: valid
status modified: 2022-12-02
accepted date: 2022-12-02
in scheme: AQD - Sampling Equipment**

DANISH LMP FILTERPACK ELEMENT COLLECTOR
type: Concept
notation: danishLMP-FP-ELEM
status: valid
status modified: 2022-12-02
accepted date: 2022-12-02
in scheme: AQD - Sampling Equipment**

DANISH LMP FILTERPACK POLL. COLLECTOR
type: Concept
notation: danishLMP-FP-POLL
status: valid
status modified: 2022-12-02
accepted date: 2022-12-02
in scheme: AQD - Sampling Equipment**

DANISH LMP FILTERPACK SPM COLLECTOR
type: Concept
notation: danishLMP-FP-SPM
status: valid
status modified: 2022-12-02
accepted date: 2022-12-02
in scheme: AQD - Sampling Equipment**

DERENDA
type: Concept
notation: derenda
status: valid
status modified: 2022-12-02
accepted date: 2022-12-02
in scheme: AQD - Sampling Equipment**

Derenda LVS 3.1
type: Concept
notation: derendaLVS-3-1
status: valid
status modified: 2022-12-02
accepted date: 2022-12-02
in scheme: AQD - Sampling Equipment**

Derenda LVS 3.2
type: Concept
notation: derendaLVS-3-2
status: valid
status modified: 2022-12-02
accepted date: 2022-12-02
in scheme: AQD - Sampling Equipment**

DIFFUSION TUBE
type: Concept
notation: diffusion-tube
status: valid
status modified: 2022-12-02
accepted date: 2022-12-02
in scheme: AQD - Sampling Equipment**

Diffusion Systems Ltd: Smoke Stain Reflectometer mod. 43
type: Concept
notation: diffusionSSR-M4-3
status: valid
status modified: 2022-12-02
accepted date: 2022-12-02
in scheme: AQD - Sampling Equipment**

Diffusive TenaxTA
type: Concept
notation: diffusive-tenaxTA
status: valid
status modified: 2022-12-02
accepted date: 2022-12-02
in scheme: AQD - Sampling Equipment**

Digitel Active Sampler
type: Concept
notation: digitelAS
status: valid
status modified: 2022-12-02
accepted date: 2022-12-02
in scheme: AQD - Sampling Equipment**

Digitel DA80
type: Concept
notation: digitelDA-80
status: valid
status modified: 2022-12-02
accepted date: 2022-12-02
in scheme: AQD - Sampling Equipment**

DUPLICATE - DIGITEL Enviro-Sense DHA-80
type: Concept
notation: to be removed
definition: This will be remove shortly from CODELIST
status: valid
status modified: 2022-12-02
accepted date: 2022-12-02
in scheme: AQD - Sampling Equipment**

DIGITEL Enviro-Sense DHA-80 sampler
type: Concept
notation: Digitel DHA-80
status: valid
status modified: 2022-12-02
accepted date: 2022-12-02
in scheme: AQD - Sampling Equipment**

Digitel LVS - Aerosol Sampler DPA14
type: Concept
notation: digitelDPA14
definition: Digitel LVS - Aerosol Sampler DPA14
status: valid
status modified: 2022-12-02
accepted date: 2022-12-02
in scheme: AQD - Sampling Equipment**

Digitel - DPA96MV
type: Concept
notation: digitelDPA96MV
definition: Digitel DPA96MV (active sampling for VOC)
status: valid
status modified: 2022-12-02
accepted date: 2022-12-02
in scheme: AQD - Sampling Equipment**

DIGITEL HVS
type: Concept
notation: digitelHVS
status: valid
status modified: 2022-12-02
accepted date: 2022-12-02
in scheme: AQD - Sampling Equipment**

DIGITEL HVS 150mm QURTZ FILTERS
type: Concept
notation: digitelHVS-150Q
status: valid
status modified: 2022-12-02
accepted date: 2022-12-02
in scheme: AQD - Sampling Equipment**

150mm GRAVIMETRY DIGITEL HVS PM10
type: Concept
notation: digitelHVS_PM10_150G
status: valid
status modified: 2022-12-02
accepted date: 2022-12-02
in scheme: AQD - Sampling Equipment**

Dionex
type: Concept
notation: dionex
status: valid
status modified: 2022-12-02
accepted date: 2022-12-02
in scheme: AQD - Sampling Equipment**

DIONEX 2010I
type: Concept
notation: dionex2010I
status: valid
status modified: 2022-12-02
accepted date: 2022-12-02
in scheme: AQD - Sampling Equipment**

Dionex 3000
type: Concept
notation: dionex3000
status: valid
status modified: 2022-12-02
accepted date: 2022-12-02
in scheme: AQD - Sampling Equipment**

Draeger Niosh (active sampling)
type: Concept
notation: draeger-niosh-AS
status: valid
status modified: 2022-12-02
accepted date: 2022-12-02
in scheme: AQD - Sampling Equipment**

TOTAL ANS FILTER PACK ECE-EMEP
type: Concept
notation: ece-emepTA-FP
status: valid
status modified: 2022-12-02
accepted date: 2022-12-02
in scheme: AQD - Sampling Equipment**

Eigenbrodt NSA181KHT
type: Concept
notation: eigenbrodtNSA181KHT
status: valid
status modified: 2022-12-02
accepted date: 2022-12-02
in scheme: AQD - Sampling Equipment**

Eigenbrodt_UNS-130E
type: Concept
notation: eigenbrodtUNS130E
status: valid
status modified: 2022-12-02
accepted date: 2022-12-02
in scheme: AQD - Sampling Equipment**

ENVIRONNEMENT AC 30M
type: Concept
notation: envAC30M
status: valid
status modified: 2022-12-02
accepted date: 2022-12-02
in scheme: AQD - Sampling Equipment**

Environnement S.A. MP101M
type: Concept
notation: envSA-MP101M
status: valid
status modified: 2022-12-02
accepted date: 2022-12-02
in scheme: AQD - Sampling Equipment**

ENVIRONMENT SA COLLECTOR FI15
type: Concept
notation: envSA-coll-FI15
status: valid
status modified: 2022-12-02
accepted date: 2022-12-02
in scheme: AQD - Sampling Equipment**

ENVIRONMENT SA FILTROMAT COLLECTOR
type: Concept
notation: envSA-filtromatcoll
status: valid
status modified: 2022-12-02
accepted date: 2022-12-02
in scheme: AQD - Sampling Equipment**

Environnement SF8
type: Concept
notation: Environnement SF8
definition: The Environnement SF8 is an instrument from France to measure Black Smoke & Acidity The Environnement SF8 instrument is used with a Photovolt Model 670 reflectometer, to measure the degree of staining on Schneider CA 32 filter paper. The reflectometer is zeroed by setting the measuring head on a standard black tile and to 100 when set on a pile of clean Schneider filter papers. A standard white tile of similar reflectance to the filter papers is used to check the calibration which should not differ from clean filter paper by more than ±2 divisions. Each stain is measured with the stained paper set on a pile of clean filter papers. The reflectometer uses a green optical filter.
status: valid
status modified: 2022-12-02
accepted date: 2022-12-02
in scheme: AQD - Sampling Equipment**

FILTER SAMPLING
type: Concept
notation: filter-sampling
status: valid
status modified: 2022-12-02
accepted date: 2022-12-02
in scheme: AQD - Sampling Equipment**

filter_2pack
type: Concept
notation: filter2pack
status: valid
status modified: 2022-12-02
accepted date: 2022-12-02
in scheme: AQD - Sampling Equipment**

filter_3pack
type: Concept
notation: filter3pack
status: valid
status modified: 2022-12-02
accepted date: 2022-12-02
in scheme: AQD - Sampling Equipment**

FILTER SIERRA ANDERSEN
type: Concept
notation: filterSierraAnderson
status: valid
status modified: 2022-12-02
accepted date: 2022-12-02
in scheme: AQD - Sampling Equipment**

Finigan-element2
type: Concept
notation: finigan-element2
status: valid
status modified: 2022-12-02
accepted date: 2022-12-02
in scheme: AQD - Sampling Equipment**

glass filter
type: Concept
notation: glass-filter
status: valid
status modified: 2022-12-02
accepted date: 2022-12-02
in scheme: AQD - Sampling Equipment**

glass_sinter
type: Concept
notation: glass-sinter
status: valid
status modified: 2022-12-02
accepted date: 2022-12-02
in scheme: AQD - Sampling Equipment**

Glass tubes
type: Concept
notation: glass-tubes
status: valid
status modified: 2022-12-02
accepted date: 2022-12-02
in scheme: AQD - Sampling Equipment**

Gradko 3.5cm membrane diffusion tubes
type: Concept
notation: Gradko 3.5cm with Membrane
definition: Modified diffusion tube by Gradko to measure NH3
status: valid
status modified: 2022-12-02
accepted date: 2022-12-02
in scheme: AQD - Sampling Equipment**

IMPINGER HYDROGEN PEROXIDE TCM
type: Concept
notation: impinger-hyd-per-tcm
status: valid
status modified: 2022-12-02
accepted date: 2022-12-02
in scheme: AQD - Sampling Equipment**

IMPINGER TRIETHYLONAMINE
type: Concept
notation: impinger-triethylon
status: valid
status modified: 2022-12-02
accepted date: 2022-12-02
in scheme: AQD - Sampling Equipment**

IMPREGNATED FILTER
type: Concept
notation: impregnated-filter
status: valid
status modified: 2022-12-02
accepted date: 2022-12-02
in scheme: AQD - Sampling Equipment**

Inverfeldt bulk sampler
type: Concept
notation: Inverfeldt
definition: inverfeldt
status: valid
status modified: 2022-12-02
accepted date: 2022-12-02
in scheme: AQD - Sampling Equipment**

KIMOTO 120
type: Concept
notation: kimoto120
status: valid
status modified: 2022-12-02
accepted date: 2022-12-02
in scheme: AQD - Sampling Equipment**

Kleinfilter
type: Concept
notation: kleinfilter
status: valid
status modified: 2022-12-02
accepted date: 2022-12-02
in scheme: AQD - Sampling Equipment**

LOW VOLUME SAMPLER LECKEL
type: Concept
notation: leckelLVS
status: valid
status modified: 2022-12-02
accepted date: 2022-12-02
in scheme: AQD - Sampling Equipment**

LECKEL - LVS 3
type: Concept
notation: leckelLVS3
status: valid
status modified: 2022-12-02
accepted date: 2022-12-02
in scheme: AQD - Sampling Equipment**

Sven Leckel MVS6
type: Concept
notation: leckelMVS6
status: valid
status modified: 2022-12-02
accepted date: 2022-12-02
in scheme: AQD - Sampling Equipment**

Leckel Sequential LVS
type: Concept
notation: leckelSEQ-LVS
status: valid
status modified: 2022-12-02
accepted date: 2022-12-02
in scheme: AQD - Sampling Equipment**

Sven Leckel,SEQ 47/50
type: Concept
notation: leckelSEQ47-50
status: valid
status modified: 2022-12-02
accepted date: 2022-12-02
in scheme: AQD - Sampling Equipment**

Leckel SEQ47/50 with cooler
type: Concept
notation: leckelSEQ47-50wc
definition: leckelSEQ47-50wc
status: valid
status modified: 2022-12-02
accepted date: 2022-12-02
in scheme: AQD - Sampling Equipment**

LEVY 120
type: Concept
notation: levy120
status: valid
status modified: 2022-12-02
accepted date: 2022-12-02
in scheme: AQD - Sampling Equipment**

MACLEOD COLLECTOR SF1
type: Concept
notation: macleod-collSF1
status: valid
status modified: 2022-12-02
accepted date: 2022-12-02
in scheme: AQD - Sampling Equipment**

MILTON ROY, Model 1255
type: Concept
notation: milton-royM1255
status: valid
status modified: 2022-12-02
accepted date: 2022-12-02
in scheme: AQD - Sampling Equipment**

Ogawa badge
type: Concept
notation: Ogawa badge
definition: The Ogawa sampler is a badge-type sampler that can be equipped with a sampling filter on either side of the sampler body. Sampling filters consist of cellulose fibre.
status: valid
status modified: 2022-12-02
accepted date: 2022-12-02
in scheme: AQD - Sampling Equipment**

OPSIS SM200
type: Concept
notation: opsisSM200
status: valid
status modified: 2022-12-02
accepted date: 2022-12-02
in scheme: AQD - Sampling Equipment**

ORBO 32 S
type: Concept
notation: orbo32S
status: valid
status modified: 2022-12-02
accepted date: 2022-12-02
in scheme: AQD - Sampling Equipment**

ORION
type: Concept
notation: orion
status: valid
status modified: 2022-12-02
accepted date: 2022-12-02
in scheme: AQD - Sampling Equipment**

ORSA Passive Sampler
type: Concept
notation: orsaPS
status: valid
status modified: 2022-12-02
accepted date: 2022-12-02
in scheme: AQD - Sampling Equipment**

Equipment not defined in codelist
type: Concept
notation: other
status: valid
status modified: 2022-12-02
accepted date: 2022-12-02
in scheme: AQD - Sampling Equipment**

Palmes diffusion tubes
type: Concept
notation: palmes
status: valid
status modified: 2022-12-02
accepted date: 2022-12-02
in scheme: AQD - Sampling Equipment**

Partisol (undetermined)
type: Concept
notation: Partisol
status: valid
status modified: 2022-12-02
accepted date: 2022-12-02
in scheme: AQD - Sampling Equipment**

Partisol 2000
type: Concept
notation: partisol2000
definition: To include both PM10, PM2.5 or other PM fraction...
status: valid
status modified: 2022-12-02
accepted date: 2022-12-02
in scheme: AQD - Sampling Equipment**

Partisol 2025
type: Concept
notation: partisol2025
definition: To include both PM10, PM2.5 or other PM fraction...
status: valid
status modified: 2022-12-02
accepted date: 2022-12-02
in scheme: AQD - Sampling Equipment**

Partisol 2300
type: Concept
notation: partisol2300
status: valid
status modified: 2022-12-02
accepted date: 2022-12-02
in scheme: AQD - Sampling Equipment**

Passive Sampler PASSAM
type: Concept
notation: passamPS
status: valid
status modified: 2022-12-02
accepted date: 2022-12-02
in scheme: AQD - Sampling Equipment**

passive sampling
type: Concept
notation: passive-sampling
status: valid
status modified: 2022-12-02
accepted date: 2022-12-02
in scheme: AQD - Sampling Equipment**

Perkin Elmer
type: Concept
notation: Perkin Elmer
status: valid
status modified: 2022-12-02
accepted date: 2022-12-02
in scheme: AQD - Sampling Equipment**

Parkin Elmer AANALYST 800
type: Concept
notation: perkinelmerAA800
status: valid
status modified: 2022-12-02
accepted date: 2022-12-02
in scheme: AQD - Sampling Equipment**

Perkin Elmer AAS4100ZL
type: Concept
notation: perkinelmerAAS4100ZL
status: valid
status modified: 2022-12-02
accepted date: 2022-12-02
in scheme: AQD - Sampling Equipment**

Passive sampler (Carbopack E),Perkin-Elmer ATD 400,HP GC 5890,HP MS 5792
type: Concept
notation: perkinelmerATD400
status: valid
status modified: 2022-12-02
accepted date: 2022-12-02
in scheme: AQD - Sampling Equipment**

PERKIN ELMER Turbomatrix Desorber, PERKIN ELMER Clarus 500
type: Concept
notation: perkinelmerC500
status: valid
status modified: 2022-12-02
accepted date: 2022-12-02
in scheme: AQD - Sampling Equipment**

Perkin-Elmer ELAN 6000
type: Concept
notation: perkinelmerElan6000
status: valid
status modified: 2022-12-02
accepted date: 2022-12-02
in scheme: AQD - Sampling Equipment**

Perkin Elmer Elan DRC II
type: Concept
notation: perkinelmerElanDRCII
status: valid
status modified: 2022-12-02
accepted date: 2022-12-02
in scheme: AQD - Sampling Equipment**

Pumped tube
type: Concept
notation: pumped Tube
status: valid
status modified: 2022-12-02
accepted date: 2022-12-02
in scheme: AQD - Sampling Equipment**

Radial sampler
type: Concept
notation: radial
definition: Radial passive sampler like Radiello
status: valid
status modified: 2022-12-02
accepted date: 2022-12-02
in scheme: AQD - Sampling Equipment**

SAPHYMO MPSI-50
type: Concept
notation: saphymoMPSI50
status: valid
status modified: 2022-12-02
accepted date: 2022-12-02
in scheme: AQD - Sampling Equipment**

Semi-automatic combined filter and impinger
type: Concept
notation: semiAutoCFI
definition: Semi-automatic (combined filter and impinger) device for daily sampling of NO2, SO2, and soot in ambient air
status: valid
status modified: 2022-12-02
accepted date: 2022-12-02
in scheme: AQD - Sampling Equipment**

Sentinel
type: Concept
notation: sentinel
status: valid
status modified: 2022-12-02
accepted date: 2022-12-02
in scheme: AQD - Sampling Equipment**

Sharp
type: Concept
notation: sharp
status: valid
status modified: 2022-12-02
accepted date: 2022-12-02
in scheme: AQD - Sampling Equipment**

SHIMADZU GC-14A
type: Concept
notation: shimadzuGC14A
status: valid
status modified: 2022-12-02
accepted date: 2022-12-02
in scheme: AQD - Sampling Equipment**

SPEKTRAA 220SS Varian
type: Concept
notation: spektraa220SS-V
status: valid
status modified: 2022-12-02
accepted date: 2022-12-02
in scheme: AQD - Sampling Equipment**

Staplex
type: Concept
notation: staplex
status: valid
status modified: 2022-12-02
accepted date: 2022-12-02
in scheme: AQD - Sampling Equipment**

Sunset Laboratory
type: Concept
notation: sunset
status: valid
status modified: 2022-12-02
accepted date: 2022-12-02
in scheme: AQD - Sampling Equipment**

Sunset Laboratory Inc Thermal / Optical Carbon Analyser
type: Concept
notation: sunsetTO-CA
status: valid
status modified: 2022-12-02
accepted date: 2022-12-02
in scheme: AQD - Sampling Equipment**

Tecora
type: Concept
notation: tecora
status: valid
status modified: 2022-12-02
accepted date: 2022-12-02
in scheme: AQD - Sampling Equipment**

TECORA BRAVO M+
type: Concept
notation: tecoraBRAVO-M+
status: valid
status modified: 2022-12-02
accepted date: 2022-12-02
in scheme: AQD - Sampling Equipment**

TCR TECORA, model Sentinel PM
type: Concept
notation: tecoraSentinelPM
status: valid
status modified: 2022-12-02
accepted date: 2022-12-02
in scheme: AQD - Sampling Equipment**

Tecora Skypost PM
type: Concept
notation: tecoraSkypostPM
definition: Tecora Skypost PM
status: valid
status modified: 2022-12-02
accepted date: 2022-12-02
in scheme: AQD - Sampling Equipment**

teflon bag+desorption tube
type: Concept
notation: tefl_bag+desorp_tube
status: valid
status modified: 2022-12-02
accepted date: 2022-12-02
in scheme: AQD - Sampling Equipment**

Tekran Hg pumped tube
type: Concept
notation: tekran Hg pumped tube
definition: Total gaseous mercury analyser system
status: valid
status modified: 2022-12-02
accepted date: 2022-12-02
in scheme: AQD - Sampling Equipment**

Thermo ESM Andersen, FH
type: Concept
notation: thermoESM-A-FH
status: valid
status modified: 2022-12-02
accepted date: 2022-12-02
in scheme: AQD - Sampling Equipment**

Thermo ESM Andersen, FH 95 kF
type: Concept
notation: thermoESM-A-FH95kF
status: valid
status modified: 2022-12-02
accepted date: 2022-12-02
in scheme: AQD - Sampling Equipment**

THERMO ICP IRIS Intrepid II
type: Concept
notation: thermoICP-IRISintII
status: valid
status modified: 2022-12-02
accepted date: 2022-12-02
in scheme: AQD - Sampling Equipment**

Thermo RAAS10-300
type: Concept
notation: thermoRAAS10-300
status: valid
status modified: 2022-12-02
accepted date: 2022-12-02
in scheme: AQD - Sampling Equipment**

Thermo SO2 43i
type: Concept
notation: thermoSO2-43i
status: valid
status modified: 2022-12-02
accepted date: 2022-12-02
in scheme: AQD - Sampling Equipment**

Thermo Scientific: Trace GC ultra + DSQII
type: Concept
notation: thermoT-GC-U-DSQII
status: valid
status modified: 2022-12-02
accepted date: 2022-12-02
in scheme: AQD - Sampling Equipment**

Thermo Scientific: Trace GC ultra + Trace MS
type: Concept
notation: thermoT-GC-U-MS
status: valid
status modified: 2022-12-02
accepted date: 2022-12-02
in scheme: AQD - Sampling Equipment**

Thermo Scientific iCAP Q
type: Concept
notation: thermoiCAPQ
status: valid
status modified: 2022-12-02
accepted date: 2022-12-02
in scheme: AQD - Sampling Equipment**

VAN ESSEN - WET ONLY SAMPLER
type: Concept
notation: vanessenWO-sampler
status: valid
status modified: 2022-12-02
accepted date: 2022-12-02
in scheme: AQD - Sampling Equipment**

VGelementalPQ2
type: Concept
notation: vgelementalPQ2
status: valid
status modified: 2022-12-02
accepted date: 2022-12-02
in scheme: AQD - Sampling Equipment**

WEDDING & AS. Critical Flow Device
type: Concept
notation: weddingCFD
status: valid
status modified: 2022-12-02
accepted date: 2022-12-02
in scheme: AQD - Sampling Equipment**

WEDDING & AS. PM10
type: Concept
notation: weddingPM10
status: valid
status modified: 2022-12-02
accepted date: 2022-12-02
in scheme: AQD - Sampling Equipment**

WEST-GAEKE
type: Concept
notation: west-gaeke
status: valid
status modified: 2022-12-02
accepted date: 2022-12-02
in scheme: AQD - Sampling Equipment**

The LIFETEK PMS model
type: Concept
notation: lifetek-PMS
definition: The LIFETEK PMS model is certified for outdoor use in temperatures ranging from -20 C° to 50 °C. https://dilus.com/wp-content/uploads/2021/02/LIFETEK-PMS-SERIES-1.pdf
status: valid
status modified: 2023-05-19
accepted date: 2023-05-19
in scheme: AQD - Sampling Equipment**

AQD - Sampling Methods*
type: ConceptScheme
notation: samplingmethod
is part of: Air Quality Directive e-Reporting
registration status: Public draft
user modified: targajau
date modified: 2021-07-02 06:51:30.0
vocabulary type: Common
is numeric concept identifiers: false
is notations equal identifiers: false

Active sampler 0.004 m3/h - Gold trap - manual sample change
type: Concept
notation: AS0.004manGT
definition: ACTIVE - Low Volume Sampling with manual change - Gold trap. Air sampling flow to be 0.004 m³/h
status: valid
status modified: 2017-09-14
in scheme: AQD - Sampling Methods*

Active sampler 0.05 m³/h - Activated charcoal - automatic sample change
type: Concept
notation: AS1autFil
definition: ACTIVE - Low Volume Sampling with automatic change of activated charcoal samplers. Air sampling flow to be 1 m³/h
status: valid
status modified: 2016-03-30
accepted date: 2016-03-30
in scheme: AQD - Sampling Methods*

Active sampler 0.05 m³/h - activated charcoal - manual sample change
type: Concept
notation: AS1manFil
definition: ACTIVE - Low Volume Sampling with manual change of activated charcoal samplers. Air sampling flow to be 1 m³/h
status: valid
status modified: 2016-03-30
accepted date: 2016-03-30
in scheme: AQD - Sampling Methods*

Active sampler 0.06 m³/h - Gold trap - automatic sample change
type: Concept
notation: AS0.06autGT
definition: ACTIVE - Low Volume Sampling with automatic change - Gold trap. Air sampling flow to be 0.06 m³/h
status: valid
status modified: 2017-07-19
in scheme: AQD - Sampling Methods*

Active sampler 0.12 m³/h - denuders - automatic sample change
type: Concept
notation: AS0.12autDen
definition: ACTIVE - Low Volume Sampling with automatic change of Denuders. Air sampling flow to be 0.12 m³/h
status: valid
status modified: 2016-03-30
accepted date: 2016-03-30
in scheme: AQD - Sampling Methods*

Active sampler 0.12 m³/h - denuders&filters - automatic sample change
type: Concept
notation: AS0.12autDenFil
definition: ACTIVE - Low Volume Sampling with automatic change of Denuders&Filters. Air sampling flow to be 0.12 m³/h
status: valid
status modified: 2016-03-30
accepted date: 2016-03-30
in scheme: AQD - Sampling Methods*

Active sampler 0.12 m³/h - denuders - manual sample change
type: Concept
notation: AS0.12manDen
definition: ACTIVE - Low Volume Sampling with manual change of Denuders. Air sampling flow to be 0.12 m³/h
status: valid
status modified: 2016-03-30
accepted date: 2016-03-30
in scheme: AQD - Sampling Methods*

Active sampler 0.12 m³/h - denuders&filters - manual sample change
type: Concept
notation: AS0.12manDenFil
definition: ACTIVE - Low Volume Sampling with manual change of Denuders&Filters. Air sampling flow to be 0.12 m³/h
status: valid
status modified: 2016-03-30
accepted date: 2016-03-30
in scheme: AQD - Sampling Methods*

Active sampler 0.1 m³/h - filters - manual sample change
type: Concept
notation: AS0.1manFil
definition: ACTIVE - Low Volume Sampling with manual change of filters. Air sampling flow to be 0.1 m³/h
status: valid
status modified: 2017-09-14
in scheme: AQD - Sampling Methods*

Active sampler 0.6 m³/h - denuders - automatic sample change
type: Concept
notation: AS0.6autDen
definition: ACTIVE - Low Volume Sampling with automatic change of Denuders. Air sampling flow to be 0.6 m³/h
status: valid
status modified: 2017-07-19
in scheme: AQD - Sampling Methods*

Active sampler 0.6 m³/h – quartz filter – automatic sample change
type: Concept
notation: AS0.6autFilQuartz
definition: ACTIVE - Low Volume Sampling with automatic change of quartz filers. Air sampling flow to be 0.6 m³/h
status: valid
status modified: 2017-07-19
in scheme: AQD - Sampling Methods*

Active sampler 15 m³/h - filters - automatic sample change
type: Concept
notation: AS15autFil
definition: ACTIVE - Medium Volume Sampling with automatic change of filters. Air sampling flow to be 15 m³/h
status: valid
status modified: 2016-03-30
accepted date: 2016-03-30
in scheme: AQD - Sampling Methods*

Active sampler 15 m³/h - filters - manual sample change
type: Concept
notation: AS15manFil
definition: ACTIVE - Medium Volume Sampling with manual change of filters. Air sampling flow to be 15 m³/h
status: valid
status modified: 2016-03-30
accepted date: 2016-03-30
in scheme: AQD - Sampling Methods*

Active sampler 1 m³/h - canisters - automatic sample change
type: Concept
notation: AS1autCan
definition: ACTIVE - Low Volume Sampling with automatic change of canisters. Air sampling flow to be 1 m³/h
status: valid
status modified: 2016-03-30
accepted date: 2016-03-30
in scheme: AQD - Sampling Methods*

Active sampler 1 m³/h - filters - automatic sample change
type: Concept
notation: AS1autFil
definition: ACTIVE - Low Volume Sampling with automatic change of filters. Air sampling flow to be 1 m³/h
status: valid
status modified: 2016-03-30
accepted date: 2016-03-30
in scheme: AQD - Sampling Methods*

Active sampler 1 m³/h - canisters - manual sample change
type: Concept
notation: A12manCan
definition: ACTIVE - Low Volume Sampling with manual change of canisters. Air sampling flow to be 1 m³/h
status: valid
status modified: 2016-03-30
accepted date: 2016-03-30
in scheme: AQD - Sampling Methods*

Active sampler 1 m³/h - filters - manual sample change
type: Concept
notation: AS1manFil
definition: ACTIVE - Low Volume Sampling with manual change of filters. Air sampling flow to be 1 m³/h
status: valid
status modified: 2016-03-30
accepted date: 2016-03-30
in scheme: AQD - Sampling Methods*

Active sampler 2.3 m³/h - filters - automatic sample change
type: Concept
notation: AS2.3auFil
definition: ACTIVE - Low Volume Sampling with automatic change of filters. Air sampling flow to be 2.3 m³/h
status: valid
status modified: 2016-03-30
accepted date: 2016-03-30
in scheme: AQD - Sampling Methods*

Active sampler 2.3 m³/h - PU foam - automatic sample change
type: Concept
notation: AS2.3autPUF
definition: ACTIVE - Medium Volume Sampling with automatic change of PU foam. Air sampling flow to be 2.3 m³/h
status: valid
status modified: 2018-08-30
in scheme: AQD - Sampling Methods*

Active sampler 2.3 m³/h - filters - manual sample change
type: Concept
notation: AS2.3manFil
definition: ACTIVE - Low Volume Sampling with manual change of filters. Air sampling flow to be 2.3 m³/h
status: valid
status modified: 2016-03-30
accepted date: 2016-03-30
in scheme: AQD - Sampling Methods*

Active sampler 30 m³/h - filters - automatic sample change
type: Concept
notation: AS30autFil
definition: ACTIVE - High Volume Sampling with automatic change of filters. Air sampling flow to be 30 m³/h
status: valid
status modified: 2016-03-30
accepted date: 2016-03-30
in scheme: AQD - Sampling Methods*

Active sampler 30 m³/h - PU foam - automatic sample change
type: Concept
notation: AS30autPUF
definition: ACTIVE - High Volume Sampling with automatic change of PU foam. Air sampling flow to be 30 m³/h
status: valid
status modified: 2018-08-30
in scheme: AQD - Sampling Methods*

Active sampler 30 m³/h - PU foam&Filters - automatic sample change
type: Concept
notation: AS30autPUFFil
definition: ACTIVE - High Volume Sampling with automatic change of PU foam&Filters. Air sampling flow to be 30 m³/h
status: valid
status modified: 2018-08-30
in scheme: AQD - Sampling Methods*

Active sampler 30 m³/h - filters - manual sample change
type: Concept
notation: AS30manFil
definition: ACTIVE - High Volume Sampling with manual change of filters. Air sampling flow to be 30 m³/h
status: valid
status modified: 2016-03-30
accepted date: 2016-03-30
in scheme: AQD - Sampling Methods*

Active sampler 5 m³/h - PU foam - automatic sample change
type: Concept
notation: AS5autPUF
definition: ACTIVE - Medium Volume Sampling with automatic change of PU foam. Air sampling flow to be 5 m³/h
status: valid
status modified: 2016-03-30
accepted date: 2016-03-30
in scheme: AQD - Sampling Methods*

Active sampler 5 m³/h - PU foam&Filters - automatic sample change
type: Concept
notation: AS5autPUFFil
definition: ACTIVE - Medium Volume Sampling with automatic change of PU foam&Filters. Air sampling flow to be 5 m³/h
status: valid
status modified: 2016-03-30
accepted date: 2016-03-30
in scheme: AQD - Sampling Methods*

Active sampler 5 m³/h - PU foam - manual sample change
type: Concept
notation: AS5manPUF
definition: ACTIVE - Medium Volume Sampling with manual change of PU foam. Air sampling flow to be 5 m³/h
status: valid
status modified: 2016-03-30
accepted date: 2016-03-30
in scheme: AQD - Sampling Methods*

Active sampler 5 m³/h - PU foam&Filters - manual sample change
type: Concept
notation: AS5manPUFFil
definition: ACTIVE - Medium Volume Sampling with manual change of PU foam&Filters. Air sampling flow to be 5 m³/h
status: valid
status modified: 2016-03-30
accepted date: 2016-03-30
in scheme: AQD - Sampling Methods*

Active sampler 68 m³/h - filters - automatic sample change
type: Concept
notation: AS68autFil
definition: ACTIVE - High Volume Sampling with automatic change of filters. Air sampling flow to be 68 m³/h
status: valid
status modified: 2016-03-30
accepted date: 2016-03-30
in scheme: AQD - Sampling Methods*

Active sampler 68 m³/h - filters - manual sample change
type: Concept
notation: AS68manFil
definition: ACTIVE - High Volume Sampling with manual change of filters. Air sampling flow to be 68 m³/h
status: valid
status modified: 2016-03-30
accepted date: 2016-03-30
in scheme: AQD - Sampling Methods*

Deposition: wet and dry
type: Concept
notation: Deposition-Bulk
definition: Bulk sampler
status: valid
status modified: 2016-03-30
accepted date: 2016-03-30
in scheme: AQD - Sampling Methods*

HVS -automatic filter change 30 m³/h
type: Concept
notation: HVSauto30
definition: ACTIVE - High Volume Sampling with automatic change of filters. Air sampling flow to be 30 m³/h
status: valid
status modified: 2013-03-22
accepted date: 2013-03-22
in scheme: AQD - Sampling Methods*

HVS - manual filter change 30 m³/h
type: Concept
notation: HVSman30
definition: ACTIVE - High Volume Sampling with manual change of filters. Air sampling flow to be 30 m³/h
status: valid
status modified: 2013-03-22
accepted date: 2013-03-22
in scheme: AQD - Sampling Methods*

HVS - manual filter change 68 m³/h
type: Concept
notation: HVSman68
definition: ACTIVE - High Volume Sampling with manual change of filters. Air sampling flow to be 68 m³/h
status: valid
status modified: 2013-03-22
accepted date: 2013-03-22
in scheme: AQD - Sampling Methods*

Low volume denuder + filters
type: Concept
notation: LVDF
definition: ACTIVE
status: valid
status modified: 2013-03-22
accepted date: 2013-03-22
in scheme: AQD - Sampling Methods*

LVS - automatic filter change 0.7 m³/d
type: Concept
notation: LVSauto0.7m3d
definition: ACTIVE - Low Volume Sampling with automatic change of filters. Air sampling flow to be 0.7 m³/d
status: valid
status modified: 2019-11-27
in scheme: AQD - Sampling Methods*

LVS - automatic filter change 0,8 m³/h
type: Concept
notation: LVSauto08
definition: ACTIVE - Low Volume Sampling with automatic change of filters. Air sampling flow to be 0,8 m³/h
status: valid
status modified: 2017-06-21
in scheme: AQD - Sampling Methods*

LVS - automatic filter change 0,9 m³/h
type: Concept
notation: LVSauto0.9
definition: ACTIVE - Low Volume Sampling with automatic change of filters. Air sampling flow to be 0,9 m³/h
status: valid
status modified: 2021-07-02
in scheme: AQD - Sampling Methods*

LVS - automatic filter change 1,0 m³/h
type: Concept
notation: LVSauto1
definition: ACTIVE - Low Volume Sampling with automatic change of filters. Air sampling flow to be 1 m³/h
status: valid
status modified: 2013-03-22
accepted date: 2013-03-22
in scheme: AQD - Sampling Methods*

LVS - automatic filter change 1.5 m³/d
type: Concept
notation: LVSauto1.5m3d
definition: ACTIVE - Low Volume Sampling with automatic change of filters. Air sampling flow to be 1.5 m³/d
status: valid
status modified: 2019-11-27
in scheme: AQD - Sampling Methods*

LVS - automatic filter change 2.2 m³/d
type: Concept
notation: LVSauto2.2m3d
definition: ACTIVE - Low Volume Sampling with automatic change of filters. Air sampling flow to be 2.2 m³/d
status: valid
status modified: 2019-11-27
in scheme: AQD - Sampling Methods*

LVS - automatic filter change 2,3 m³/h
type: Concept
notation: LVSauto2.3
definition: ACTIVE - Low Volume Sampling with automatic change of filters. Air sampling flow to be 2,3 m³/h
status: valid
status modified: 2013-03-22
accepted date: 2013-03-22
in scheme: AQD - Sampling Methods*

LVS - automatic filter change 21 m³/d
type: Concept
notation: LVSauto21m3d
definition: ACTIVE - Low Volume Sampling with automatic change of filters. Air sampling flow to be 21 m³/d
status: valid
status modified: 2019-11-27
in scheme: AQD - Sampling Methods*

LVS - manual filter change 0,24 m³/h
type: Concept
notation: LVSman0.24
definition: ACTIVE - Low Volume Sampling with manual change of filters. Air sampling flow to be 0.24 m³/h
status: valid
status modified: 2019-11-27
in scheme: AQD - Sampling Methods*

LVS - manual filter change 0,03 m³/h
type: Concept
notation: LVSman0.3
definition: ACTIVE - Low Volume Sampling with automatic change of filters. Air sampling flow to be 0,03 m³/h
status: valid
status modified: 2017-09-25
in scheme: AQD - Sampling Methods*

LVS - manual filter change 0,9 m³/h
type: Concept
notation: LVSman0.9
definition: ACTIVE - Low Volume Sampling with manual change of filters. Air sampling flow to be 0,9 m³/h
status: valid
status modified: 2017-06-21
in scheme: AQD - Sampling Methods*

LVS - manual filter change 0,8 m³/h
type: Concept
notation: LVSman08
definition: ACTIVE - Low Volume Sampling with manual change of filters. Air sampling flow to be 0,8 m³/h
status: valid
status modified: 2017-09-25
in scheme: AQD - Sampling Methods*

LVS - manual filter change 1,0 m³/h
type: Concept
notation: LVSman1
definition: ACTIVE - Low Volume Sampling with manual change of filters. Air sampling flow to be 1 m³/h
status: valid
status modified: 2013-03-22
accepted date: 2013-03-22
in scheme: AQD - Sampling Methods*

LVS - manual filter change 2,3 m³/h
type: Concept
notation: LVSman2.3
definition: ACTIVE - Low Volume Sampling with manual change of filters. Air sampling flow to be 2,3 m³/h
status: valid
status modified: 2013-03-22
accepted date: 2013-03-22
in scheme: AQD - Sampling Methods*

MVS - manual filter change 15 m³/h
type: Concept
notation: MVSman15
definition: ACTIVE - Medium Volume Sampling with manual change of filters. Air sampling flow to be 15 m³/h
status: valid
status modified: 2013-03-22
accepted date: 2013-03-22
in scheme: AQD - Sampling Methods*

MVS - manual puf cartridge change 5,0 m3/h
type: Concept
notation: MVSman5puf
definition: ACTIVE - Medium Volume Sampling with manual PUF cartridge. Air sampling flow to be 5,0 m3/h
status: valid
status modified: 2013-03-22
accepted date: 2013-03-22
in scheme: AQD - Sampling Methods*

Passive Sampler - Activated Charcoal
type: Concept
notation: PS_AC
definition: Passive Sampler - Activated Charcoal
status: valid
status modified: 2016-03-30
accepted date: 2016-03-30
in scheme: AQD - Sampling Methods*

Passive Sampler - K2CO3&Glycerine
type: Concept
notation: PS_KCG
definition: Passive Sampler - Potassiumcarbonate&Glycerine
status: valid
status modified: 2016-03-30
accepted date: 2016-03-30
in scheme: AQD - Sampling Methods*

Passive Sampler - TEA
type: Concept
notation: PS_TEA
definition: Passive Sampler - Triethanolamine
status: valid
status modified: 2016-03-30
accepted date: 2016-03-30
in scheme: AQD - Sampling Methods*

Active Adsorbent
type: Concept
notation: activeabsorbent
definition: ACTIVE adsorbent - either solid or liquid
status: valid
status modified: 2013-03-22
accepted date: 2013-03-22
in scheme: AQD - Sampling Methods*

Whole air canister
type: Concept
notation: canister
status: valid
status modified: 2013-03-22
accepted date: 2013-03-22
in scheme: AQD - Sampling Methods*

Deposition: dry-only
type: Concept
notation: deposition-dry
definition: ACTIVE/PASSIVE
status: valid
status modified: 2013-03-22
accepted date: 2013-03-22
in scheme: AQD - Sampling Methods*

Deposition: wet-only
type: Concept
notation: deposition-wet
definition: ACTIVE - Rainwater sampler only open when it rains
status: valid
status modified: 2013-03-22
accepted date: 2013-03-22
in scheme: AQD - Sampling Methods*

Deposition: wet and dry (also known as bulk)
type: Concept
notation: deposition-wetdry
definition: PASSIVE
status: valid
status modified: 2013-03-22
accepted date: 2013-03-22
in scheme: AQD - Sampling Methods*

Other, please specify
type: Concept
notation: other
status: valid
status modified: 2013-03-22
accepted date: 2013-03-22
in scheme: AQD - Sampling Methods*

Passive Adsorbent
type: Concept
notation: passiveadsorbent
definition: PASSIVE adsorbent - either solid or liquid (Also know as Diffusive adsorbent)
status: valid
status modified: 2013-03-22
accepted date: 2013-03-22
in scheme: AQD - Sampling Methods*

Automatic Pumpling at about 2 m3 per day
type: Concept
notation: pumpauto2
definition: Drawing air, at about 2 m3 per day, through a filter paper, by means of a pump. Sampling is for periods of 24 hours after which the filter is changed automatically. Sampling principle for instruments for Black Smoke sampling.
status: valid
status modified: 2015-12-04
in scheme: AQD - Sampling Methods*

AQD - Purpose of Sampling Point
type: ConceptScheme
notation: samplingpointpurpose
is part of: Air Quality Directive e-Reporting
registration status: Public draft
user modified: targajau
date modified: 2017-04-12 12:11:22.0
vocabulary type: Common
is numeric concept identifiers: false
is notations equal identifiers: false

Used for National Assessment Exposure Indicator
type: Concept
notation: AEI
definition: Used to characterise a SamplingPoint to the Assessment Exposure for PM2.5
status: valid
status modified: 2013-06-08
accepted date: 2013-06-08
in scheme: AQD - Purpose of Sampling Point

Natural Sources (used for)
type: Concept
notation: NS
definition: SamplingPoint used for the demonstration or substraction of exceedances attributable to natural sources
status: valid
status modified: 2013-06-08
accepted date: 2013-06-08
in scheme: AQD - Purpose of Sampling Point

Winter-sanding or -salting (used for)
type: Concept
notation: WSS
definition: Sampling used for the demonstration or substraction of exceedances attributable to winter-sanding or -salting
status: valid
status modified: 2013-06-08
accepted date: 2013-06-08
in scheme: AQD - Purpose of Sampling Point

Scenario category
type: ConceptScheme
notation: scenariocategory
is part of: Air Quality Directive e-Reporting
registration status: Public draft
user modified: targajau
date modified: 2025-09-17 13:03:09.0
vocabulary type: Common
is numeric concept identifiers: false
is notations equal identifiers: true

baseline
type: Concept
notation: baseline
definition: baseline
status: valid
status modified: 2025-08-29
accepted date: 2025-08-29
in scheme: Scenario category

projection
type: Concept
notation: projection
definition: projection
status: valid
status modified: 2025-08-29
accepted date: 2025-08-29
in scheme: Scenario category

AQD - AQ Plans - Source Sectors
type: ConceptScheme
notation: sourcesectors
is part of: Air Quality Directive e-Reporting
registration status: Public draft
user modified: targajau
date modified: 2025-07-15 12:07:41.0
vocabulary type: Common
is numeric concept identifiers: false
is notations equal identifiers: false

Agriculture
type: Concept
notation: agriculture
definition: Agricultural livestock and land activities; including fertilizer use; manure management; and crop residue burning.
status: valid
status modified: 2025-07-15
accepted date: 2025-07-15
in scheme: AQD - AQ Plans - Source Sectors

Air traffic
type: Concept
notation: air-traffic
definition: Total aircraft operations at an airport; including landing; take-off (LTO); and taxiing.
status: valid
status modified: 2025-07-15
accepted date: 2025-07-15
in scheme: AQD - AQ Plans - Source Sectors

Commercial and residential sources
type: Concept
notation: commercial-residential
status: valid
status modified: 2025-07-15
accepted date: 2025-07-15
in scheme: AQD - AQ Plans - Source Sectors

Domestic heating
type: Concept
notation: domestic-heating
definition: Residential heating (wood; coal; gas); commercial and institutional buildings.
status: valid
status modified: 2025-07-15
accepted date: 2025-07-15
in scheme: AQD - AQ Plans - Source Sectors

Energy production and supply
type: Concept
notation: energy-production
definition: Energy generation outside of industry.
status: valid
status modified: 2025-07-15
accepted date: 2025-07-15
in scheme: AQD - AQ Plans - Source Sectors

Industry
type: Concept
notation: industry
definition: Industry production; combustion in manufacturing industry; solvent and other product use; and others.
status: valid
status modified: 2025-07-15
accepted date: 2025-07-15
in scheme: AQD - AQ Plans - Source Sectors

Natural
type: Concept
notation: natural-sources
definition: Natural sources like biogenic emissions.
status: valid
status modified: 2025-07-15
accepted date: 2025-07-15
in scheme: AQD - AQ Plans - Source Sectors

Off road vehicles and machines
type: Concept
notation: off-road
definition: Off-road vehicles and machinery; etc.
status: valid
status modified: 2025-07-15
accepted date: 2025-07-15
in scheme: AQD - AQ Plans - Source Sectors

Other; please specify
type: Concept
notation: other
definition: Emission source not listed; requires specification.
status: valid
status modified: 2025-07-15
accepted date: 2025-07-15
in scheme: AQD - AQ Plans - Source Sectors

Road transport
type: Concept
notation: road-transport
definition: Passenger cars; trucks; buses; and motorcycles on roads.
status: valid
status modified: 2025-07-15
accepted date: 2025-07-15
in scheme: AQD - AQ Plans - Source Sectors

Shipping
type: Concept
notation: shipping
definition: Inland and sea-shipping vessels operating in ports or coastal areas.
status: valid
status modified: 2025-07-15
accepted date: 2025-07-15
in scheme: AQD - AQ Plans - Source Sectors

Transboundary
type: Concept
notation: transboundary
definition: Contribution from other countries across borders.
status: valid
status modified: 2025-07-15
accepted date: 2025-07-15
in scheme: AQD - AQ Plans - Source Sectors

Transport
type: Concept
notation: transport
definition: DELETE
status: invalid
status modified: 2025-07-15
not accepted date: 2025-07-15
in scheme: AQD - AQ Plans - Source Sectors

Waste management
type: Concept
notation: waste-management
definition: Waste treatment and disposal; including incineration.
status: valid
status modified: 2025-07-15
accepted date: 2025-07-15
in scheme: AQD - AQ Plans - Source Sectors

AQD - IPR - EEA grid - Spatial Resolution
type: ConceptScheme
notation: spatialresolution
is part of: Air Quality Directive e-Reporting
registration status: Public draft
user modified: targajau
date modified: 2025-07-08 11:04:57.0
vocabulary type: Common
is numeric concept identifiers: true
is notations equal identifiers: true

10 meters
type: Concept
notation: 10
definition: Spatial resolution of 10 meters following the EEA LAEA grid (EPSG:3035).
status: valid
status modified: 2025-07-07
accepted date: 2025-07-07
in scheme: AQD - IPR - EEA grid - Spatial Resolution

100 meters
type: Concept
notation: 100
definition: Spatial resolution of 100 meters following the EEA LAEA grid (EPSG:3035).
status: valid
status modified: 2025-07-07
accepted date: 2025-07-07
in scheme: AQD - IPR - EEA grid - Spatial Resolution

1000 meters
type: Concept
notation: 1000
definition: Spatial resolution of 1000 meters following the EEA LAEA grid (EPSG:3035).
status: valid
status modified: 2025-07-07
accepted date: 2025-07-07
in scheme: AQD - IPR - EEA grid - Spatial Resolution

10000 meters
type: Concept
notation: 10000
definition: Spatial resolution of 10000 meters following the EEA LAEA grid (EPSG:3035).
status: valid
status modified: 2025-07-07
accepted date: 2025-07-07
in scheme: AQD - IPR - EEA grid - Spatial Resolution

AQD - AQ Plans - Spatial Scale
type: ConceptScheme
notation: spatialscale
is part of: Air Quality Directive e-Reporting
registration status: Public draft
user modified: targajau
date modified: 2025-07-15 11:55:35.0
vocabulary type: Common
is numeric concept identifiers: false
is notations equal identifiers: false

Local
type: Concept
notation: local
status: valid
status modified: 2013-03-22
accepted date: 2013-03-22
in scheme: AQD - AQ Plans - Spatial Scale

National
type: Concept
notation: national
status: valid
status modified: 2013-03-22
accepted date: 2013-03-22
in scheme: AQD - AQ Plans - Spatial Scale

Town as part of a zone
type: Concept
notation: town
status: valid
status modified: 2013-03-22
accepted date: 2013-03-22
in scheme: AQD - AQ Plans - Spatial Scale

Zone / Agglomeration
type: Concept
notation: zone_agg
status: valid
status modified: 2013-03-22
accepted date: 2013-03-22
in scheme: AQD - AQ Plans - Spatial Scale

Regional
type: Concept
notation: regional
definition: Regional e.g. NUTS
status: valid
status modified: 2025-07-15
accepted date: 2025-07-15
in scheme: AQD - AQ Plans - Spatial Scale

Cross-boundary
type: Concept
notation: cross-boundary
definition: Cross-boundary
status: valid
status modified: 2025-07-15
accepted date: 2025-07-15
in scheme: AQD - AQ Plans - Spatial Scale

SRapplication
type: ConceptScheme
notation: SRapplication
is part of: Air Quality Directive e-Reporting
registration status: Public draft
user modified: targajau
date modified: 2025-10-01 13:08:33.0
vocabulary type: Common
is numeric concept identifiers: false
is notations equal identifiers: true

Exceedance extent
type: Concept
notation: exc_sr
definition: Exceedance extent
status: valid
status modified: 2025-08-29
accepted date: 2025-08-29
in scheme: SRapplication

Spatial representativeness of sampling point
type: Concept
notation: spo_sr
definition: Spatial representativeness of sampling point
status: valid
status modified: 2025-08-29
accepted date: 2025-08-29
in scheme: SRapplication

AQD - Station Classification
type: ConceptScheme
notation: stationclassification
is part of: Air Quality Directive e-Reporting
registration status: Public draft
user modified: targajau
date modified: 2013-05-13 10:48:09.0
vocabulary type: Common
is numeric concept identifiers: false
is notations equal identifiers: false

Background
type: Concept
notation: background
definition: Located such that its pollution levels are representative of the average exposure of the general population within the type of area under assessment. The pollution level should not be dominated by a single source type (e.g. traffic), unless that source type is typical within the area under assessment. The station should usually be representative of a wider area of at least several square kilometers.
status: valid
status modified: 2013-03-22
accepted date: 2013-03-22
in scheme: AQD - Station Classification

Industrial
type: Concept
notation: industrial
definition: Located in close proximity to single industrial sources or industrial areas, in a location that should represent the highest concentrations to which the population within the zone are exposed to. A wide range of industrial sources can be considered here, including: a) thermal power generation, b) district heating plants, c) refineries, d) waste incineration/treatment plants, dump sites, e) mining, including gravel, oil, natural gas, f) airports or g) ports.
status: valid
status modified: 2013-03-22
accepted date: 2013-03-22
in scheme: AQD - Station Classification

Traffic
type: Concept
notation: traffic
definition: Located in close proximity to a road, in a location that should represent the highest concentrations to which the population are exposed to within the zone. Located such that the pollution level for the specific pollutant is determined predominantly by the emissions from road traffic (i.e. not ship, railway, airplane, off-road) on distinct major roads. As per ANNEX III of DIRECTIVE 2008/50/EC, for all pollutants, traffic-orientated sampling probes shall be at least 25 m from the edge of major junctions and no more than 10 m from the kerbside.
status: valid
status modified: 2013-03-22
accepted date: 2013-03-22
in scheme: AQD - Station Classification

AQD - AQ Plans - Status AQ Plan
type: ConceptScheme
notation: statusaqplan
is part of: Air Quality Directive e-Reporting
registration status: Public draft
user modified: targajau
date modified: 2016-01-11 09:14:07.0
vocabulary type: Common
is numeric concept identifiers: false
is notations equal identifiers: false

In formal adoption process
type: Concept
notation: adoption-process
status: valid
status modified: 2013-03-22
accepted date: 2013-03-22
in scheme: AQD - AQ Plans - Status AQ Plan

Ended, no revision foreseen
type: Concept
notation: ended
status: valid
status modified: 2013-03-22
accepted date: 2013-03-22
in scheme: AQD - AQ Plans - Status AQ Plan

First year of implementation, adopted during reporting year
type: Concept
notation: first-year
status: valid
status modified: 2013-03-22
accepted date: 2013-03-22
in scheme: AQD - AQ Plans - Status AQ Plan

Implemented
type: Concept
notation: implemented
status: valid
status modified: 2013-03-22
accepted date: 2013-03-22
in scheme: AQD - AQ Plans - Status AQ Plan

In preparation
type: Concept
notation: preparation
status: valid
status modified: 2013-03-22
accepted date: 2013-03-22
in scheme: AQD - AQ Plans - Status AQ Plan

Under revision
type: Concept
notation: under-revision
status: valid
status modified: 2013-03-22
accepted date: 2013-03-22
in scheme: AQD - AQ Plans - Status AQ Plan

Under implementation
type: Concept
notation: under-implementation
definition: Minor modifications of the adopted plan may occur and do not need to be reported through the full information on AQ plan
status: valid
status modified: 2016-01-11
in scheme: AQD - AQ Plans - Status AQ Plan

AQD - Time Extension Types
type: ConceptScheme
notation: timeextensiontypes
is part of: Air Quality Directive e-Reporting
registration status: Public draft
user modified: roug
date modified: 2014-07-21 15:21:39.0
vocabulary type: Common
is numeric concept identifiers: false
is notations equal identifiers: false

Benzene annual
type: Concept
notation: C6H6-annual
definition: Time extension for benzene annual mean Limit Value.
status: valid
status modified: 2013-03-22
accepted date: 2013-03-22
in scheme: AQD - Time Extension Types
related pollutant: Benzene (air)

NO2-1h
type: Concept
notation: NO2-1h
definition: Time extension for NO2 hourly Limit Value
status: valid
status modified: 2013-03-22
accepted date: 2013-03-22
in scheme: AQD - Time Extension Types
related pollutant: Nitrogen dioxide (air)

NO2-annual
type: Concept
notation: NO2-annual
definition: Time extension for NO2 annual mean Limit Value.
status: valid
status modified: 2013-03-22
accepted date: 2013-03-22
in scheme: AQD - Time Extension Types
related pollutant: Nitrogen dioxide (air)

None
type: Concept
notation: none
definition: No time extension
status: valid
status modified: 2013-03-22
accepted date: 2013-03-22
in scheme: AQD - Time Extension Types

PM10-24h
type: Concept
notation: PM10-24h
definition: Time extension for PM10 daily Limit Value.
status: valid
status modified: 2013-03-22
accepted date: 2013-03-22
in scheme: AQD - Time Extension Types
related pollutant: Particulate matter < 10 µm (aerosol)

PM10-annual
type: Concept
notation: PM10-annual
definition: Time extension for PM10 annual mean Limit Value.
status: valid
status modified: 2013-03-22
accepted date: 2013-03-22
in scheme: AQD - Time Extension Types
related pollutant: Particulate matter < 10 µm (aerosol)

AQD - AQ Plans - Timeascale
type: ConceptScheme
notation: timescale
is part of: Air Quality Directive e-Reporting
registration status: Public draft
user modified: targajau
date modified: 2014-02-26 10:50:31.0
vocabulary type: Common
is numeric concept identifiers: false
is notations equal identifiers: false

Long term (more than 1 year)
type: Concept
notation: long
status: valid
status modified: 2013-03-22
accepted date: 2013-03-22
in scheme: AQD - AQ Plans - Timeascale

Medium term (1 year)
type: Concept
notation: medium
status: valid
status modified: 2013-03-22
accepted date: 2013-03-22
in scheme: AQD - AQ Plans - Timeascale

Short term (less than 1 year)
type: Concept
notation: short
status: valid
status modified: 2013-03-22
accepted date: 2013-03-22
in scheme: AQD - AQ Plans - Timeascale

Unknown timescale
type: Concept
notation: unknown
definition: Timescale of the action is unknown or undetermined.
status: valid
status modified: 2014-02-26
accepted date: 2014-02-26
in scheme: AQD - AQ Plans - Timeascale

AQD Time Zone - used for aggregated data & statistics
type: ConceptScheme
notation: timezone
is part of: Air Quality Directive e-Reporting
registration status: Public draft
user modified: targajau
date modified: 2013-05-13 10:53:29.0
vocabulary type: Common
is numeric concept identifiers: false
is notations equal identifiers: false

Coordinated Universal Time
type: Concept
notation: UTC
definition: Coordinated Universal Time (UTC) is the primary time standard by which the world regulates clocks and time. (Wikipedia) or defined as the time scale which forms the basis of a coordinated radio dissemination of standard frequencies and time signals (ISO_8601-2004)
status: valid
status modified: 2013-04-17
accepted date: 2013-04-17
in scheme: AQD Time Zone - used for aggregated data & statistics

UTC+01
type: Concept
notation: UTC+01
definition: UTC offset of +01 hours. For example, the local time in a time zone which observes UTC+01 is calculated by adding 1 hours to UTC.
status: valid
status modified: 2013-04-17
accepted date: 2013-04-17
in scheme: AQD Time Zone - used for aggregated data & statistics

UTC+02
type: Concept
notation: UTC+02
definition: UTC offset of +02 hours.
status: valid
status modified: 2013-04-17
accepted date: 2013-04-17
in scheme: AQD Time Zone - used for aggregated data & statistics

UTC+03
type: Concept
notation: UTC+03
definition: UTC offset of +03 hours.
status: valid
status modified: 2013-04-17
accepted date: 2013-04-17
in scheme: AQD Time Zone - used for aggregated data & statistics

UTC+04
type: Concept
notation: UTC+04
definition: UTC offset of +04 hours.
status: valid
status modified: 2013-04-17
accepted date: 2013-04-17
in scheme: AQD Time Zone - used for aggregated data & statistics

UTC+05
type: Concept
notation: UTC+05
definition: UTC offset of +05 hours.
status: valid
status modified: 2013-04-17
accepted date: 2013-04-17
in scheme: AQD Time Zone - used for aggregated data & statistics

UTC+06
type: Concept
notation: UTC+06
definition: UTC offset of +06 hours.
status: valid
status modified: 2013-04-17
accepted date: 2013-04-17
in scheme: AQD Time Zone - used for aggregated data & statistics

UTC-01
type: Concept
notation: UTC-01
definition: UTC offset of -01 hours. For example, the local time in a time zone which observes UTC-01 is calculated by substracting 1 hours to UTC.
status: valid
status modified: 2013-04-17
accepted date: 2013-04-17
in scheme: AQD Time Zone - used for aggregated data & statistics

UTC-02
type: Concept
notation: UTC-02
definition: UTC offset of -02 hours.
status: valid
status modified: 2013-04-17
accepted date: 2013-04-17
in scheme: AQD Time Zone - used for aggregated data & statistics

UTC-03
type: Concept
notation: UTC-03
definition: UTC offset of -03 hours.
status: valid
status modified: 2013-04-17
accepted date: 2013-04-17
in scheme: AQD Time Zone - used for aggregated data & statistics

UTC-04
type: Concept
notation: UTC-04
definition: UTC offset of -04 hours.
status: valid
status modified: 2013-04-17
accepted date: 2013-04-17
in scheme: AQD Time Zone - used for aggregated data & statistics

UTC-05
type: Concept
notation: UTC-05
definition: UTC offset of -05 hours.
status: valid
status modified: 2013-04-17
accepted date: 2013-04-17
in scheme: AQD Time Zone - used for aggregated data & statistics

UTC-06
type: Concept
notation: UTC-06
definition: UTC offset of -06 hours.
status: valid
status modified: 2013-04-17
accepted date: 2013-04-17
in scheme: AQD Time Zone - used for aggregated data & statistics

Zone category
type: ConceptScheme
notation: zonecategory
is part of: Air Quality Directive e-Reporting
registration status: Public draft
user modified: targajau
date modified: 2025-08-29 14:47:56.0
vocabulary type: Common
is numeric concept identifiers: false
is notations equal identifiers: false

AQ zone
type: Concept
notation: aqzone
definition: AQ zone
status: valid
status modified: 2025-04-10
accepted date: 2025-04-10
in scheme: Zone category

NUTS region
type: Concept
notation: nuts
definition: NUTS region
status: valid
status modified: 2025-04-10
accepted date: 2025-04-10
in scheme: Zone category

AQD - AQ Assessment & Management Zone Type
type: ConceptScheme
notation: zonetype
is part of: Air Quality Directive e-Reporting
registration status: Released
user modified: targajau
date modified: 2023-11-16 14:20:12.0
vocabulary type: Common
is numeric concept identifiers: false
is notations equal identifiers: false

Agglomeration
type: Concept
notation: agg
definition: ‘Agglomeration’ shall mean a zone that is a conurbation with a population in excess of 250 000 inhabitants or, where the population is 250 000 inhabitants or less, with a given population density per km2 to be established by the Member States.
status: valid
status modified: 2013-03-22
accepted date: 2013-03-22
in scheme: AQD - AQ Assessment & Management Zone Type

Non-agglomeration
type: Concept
notation: noagg
definition: A zone delimited by a Member State for the purposes of air quality assessment and management which does not fullfil the requirements of an agglomeration
status: valid
status modified: 2013-03-22
accepted date: 2013-03-22
in scheme: AQD - AQ Assessment & Management Zone Type