NACEValue
type: ConceptScheme
label: List hosts the classification for the activities according to the Council Regulation 3037 and the NACE Rev 2.1 established by Commission Delegated Regulation (EU) 2023/137 and published by EUROSTAT on 10 February 2023./90/EEC.
notation: NACEValue
is part of: euregistryonindustrialsites
registration status: Released
user modified: antogfed
date modified: 2025-06-16 09:37:51.0
vocabulary type: Common
is numeric concept identifiers: false
is notations equal identifiers: false

Growing of cereals except rice leguminous crops and oil seeds
type: Concept
notation: 01.11
definition: List hosts the classification for the activities according to the Council Regulation 3037 90 EEC
status: valid
status modified: 2016-06-08
accepted date: 2016-06-08
in scheme: NACEValue

Growing of rice
type: Concept
notation: 01.12
definition: List hosts the classification for the activities according to the Council Regulation 3037 90 EEC
status: valid
status modified: 2016-06-08
accepted date: 2016-06-08
in scheme: NACEValue

Growing of vegetables and melons roots and tubers
type: Concept
notation: 01.13
definition: List hosts the classification for the activities according to the Council Regulation 3037 90 EEC
status: valid
status modified: 2016-06-08
accepted date: 2016-06-08
in scheme: NACEValue

Growing of sugar cane
type: Concept
notation: 01.14
definition: List hosts the classification for the activities according to the Council Regulation 3037 90 EEC
status: valid
status modified: 2016-06-08
accepted date: 2016-06-08
in scheme: NACEValue

Growing of tobacco
type: Concept
notation: 01.15
definition: List hosts the classification for the activities according to the Council Regulation 3037 90 EEC
status: valid
status modified: 2016-06-08
accepted date: 2016-06-08
in scheme: NACEValue

Growing of fibre crops
type: Concept
notation: 01.16
definition: List hosts the classification for the activities according to the Council Regulation 3037 90 EEC
status: valid
status modified: 2016-06-08
accepted date: 2016-06-08
in scheme: NACEValue

Growing of other non-perennial crops
type: Concept
notation: 01.19
definition: List hosts the classification for the activities according to the Council Regulation 3037 90 EEC
status: valid
status modified: 2016-06-08
accepted date: 2016-06-08
in scheme: NACEValue

Growing of grapes
type: Concept
notation: 01.21
definition: List hosts the classification for the activities according to the Council Regulation 3037 90 EEC
status: valid
status modified: 2016-06-08
accepted date: 2016-06-08
in scheme: NACEValue

Growing of tropical and subtropical fruits
type: Concept
notation: 01.22
definition: List hosts the classification for the activities according to the Council Regulation 3037 90 EEC
status: valid
status modified: 2016-06-08
accepted date: 2016-06-08
in scheme: NACEValue

Growing of citrus fruits
type: Concept
notation: 01.23
definition: List hosts the classification for the activities according to the Council Regulation 3037 90 EEC
status: valid
status modified: 2016-06-08
accepted date: 2016-06-08
in scheme: NACEValue

Growing of pome fruits and stone fruits
type: Concept
notation: 01.24
definition: List hosts the classification for the activities according to the Council Regulation 3037 90 EEC
status: valid
status modified: 2016-06-08
accepted date: 2016-06-08
in scheme: NACEValue

Growing of other tree and bush fruits and nuts
type: Concept
notation: 01.25
definition: List hosts the classification for the activities according to the Council Regulation 3037 90 EEC
status: valid
status modified: 2016-06-08
accepted date: 2016-06-08
in scheme: NACEValue

Growing of oleaginous fruits
type: Concept
notation: 01.26
definition: List hosts the classification for the activities according to the Council Regulation 3037 90 EEC
status: valid
status modified: 2016-06-08
accepted date: 2016-06-08
in scheme: NACEValue

Growing of beverage crops
type: Concept
notation: 01.27
definition: List hosts the classification for the activities according to the Council Regulation 3037 90 EEC
status: valid
status modified: 2016-06-08
accepted date: 2016-06-08
in scheme: NACEValue

Growing of spices aromatic drug and pharmaceutical crops
type: Concept
notation: 01.28
definition: List hosts the classification for the activities according to the Council Regulation 3037 90 EEC
status: valid
status modified: 2016-06-08
accepted date: 2016-06-08
in scheme: NACEValue

Growing of other perennial crops
type: Concept
notation: 01.29
definition: List hosts the classification for the activities according to the Council Regulation 3037 90 EEC
status: valid
status modified: 2016-06-08
accepted date: 2016-06-08
in scheme: NACEValue

Plant propagation
type: Concept
notation: 01.30
definition: List hosts the classification for the activities according to the Council Regulation 3037 90 EEC
status: valid
status modified: 2016-06-08
accepted date: 2016-06-08
in scheme: NACEValue

Raising of dairy cattle
type: Concept
notation: 01.41
definition: List hosts the classification for the activities according to the Council Regulation 3037 90 EEC
status: valid
status modified: 2016-06-08
accepted date: 2016-06-08
in scheme: NACEValue

Raising of other cattle and buffaloes
type: Concept
notation: 01.42
definition: List hosts the classification for the activities according to the Council Regulation 3037 90 EEC
status: valid
status modified: 2016-06-08
accepted date: 2016-06-08
in scheme: NACEValue

Raising of horses and other equines
type: Concept
notation: 01.43
definition: List hosts the classification for the activities according to the Council Regulation 3037 90 EEC
status: valid
status modified: 2016-06-08
accepted date: 2016-06-08
in scheme: NACEValue

Raising of camels and camelids
type: Concept
notation: 01.44
definition: List hosts the classification for the activities according to the Council Regulation 3037 90 EEC
status: valid
status modified: 2016-06-08
accepted date: 2016-06-08
in scheme: NACEValue

Raising of sheep and goats
type: Concept
notation: 01.45
definition: List hosts the classification for the activities according to the Council Regulation 3037 90 EEC
status: valid
status modified: 2016-06-08
accepted date: 2016-06-08
in scheme: NACEValue

Raising of swine/pigs
type: Concept
notation: 01.46
definition: List hosts the classification for the activities according to the Council Regulation 3037 90 EEC
status: valid
status modified: 2016-06-08
accepted date: 2016-06-08
in scheme: NACEValue

Raising of poultry
type: Concept
notation: 01.47
definition: List hosts the classification for the activities according to the Council Regulation 3037 90 EEC
status: valid
status modified: 2016-06-08
accepted date: 2016-06-08
in scheme: NACEValue

Raising of other animals
type: Concept
notation: 01.49
definition: List hosts the classification for the activities according to the Council Regulation 3037 90 EEC
status: valid
status modified: 2016-06-08
accepted date: 2016-06-08
in scheme: NACEValue

Mixed farming
type: Concept
notation: 01.50
definition: List hosts the classification for the activities according to the Council Regulation 3037 90 EEC
status: valid
status modified: 2016-06-08
accepted date: 2016-06-08
in scheme: NACEValue

Support activities for crop production
type: Concept
notation: 01.61
definition: List hosts the classification for the activities according to the Council Regulation 3037 90 EEC
status: valid
status modified: 2016-06-08
accepted date: 2016-06-08
in scheme: NACEValue

Support activities for animal production
type: Concept
notation: 01.62
definition: List hosts the classification for the activities according to the Council Regulation 3037 90 EEC
status: valid
status modified: 2016-06-08
accepted date: 2016-06-08
in scheme: NACEValue

Post-harvest crop activities
type: Concept
notation: 01.63
definition: List hosts the classification for the activities according to the Council Regulation 3037 90 EEC
status: valid
status modified: 2016-06-08
accepted date: 2016-06-08
in scheme: NACEValue

Seed processing for propagation
type: Concept
notation: 01.64
definition: List hosts the classification for the activities according to the Council Regulation 3037 90 EEC
status: valid
status modified: 2016-06-08
accepted date: 2016-06-08
in scheme: NACEValue

Hunting trapping and related service activities
type: Concept
notation: 01.70
definition: List hosts the classification for the activities according to the Council Regulation 3037 90 EEC
status: valid
status modified: 2016-06-08
accepted date: 2016-06-08
in scheme: NACEValue

Silviculture and other forestry activities
type: Concept
notation: 02.10
definition: List hosts the classification for the activities according to the Council Regulation 3037 90 EEC
status: valid
status modified: 2016-06-08
accepted date: 2016-06-08
in scheme: NACEValue

Logging
type: Concept
notation: 02.20
definition: List hosts the classification for the activities according to the Council Regulation 3037 90 EEC
status: valid
status modified: 2016-06-08
accepted date: 2016-06-08
in scheme: NACEValue

Gathering of wild growing non-wood products
type: Concept
notation: 02.30
definition: List hosts the classification for the activities according to the Council Regulation 3037 90 EEC
status: valid
status modified: 2016-06-08
accepted date: 2016-06-08
in scheme: NACEValue

Support services to forestry
type: Concept
notation: 02.40
definition: List hosts the classification for the activities according to the Council Regulation 3037 90 EEC
status: valid
status modified: 2016-06-08
accepted date: 2016-06-08
in scheme: NACEValue

Marine fishing
type: Concept
notation: 03.11
definition: List hosts the classification for the activities according to the Council Regulation 3037 90 EEC
status: valid
status modified: 2016-06-08
accepted date: 2016-06-08
in scheme: NACEValue

Freshwater fishing
type: Concept
notation: 03.12
definition: List hosts the classification for the activities according to the Council Regulation 3037 90 EEC
status: valid
status modified: 2016-06-08
accepted date: 2016-06-08
in scheme: NACEValue

Marine aquaculture
type: Concept
notation: 03.21
definition: List hosts the classification for the activities according to the Council Regulation 3037 90 EEC
status: valid
status modified: 2016-06-08
accepted date: 2016-06-08
in scheme: NACEValue

Freshwater aquaculture
type: Concept
notation: 03.22
definition: List hosts the classification for the activities according to the Council Regulation 3037 90 EEC
status: valid
status modified: 2016-06-08
accepted date: 2016-06-08
in scheme: NACEValue

Mining of hard coal
type: Concept
notation: 05.10
definition: List hosts the classification for the activities according to the Council Regulation 3037 90 EEC
status: valid
status modified: 2016-06-08
accepted date: 2016-06-08
in scheme: NACEValue

Mining of lignite
type: Concept
notation: 05.20
definition: List hosts the classification for the activities according to the Council Regulation 3037 90 EEC
status: valid
status modified: 2016-06-08
accepted date: 2016-06-08
in scheme: NACEValue

Extraction of crude petroleum
type: Concept
notation: 06.10
definition: List hosts the classification for the activities according to the Council Regulation 3037 90 EEC
status: valid
status modified: 2016-06-08
accepted date: 2016-06-08
in scheme: NACEValue

Extraction of natural gas
type: Concept
notation: 06.20
definition: List hosts the classification for the activities according to the Council Regulation 3037 90 EEC
status: valid
status modified: 2016-06-08
accepted date: 2016-06-08
in scheme: NACEValue

Mining of iron ores
type: Concept
notation: 07.10
definition: List hosts the classification for the activities according to the Council Regulation 3037 90 EEC
status: valid
status modified: 2016-06-08
accepted date: 2016-06-08
in scheme: NACEValue

Mining of uranium and thorium ores
type: Concept
notation: 07.21
definition: List hosts the classification for the activities according to the Council Regulation 3037 90 EEC
status: valid
status modified: 2016-06-08
accepted date: 2016-06-08
in scheme: NACEValue

Mining of other non-ferrous metal ores
type: Concept
notation: 07.29
definition: List hosts the classification for the activities according to the Council Regulation 3037 90 EEC
status: valid
status modified: 2016-06-08
accepted date: 2016-06-08
in scheme: NACEValue

Quarrying of ornamental and building stone limestone gypsum chalk and slate
type: Concept
notation: 08.11
definition: List hosts the classification for the activities according to the Council Regulation 3037 90 EEC
status: valid
status modified: 2016-06-08
accepted date: 2016-06-08
in scheme: NACEValue

Operation of gravel and sand pits mining of clays and kaolin
type: Concept
notation: 08.12
definition: List hosts the classification for the activities according to the Council Regulation 3037 90 EEC
status: valid
status modified: 2016-06-08
accepted date: 2016-06-08
in scheme: NACEValue

Mining of chemical and fertiliser minerals
type: Concept
notation: 08.91
definition: List hosts the classification for the activities according to the Council Regulation 3037 90 EEC
status: valid
status modified: 2016-06-08
accepted date: 2016-06-08
in scheme: NACEValue

Extraction of peat
type: Concept
notation: 08.92
definition: List hosts the classification for the activities according to the Council Regulation 3037 90 EEC
status: valid
status modified: 2016-06-08
accepted date: 2016-06-08
in scheme: NACEValue

Extraction of salt
type: Concept
notation: 08.93
definition: List hosts the classification for the activities according to the Council Regulation 3037 90 EEC
status: valid
status modified: 2016-06-08
accepted date: 2016-06-08
in scheme: NACEValue

Other mining and quarrying n e c
type: Concept
notation: 08.99
definition: List hosts the classification for the activities according to the Council Regulation 3037 90 EEC
status: valid
status modified: 2016-06-08
accepted date: 2016-06-08
in scheme: NACEValue

Support activities for petroleum and natural gas extraction
type: Concept
notation: 09.10
definition: List hosts the classification for the activities according to the Council Regulation 3037 90 EEC
status: valid
status modified: 2016-06-08
accepted date: 2016-06-08
in scheme: NACEValue

Support activities for other mining and quarrying
type: Concept
notation: 09.90
definition: List hosts the classification for the activities according to the Council Regulation 3037 90 EEC
status: valid
status modified: 2016-06-08
accepted date: 2016-06-08
in scheme: NACEValue

Processing and preserving of meat
type: Concept
notation: 10.11
definition: List hosts the classification for the activities according to the Council Regulation 3037 90 EEC
status: valid
status modified: 2016-06-08
accepted date: 2016-06-08
in scheme: NACEValue

Processing and preserving of poultry meat
type: Concept
notation: 10.12
definition: List hosts the classification for the activities according to the Council Regulation 3037 90 EEC
status: valid
status modified: 2016-06-08
accepted date: 2016-06-08
in scheme: NACEValue

Production of meat and poultry meat products
type: Concept
notation: 10.13
definition: List hosts the classification for the activities according to the Council Regulation 3037 90 EEC
status: valid
status modified: 2016-06-08
accepted date: 2016-06-08
in scheme: NACEValue

Processing and preserving of fish crustaceans and molluscs
type: Concept
notation: 10.20
definition: List hosts the classification for the activities according to the Council Regulation 3037 90 EEC
status: valid
status modified: 2016-06-08
accepted date: 2016-06-08
in scheme: NACEValue

Processing and preserving of potatoes
type: Concept
notation: 10.31
definition: List hosts the classification for the activities according to the Council Regulation 3037 90 EEC
status: valid
status modified: 2016-06-08
accepted date: 2016-06-08
in scheme: NACEValue

Manufacture of fruit and vegetable juice
type: Concept
notation: 10.32
definition: List hosts the classification for the activities according to the Council Regulation 3037 90 EEC
status: valid
status modified: 2016-06-08
accepted date: 2016-06-08
in scheme: NACEValue

Other processing and preserving of fruit and vegetables
type: Concept
notation: 10.39
definition: List hosts the classification for the activities according to the Council Regulation 3037 90 EEC
status: valid
status modified: 2016-06-08
accepted date: 2016-06-08
in scheme: NACEValue

Manufacture of oils and fats
type: Concept
notation: 10.41
definition: List hosts the classification for the activities according to the Council Regulation 3037 90 EEC
status: valid
status modified: 2016-06-08
accepted date: 2016-06-08
in scheme: NACEValue

Manufacture of margarine and similar edible fats
type: Concept
notation: 10.42
definition: List hosts the classification for the activities according to the Council Regulation 3037 90 EEC
status: valid
status modified: 2016-06-08
accepted date: 2016-06-08
in scheme: NACEValue

Operation of dairies and cheese making
type: Concept
notation: 10.51
definition: List hosts the classification for the activities according to the Council Regulation 3037 90 EEC
status: valid
status modified: 2016-06-08
accepted date: 2016-06-08
in scheme: NACEValue

Manufacture of ice cream
type: Concept
notation: 10.52
definition: List hosts the classification for the activities according to the Council Regulation 3037 90 EEC
status: valid
status modified: 2016-06-08
accepted date: 2016-06-08
in scheme: NACEValue

Manufacture of grain mill products
type: Concept
notation: 10.61
definition: List hosts the classification for the activities according to the Council Regulation 3037 90 EEC
status: valid
status modified: 2016-06-08
accepted date: 2016-06-08
in scheme: NACEValue

Manufacture of starches and starch products
type: Concept
notation: 10.62
definition: List hosts the classification for the activities according to the Council Regulation 3037 90 EEC
status: valid
status modified: 2016-06-08
accepted date: 2016-06-08
in scheme: NACEValue

Manufacture of bread manufacture of fresh pastry goods and cakes
type: Concept
notation: 10.71
definition: List hosts the classification for the activities according to the Council Regulation 3037 90 EEC
status: valid
status modified: 2016-06-08
accepted date: 2016-06-08
in scheme: NACEValue

Manufacture of rusks and biscuits manufacture of preserved pastry goods and cakes
type: Concept
notation: 10.72
definition: List hosts the classification for the activities according to the Council Regulation 3037 90 EEC
status: valid
status modified: 2016-06-08
accepted date: 2016-06-08
in scheme: NACEValue

Manufacture of macaroni noodles couscous and similar farinaceous products
type: Concept
notation: 10.73
definition: List hosts the classification for the activities according to the Council Regulation 3037 90 EEC
status: valid
status modified: 2016-06-08
accepted date: 2016-06-08
in scheme: NACEValue

Manufacture of sugar
type: Concept
notation: 10.81
definition: List hosts the classification for the activities according to the Council Regulation 3037 90 EEC
status: valid
status modified: 2016-06-08
accepted date: 2016-06-08
in scheme: NACEValue

Manufacture of cocoa chocolate and sugar confectionery
type: Concept
notation: 10.82
definition: List hosts the classification for the activities according to the Council Regulation 3037 90 EEC
status: valid
status modified: 2016-06-08
accepted date: 2016-06-08
in scheme: NACEValue

Processing of tea and coffee
type: Concept
notation: 10.83
definition: List hosts the classification for the activities according to the Council Regulation 3037 90 EEC
status: valid
status modified: 2016-06-08
accepted date: 2016-06-08
in scheme: NACEValue

Manufacture of condiments and seasonings
type: Concept
notation: 10.84
definition: List hosts the classification for the activities according to the Council Regulation 3037 90 EEC
status: valid
status modified: 2016-06-08
accepted date: 2016-06-08
in scheme: NACEValue

Manufacture of prepared meals and dishes
type: Concept
notation: 10.85
definition: List hosts the classification for the activities according to the Council Regulation 3037 90 EEC
status: valid
status modified: 2016-06-08
accepted date: 2016-06-08
in scheme: NACEValue

Manufacture of homogenised food preparations and dietetic food
type: Concept
notation: 10.86
definition: List hosts the classification for the activities according to the Council Regulation 3037 90 EEC
status: valid
status modified: 2016-06-08
accepted date: 2016-06-08
in scheme: NACEValue

Manufacture of other food products n e c
type: Concept
notation: 10.89
definition: List hosts the classification for the activities according to the Council Regulation 3037 90 EEC
status: valid
status modified: 2016-06-08
accepted date: 2016-06-08
in scheme: NACEValue

Manufacture of prepared feeds for farm animals
type: Concept
notation: 10.91
definition: List hosts the classification for the activities according to the Council Regulation 3037 90 EEC
status: valid
status modified: 2016-06-08
accepted date: 2016-06-08
in scheme: NACEValue

Manufacture of prepared pet foods
type: Concept
notation: 10.92
definition: List hosts the classification for the activities according to the Council Regulation 3037 90 EEC
status: valid
status modified: 2016-06-08
accepted date: 2016-06-08
in scheme: NACEValue

Distilling rectifying and blending of spirits
type: Concept
notation: 11.01
definition: List hosts the classification for the activities according to the Council Regulation 3037 90 EEC
status: valid
status modified: 2016-06-08
accepted date: 2016-06-08
in scheme: NACEValue

Manufacture of wine from grape
type: Concept
notation: 11.02
definition: List hosts the classification for the activities according to the Council Regulation 3037 90 EEC
status: valid
status modified: 2016-06-08
accepted date: 2016-06-08
in scheme: NACEValue

Manufacture of cider and other fruit wines
type: Concept
notation: 11.03
definition: List hosts the classification for the activities according to the Council Regulation 3037 90 EEC
status: valid
status modified: 2016-06-08
accepted date: 2016-06-08
in scheme: NACEValue

Manufacture of other non-distilled fermented beverages
type: Concept
notation: 11.04
definition: List hosts the classification for the activities according to the Council Regulation 3037 90 EEC
status: valid
status modified: 2016-06-08
accepted date: 2016-06-08
in scheme: NACEValue

Manufacture of beer
type: Concept
notation: 11.05
definition: List hosts the classification for the activities according to the Council Regulation 3037 90 EEC
status: valid
status modified: 2016-06-08
accepted date: 2016-06-08
in scheme: NACEValue

Manufacture of malt
type: Concept
notation: 11.06
definition: List hosts the classification for the activities according to the Council Regulation 3037 90 EEC
status: valid
status modified: 2016-06-08
accepted date: 2016-06-08
in scheme: NACEValue

Manufacture of soft drinks production of mineral waters and other bottled waters
type: Concept
notation: 11.07
definition: List hosts the classification for the activities according to the Council Regulation 3037 90 EEC
status: valid
status modified: 2016-06-08
accepted date: 2016-06-08
in scheme: NACEValue

Manufacture of tobacco products
type: Concept
notation: 12.00
definition: List hosts the classification for the activities according to the Council Regulation 3037 90 EEC
status: valid
status modified: 2016-06-08
accepted date: 2016-06-08
in scheme: NACEValue

Preparation and spinning of textile fibres
type: Concept
notation: 13.10
definition: List hosts the classification for the activities according to the Council Regulation 3037 90 EEC
status: valid
status modified: 2016-06-08
accepted date: 2016-06-08
in scheme: NACEValue

Weaving of textiles
type: Concept
notation: 13.20
definition: List hosts the classification for the activities according to the Council Regulation 3037 90 EEC
status: valid
status modified: 2016-06-08
accepted date: 2016-06-08
in scheme: NACEValue

Finishing of textiles
type: Concept
notation: 13.30
definition: List hosts the classification for the activities according to the Council Regulation 3037 90 EEC
status: valid
status modified: 2016-06-08
accepted date: 2016-06-08
in scheme: NACEValue

Manufacture of knitted and crocheted fabrics
type: Concept
notation: 13.91
definition: List hosts the classification for the activities according to the Council Regulation 3037 90 EEC
status: valid
status modified: 2016-06-08
accepted date: 2016-06-08
in scheme: NACEValue

Manufacture of made-up textile articles except apparel
type: Concept
notation: 13.92
definition: List hosts the classification for the activities according to the Council Regulation 3037 90 EEC
status: valid
status modified: 2016-06-08
accepted date: 2016-06-08
in scheme: NACEValue

Manufacture of carpets and rugs
type: Concept
notation: 13.93
definition: List hosts the classification for the activities according to the Council Regulation 3037 90 EEC
status: valid
status modified: 2016-06-08
accepted date: 2016-06-08
in scheme: NACEValue

Manufacture of cordage rope twine and netting
type: Concept
notation: 13.94
definition: List hosts the classification for the activities according to the Council Regulation 3037 90 EEC
status: valid
status modified: 2016-06-08
accepted date: 2016-06-08
in scheme: NACEValue

Manufacture of non-wovens and articles made from non-wovens except apparel
type: Concept
notation: 13.95
definition: List hosts the classification for the activities according to the Council Regulation 3037 90 EEC
status: valid
status modified: 2016-06-08
accepted date: 2016-06-08
in scheme: NACEValue

Manufacture of other technical and industrial textiles
type: Concept
notation: 13.96
definition: List hosts the classification for the activities according to the Council Regulation 3037 90 EEC
status: valid
status modified: 2016-06-08
accepted date: 2016-06-08
in scheme: NACEValue

Manufacture of other textiles n e c
type: Concept
notation: 13.99
definition: List hosts the classification for the activities according to the Council Regulation 3037 90 EEC
status: valid
status modified: 2016-06-08
accepted date: 2016-06-08
in scheme: NACEValue

Manufacture of leather clothes
type: Concept
notation: 14.11
definition: List hosts the classification for the activities according to the Council Regulation 3037 90 EEC
status: valid
status modified: 2016-06-08
accepted date: 2016-06-08
in scheme: NACEValue

Manufacture of workwear
type: Concept
notation: 14.12
definition: List hosts the classification for the activities according to the Council Regulation 3037 90 EEC
status: valid
status modified: 2016-06-08
accepted date: 2016-06-08
in scheme: NACEValue

Manufacture of other outerwear
type: Concept
notation: 14.13
definition: List hosts the classification for the activities according to the Council Regulation 3037 90 EEC
status: valid
status modified: 2016-06-08
accepted date: 2016-06-08
in scheme: NACEValue

Manufacture of underwear
type: Concept
notation: 14.14
definition: List hosts the classification for the activities according to the Council Regulation 3037 90 EEC
status: valid
status modified: 2016-06-08
accepted date: 2016-06-08
in scheme: NACEValue

Manufacture of other wearing apparel and accessories
type: Concept
notation: 14.19
definition: List hosts the classification for the activities according to the Council Regulation 3037 90 EEC
status: valid
status modified: 2016-06-08
accepted date: 2016-06-08
in scheme: NACEValue

Manufacture of articles of fur
type: Concept
notation: 14.20
definition: List hosts the classification for the activities according to the Council Regulation 3037 90 EEC
status: valid
status modified: 2016-06-08
accepted date: 2016-06-08
in scheme: NACEValue

Manufacture of knitted and crocheted hosiery
type: Concept
notation: 14.31
definition: List hosts the classification for the activities according to the Council Regulation 3037 90 EEC
status: valid
status modified: 2016-06-08
accepted date: 2016-06-08
in scheme: NACEValue

Manufacture of other knitted and crocheted apparel
type: Concept
notation: 14.39
definition: List hosts the classification for the activities according to the Council Regulation 3037 90 EEC
status: valid
status modified: 2016-06-08
accepted date: 2016-06-08
in scheme: NACEValue

Tanning and dressing of leather dressing and dyeing of fur
type: Concept
notation: 15.11
definition: List hosts the classification for the activities according to the Council Regulation 3037 90 EEC
status: valid
status modified: 2016-06-08
accepted date: 2016-06-08
in scheme: NACEValue

Manufacture of luggage handbags and the like saddlery and harness
type: Concept
notation: 15.12
definition: List hosts the classification for the activities according to the Council Regulation 3037 90 EEC
status: valid
status modified: 2016-06-08
accepted date: 2016-06-08
in scheme: NACEValue

Manufacture of footwear
type: Concept
notation: 15.20
definition: List hosts the classification for the activities according to the Council Regulation 3037 90 EEC
status: valid
status modified: 2016-06-08
accepted date: 2016-06-08
in scheme: NACEValue

Sawmilling and planing of wood
type: Concept
notation: 16.10
definition: List hosts the classification for the activities according to the Council Regulation 3037 90 EEC
status: valid
status modified: 2016-06-08
accepted date: 2016-06-08
in scheme: NACEValue

Manufacture of veneer sheets and wood-based panels
type: Concept
notation: 16.21
definition: List hosts the classification for the activities according to the Council Regulation 3037 90 EEC
status: valid
status modified: 2016-06-08
accepted date: 2016-06-08
in scheme: NACEValue

Manufacture of assembled parquet floors
type: Concept
notation: 16.22
definition: List hosts the classification for the activities according to the Council Regulation 3037 90 EEC
status: valid
status modified: 2016-06-08
accepted date: 2016-06-08
in scheme: NACEValue

Manufacture of other builders carpentry and joinery
type: Concept
notation: 16.23
definition: List hosts the classification for the activities according to the Council Regulation 3037 90 EEC
status: valid
status modified: 2016-06-08
accepted date: 2016-06-08
in scheme: NACEValue

Manufacture of wooden containers
type: Concept
notation: 16.24
definition: List hosts the classification for the activities according to the Council Regulation 3037 90 EEC
status: valid
status modified: 2016-06-08
accepted date: 2016-06-08
in scheme: NACEValue

Manufacture of other products of wood manufacture of articles of cork straw and plaiting materials
type: Concept
notation: 16.29
definition: List hosts the classification for the activities according to the Council Regulation 3037 90 EEC
status: valid
status modified: 2016-06-08
accepted date: 2016-06-08
in scheme: NACEValue

Manufacture of pulp
type: Concept
notation: 17.11
definition: List hosts the classification for the activities according to the Council Regulation 3037 90 EEC
status: valid
status modified: 2016-06-08
accepted date: 2016-06-08
in scheme: NACEValue

Manufacture of paper and paperboard
type: Concept
notation: 17.12
definition: List hosts the classification for the activities according to the Council Regulation 3037 90 EEC
status: valid
status modified: 2016-06-08
accepted date: 2016-06-08
in scheme: NACEValue

Manufacture of corrugated paper and paperboard and of containers of paper and paperboard
type: Concept
notation: 17.21
definition: List hosts the classification for the activities according to the Council Regulation 3037 90 EEC
status: valid
status modified: 2016-06-08
accepted date: 2016-06-08
in scheme: NACEValue

Manufacture of household and sanitary goods and of toilet requisites
type: Concept
notation: 17.22
definition: List hosts the classification for the activities according to the Council Regulation 3037 90 EEC
status: valid
status modified: 2016-06-08
accepted date: 2016-06-08
in scheme: NACEValue

Manufacture of paper stationery
type: Concept
notation: 17.23
definition: List hosts the classification for the activities according to the Council Regulation 3037 90 EEC
status: valid
status modified: 2016-06-08
accepted date: 2016-06-08
in scheme: NACEValue

Manufacture of wallpaper
type: Concept
notation: 17.24
definition: List hosts the classification for the activities according to the Council Regulation 3037 90 EEC
status: valid
status modified: 2016-06-08
accepted date: 2016-06-08
in scheme: NACEValue

Manufacture of other articles of paper and paperboard
type: Concept
notation: 17.29
definition: List hosts the classification for the activities according to the Council Regulation 3037 90 EEC
status: valid
status modified: 2016-06-08
accepted date: 2016-06-08
in scheme: NACEValue

Printing of newspapers
type: Concept
notation: 18.11
definition: List hosts the classification for the activities according to the Council Regulation 3037 90 EEC
status: valid
status modified: 2016-06-08
accepted date: 2016-06-08
in scheme: NACEValue

Other printing
type: Concept
notation: 18.12
definition: List hosts the classification for the activities according to the Council Regulation 3037 90 EEC
status: valid
status modified: 2016-06-08
accepted date: 2016-06-08
in scheme: NACEValue

Pre-press and pre-media services
type: Concept
notation: 18.13
definition: List hosts the classification for the activities according to the Council Regulation 3037 90 EEC
status: valid
status modified: 2016-06-08
accepted date: 2016-06-08
in scheme: NACEValue

Binding and related services
type: Concept
notation: 18.14
definition: List hosts the classification for the activities according to the Council Regulation 3037 90 EEC
status: valid
status modified: 2016-06-08
accepted date: 2016-06-08
in scheme: NACEValue

Reproduction of recorded media
type: Concept
notation: 18.20
definition: List hosts the classification for the activities according to the Council Regulation 3037 90 EEC
status: valid
status modified: 2016-06-08
accepted date: 2016-06-08
in scheme: NACEValue

Manufacture of coke oven products
type: Concept
notation: 19.10
definition: List hosts the classification for the activities according to the Council Regulation 3037 90 EEC
status: valid
status modified: 2016-06-08
accepted date: 2016-06-08
in scheme: NACEValue

Manufacture of refined petroleum products
type: Concept
notation: 19.20
definition: List hosts the classification for the activities according to the Council Regulation 3037 90 EEC
status: valid
status modified: 2016-06-08
accepted date: 2016-06-08
in scheme: NACEValue

Manufacture of industrial gases
type: Concept
notation: 20.11
definition: List hosts the classification for the activities according to the Council Regulation 3037 90 EEC
status: valid
status modified: 2016-06-08
accepted date: 2016-06-08
in scheme: NACEValue

Manufacture of dyes and pigments
type: Concept
notation: 20.12
definition: List hosts the classification for the activities according to the Council Regulation 3037 90 EEC
status: valid
status modified: 2016-06-08
accepted date: 2016-06-08
in scheme: NACEValue

Manufacture of other inorganic basic chemicals
type: Concept
notation: 20.13
definition: List hosts the classification for the activities according to the Council Regulation 3037 90 EEC
status: valid
status modified: 2016-06-08
accepted date: 2016-06-08
in scheme: NACEValue

Manufacture of other organic basic chemicals
type: Concept
notation: 20.14
definition: List hosts the classification for the activities according to the Council Regulation 3037 90 EEC
status: valid
status modified: 2016-06-08
accepted date: 2016-06-08
in scheme: NACEValue

Manufacture of fertilisers and nitrogen compounds
type: Concept
notation: 20.15
definition: List hosts the classification for the activities according to the Council Regulation 3037 90 EEC
status: valid
status modified: 2016-06-08
accepted date: 2016-06-08
in scheme: NACEValue

Manufacture of plastics in primary forms
type: Concept
notation: 20.16
definition: List hosts the classification for the activities according to the Council Regulation 3037 90 EEC
status: valid
status modified: 2016-06-08
accepted date: 2016-06-08
in scheme: NACEValue

Manufacture of synthetic rubber in primary forms
type: Concept
notation: 20.17
definition: List hosts the classification for the activities according to the Council Regulation 3037 90 EEC
status: valid
status modified: 2016-06-08
accepted date: 2016-06-08
in scheme: NACEValue

Manufacture of pesticides and other agrochemical products
type: Concept
notation: 20.20
definition: List hosts the classification for the activities according to the Council Regulation 3037 90 EEC
status: valid
status modified: 2016-06-08
accepted date: 2016-06-08
in scheme: NACEValue

Manufacture of paints varnishes and similar coatings printing ink and mastics
type: Concept
notation: 20.30
definition: List hosts the classification for the activities according to the Council Regulation 3037 90 EEC
status: valid
status modified: 2016-06-08
accepted date: 2016-06-08
in scheme: NACEValue

Manufacture of soap and detergents cleaning and polishing preparations
type: Concept
notation: 20.41
definition: List hosts the classification for the activities according to the Council Regulation 3037 90 EEC
status: valid
status modified: 2016-06-08
accepted date: 2016-06-08
in scheme: NACEValue

Manufacture of perfumes and toilet preparations
type: Concept
notation: 20.42
definition: List hosts the classification for the activities according to the Council Regulation 3037 90 EEC
status: valid
status modified: 2016-06-08
accepted date: 2016-06-08
in scheme: NACEValue

Manufacture of explosives
type: Concept
notation: 20.51
definition: List hosts the classification for the activities according to the Council Regulation 3037 90 EEC
status: valid
status modified: 2016-06-08
accepted date: 2016-06-08
in scheme: NACEValue

Manufacture of glues
type: Concept
notation: 20.52
definition: List hosts the classification for the activities according to the Council Regulation 3037 90 EEC
status: valid
status modified: 2016-06-08
accepted date: 2016-06-08
in scheme: NACEValue

Manufacture of essential oils
type: Concept
notation: 20.53
definition: List hosts the classification for the activities according to the Council Regulation 3037 90 EEC
status: valid
status modified: 2016-06-08
accepted date: 2016-06-08
in scheme: NACEValue

Manufacture of other chemical products n e c
type: Concept
notation: 20.59
definition: List hosts the classification for the activities according to the Council Regulation 3037 90 EEC
status: valid
status modified: 2016-06-08
accepted date: 2016-06-08
in scheme: NACEValue

Manufacture of man-made fibres
type: Concept
notation: 20.60
definition: List hosts the classification for the activities according to the Council Regulation 3037 90 EEC
status: valid
status modified: 2016-06-08
accepted date: 2016-06-08
in scheme: NACEValue

Manufacture of basic pharmaceutical products
type: Concept
notation: 21.10
definition: List hosts the classification for the activities according to the Council Regulation 3037 90 EEC
status: valid
status modified: 2016-06-08
accepted date: 2016-06-08
in scheme: NACEValue

Manufacture of pharmaceutical preparations
type: Concept
notation: 21.20
definition: List hosts the classification for the activities according to the Council Regulation 3037 90 EEC
status: valid
status modified: 2016-06-08
accepted date: 2016-06-08
in scheme: NACEValue

Manufacture of rubber tyres and tubes retreading and rebuilding of rubber tyres
type: Concept
notation: 22.11
definition: List hosts the classification for the activities according to the Council Regulation 3037 90 EEC
status: valid
status modified: 2016-06-08
accepted date: 2016-06-08
in scheme: NACEValue

Manufacture of other rubber products
type: Concept
notation: 22.19
definition: List hosts the classification for the activities according to the Council Regulation 3037 90 EEC
status: valid
status modified: 2016-06-08
accepted date: 2016-06-08
in scheme: NACEValue

Manufacture of plastic plates sheets tubes and profiles
type: Concept
notation: 22.21
definition: List hosts the classification for the activities according to the Council Regulation 3037 90 EEC
status: valid
status modified: 2016-06-08
accepted date: 2016-06-08
in scheme: NACEValue

Manufacture of plastic packing goods
type: Concept
notation: 22.22
definition: List hosts the classification for the activities according to the Council Regulation 3037 90 EEC
status: valid
status modified: 2016-06-08
accepted date: 2016-06-08
in scheme: NACEValue

Manufacture of builders’ ware of plastic
type: Concept
notation: 22.23
definition: List hosts the classification for the activities according to the Council Regulation 3037 90 EEC
status: valid
status modified: 2016-06-08
accepted date: 2016-06-08
in scheme: NACEValue

Manufacture of other plastic products
type: Concept
notation: 22.29
definition: List hosts the classification for the activities according to the Council Regulation 3037 90 EEC
status: valid
status modified: 2016-06-08
accepted date: 2016-06-08
in scheme: NACEValue

Manufacture of flat glass
type: Concept
notation: 23.11
definition: List hosts the classification for the activities according to the Council Regulation 3037 90 EEC
status: valid
status modified: 2016-06-08
accepted date: 2016-06-08
in scheme: NACEValue

Shaping and processing of flat glass
type: Concept
notation: 23.12
definition: List hosts the classification for the activities according to the Council Regulation 3037 90 EEC
status: valid
status modified: 2016-06-08
accepted date: 2016-06-08
in scheme: NACEValue

Manufacture of hollow glass
type: Concept
notation: 23.13
definition: List hosts the classification for the activities according to the Council Regulation 3037 90 EEC
status: valid
status modified: 2016-06-08
accepted date: 2016-06-08
in scheme: NACEValue

Manufacture of glass fibres
type: Concept
notation: 23.14
definition: List hosts the classification for the activities according to the Council Regulation 3037 90 EEC
status: valid
status modified: 2016-06-08
accepted date: 2016-06-08
in scheme: NACEValue

Manufacture and processing of other glass including technical glassware
type: Concept
notation: 23.19
definition: List hosts the classification for the activities according to the Council Regulation 3037 90 EEC
status: valid
status modified: 2016-06-08
accepted date: 2016-06-08
in scheme: NACEValue

Manufacture of refractory products
type: Concept
notation: 23.20
definition: List hosts the classification for the activities according to the Council Regulation 3037 90 EEC
status: valid
status modified: 2016-06-08
accepted date: 2016-06-08
in scheme: NACEValue

Manufacture of ceramic tiles and flags
type: Concept
notation: 23.31
definition: List hosts the classification for the activities according to the Council Regulation 3037 90 EEC
status: valid
status modified: 2016-06-08
accepted date: 2016-06-08
in scheme: NACEValue

Manufacture of bricks tiles and construction products in baked clay
type: Concept
notation: 23.32
definition: List hosts the classification for the activities according to the Council Regulation 3037 90 EEC
status: valid
status modified: 2016-06-08
accepted date: 2016-06-08
in scheme: NACEValue

Manufacture of ceramic household and ornamental articles
type: Concept
notation: 23.41
definition: List hosts the classification for the activities according to the Council Regulation 3037 90 EEC
status: valid
status modified: 2016-06-08
accepted date: 2016-06-08
in scheme: NACEValue

Manufacture of ceramic sanitary fixtures
type: Concept
notation: 23.42
definition: List hosts the classification for the activities according to the Council Regulation 3037 90 EEC
status: valid
status modified: 2016-06-08
accepted date: 2016-06-08
in scheme: NACEValue

Manufacture of ceramic insulators and insulating fittings
type: Concept
notation: 23.43
definition: List hosts the classification for the activities according to the Council Regulation 3037 90 EEC
status: valid
status modified: 2016-06-08
accepted date: 2016-06-08
in scheme: NACEValue

Manufacture of other technical ceramic products
type: Concept
notation: 23.44
definition: List hosts the classification for the activities according to the Council Regulation 3037 90 EEC
status: valid
status modified: 2016-06-08
accepted date: 2016-06-08
in scheme: NACEValue

Manufacture of other ceramic products
type: Concept
notation: 23.49
definition: List hosts the classification for the activities according to the Council Regulation 3037 90 EEC
status: valid
status modified: 2016-06-08
accepted date: 2016-06-08
in scheme: NACEValue

Manufacture of cement
type: Concept
notation: 23.51
definition: List hosts the classification for the activities according to the Council Regulation 3037 90 EEC
status: valid
status modified: 2016-06-08
accepted date: 2016-06-08
in scheme: NACEValue

Manufacture of lime and plaster
type: Concept
notation: 23.52
definition: List hosts the classification for the activities according to the Council Regulation 3037 90 EEC
status: valid
status modified: 2016-06-08
accepted date: 2016-06-08
in scheme: NACEValue

Manufacture of concrete products for construction purposes
type: Concept
notation: 23.61
definition: List hosts the classification for the activities according to the Council Regulation 3037 90 EEC
status: valid
status modified: 2016-06-08
accepted date: 2016-06-08
in scheme: NACEValue

Manufacture of plaster products for construction purposes
type: Concept
notation: 23.62
definition: List hosts the classification for the activities according to the Council Regulation 3037 90 EEC
status: valid
status modified: 2016-06-08
accepted date: 2016-06-08
in scheme: NACEValue

Manufacture of ready-mixed concrete
type: Concept
notation: 23.63
definition: List hosts the classification for the activities according to the Council Regulation 3037 90 EEC
status: valid
status modified: 2016-06-08
accepted date: 2016-06-08
in scheme: NACEValue

Manufacture of mortars
type: Concept
notation: 23.64
definition: List hosts the classification for the activities according to the Council Regulation 3037 90 EEC
status: valid
status modified: 2016-06-08
accepted date: 2016-06-08
in scheme: NACEValue

Manufacture of fibre cement
type: Concept
notation: 23.65
definition: List hosts the classification for the activities according to the Council Regulation 3037 90 EEC
status: valid
status modified: 2016-06-08
accepted date: 2016-06-08
in scheme: NACEValue

Manufacture of other articles of concrete plaster and cement
type: Concept
notation: 23.69
definition: List hosts the classification for the activities according to the Council Regulation 3037 90 EEC
status: valid
status modified: 2016-06-08
accepted date: 2016-06-08
in scheme: NACEValue

Cutting shaping and finishing of stone
type: Concept
notation: 23.70
definition: List hosts the classification for the activities according to the Council Regulation 3037 90 EEC
status: valid
status modified: 2016-06-08
accepted date: 2016-06-08
in scheme: NACEValue

Production of abrasive products
type: Concept
notation: 23.91
definition: List hosts the classification for the activities according to the Council Regulation 3037 90 EEC
status: valid
status modified: 2016-06-08
accepted date: 2016-06-08
in scheme: NACEValue

Manufacture of other non-metallic mineral products n e c
type: Concept
notation: 23.99
definition: List hosts the classification for the activities according to the Council Regulation 3037 90 EEC
status: valid
status modified: 2016-06-08
accepted date: 2016-06-08
in scheme: NACEValue

Manufacture of basic iron and steel and of ferro-alloys
type: Concept
notation: 24.10
definition: List hosts the classification for the activities according to the Council Regulation 3037 90 EEC
status: valid
status modified: 2016-06-08
accepted date: 2016-06-08
in scheme: NACEValue

Manufacture of tubes pipes hollow profiles and related fittings of steel
type: Concept
notation: 24.20
definition: List hosts the classification for the activities according to the Council Regulation 3037 90 EEC
status: valid
status modified: 2016-06-08
accepted date: 2016-06-08
in scheme: NACEValue

Cold drawing of bars
type: Concept
notation: 24.31
definition: List hosts the classification for the activities according to the Council Regulation 3037 90 EEC
status: valid
status modified: 2016-06-08
accepted date: 2016-06-08
in scheme: NACEValue

Cold rolling of narrow strip
type: Concept
notation: 24.32
definition: List hosts the classification for the activities according to the Council Regulation 3037 90 EEC
status: valid
status modified: 2016-06-08
accepted date: 2016-06-08
in scheme: NACEValue

Cold forming or folding
type: Concept
notation: 24.33
definition: List hosts the classification for the activities according to the Council Regulation 3037 90 EEC
status: valid
status modified: 2016-06-08
accepted date: 2016-06-08
in scheme: NACEValue

Cold drawing of wire
type: Concept
notation: 24.34
definition: List hosts the classification for the activities according to the Council Regulation 3037 90 EEC
status: valid
status modified: 2016-06-08
accepted date: 2016-06-08
in scheme: NACEValue

Precious metals production
type: Concept
notation: 24.41
definition: List hosts the classification for the activities according to the Council Regulation 3037 90 EEC
status: valid
status modified: 2016-06-08
accepted date: 2016-06-08
in scheme: NACEValue

Aluminium production
type: Concept
notation: 24.42
definition: List hosts the classification for the activities according to the Council Regulation 3037 90 EEC
status: valid
status modified: 2016-06-08
accepted date: 2016-06-08
in scheme: NACEValue

Lead zinc and tin production
type: Concept
notation: 24.43
definition: List hosts the classification for the activities according to the Council Regulation 3037 90 EEC
status: valid
status modified: 2016-06-08
accepted date: 2016-06-08
in scheme: NACEValue

Copper production
type: Concept
notation: 24.44
definition: List hosts the classification for the activities according to the Council Regulation 3037 90 EEC
status: valid
status modified: 2016-06-08
accepted date: 2016-06-08
in scheme: NACEValue

Other non-ferrous metal production
type: Concept
notation: 24.45
definition: List hosts the classification for the activities according to the Council Regulation 3037 90 EEC
status: valid
status modified: 2016-06-08
accepted date: 2016-06-08
in scheme: NACEValue

Processing of nuclear fuel
type: Concept
notation: 24.46
definition: List hosts the classification for the activities according to the Council Regulation 3037 90 EEC
status: valid
status modified: 2016-06-08
accepted date: 2016-06-08
in scheme: NACEValue

Casting of iron
type: Concept
notation: 24.51
definition: List hosts the classification for the activities according to the Council Regulation 3037 90 EEC
status: valid
status modified: 2016-06-08
accepted date: 2016-06-08
in scheme: NACEValue

Casting of steel
type: Concept
notation: 24.52
definition: List hosts the classification for the activities according to the Council Regulation 3037 90 EEC
status: valid
status modified: 2016-06-08
accepted date: 2016-06-08
in scheme: NACEValue

Casting of light metals
type: Concept
notation: 24.53
definition: List hosts the classification for the activities according to the Council Regulation 3037 90 EEC
status: valid
status modified: 2016-06-08
accepted date: 2016-06-08
in scheme: NACEValue

Casting of other non-ferrous metals
type: Concept
notation: 24.54
definition: List hosts the classification for the activities according to the Council Regulation 3037 90 EEC
status: valid
status modified: 2016-06-08
accepted date: 2016-06-08
in scheme: NACEValue

Manufacture of metal structures and parts of structures
type: Concept
notation: 25.11
definition: List hosts the classification for the activities according to the Council Regulation 3037 90 EEC
status: valid
status modified: 2016-06-08
accepted date: 2016-06-08
in scheme: NACEValue

Manufacture of doors and windows of metal
type: Concept
notation: 25.12
definition: List hosts the classification for the activities according to the Council Regulation 3037 90 EEC
status: valid
status modified: 2016-06-08
accepted date: 2016-06-08
in scheme: NACEValue

Manufacture of central heating radiators and boilers
type: Concept
notation: 25.21
definition: List hosts the classification for the activities according to the Council Regulation 3037 90 EEC
status: valid
status modified: 2016-06-08
accepted date: 2016-06-08
in scheme: NACEValue

Manufacture of other tanks reservoirs and containers of metal
type: Concept
notation: 25.29
definition: List hosts the classification for the activities according to the Council Regulation 3037 90 EEC
status: valid
status modified: 2016-06-08
accepted date: 2016-06-08
in scheme: NACEValue

Manufacture of steam generators except central heating hot water boilers
type: Concept
notation: 25.30
definition: List hosts the classification for the activities according to the Council Regulation 3037 90 EEC
status: valid
status modified: 2016-06-08
accepted date: 2016-06-08
in scheme: NACEValue

Manufacture of weapons and ammunition
type: Concept
notation: 25.40
definition: List hosts the classification for the activities according to the Council Regulation 3037 90 EEC
status: valid
status modified: 2016-06-08
accepted date: 2016-06-08
in scheme: NACEValue

Forging pressing stamping and roll-forming of metal powder metallurgy
type: Concept
notation: 25.50
definition: List hosts the classification for the activities according to the Council Regulation 3037 90 EEC
status: valid
status modified: 2016-06-08
accepted date: 2016-06-08
in scheme: NACEValue

Treatment and coating of metals
type: Concept
notation: 25.61
definition: List hosts the classification for the activities according to the Council Regulation 3037 90 EEC
status: valid
status modified: 2016-06-08
accepted date: 2016-06-08
in scheme: NACEValue

Machining
type: Concept
notation: 25.62
definition: List hosts the classification for the activities according to the Council Regulation 3037 90 EEC
status: valid
status modified: 2016-06-08
accepted date: 2016-06-08
in scheme: NACEValue

Manufacture of cutlery
type: Concept
notation: 25.71
definition: List hosts the classification for the activities according to the Council Regulation 3037 90 EEC
status: valid
status modified: 2016-06-08
accepted date: 2016-06-08
in scheme: NACEValue

Manufacture of locks and hinges
type: Concept
notation: 25.72
definition: List hosts the classification for the activities according to the Council Regulation 3037 90 EEC
status: valid
status modified: 2016-06-08
accepted date: 2016-06-08
in scheme: NACEValue

Manufacture of tools
type: Concept
notation: 25.73
definition: List hosts the classification for the activities according to the Council Regulation 3037 90 EEC
status: valid
status modified: 2016-06-08
accepted date: 2016-06-08
in scheme: NACEValue

Manufacture of steel drums and similar containers
type: Concept
notation: 25.91
definition: List hosts the classification for the activities according to the Council Regulation 3037 90 EEC
status: valid
status modified: 2016-06-08
accepted date: 2016-06-08
in scheme: NACEValue

Manufacture of light metal packaging
type: Concept
notation: 25.92
definition: List hosts the classification for the activities according to the Council Regulation 3037 90 EEC
status: valid
status modified: 2016-06-08
accepted date: 2016-06-08
in scheme: NACEValue

Manufacture of wire products chain and springs
type: Concept
notation: 25.93
definition: List hosts the classification for the activities according to the Council Regulation 3037 90 EEC
status: valid
status modified: 2016-06-08
accepted date: 2016-06-08
in scheme: NACEValue

Manufacture of fasteners and screw machine products
type: Concept
notation: 25.94
definition: List hosts the classification for the activities according to the Council Regulation 3037 90 EEC
status: valid
status modified: 2016-06-08
accepted date: 2016-06-08
in scheme: NACEValue

Manufacture of other fabricated metal products n e c
type: Concept
notation: 25.99
definition: List hosts the classification for the activities according to the Council Regulation 3037 90 EEC
status: valid
status modified: 2016-06-08
accepted date: 2016-06-08
in scheme: NACEValue

Manufacture of electronic components
type: Concept
notation: 26.11
definition: List hosts the classification for the activities according to the Council Regulation 3037 90 EEC
status: valid
status modified: 2016-06-08
accepted date: 2016-06-08
in scheme: NACEValue

Manufacture of loaded electronic boards
type: Concept
notation: 26.12
definition: List hosts the classification for the activities according to the Council Regulation 3037 90 EEC
status: valid
status modified: 2016-06-08
accepted date: 2016-06-08
in scheme: NACEValue

Manufacture of computers and peripheral equipment
type: Concept
notation: 26.20
definition: List hosts the classification for the activities according to the Council Regulation 3037 90 EEC
status: valid
status modified: 2016-06-08
accepted date: 2016-06-08
in scheme: NACEValue

Manufacture of communication equipment
type: Concept
notation: 26.30
definition: List hosts the classification for the activities according to the Council Regulation 3037 90 EEC
status: valid
status modified: 2016-06-08
accepted date: 2016-06-08
in scheme: NACEValue

Manufacture of consumer electronics
type: Concept
notation: 26.40
definition: List hosts the classification for the activities according to the Council Regulation 3037 90 EEC
status: valid
status modified: 2016-06-08
accepted date: 2016-06-08
in scheme: NACEValue

Manufacture of instruments and appliances for measuring testing and navigation
type: Concept
notation: 26.51
definition: List hosts the classification for the activities according to the Council Regulation 3037 90 EEC
status: valid
status modified: 2016-06-08
accepted date: 2016-06-08
in scheme: NACEValue

Manufacture of watches and clocks
type: Concept
notation: 26.52
definition: List hosts the classification for the activities according to the Council Regulation 3037 90 EEC
status: valid
status modified: 2016-06-08
accepted date: 2016-06-08
in scheme: NACEValue

Manufacture of irradiation electromedical and electrotherapeutic equipment
type: Concept
notation: 26.60
definition: List hosts the classification for the activities according to the Council Regulation 3037 90 EEC
status: valid
status modified: 2016-06-08
accepted date: 2016-06-08
in scheme: NACEValue

Manufacture of optical instruments and photographic equipment
type: Concept
notation: 26.70
definition: List hosts the classification for the activities according to the Council Regulation 3037 90 EEC
status: valid
status modified: 2016-06-08
accepted date: 2016-06-08
in scheme: NACEValue

Manufacture of magnetic and optical media
type: Concept
notation: 26.80
definition: List hosts the classification for the activities according to the Council Regulation 3037 90 EEC
status: valid
status modified: 2016-06-08
accepted date: 2016-06-08
in scheme: NACEValue

Manufacture of electric motors generators and transformers
type: Concept
notation: 27.11
definition: List hosts the classification for the activities according to the Council Regulation 3037 90 EEC
status: valid
status modified: 2016-06-08
accepted date: 2016-06-08
in scheme: NACEValue

Manufacture of electricity distribution and control apparatus
type: Concept
notation: 27.12
definition: List hosts the classification for the activities according to the Council Regulation 3037 90 EEC
status: valid
status modified: 2016-06-08
accepted date: 2016-06-08
in scheme: NACEValue

Manufacture of batteries and accumulators
type: Concept
notation: 27.20
definition: List hosts the classification for the activities according to the Council Regulation 3037 90 EEC
status: valid
status modified: 2016-06-08
accepted date: 2016-06-08
in scheme: NACEValue

Manufacture of fibre optic cables
type: Concept
notation: 27.31
definition: List hosts the classification for the activities according to the Council Regulation 3037 90 EEC
status: valid
status modified: 2016-06-08
accepted date: 2016-06-08
in scheme: NACEValue

Manufacture of other electronic and electric wires and cables
type: Concept
notation: 27.32
definition: List hosts the classification for the activities according to the Council Regulation 3037 90 EEC
status: valid
status modified: 2016-06-08
accepted date: 2016-06-08
in scheme: NACEValue

Manufacture of wiring devices
type: Concept
notation: 27.33
definition: List hosts the classification for the activities according to the Council Regulation 3037 90 EEC
status: valid
status modified: 2016-06-08
accepted date: 2016-06-08
in scheme: NACEValue

Manufacture of electric lighting equipment
type: Concept
notation: 27.40
definition: List hosts the classification for the activities according to the Council Regulation 3037 90 EEC
status: valid
status modified: 2016-06-08
accepted date: 2016-06-08
in scheme: NACEValue

Manufacture of electric domestic appliances
type: Concept
notation: 27.51
definition: List hosts the classification for the activities according to the Council Regulation 3037 90 EEC
status: valid
status modified: 2016-06-08
accepted date: 2016-06-08
in scheme: NACEValue

Manufacture of non-electric domestic appliances
type: Concept
notation: 27.52
definition: List hosts the classification for the activities according to the Council Regulation 3037 90 EEC
status: valid
status modified: 2016-06-08
accepted date: 2016-06-08
in scheme: NACEValue

Manufacture of other electrical equipment
type: Concept
notation: 27.90
definition: List hosts the classification for the activities according to the Council Regulation 3037 90 EEC
status: valid
status modified: 2016-06-08
accepted date: 2016-06-08
in scheme: NACEValue

Manufacture of engines and turbines except aircraft vehicle and cycle engines
type: Concept
notation: 28.11
definition: List hosts the classification for the activities according to the Council Regulation 3037 90 EEC
status: valid
status modified: 2016-06-08
accepted date: 2016-06-08
in scheme: NACEValue

Manufacture of fluid power equipment
type: Concept
notation: 28.12
definition: List hosts the classification for the activities according to the Council Regulation 3037 90 EEC
status: valid
status modified: 2016-06-08
accepted date: 2016-06-08
in scheme: NACEValue

Manufacture of other pumps and compressors
type: Concept
notation: 28.13
definition: List hosts the classification for the activities according to the Council Regulation 3037 90 EEC
status: valid
status modified: 2016-06-08
accepted date: 2016-06-08
in scheme: NACEValue

Manufacture of other taps and valves
type: Concept
notation: 28.14
definition: List hosts the classification for the activities according to the Council Regulation 3037 90 EEC
status: valid
status modified: 2016-06-08
accepted date: 2016-06-08
in scheme: NACEValue

Manufacture of bearings gears gearing and driving elements
type: Concept
notation: 28.15
definition: List hosts the classification for the activities according to the Council Regulation 3037 90 EEC
status: valid
status modified: 2016-06-08
accepted date: 2016-06-08
in scheme: NACEValue

Manufacture of ovens furnaces and furnace burners
type: Concept
notation: 28.21
definition: List hosts the classification for the activities according to the Council Regulation 3037 90 EEC
status: valid
status modified: 2016-06-08
accepted date: 2016-06-08
in scheme: NACEValue

Manufacture of lifting and handling equipment
type: Concept
notation: 28.22
definition: List hosts the classification for the activities according to the Council Regulation 3037 90 EEC
status: valid
status modified: 2016-06-08
accepted date: 2016-06-08
in scheme: NACEValue

Manufacture of office machinery and equipment except computers and peripheral equipment
type: Concept
notation: 28.23
definition: List hosts the classification for the activities according to the Council Regulation 3037 90 EEC
status: valid
status modified: 2016-06-08
accepted date: 2016-06-08
in scheme: NACEValue

Manufacture of power-driven hand tools
type: Concept
notation: 28.24
definition: List hosts the classification for the activities according to the Council Regulation 3037 90 EEC
status: valid
status modified: 2016-06-08
accepted date: 2016-06-08
in scheme: NACEValue

Manufacture of non-domestic cooling and ventilation equipment
type: Concept
notation: 28.25
definition: List hosts the classification for the activities according to the Council Regulation 3037 90 EEC
status: valid
status modified: 2016-06-08
accepted date: 2016-06-08
in scheme: NACEValue

Manufacture of other general-purpose machinery n e c
type: Concept
notation: 28.29
definition: List hosts the classification for the activities according to the Council Regulation 3037 90 EEC
status: valid
status modified: 2016-06-08
accepted date: 2016-06-08
in scheme: NACEValue

Manufacture of agricultural and forestry machinery
type: Concept
notation: 28.30
definition: List hosts the classification for the activities according to the Council Regulation 3037 90 EEC
status: valid
status modified: 2016-06-08
accepted date: 2016-06-08
in scheme: NACEValue

Manufacture of metal forming machinery
type: Concept
notation: 28.41
definition: List hosts the classification for the activities according to the Council Regulation 3037 90 EEC
status: valid
status modified: 2016-06-08
accepted date: 2016-06-08
in scheme: NACEValue

Manufacture of other machine tools
type: Concept
notation: 28.49
definition: List hosts the classification for the activities according to the Council Regulation 3037 90 EEC
status: valid
status modified: 2016-06-08
accepted date: 2016-06-08
in scheme: NACEValue

Manufacture of machinery for metallurgy
type: Concept
notation: 28.91
definition: List hosts the classification for the activities according to the Council Regulation 3037 90 EEC
status: valid
status modified: 2016-06-08
accepted date: 2016-06-08
in scheme: NACEValue

Manufacture of machinery for mining quarrying and construction
type: Concept
notation: 28.92
definition: List hosts the classification for the activities according to the Council Regulation 3037 90 EEC
status: valid
status modified: 2016-06-08
accepted date: 2016-06-08
in scheme: NACEValue

Manufacture of machinery for food beverage and tobacco processing
type: Concept
notation: 28.93
definition: List hosts the classification for the activities according to the Council Regulation 3037 90 EEC
status: valid
status modified: 2016-06-08
accepted date: 2016-06-08
in scheme: NACEValue

Manufacture of machinery for textile apparel and leather production
type: Concept
notation: 28.94
definition: List hosts the classification for the activities according to the Council Regulation 3037 90 EEC
status: valid
status modified: 2016-06-08
accepted date: 2016-06-08
in scheme: NACEValue

Manufacture of machinery for paper and paperboard production
type: Concept
notation: 28.95
definition: List hosts the classification for the activities according to the Council Regulation 3037 90 EEC
status: valid
status modified: 2016-06-08
accepted date: 2016-06-08
in scheme: NACEValue

Manufacture of plastics and rubber machinery
type: Concept
notation: 28.96
definition: List hosts the classification for the activities according to the Council Regulation 3037 90 EEC
status: valid
status modified: 2016-06-08
accepted date: 2016-06-08
in scheme: NACEValue

Manufacture of other special-purpose machinery n e c
type: Concept
notation: 28.99
definition: List hosts the classification for the activities according to the Council Regulation 3037 90 EEC
status: valid
status modified: 2016-06-08
accepted date: 2016-06-08
in scheme: NACEValue

Manufacture of motor vehicles
type: Concept
notation: 29.10
definition: List hosts the classification for the activities according to the Council Regulation 3037 90 EEC
status: valid
status modified: 2016-06-08
accepted date: 2016-06-08
in scheme: NACEValue

Manufacture of bodies coachwork for motor vehicles manufacture of trailers and semi-trailers
type: Concept
notation: 29.20
definition: List hosts the classification for the activities according to the Council Regulation 3037 90 EEC
status: valid
status modified: 2016-06-08
accepted date: 2016-06-08
in scheme: NACEValue

Manufacture of electrical and electronic equipment for motor vehicles
type: Concept
notation: 29.31
definition: List hosts the classification for the activities according to the Council Regulation 3037 90 EEC
status: valid
status modified: 2016-06-08
accepted date: 2016-06-08
in scheme: NACEValue

Manufacture of other parts and accessories for motor vehicles
type: Concept
notation: 29.32
definition: List hosts the classification for the activities according to the Council Regulation 3037 90 EEC
status: valid
status modified: 2016-06-08
accepted date: 2016-06-08
in scheme: NACEValue

Building of ships and floating structures
type: Concept
notation: 30.11
definition: List hosts the classification for the activities according to the Council Regulation 3037 90 EEC
status: valid
status modified: 2016-06-08
accepted date: 2016-06-08
in scheme: NACEValue

Building of pleasure and sporting boats
type: Concept
notation: 30.12
definition: List hosts the classification for the activities according to the Council Regulation 3037 90 EEC
status: valid
status modified: 2016-06-08
accepted date: 2016-06-08
in scheme: NACEValue

Manufacture of railway locomotives and rolling stock
type: Concept
notation: 30.20
definition: List hosts the classification for the activities according to the Council Regulation 3037 90 EEC
status: valid
status modified: 2016-06-08
accepted date: 2016-06-08
in scheme: NACEValue

Manufacture of air and spacecraft and related machinery
type: Concept
notation: 30.30
definition: List hosts the classification for the activities according to the Council Regulation 3037 90 EEC
status: valid
status modified: 2016-06-08
accepted date: 2016-06-08
in scheme: NACEValue

Manufacture of military fighting vehicles
type: Concept
notation: 30.40
definition: List hosts the classification for the activities according to the Council Regulation 3037 90 EEC
status: valid
status modified: 2016-06-08
accepted date: 2016-06-08
in scheme: NACEValue

Manufacture of motorcycles
type: Concept
notation: 30.91
definition: List hosts the classification for the activities according to the Council Regulation 3037 90 EEC
status: valid
status modified: 2016-06-08
accepted date: 2016-06-08
in scheme: NACEValue

Manufacture of bicycles and invalid carriages
type: Concept
notation: 30.92
definition: List hosts the classification for the activities according to the Council Regulation 3037 90 EEC
status: valid
status modified: 2016-06-08
accepted date: 2016-06-08
in scheme: NACEValue

Manufacture of other transport equipment n e c
type: Concept
notation: 30.99
definition: List hosts the classification for the activities according to the Council Regulation 3037 90 EEC
status: valid
status modified: 2016-06-08
accepted date: 2016-06-08
in scheme: NACEValue

Manufacture of office and shop furniture
type: Concept
notation: 31.01
definition: List hosts the classification for the activities according to the Council Regulation 3037 90 EEC
status: valid
status modified: 2016-06-08
accepted date: 2016-06-08
in scheme: NACEValue

Manufacture of kitchen furniture
type: Concept
notation: 31.02
definition: List hosts the classification for the activities according to the Council Regulation 3037 90 EEC
status: valid
status modified: 2016-06-08
accepted date: 2016-06-08
in scheme: NACEValue

Manufacture of mattresses
type: Concept
notation: 31.03
definition: List hosts the classification for the activities according to the Council Regulation 3037 90 EEC
status: valid
status modified: 2016-06-08
accepted date: 2016-06-08
in scheme: NACEValue

Manufacture of other furniture
type: Concept
notation: 31.09
definition: List hosts the classification for the activities according to the Council Regulation 3037 90 EEC
status: valid
status modified: 2016-06-08
accepted date: 2016-06-08
in scheme: NACEValue

Manufacture of jewellery, bijouterie and related articles
type: Concept
notation: 32.10
definition: Manufacture of jewellery, bijouterie and related articles
status: valid
status modified: 2017-02-08
in scheme: NACEValue

Striking of coins
type: Concept
notation: 32.11
definition: List hosts the classification for the activities according to the Council Regulation 3037 90 EEC
status: valid
status modified: 2016-06-08
accepted date: 2016-06-08
in scheme: NACEValue

Manufacture of jewellery and related articles
type: Concept
notation: 32.12
definition: List hosts the classification for the activities according to the Council Regulation 3037 90 EEC
status: valid
status modified: 2016-06-08
accepted date: 2016-06-08
in scheme: NACEValue

Manufacture of imitation jewellery and related articles
type: Concept
notation: 32.13
definition: List hosts the classification for the activities according to the Council Regulation 3037 90 EEC
status: valid
status modified: 2016-06-08
accepted date: 2016-06-08
in scheme: NACEValue

Manufacture of musical instruments
type: Concept
notation: 32.20
definition: List hosts the classification for the activities according to the Council Regulation 3037 90 EEC
status: valid
status modified: 2016-06-08
accepted date: 2016-06-08
in scheme: NACEValue

Manufacture of sports goods
type: Concept
notation: 32.30
definition: List hosts the classification for the activities according to the Council Regulation 3037 90 EEC
status: valid
status modified: 2016-06-08
accepted date: 2016-06-08
in scheme: NACEValue

Manufacture of games and toys
type: Concept
notation: 32.40
definition: List hosts the classification for the activities according to the Council Regulation 3037 90 EEC
status: valid
status modified: 2016-06-08
accepted date: 2016-06-08
in scheme: NACEValue

Manufacture of medical and dental instruments and supplies
type: Concept
notation: 32.50
definition: List hosts the classification for the activities according to the Council Regulation 3037 90 EEC
status: valid
status modified: 2016-06-08
accepted date: 2016-06-08
in scheme: NACEValue

Manufacture of brooms and brushes
type: Concept
notation: 32.91
definition: List hosts the classification for the activities according to the Council Regulation 3037 90 EEC
status: valid
status modified: 2016-06-08
accepted date: 2016-06-08
in scheme: NACEValue

Other manufacturing n e c
type: Concept
notation: 32.99
definition: List hosts the classification for the activities according to the Council Regulation 3037 90 EEC
status: valid
status modified: 2016-06-08
accepted date: 2016-06-08
in scheme: NACEValue

Repair of fabricated metal products
type: Concept
notation: 33.11
definition: List hosts the classification for the activities according to the Council Regulation 3037 90 EEC
status: valid
status modified: 2016-06-08
accepted date: 2016-06-08
in scheme: NACEValue

Repair of machinery
type: Concept
notation: 33.12
definition: List hosts the classification for the activities according to the Council Regulation 3037 90 EEC
status: valid
status modified: 2016-06-08
accepted date: 2016-06-08
in scheme: NACEValue

Repair of electronic and optical equipment
type: Concept
notation: 33.13
definition: List hosts the classification for the activities according to the Council Regulation 3037 90 EEC
status: valid
status modified: 2016-06-08
accepted date: 2016-06-08
in scheme: NACEValue

Repair of electrical equipment
type: Concept
notation: 33.14
definition: List hosts the classification for the activities according to the Council Regulation 3037 90 EEC
status: valid
status modified: 2016-06-08
accepted date: 2016-06-08
in scheme: NACEValue

Repair and maintenance of ships and boats
type: Concept
notation: 33.15
definition: List hosts the classification for the activities according to the Council Regulation 3037 90 EEC
status: valid
status modified: 2016-06-08
accepted date: 2016-06-08
in scheme: NACEValue

Repair and maintenance of aircraft and spacecraft
type: Concept
notation: 33.16
definition: List hosts the classification for the activities according to the Council Regulation 3037 90 EEC
status: valid
status modified: 2016-06-08
accepted date: 2016-06-08
in scheme: NACEValue

Repair and maintenance of other transport equipment
type: Concept
notation: 33.17
definition: List hosts the classification for the activities according to the Council Regulation 3037 90 EEC
status: valid
status modified: 2016-06-08
accepted date: 2016-06-08
in scheme: NACEValue

Repair of other equipment
type: Concept
notation: 33.19
definition: List hosts the classification for the activities according to the Council Regulation 3037 90 EEC
status: valid
status modified: 2016-06-08
accepted date: 2016-06-08
in scheme: NACEValue

Installation of industrial machinery and equipment
type: Concept
notation: 33.20
definition: List hosts the classification for the activities according to the Council Regulation 3037 90 EEC
status: valid
status modified: 2016-06-08
accepted date: 2016-06-08
in scheme: NACEValue

Production of electricity
type: Concept
notation: 35.11
definition: List hosts the classification for the activities according to the Council Regulation 3037 90 EEC
status: valid
status modified: 2016-06-08
accepted date: 2016-06-08
in scheme: NACEValue

Transmission of electricity
type: Concept
notation: 35.12
definition: List hosts the classification for the activities according to the Council Regulation 3037 90 EEC
status: valid
status modified: 2016-06-08
accepted date: 2016-06-08
in scheme: NACEValue

Distribution of electricity
type: Concept
notation: 35.13
definition: List hosts the classification for the activities according to the Council Regulation 3037 90 EEC
status: valid
status modified: 2016-06-08
accepted date: 2016-06-08
in scheme: NACEValue

Trade of electricity
type: Concept
notation: 35.14
definition: List hosts the classification for the activities according to the Council Regulation 3037 90 EEC
status: valid
status modified: 2016-06-08
accepted date: 2016-06-08
in scheme: NACEValue

Manufacture of gas
type: Concept
notation: 35.21
definition: List hosts the classification for the activities according to the Council Regulation 3037 90 EEC
status: valid
status modified: 2016-06-08
accepted date: 2016-06-08
in scheme: NACEValue

Distribution of gaseous fuels through mains
type: Concept
notation: 35.22
definition: List hosts the classification for the activities according to the Council Regulation 3037 90 EEC
status: valid
status modified: 2016-06-08
accepted date: 2016-06-08
in scheme: NACEValue

Trade of gas through mains
type: Concept
notation: 35.23
definition: List hosts the classification for the activities according to the Council Regulation 3037 90 EEC
status: valid
status modified: 2016-06-08
accepted date: 2016-06-08
in scheme: NACEValue

Steam and air conditioning supply
type: Concept
notation: 35.30
definition: List hosts the classification for the activities according to the Council Regulation 3037 90 EEC
status: valid
status modified: 2016-06-08
accepted date: 2016-06-08
in scheme: NACEValue

Water collection treatment and supply
type: Concept
notation: 36.00
definition: List hosts the classification for the activities according to the Council Regulation 3037 90 EEC
status: valid
status modified: 2016-06-08
accepted date: 2016-06-08
in scheme: NACEValue

Sewerage
type: Concept
notation: 37.00
definition: List hosts the classification for the activities according to the Council Regulation 3037 90 EEC
status: valid
status modified: 2016-06-08
accepted date: 2016-06-08
in scheme: NACEValue

Collection of non-hazardous waste
type: Concept
notation: 38.11
definition: List hosts the classification for the activities according to the Council Regulation 3037 90 EEC
status: valid
status modified: 2016-06-08
accepted date: 2016-06-08
in scheme: NACEValue

Collection of hazardous waste
type: Concept
notation: 38.12
definition: List hosts the classification for the activities according to the Council Regulation 3037 90 EEC
status: valid
status modified: 2016-06-08
accepted date: 2016-06-08
in scheme: NACEValue

Treatment and disposal of non-hazardous waste
type: Concept
notation: 38.21
definition: List hosts the classification for the activities according to the Council Regulation 3037 90 EEC
status: valid
status modified: 2016-06-08
accepted date: 2016-06-08
in scheme: NACEValue

Treatment and disposal of hazardous waste
type: Concept
notation: 38.22
definition: List hosts the classification for the activities according to the Council Regulation 3037 90 EEC
status: valid
status modified: 2016-06-08
accepted date: 2016-06-08
in scheme: NACEValue

Dismantling of wrecks
type: Concept
notation: 38.31
definition: List hosts the classification for the activities according to the Council Regulation 3037 90 EEC
status: valid
status modified: 2016-06-08
accepted date: 2016-06-08
in scheme: NACEValue

Recovery of sorted materials
type: Concept
notation: 38.32
definition: List hosts the classification for the activities according to the Council Regulation 3037 90 EEC
status: valid
status modified: 2016-06-08
accepted date: 2016-06-08
in scheme: NACEValue

Remediation activities and other waste management services
type: Concept
notation: 39.00
definition: List hosts the classification for the activities according to the Council Regulation 3037 90 EEC
status: valid
status modified: 2016-06-08
accepted date: 2016-06-08
in scheme: NACEValue

Development of building projects
type: Concept
notation: 41.10
definition: List hosts the classification for the activities according to the Council Regulation 3037 90 EEC
status: valid
status modified: 2016-06-08
accepted date: 2016-06-08
in scheme: NACEValue

Construction of residential and non-residential buildings
type: Concept
notation: 41.20
definition: List hosts the classification for the activities according to the Council Regulation 3037 90 EEC
status: valid
status modified: 2016-06-08
accepted date: 2016-06-08
in scheme: NACEValue

Construction of roads and motorways
type: Concept
notation: 42.11
definition: List hosts the classification for the activities according to the Council Regulation 3037 90 EEC
status: valid
status modified: 2016-06-08
accepted date: 2016-06-08
in scheme: NACEValue

Construction of railways and underground railways
type: Concept
notation: 42.12
definition: List hosts the classification for the activities according to the Council Regulation 3037 90 EEC
status: valid
status modified: 2016-06-08
accepted date: 2016-06-08
in scheme: NACEValue

Construction of bridges and tunnels
type: Concept
notation: 42.13
definition: List hosts the classification for the activities according to the Council Regulation 3037 90 EEC
status: valid
status modified: 2016-06-08
accepted date: 2016-06-08
in scheme: NACEValue

Construction of utility projects for fluids
type: Concept
notation: 42.21
definition: List hosts the classification for the activities according to the Council Regulation 3037 90 EEC
status: valid
status modified: 2016-06-08
accepted date: 2016-06-08
in scheme: NACEValue

Construction of utility projects for electricity and telecommunications
type: Concept
notation: 42.22
definition: List hosts the classification for the activities according to the Council Regulation 3037 90 EEC
status: valid
status modified: 2016-06-08
accepted date: 2016-06-08
in scheme: NACEValue

Construction of water projects
type: Concept
notation: 42.91
definition: List hosts the classification for the activities according to the Council Regulation 3037 90 EEC
status: valid
status modified: 2016-06-08
accepted date: 2016-06-08
in scheme: NACEValue

Construction of other civil engineering projects n e c
type: Concept
notation: 42.99
definition: List hosts the classification for the activities according to the Council Regulation 3037 90 EEC
status: valid
status modified: 2016-06-08
accepted date: 2016-06-08
in scheme: NACEValue

Demolition
type: Concept
notation: 43.11
definition: List hosts the classification for the activities according to the Council Regulation 3037 90 EEC
status: valid
status modified: 2016-06-08
accepted date: 2016-06-08
in scheme: NACEValue

Site preparation
type: Concept
notation: 43.12
definition: List hosts the classification for the activities according to the Council Regulation 3037 90 EEC
status: valid
status modified: 2016-06-08
accepted date: 2016-06-08
in scheme: NACEValue

Test drilling and boring
type: Concept
notation: 43.13
definition: List hosts the classification for the activities according to the Council Regulation 3037 90 EEC
status: valid
status modified: 2016-06-08
accepted date: 2016-06-08
in scheme: NACEValue

Electrical installation
type: Concept
notation: 43.21
definition: List hosts the classification for the activities according to the Council Regulation 3037 90 EEC
status: valid
status modified: 2016-06-08
accepted date: 2016-06-08
in scheme: NACEValue

Plumbing heat and air-conditioning installation
type: Concept
notation: 43.22
definition: List hosts the classification for the activities according to the Council Regulation 3037 90 EEC
status: valid
status modified: 2016-06-08
accepted date: 2016-06-08
in scheme: NACEValue

Other construction installation
type: Concept
notation: 43.29
definition: List hosts the classification for the activities according to the Council Regulation 3037 90 EEC
status: valid
status modified: 2016-06-08
accepted date: 2016-06-08
in scheme: NACEValue

Plastering
type: Concept
notation: 43.31
definition: List hosts the classification for the activities according to the Council Regulation 3037 90 EEC
status: valid
status modified: 2016-06-08
accepted date: 2016-06-08
in scheme: NACEValue

Joinery installation
type: Concept
notation: 43.32
definition: List hosts the classification for the activities according to the Council Regulation 3037 90 EEC
status: valid
status modified: 2016-06-08
accepted date: 2016-06-08
in scheme: NACEValue

Floor and wall covering
type: Concept
notation: 43.33
definition: List hosts the classification for the activities according to the Council Regulation 3037 90 EEC
status: valid
status modified: 2016-06-08
accepted date: 2016-06-08
in scheme: NACEValue

Painting and glazing
type: Concept
notation: 43.34
definition: List hosts the classification for the activities according to the Council Regulation 3037 90 EEC
status: valid
status modified: 2016-06-08
accepted date: 2016-06-08
in scheme: NACEValue

Other building completion and finishing
type: Concept
notation: 43.39
definition: List hosts the classification for the activities according to the Council Regulation 3037 90 EEC
status: valid
status modified: 2016-06-08
accepted date: 2016-06-08
in scheme: NACEValue

Roofing activities
type: Concept
notation: 43.91
definition: List hosts the classification for the activities according to the Council Regulation 3037 90 EEC
status: valid
status modified: 2016-06-08
accepted date: 2016-06-08
in scheme: NACEValue

Other specialised construction activities n e c
type: Concept
notation: 43.99
definition: List hosts the classification for the activities according to the Council Regulation 3037 90 EEC
status: valid
status modified: 2016-06-08
accepted date: 2016-06-08
in scheme: NACEValue

Sale of cars and light motor vehicles
type: Concept
notation: 45.11
definition: List hosts the classification for the activities according to the Council Regulation 3037 90 EEC
status: valid
status modified: 2016-06-08
accepted date: 2016-06-08
in scheme: NACEValue

Sale of other motor vehicles
type: Concept
notation: 45.19
definition: List hosts the classification for the activities according to the Council Regulation 3037 90 EEC
status: valid
status modified: 2016-06-08
accepted date: 2016-06-08
in scheme: NACEValue

Maintenance and repair of motor vehicles
type: Concept
notation: 45.20
definition: List hosts the classification for the activities according to the Council Regulation 3037 90 EEC
status: valid
status modified: 2016-06-08
accepted date: 2016-06-08
in scheme: NACEValue

Wholesale trade of motor vehicle parts and accessories
type: Concept
notation: 45.31
definition: List hosts the classification for the activities according to the Council Regulation 3037 90 EEC
status: valid
status modified: 2016-06-08
accepted date: 2016-06-08
in scheme: NACEValue

Retail trade of motor vehicle parts and accessories
type: Concept
notation: 45.32
definition: List hosts the classification for the activities according to the Council Regulation 3037 90 EEC
status: valid
status modified: 2016-06-08
accepted date: 2016-06-08
in scheme: NACEValue

Sale maintenance and repair of motorcycles and related parts and accessories
type: Concept
notation: 45.40
definition: List hosts the classification for the activities according to the Council Regulation 3037 90 EEC
status: valid
status modified: 2016-06-08
accepted date: 2016-06-08
in scheme: NACEValue

Agents involved in the sale of agricultural raw materials live animals textile raw materials and semi-finished goods
type: Concept
notation: 46.11
definition: List hosts the classification for the activities according to the Council Regulation 3037 90 EEC
status: valid
status modified: 2016-06-08
accepted date: 2016-06-08
in scheme: NACEValue

Agents involved in the sale of fuels ores metals and industrial chemicals
type: Concept
notation: 46.12
definition: List hosts the classification for the activities according to the Council Regulation 3037 90 EEC
status: valid
status modified: 2016-06-08
accepted date: 2016-06-08
in scheme: NACEValue

Agents involved in the sale of timber and building materials
type: Concept
notation: 46.13
definition: List hosts the classification for the activities according to the Council Regulation 3037 90 EEC
status: valid
status modified: 2016-06-08
accepted date: 2016-06-08
in scheme: NACEValue

Agents involved in the sale of machinery industrial equipment ships and aircraft
type: Concept
notation: 46.14
definition: List hosts the classification for the activities according to the Council Regulation 3037 90 EEC
status: valid
status modified: 2016-06-08
accepted date: 2016-06-08
in scheme: NACEValue

Agents involved in the sale of furniture household goods hardware and ironmongery
type: Concept
notation: 46.15
definition: List hosts the classification for the activities according to the Council Regulation 3037 90 EEC
status: valid
status modified: 2016-06-08
accepted date: 2016-06-08
in scheme: NACEValue

Agents involved in the sale of textiles clothing fur footwear and leather goods
type: Concept
notation: 46.16
definition: List hosts the classification for the activities according to the Council Regulation 3037 90 EEC
status: valid
status modified: 2016-06-08
accepted date: 2016-06-08
in scheme: NACEValue

Agents involved in the sale of food beverages and tobacco
type: Concept
notation: 46.17
definition: List hosts the classification for the activities according to the Council Regulation 3037 90 EEC
status: valid
status modified: 2016-06-08
accepted date: 2016-06-08
in scheme: NACEValue

Agents specialised in the sale of other particular products
type: Concept
notation: 46.18
definition: List hosts the classification for the activities according to the Council Regulation 3037 90 EEC
status: valid
status modified: 2016-06-08
accepted date: 2016-06-08
in scheme: NACEValue

Agents involved in the sale of a variety of goods
type: Concept
notation: 46.19
definition: List hosts the classification for the activities according to the Council Regulation 3037 90 EEC
status: valid
status modified: 2016-06-08
accepted date: 2016-06-08
in scheme: NACEValue

Wholesale of grain unmanufactured tobacco seeds and animal feeds
type: Concept
notation: 46.21
definition: List hosts the classification for the activities according to the Council Regulation 3037 90 EEC
status: valid
status modified: 2016-06-08
accepted date: 2016-06-08
in scheme: NACEValue

Wholesale of flowers and plants
type: Concept
notation: 46.22
definition: List hosts the classification for the activities according to the Council Regulation 3037 90 EEC
status: valid
status modified: 2016-06-08
accepted date: 2016-06-08
in scheme: NACEValue

Wholesale of live animals
type: Concept
notation: 46.23
definition: List hosts the classification for the activities according to the Council Regulation 3037 90 EEC
status: valid
status modified: 2016-06-08
accepted date: 2016-06-08
in scheme: NACEValue

Wholesale of hides skins and leather
type: Concept
notation: 46.24
definition: List hosts the classification for the activities according to the Council Regulation 3037 90 EEC
status: valid
status modified: 2016-06-08
accepted date: 2016-06-08
in scheme: NACEValue

Wholesale of fruit and vegetables
type: Concept
notation: 46.31
definition: List hosts the classification for the activities according to the Council Regulation 3037 90 EEC
status: valid
status modified: 2016-06-08
accepted date: 2016-06-08
in scheme: NACEValue

Wholesale of meat and meat products
type: Concept
notation: 46.32
definition: List hosts the classification for the activities according to the Council Regulation 3037 90 EEC
status: valid
status modified: 2016-06-08
accepted date: 2016-06-08
in scheme: NACEValue

Wholesale of dairy products eggs and edible oils and fats
type: Concept
notation: 46.33
definition: List hosts the classification for the activities according to the Council Regulation 3037 90 EEC
status: valid
status modified: 2016-06-08
accepted date: 2016-06-08
in scheme: NACEValue

Wholesale of beverages
type: Concept
notation: 46.34
definition: List hosts the classification for the activities according to the Council Regulation 3037 90 EEC
status: valid
status modified: 2016-06-08
accepted date: 2016-06-08
in scheme: NACEValue

Wholesale of tobacco products
type: Concept
notation: 46.35
definition: List hosts the classification for the activities according to the Council Regulation 3037 90 EEC
status: valid
status modified: 2016-06-08
accepted date: 2016-06-08
in scheme: NACEValue

Wholesale of sugar and chocolate and sugar confectionery
type: Concept
notation: 46.36
definition: List hosts the classification for the activities according to the Council Regulation 3037 90 EEC
status: valid
status modified: 2016-06-08
accepted date: 2016-06-08
in scheme: NACEValue

Wholesale of coffee tea cocoa and spices
type: Concept
notation: 46.37
definition: List hosts the classification for the activities according to the Council Regulation 3037 90 EEC
status: valid
status modified: 2016-06-08
accepted date: 2016-06-08
in scheme: NACEValue

Wholesale of other food including fish crustaceans and molluscs
type: Concept
notation: 46.38
definition: List hosts the classification for the activities according to the Council Regulation 3037 90 EEC
status: valid
status modified: 2016-06-08
accepted date: 2016-06-08
in scheme: NACEValue

Non-specialised wholesale of food beverages and tobacco
type: Concept
notation: 46.39
definition: List hosts the classification for the activities according to the Council Regulation 3037 90 EEC
status: valid
status modified: 2016-06-08
accepted date: 2016-06-08
in scheme: NACEValue

Wholesale of textiles
type: Concept
notation: 46.41
definition: List hosts the classification for the activities according to the Council Regulation 3037 90 EEC
status: valid
status modified: 2016-06-08
accepted date: 2016-06-08
in scheme: NACEValue

Wholesale of clothing and footwear
type: Concept
notation: 46.42
definition: List hosts the classification for the activities according to the Council Regulation 3037 90 EEC
status: valid
status modified: 2016-06-08
accepted date: 2016-06-08
in scheme: NACEValue

Wholesale of electrical household appliances
type: Concept
notation: 46.43
definition: List hosts the classification for the activities according to the Council Regulation 3037 90 EEC
status: valid
status modified: 2016-06-08
accepted date: 2016-06-08
in scheme: NACEValue

Wholesale of china and glassware and cleaning materials
type: Concept
notation: 46.44
definition: List hosts the classification for the activities according to the Council Regulation 3037 90 EEC
status: valid
status modified: 2016-06-08
accepted date: 2016-06-08
in scheme: NACEValue

Wholesale of perfume and cosmetics
type: Concept
notation: 46.45
definition: List hosts the classification for the activities according to the Council Regulation 3037 90 EEC
status: valid
status modified: 2016-06-08
accepted date: 2016-06-08
in scheme: NACEValue

Wholesale of pharmaceutical goods
type: Concept
notation: 46.46
definition: List hosts the classification for the activities according to the Council Regulation 3037 90 EEC
status: valid
status modified: 2016-06-08
accepted date: 2016-06-08
in scheme: NACEValue

Wholesale of furniture carpets and lighting equipment
type: Concept
notation: 46.47
definition: List hosts the classification for the activities according to the Council Regulation 3037 90 EEC
status: valid
status modified: 2016-06-08
accepted date: 2016-06-08
in scheme: NACEValue

Wholesale of watches and jewellery
type: Concept
notation: 46.48
definition: List hosts the classification for the activities according to the Council Regulation 3037 90 EEC
status: valid
status modified: 2016-06-08
accepted date: 2016-06-08
in scheme: NACEValue

Wholesale of other household goods
type: Concept
notation: 46.49
definition: List hosts the classification for the activities according to the Council Regulation 3037 90 EEC
status: valid
status modified: 2016-06-08
accepted date: 2016-06-08
in scheme: NACEValue

Wholesale of computers computer peripheral equipment and software
type: Concept
notation: 46.51
definition: List hosts the classification for the activities according to the Council Regulation 3037 90 EEC
status: valid
status modified: 2016-06-08
accepted date: 2016-06-08
in scheme: NACEValue

Wholesale of electronic and telecommunications equipment and parts
type: Concept
notation: 46.52
definition: List hosts the classification for the activities according to the Council Regulation 3037 90 EEC
status: valid
status modified: 2016-06-08
accepted date: 2016-06-08
in scheme: NACEValue

Wholesale of agricultural machinery equipment and supplies
type: Concept
notation: 46.61
definition: List hosts the classification for the activities according to the Council Regulation 3037 90 EEC
status: valid
status modified: 2016-06-08
accepted date: 2016-06-08
in scheme: NACEValue

Wholesale of machine tools
type: Concept
notation: 46.62
definition: List hosts the classification for the activities according to the Council Regulation 3037 90 EEC
status: valid
status modified: 2016-06-08
accepted date: 2016-06-08
in scheme: NACEValue

Wholesale of mining construction and civil engineering machinery
type: Concept
notation: 46.63
definition: List hosts the classification for the activities according to the Council Regulation 3037 90 EEC
status: valid
status modified: 2016-06-08
accepted date: 2016-06-08
in scheme: NACEValue

Wholesale of machinery for the textile industry and of sewing and knitting machines
type: Concept
notation: 46.64
definition: List hosts the classification for the activities according to the Council Regulation 3037 90 EEC
status: valid
status modified: 2016-06-08
accepted date: 2016-06-08
in scheme: NACEValue

Wholesale of office furniture
type: Concept
notation: 46.65
definition: List hosts the classification for the activities according to the Council Regulation 3037 90 EEC
status: valid
status modified: 2016-06-08
accepted date: 2016-06-08
in scheme: NACEValue

Wholesale of other office machinery and equipment
type: Concept
notation: 46.66
definition: List hosts the classification for the activities according to the Council Regulation 3037 90 EEC
status: valid
status modified: 2016-06-08
accepted date: 2016-06-08
in scheme: NACEValue

Wholesale of other machinery and equipment
type: Concept
notation: 46.69
definition: List hosts the classification for the activities according to the Council Regulation 3037 90 EEC
status: valid
status modified: 2016-06-08
accepted date: 2016-06-08
in scheme: NACEValue

Wholesale of solid liquid and gaseous fuels and related products
type: Concept
notation: 46.71
definition: List hosts the classification for the activities according to the Council Regulation 3037 90 EEC
status: valid
status modified: 2016-06-08
accepted date: 2016-06-08
in scheme: NACEValue

Wholesale of metals and metal ores
type: Concept
notation: 46.72
definition: List hosts the classification for the activities according to the Council Regulation 3037 90 EEC
status: valid
status modified: 2016-06-08
accepted date: 2016-06-08
in scheme: NACEValue

Wholesale of wood construction materials and sanitary equipment
type: Concept
notation: 46.73
definition: List hosts the classification for the activities according to the Council Regulation 3037 90 EEC
status: valid
status modified: 2016-06-08
accepted date: 2016-06-08
in scheme: NACEValue

Wholesale of hardware plumbing and heating equipment and supplies
type: Concept
notation: 46.74
definition: List hosts the classification for the activities according to the Council Regulation 3037 90 EEC
status: valid
status modified: 2016-06-08
accepted date: 2016-06-08
in scheme: NACEValue

Wholesale of chemical products
type: Concept
notation: 46.75
definition: List hosts the classification for the activities according to the Council Regulation 3037 90 EEC
status: valid
status modified: 2016-06-08
accepted date: 2016-06-08
in scheme: NACEValue

Wholesale of other intermediate products
type: Concept
notation: 46.76
definition: List hosts the classification for the activities according to the Council Regulation 3037 90 EEC
status: valid
status modified: 2016-06-08
accepted date: 2016-06-08
in scheme: NACEValue

Wholesale of waste and scrap
type: Concept
notation: 46.77
definition: List hosts the classification for the activities according to the Council Regulation 3037 90 EEC
status: valid
status modified: 2016-06-08
accepted date: 2016-06-08
in scheme: NACEValue

Non-specialised wholesale trade
type: Concept
notation: 46.90
definition: List hosts the classification for the activities according to the Council Regulation 3037 90 EEC
status: valid
status modified: 2016-06-08
accepted date: 2016-06-08
in scheme: NACEValue

Retail sale in non-specialised stores with food beverages or tobacco predominating
type: Concept
notation: 47.11
definition: List hosts the classification for the activities according to the Council Regulation 3037 90 EEC
status: valid
status modified: 2016-06-08
accepted date: 2016-06-08
in scheme: NACEValue

Other retail sale in non-specialised stores
type: Concept
notation: 47.19
definition: List hosts the classification for the activities according to the Council Regulation 3037 90 EEC
status: valid
status modified: 2016-06-08
accepted date: 2016-06-08
in scheme: NACEValue

Retail sale of fruit and vegetables in specialised stores
type: Concept
notation: 47.21
definition: List hosts the classification for the activities according to the Council Regulation 3037 90 EEC
status: valid
status modified: 2016-06-08
accepted date: 2016-06-08
in scheme: NACEValue

Retail sale of meat and meat products in specialised stores
type: Concept
notation: 47.22
definition: List hosts the classification for the activities according to the Council Regulation 3037 90 EEC
status: valid
status modified: 2016-06-08
accepted date: 2016-06-08
in scheme: NACEValue

Retail sale of fish crustaceans and molluscs in specialised stores
type: Concept
notation: 47.23
definition: List hosts the classification for the activities according to the Council Regulation 3037 90 EEC
status: valid
status modified: 2016-06-08
accepted date: 2016-06-08
in scheme: NACEValue

Retail sale of bread cakes flour confectionery and sugar confectionery in specialised stores
type: Concept
notation: 47.24
definition: List hosts the classification for the activities according to the Council Regulation 3037 90 EEC
status: valid
status modified: 2016-06-08
accepted date: 2016-06-08
in scheme: NACEValue

Retail sale of beverages in specialised stores
type: Concept
notation: 47.25
definition: List hosts the classification for the activities according to the Council Regulation 3037 90 EEC
status: valid
status modified: 2016-06-08
accepted date: 2016-06-08
in scheme: NACEValue

Retail sale of tobacco products in specialised stores
type: Concept
notation: 47.26
definition: List hosts the classification for the activities according to the Council Regulation 3037 90 EEC
status: valid
status modified: 2016-06-08
accepted date: 2016-06-08
in scheme: NACEValue

Other retail sale of food in specialised stores
type: Concept
notation: 47.29
definition: List hosts the classification for the activities according to the Council Regulation 3037 90 EEC
status: valid
status modified: 2016-06-08
accepted date: 2016-06-08
in scheme: NACEValue

Retail sale of automotive fuel in specialised stores
type: Concept
notation: 47.30
definition: List hosts the classification for the activities according to the Council Regulation 3037 90 EEC
status: valid
status modified: 2016-06-08
accepted date: 2016-06-08
in scheme: NACEValue

Retail sale of computers peripheral units and software in specialised stores
type: Concept
notation: 47.41
definition: List hosts the classification for the activities according to the Council Regulation 3037 90 EEC
status: valid
status modified: 2016-06-08
accepted date: 2016-06-08
in scheme: NACEValue

Retail sale of telecommunications equipment in specialised stores
type: Concept
notation: 47.42
definition: List hosts the classification for the activities according to the Council Regulation 3037 90 EEC
status: valid
status modified: 2016-06-08
accepted date: 2016-06-08
in scheme: NACEValue

Retail sale of audio and video equipment in specialised stores
type: Concept
notation: 47.43
definition: List hosts the classification for the activities according to the Council Regulation 3037 90 EEC
status: valid
status modified: 2016-06-08
accepted date: 2016-06-08
in scheme: NACEValue

Retail sale of textiles in specialised stores
type: Concept
notation: 47.51
definition: List hosts the classification for the activities according to the Council Regulation 3037 90 EEC
status: valid
status modified: 2016-06-08
accepted date: 2016-06-08
in scheme: NACEValue

Retail sale of hardware paints and glass in specialised stores
type: Concept
notation: 47.52
definition: List hosts the classification for the activities according to the Council Regulation 3037 90 EEC
status: valid
status modified: 2016-06-08
accepted date: 2016-06-08
in scheme: NACEValue

Retail sale of carpets rugs wall and floor coverings in specialised stores
type: Concept
notation: 47.53
definition: List hosts the classification for the activities according to the Council Regulation 3037 90 EEC
status: valid
status modified: 2016-06-08
accepted date: 2016-06-08
in scheme: NACEValue

Retail sale of electrical household appliances in specialised stores
type: Concept
notation: 47.54
definition: List hosts the classification for the activities according to the Council Regulation 3037 90 EEC
status: valid
status modified: 2016-06-08
accepted date: 2016-06-08
in scheme: NACEValue

Retail sale of furniture lighting equipment and other household articles in specialised stores
type: Concept
notation: 47.59
definition: List hosts the classification for the activities according to the Council Regulation 3037 90 EEC
status: valid
status modified: 2016-06-08
accepted date: 2016-06-08
in scheme: NACEValue

Retail sale of books in specialised stores
type: Concept
notation: 47.61
definition: List hosts the classification for the activities according to the Council Regulation 3037 90 EEC
status: valid
status modified: 2016-06-08
accepted date: 2016-06-08
in scheme: NACEValue

Retail sale of newspapers and stationery in specialised stores
type: Concept
notation: 47.62
definition: List hosts the classification for the activities according to the Council Regulation 3037 90 EEC
status: valid
status modified: 2016-06-08
accepted date: 2016-06-08
in scheme: NACEValue

Retail sale of music and video recordings in specialised stores
type: Concept
notation: 47.63
definition: List hosts the classification for the activities according to the Council Regulation 3037 90 EEC
status: valid
status modified: 2016-06-08
accepted date: 2016-06-08
in scheme: NACEValue

Retail sale of sporting equipment in specialised stores
type: Concept
notation: 47.64
definition: List hosts the classification for the activities according to the Council Regulation 3037 90 EEC
status: valid
status modified: 2016-06-08
accepted date: 2016-06-08
in scheme: NACEValue

Retail sale of games and toys in specialised stores
type: Concept
notation: 47.65
definition: List hosts the classification for the activities according to the Council Regulation 3037 90 EEC
status: valid
status modified: 2016-06-08
accepted date: 2016-06-08
in scheme: NACEValue

Retail sale of clothing in specialised stores
type: Concept
notation: 47.71
definition: List hosts the classification for the activities according to the Council Regulation 3037 90 EEC
status: valid
status modified: 2016-06-08
accepted date: 2016-06-08
in scheme: NACEValue

Retail sale of footwear and leather goods in specialised stores
type: Concept
notation: 47.72
definition: List hosts the classification for the activities according to the Council Regulation 3037 90 EEC
status: valid
status modified: 2016-06-08
accepted date: 2016-06-08
in scheme: NACEValue

Dispensing chemist in specialised stores
type: Concept
notation: 47.73
definition: List hosts the classification for the activities according to the Council Regulation 3037 90 EEC
status: valid
status modified: 2016-06-08
accepted date: 2016-06-08
in scheme: NACEValue

Retail sale of medical and orthopaedic goods in specialised stores
type: Concept
notation: 47.74
definition: List hosts the classification for the activities according to the Council Regulation 3037 90 EEC
status: valid
status modified: 2016-06-08
accepted date: 2016-06-08
in scheme: NACEValue

Retail sale of cosmetic and toilet articles in specialised stores
type: Concept
notation: 47.75
definition: List hosts the classification for the activities according to the Council Regulation 3037 90 EEC
status: valid
status modified: 2016-06-08
accepted date: 2016-06-08
in scheme: NACEValue

Retail sale of flowers plants seeds fertilisers pet animals and pet food in specialised stores
type: Concept
notation: 47.76
definition: List hosts the classification for the activities according to the Council Regulation 3037 90 EEC
status: valid
status modified: 2016-06-08
accepted date: 2016-06-08
in scheme: NACEValue

Retail sale of watches and jewellery in specialised stores
type: Concept
notation: 47.77
definition: List hosts the classification for the activities according to the Council Regulation 3037 90 EEC
status: valid
status modified: 2016-06-08
accepted date: 2016-06-08
in scheme: NACEValue

Other retail sale of new goods in specialised stores
type: Concept
notation: 47.78
definition: List hosts the classification for the activities according to the Council Regulation 3037 90 EEC
status: valid
status modified: 2016-06-08
accepted date: 2016-06-08
in scheme: NACEValue

Retail sale of second-hand goods in stores
type: Concept
notation: 47.79
definition: List hosts the classification for the activities according to the Council Regulation 3037 90 EEC
status: valid
status modified: 2016-06-08
accepted date: 2016-06-08
in scheme: NACEValue

Retail sale via stalls and markets of food beverages and tobacco products
type: Concept
notation: 47.81
definition: List hosts the classification for the activities according to the Council Regulation 3037 90 EEC
status: valid
status modified: 2016-06-08
accepted date: 2016-06-08
in scheme: NACEValue

Retail sale via stalls and markets of textiles clothing and footwear
type: Concept
notation: 47.82
definition: List hosts the classification for the activities according to the Council Regulation 3037 90 EEC
status: valid
status modified: 2016-06-08
accepted date: 2016-06-08
in scheme: NACEValue

Retail sale via stalls and markets of other goods
type: Concept
notation: 47.89
definition: List hosts the classification for the activities according to the Council Regulation 3037 90 EEC
status: valid
status modified: 2016-06-08
accepted date: 2016-06-08
in scheme: NACEValue

Retail sale via mail order houses or via Internet
type: Concept
notation: 47.91
definition: List hosts the classification for the activities according to the Council Regulation 3037 90 EEC
status: valid
status modified: 2016-06-08
accepted date: 2016-06-08
in scheme: NACEValue

Other retail sale not in stores stalls or markets
type: Concept
notation: 47.99
definition: List hosts the classification for the activities according to the Council Regulation 3037 90 EEC
status: valid
status modified: 2016-06-08
accepted date: 2016-06-08
in scheme: NACEValue

Passenger rail transport interurban
type: Concept
notation: 49.10
definition: List hosts the classification for the activities according to the Council Regulation 3037 90 EEC
status: valid
status modified: 2016-06-08
accepted date: 2016-06-08
in scheme: NACEValue

Freight rail transport
type: Concept
notation: 49.20
definition: List hosts the classification for the activities according to the Council Regulation 3037 90 EEC
status: valid
status modified: 2016-06-08
accepted date: 2016-06-08
in scheme: NACEValue

Urban and suburban passenger land transport
type: Concept
notation: 49.31
definition: List hosts the classification for the activities according to the Council Regulation 3037 90 EEC
status: valid
status modified: 2016-06-08
accepted date: 2016-06-08
in scheme: NACEValue

Taxi operation
type: Concept
notation: 49.32
definition: List hosts the classification for the activities according to the Council Regulation 3037 90 EEC
status: valid
status modified: 2016-06-08
accepted date: 2016-06-08
in scheme: NACEValue

Other passenger land transport n e c
type: Concept
notation: 49.39
definition: List hosts the classification for the activities according to the Council Regulation 3037 90 EEC
status: valid
status modified: 2016-06-08
accepted date: 2016-06-08
in scheme: NACEValue

Freight transport by road
type: Concept
notation: 49.41
definition: List hosts the classification for the activities according to the Council Regulation 3037 90 EEC
status: valid
status modified: 2016-06-08
accepted date: 2016-06-08
in scheme: NACEValue

Removal services
type: Concept
notation: 49.42
definition: List hosts the classification for the activities according to the Council Regulation 3037 90 EEC
status: valid
status modified: 2016-06-08
accepted date: 2016-06-08
in scheme: NACEValue

Transport via pipeline
type: Concept
notation: 49.50
definition: List hosts the classification for the activities according to the Council Regulation 3037 90 EEC
status: valid
status modified: 2016-06-08
accepted date: 2016-06-08
in scheme: NACEValue

Sea and coastal passenger water transport
type: Concept
notation: 50.10
definition: List hosts the classification for the activities according to the Council Regulation 3037 90 EEC
status: valid
status modified: 2016-06-08
accepted date: 2016-06-08
in scheme: NACEValue

Sea and coastal freight water transport
type: Concept
notation: 50.20
definition: List hosts the classification for the activities according to the Council Regulation 3037 90 EEC
status: valid
status modified: 2016-06-08
accepted date: 2016-06-08
in scheme: NACEValue

Inland passenger water transport
type: Concept
notation: 50.30
definition: List hosts the classification for the activities according to the Council Regulation 3037 90 EEC
status: valid
status modified: 2016-06-08
accepted date: 2016-06-08
in scheme: NACEValue

Inland freight water transport
type: Concept
notation: 50.40
definition: List hosts the classification for the activities according to the Council Regulation 3037 90 EEC
status: valid
status modified: 2016-06-08
accepted date: 2016-06-08
in scheme: NACEValue

Passenger air transport
type: Concept
notation: 51.10
definition: List hosts the classification for the activities according to the Council Regulation 3037 90 EEC
status: valid
status modified: 2016-06-08
accepted date: 2016-06-08
in scheme: NACEValue

Freight air transport
type: Concept
notation: 51.21
definition: List hosts the classification for the activities according to the Council Regulation 3037 90 EEC
status: valid
status modified: 2016-06-08
accepted date: 2016-06-08
in scheme: NACEValue

Space transport
type: Concept
notation: 51.22
definition: List hosts the classification for the activities according to the Council Regulation 3037 90 EEC
status: valid
status modified: 2016-06-08
accepted date: 2016-06-08
in scheme: NACEValue

Warehousing and storage
type: Concept
notation: 52.10
definition: List hosts the classification for the activities according to the Council Regulation 3037 90 EEC
status: valid
status modified: 2016-06-08
accepted date: 2016-06-08
in scheme: NACEValue

Service activities incidental to land transportation
type: Concept
notation: 52.21
definition: List hosts the classification for the activities according to the Council Regulation 3037 90 EEC
status: valid
status modified: 2016-06-08
accepted date: 2016-06-08
in scheme: NACEValue

Service activities incidental to water transportation
type: Concept
notation: 52.22
definition: List hosts the classification for the activities according to the Council Regulation 3037 90 EEC
status: valid
status modified: 2016-06-08
accepted date: 2016-06-08
in scheme: NACEValue

Service activities incidental to air transportation
type: Concept
notation: 52.23
definition: List hosts the classification for the activities according to the Council Regulation 3037 90 EEC
status: valid
status modified: 2016-06-08
accepted date: 2016-06-08
in scheme: NACEValue

Cargo handling
type: Concept
notation: 52.24
definition: List hosts the classification for the activities according to the Council Regulation 3037 90 EEC
status: valid
status modified: 2016-06-08
accepted date: 2016-06-08
in scheme: NACEValue

Other transportation support activities
type: Concept
notation: 52.29
definition: List hosts the classification for the activities according to the Council Regulation 3037 90 EEC
status: valid
status modified: 2016-06-08
accepted date: 2016-06-08
in scheme: NACEValue

Postal activities under universal service obligation
type: Concept
notation: 53.10
definition: List hosts the classification for the activities according to the Council Regulation 3037 90 EEC
status: valid
status modified: 2016-06-08
accepted date: 2016-06-08
in scheme: NACEValue

Other postal and courier activities
type: Concept
notation: 53.20
definition: List hosts the classification for the activities according to the Council Regulation 3037 90 EEC
status: valid
status modified: 2016-06-08
accepted date: 2016-06-08
in scheme: NACEValue

Hotels and similar accommodation
type: Concept
notation: 55.10
definition: List hosts the classification for the activities according to the Council Regulation 3037 90 EEC
status: valid
status modified: 2016-06-08
accepted date: 2016-06-08
in scheme: NACEValue

Holiday and other short-stay accommodation
type: Concept
notation: 55.20
definition: List hosts the classification for the activities according to the Council Regulation 3037 90 EEC
status: valid
status modified: 2016-06-08
accepted date: 2016-06-08
in scheme: NACEValue

Camping grounds recreational vehicle parks and trailer parks
type: Concept
notation: 55.30
definition: List hosts the classification for the activities according to the Council Regulation 3037 90 EEC
status: valid
status modified: 2016-06-08
accepted date: 2016-06-08
in scheme: NACEValue

Other accommodation
type: Concept
notation: 55.90
definition: List hosts the classification for the activities according to the Council Regulation 3037 90 EEC
status: valid
status modified: 2016-06-08
accepted date: 2016-06-08
in scheme: NACEValue

Restaurants and mobile food service activities
type: Concept
notation: 56.10
definition: List hosts the classification for the activities according to the Council Regulation 3037 90 EEC
status: valid
status modified: 2016-06-08
accepted date: 2016-06-08
in scheme: NACEValue

Event catering activities
type: Concept
notation: 56.21
definition: List hosts the classification for the activities according to the Council Regulation 3037 90 EEC
status: valid
status modified: 2016-06-08
accepted date: 2016-06-08
in scheme: NACEValue

Other food service activities
type: Concept
notation: 56.29
definition: List hosts the classification for the activities according to the Council Regulation 3037 90 EEC
status: valid
status modified: 2016-06-08
accepted date: 2016-06-08
in scheme: NACEValue

Beverage serving activities
type: Concept
notation: 56.30
definition: List hosts the classification for the activities according to the Council Regulation 3037 90 EEC
status: valid
status modified: 2016-06-08
accepted date: 2016-06-08
in scheme: NACEValue

Book publishing
type: Concept
notation: 58.11
definition: List hosts the classification for the activities according to the Council Regulation 3037 90 EEC
status: valid
status modified: 2016-06-08
accepted date: 2016-06-08
in scheme: NACEValue

Publishing of directories and mailing lists
type: Concept
notation: 58.12
definition: List hosts the classification for the activities according to the Council Regulation 3037 90 EEC
status: valid
status modified: 2016-06-08
accepted date: 2016-06-08
in scheme: NACEValue

Publishing of newspapers
type: Concept
notation: 58.13
definition: List hosts the classification for the activities according to the Council Regulation 3037 90 EEC
status: valid
status modified: 2016-06-08
accepted date: 2016-06-08
in scheme: NACEValue

Publishing of journals and periodicals
type: Concept
notation: 58.14
definition: List hosts the classification for the activities according to the Council Regulation 3037 90 EEC
status: valid
status modified: 2016-06-08
accepted date: 2016-06-08
in scheme: NACEValue

Other publishing activities
type: Concept
notation: 58.19
definition: List hosts the classification for the activities according to the Council Regulation 3037 90 EEC
status: valid
status modified: 2016-06-08
accepted date: 2016-06-08
in scheme: NACEValue

Publishing of computer games
type: Concept
notation: 58.21
definition: List hosts the classification for the activities according to the Council Regulation 3037 90 EEC
status: valid
status modified: 2016-06-08
accepted date: 2016-06-08
in scheme: NACEValue

Other software publishing
type: Concept
notation: 58.29
definition: List hosts the classification for the activities according to the Council Regulation 3037 90 EEC
status: valid
status modified: 2016-06-08
accepted date: 2016-06-08
in scheme: NACEValue

Motion picture video and television programme production activities
type: Concept
notation: 59.11
definition: List hosts the classification for the activities according to the Council Regulation 3037 90 EEC
status: valid
status modified: 2016-06-08
accepted date: 2016-06-08
in scheme: NACEValue

Motion picture video and television programme post-production activities
type: Concept
notation: 59.12
definition: List hosts the classification for the activities according to the Council Regulation 3037 90 EEC
status: valid
status modified: 2016-06-08
accepted date: 2016-06-08
in scheme: NACEValue

Motion picture video and television programme distribution activities
type: Concept
notation: 59.13
definition: List hosts the classification for the activities according to the Council Regulation 3037 90 EEC
status: valid
status modified: 2016-06-08
accepted date: 2016-06-08
in scheme: NACEValue

Motion picture projection activities
type: Concept
notation: 59.14
definition: List hosts the classification for the activities according to the Council Regulation 3037 90 EEC
status: valid
status modified: 2016-06-08
accepted date: 2016-06-08
in scheme: NACEValue

Sound recording and music publishing activities
type: Concept
notation: 59.20
definition: List hosts the classification for the activities according to the Council Regulation 3037 90 EEC
status: valid
status modified: 2016-06-08
accepted date: 2016-06-08
in scheme: NACEValue

Radio broadcasting
type: Concept
notation: 60.10
definition: List hosts the classification for the activities according to the Council Regulation 3037 90 EEC
status: valid
status modified: 2016-06-08
accepted date: 2016-06-08
in scheme: NACEValue

Television programming and broadcasting activities
type: Concept
notation: 60.20
definition: List hosts the classification for the activities according to the Council Regulation 3037 90 EEC
status: valid
status modified: 2016-06-08
accepted date: 2016-06-08
in scheme: NACEValue

Wired telecommunications activities
type: Concept
notation: 61.10
definition: List hosts the classification for the activities according to the Council Regulation 3037 90 EEC
status: valid
status modified: 2016-06-08
accepted date: 2016-06-08
in scheme: NACEValue

Wireless telecommunications activities
type: Concept
notation: 61.20
definition: List hosts the classification for the activities according to the Council Regulation 3037 90 EEC
status: valid
status modified: 2016-06-08
accepted date: 2016-06-08
in scheme: NACEValue

Satellite telecommunications activities
type: Concept
notation: 61.30
definition: List hosts the classification for the activities according to the Council Regulation 3037 90 EEC
status: valid
status modified: 2016-06-08
accepted date: 2016-06-08
in scheme: NACEValue

Other telecommunications activities
type: Concept
notation: 61.90
definition: List hosts the classification for the activities according to the Council Regulation 3037 90 EEC
status: valid
status modified: 2016-06-08
accepted date: 2016-06-08
in scheme: NACEValue

Computer programming activities
type: Concept
notation: 62.01
definition: List hosts the classification for the activities according to the Council Regulation 3037 90 EEC
status: valid
status modified: 2016-06-08
accepted date: 2016-06-08
in scheme: NACEValue

Computer consultancy activities
type: Concept
notation: 62.02
definition: List hosts the classification for the activities according to the Council Regulation 3037 90 EEC
status: valid
status modified: 2016-06-08
accepted date: 2016-06-08
in scheme: NACEValue

Computer facilities management activities
type: Concept
notation: 62.03
definition: List hosts the classification for the activities according to the Council Regulation 3037 90 EEC
status: valid
status modified: 2016-06-08
accepted date: 2016-06-08
in scheme: NACEValue

Other information technology and computer service activities
type: Concept
notation: 62.09
definition: List hosts the classification for the activities according to the Council Regulation 3037 90 EEC
status: valid
status modified: 2016-06-08
accepted date: 2016-06-08
in scheme: NACEValue

Data processing hosting and related activities
type: Concept
notation: 63.11
definition: List hosts the classification for the activities according to the Council Regulation 3037 90 EEC
status: valid
status modified: 2016-06-08
accepted date: 2016-06-08
in scheme: NACEValue

Web portals
type: Concept
notation: 63.12
definition: List hosts the classification for the activities according to the Council Regulation 3037 90 EEC
status: valid
status modified: 2016-06-08
accepted date: 2016-06-08
in scheme: NACEValue

News agency activities
type: Concept
notation: 63.91
definition: List hosts the classification for the activities according to the Council Regulation 3037 90 EEC
status: valid
status modified: 2016-06-08
accepted date: 2016-06-08
in scheme: NACEValue

Other information service activities n e c
type: Concept
notation: 63.99
definition: List hosts the classification for the activities according to the Council Regulation 3037 90 EEC
status: valid
status modified: 2016-06-08
accepted date: 2016-06-08
in scheme: NACEValue

Central banking
type: Concept
notation: 64.11
definition: List hosts the classification for the activities according to the Council Regulation 3037 90 EEC
status: valid
status modified: 2016-06-08
accepted date: 2016-06-08
in scheme: NACEValue

Other monetary intermediation
type: Concept
notation: 64.19
definition: List hosts the classification for the activities according to the Council Regulation 3037 90 EEC
status: valid
status modified: 2016-06-08
accepted date: 2016-06-08
in scheme: NACEValue

Activities of holding companies
type: Concept
notation: 64.20
definition: List hosts the classification for the activities according to the Council Regulation 3037 90 EEC
status: valid
status modified: 2016-06-08
accepted date: 2016-06-08
in scheme: NACEValue

Trusts funds and similar financial entities
type: Concept
notation: 64.30
definition: List hosts the classification for the activities according to the Council Regulation 3037 90 EEC
status: valid
status modified: 2016-06-08
accepted date: 2016-06-08
in scheme: NACEValue

Financial leasing
type: Concept
notation: 64.91
definition: List hosts the classification for the activities according to the Council Regulation 3037 90 EEC
status: valid
status modified: 2016-06-08
accepted date: 2016-06-08
in scheme: NACEValue

Other credit granting
type: Concept
notation: 64.92
definition: List hosts the classification for the activities according to the Council Regulation 3037 90 EEC
status: valid
status modified: 2016-06-08
accepted date: 2016-06-08
in scheme: NACEValue

Other financial service activities except insurance and pension funding n e c
type: Concept
notation: 64.99
definition: List hosts the classification for the activities according to the Council Regulation 3037 90 EEC
status: valid
status modified: 2016-06-08
accepted date: 2016-06-08
in scheme: NACEValue

Life insurance
type: Concept
notation: 65.11
definition: List hosts the classification for the activities according to the Council Regulation 3037 90 EEC
status: valid
status modified: 2016-06-08
accepted date: 2016-06-08
in scheme: NACEValue

Non-life insurance
type: Concept
notation: 65.12
definition: List hosts the classification for the activities according to the Council Regulation 3037 90 EEC
status: valid
status modified: 2016-06-08
accepted date: 2016-06-08
in scheme: NACEValue

Reinsurance
type: Concept
notation: 65.20
definition: List hosts the classification for the activities according to the Council Regulation 3037 90 EEC
status: valid
status modified: 2016-06-08
accepted date: 2016-06-08
in scheme: NACEValue

Pension funding
type: Concept
notation: 65.30
definition: List hosts the classification for the activities according to the Council Regulation 3037 90 EEC
status: valid
status modified: 2016-06-08
accepted date: 2016-06-08
in scheme: NACEValue

Administration of financial markets
type: Concept
notation: 66.11
definition: List hosts the classification for the activities according to the Council Regulation 3037 90 EEC
status: valid
status modified: 2016-06-08
accepted date: 2016-06-08
in scheme: NACEValue

Security and commodity contracts brokerage
type: Concept
notation: 66.12
definition: List hosts the classification for the activities according to the Council Regulation 3037 90 EEC
status: valid
status modified: 2016-06-08
accepted date: 2016-06-08
in scheme: NACEValue

Other activities auxiliary to financial services except insurance and pension funding
type: Concept
notation: 66.19
definition: List hosts the classification for the activities according to the Council Regulation 3037 90 EEC
status: valid
status modified: 2016-06-08
accepted date: 2016-06-08
in scheme: NACEValue

Risk and damage evaluation
type: Concept
notation: 66.21
definition: List hosts the classification for the activities according to the Council Regulation 3037 90 EEC
status: valid
status modified: 2016-06-08
accepted date: 2016-06-08
in scheme: NACEValue

Activities of insurance agents and brokers
type: Concept
notation: 66.22
definition: List hosts the classification for the activities according to the Council Regulation 3037 90 EEC
status: valid
status modified: 2016-06-08
accepted date: 2016-06-08
in scheme: NACEValue

Other activities auxiliary to insurance and pension funding
type: Concept
notation: 66.29
definition: List hosts the classification for the activities according to the Council Regulation 3037 90 EEC
status: valid
status modified: 2016-06-08
accepted date: 2016-06-08
in scheme: NACEValue

Fund management activities
type: Concept
notation: 66.30
definition: List hosts the classification for the activities according to the Council Regulation 3037 90 EEC
status: valid
status modified: 2016-06-08
accepted date: 2016-06-08
in scheme: NACEValue

Buying and selling of own real estate
type: Concept
notation: 68.10
definition: List hosts the classification for the activities according to the Council Regulation 3037 90 EEC
status: valid
status modified: 2016-06-08
accepted date: 2016-06-08
in scheme: NACEValue

Renting and operating of own or leased real estate
type: Concept
notation: 68.20
definition: List hosts the classification for the activities according to the Council Regulation 3037 90 EEC
status: valid
status modified: 2016-06-08
accepted date: 2016-06-08
in scheme: NACEValue

Real estate agencies
type: Concept
notation: 68.31
definition: List hosts the classification for the activities according to the Council Regulation 3037 90 EEC
status: valid
status modified: 2016-06-08
accepted date: 2016-06-08
in scheme: NACEValue

Management of real estate on a fee or contract basis
type: Concept
notation: 68.32
definition: List hosts the classification for the activities according to the Council Regulation 3037 90 EEC
status: valid
status modified: 2016-06-08
accepted date: 2016-06-08
in scheme: NACEValue

Legal activities
type: Concept
notation: 69.10
definition: List hosts the classification for the activities according to the Council Regulation 3037 90 EEC
status: valid
status modified: 2016-06-08
accepted date: 2016-06-08
in scheme: NACEValue

Accounting bookkeeping and auditing activities tax consultancy
type: Concept
notation: 69.20
definition: List hosts the classification for the activities according to the Council Regulation 3037 90 EEC
status: valid
status modified: 2016-06-08
accepted date: 2016-06-08
in scheme: NACEValue

Activities of head offices
type: Concept
notation: 70.10
definition: List hosts the classification for the activities according to the Council Regulation 3037 90 EEC
status: valid
status modified: 2016-06-08
accepted date: 2016-06-08
in scheme: NACEValue

Public relations and communication activities
type: Concept
notation: 70.21
definition: List hosts the classification for the activities according to the Council Regulation 3037 90 EEC
status: valid
status modified: 2016-06-08
accepted date: 2016-06-08
in scheme: NACEValue

Business and other management consultancy activities
type: Concept
notation: 70.22
definition: List hosts the classification for the activities according to the Council Regulation 3037 90 EEC
status: valid
status modified: 2016-06-08
accepted date: 2016-06-08
in scheme: NACEValue

Architectural activities
type: Concept
notation: 71.11
definition: List hosts the classification for the activities according to the Council Regulation 3037 90 EEC
status: valid
status modified: 2016-06-08
accepted date: 2016-06-08
in scheme: NACEValue

Engineering activities and related technical consultancy
type: Concept
notation: 71.12
definition: List hosts the classification for the activities according to the Council Regulation 3037 90 EEC
status: valid
status modified: 2016-06-08
accepted date: 2016-06-08
in scheme: NACEValue

Technical testing and analysis
type: Concept
notation: 71.20
definition: List hosts the classification for the activities according to the Council Regulation 3037 90 EEC
status: valid
status modified: 2016-06-08
accepted date: 2016-06-08
in scheme: NACEValue

Research and experimental development on biotechnology
type: Concept
notation: 72.11
definition: List hosts the classification for the activities according to the Council Regulation 3037 90 EEC
status: valid
status modified: 2016-06-08
accepted date: 2016-06-08
in scheme: NACEValue

Other research and experimental development on natural sciences and engineering
type: Concept
notation: 72.19
definition: List hosts the classification for the activities according to the Council Regulation 3037 90 EEC
status: valid
status modified: 2016-06-08
accepted date: 2016-06-08
in scheme: NACEValue

Research and experimental development on social sciences and humanities
type: Concept
notation: 72.20
definition: List hosts the classification for the activities according to the Council Regulation 3037 90 EEC
status: valid
status modified: 2016-06-08
accepted date: 2016-06-08
in scheme: NACEValue

Advertising agencies
type: Concept
notation: 73.11
definition: List hosts the classification for the activities according to the Council Regulation 3037 90 EEC
status: valid
status modified: 2016-06-08
accepted date: 2016-06-08
in scheme: NACEValue

Media representation
type: Concept
notation: 73.12
definition: List hosts the classification for the activities according to the Council Regulation 3037 90 EEC
status: valid
status modified: 2016-06-08
accepted date: 2016-06-08
in scheme: NACEValue

Market research and public opinion polling
type: Concept
notation: 73.20
definition: List hosts the classification for the activities according to the Council Regulation 3037 90 EEC
status: valid
status modified: 2016-06-08
accepted date: 2016-06-08
in scheme: NACEValue

Specialised design activities
type: Concept
notation: 74.10
definition: List hosts the classification for the activities according to the Council Regulation 3037 90 EEC
status: valid
status modified: 2016-06-08
accepted date: 2016-06-08
in scheme: NACEValue

Photographic activities
type: Concept
notation: 74.20
definition: List hosts the classification for the activities according to the Council Regulation 3037 90 EEC
status: valid
status modified: 2016-06-08
accepted date: 2016-06-08
in scheme: NACEValue

Translation and interpretation activities
type: Concept
notation: 74.30
definition: List hosts the classification for the activities according to the Council Regulation 3037 90 EEC
status: valid
status modified: 2016-06-08
accepted date: 2016-06-08
in scheme: NACEValue

Other professional scientific and technical activities n e c
type: Concept
notation: 74.90
definition: List hosts the classification for the activities according to the Council Regulation 3037 90 EEC
status: valid
status modified: 2016-06-08
accepted date: 2016-06-08
in scheme: NACEValue

Veterinary activities
type: Concept
notation: 75.00
definition: List hosts the classification for the activities according to the Council Regulation 3037 90 EEC
status: valid
status modified: 2016-06-08
accepted date: 2016-06-08
in scheme: NACEValue

Renting and leasing of cars and light motor vehicles
type: Concept
notation: 77.11
definition: List hosts the classification for the activities according to the Council Regulation 3037 90 EEC
status: valid
status modified: 2016-06-08
accepted date: 2016-06-08
in scheme: NACEValue

Renting and leasing of trucks
type: Concept
notation: 77.12
definition: List hosts the classification for the activities according to the Council Regulation 3037 90 EEC
status: valid
status modified: 2016-06-08
accepted date: 2016-06-08
in scheme: NACEValue

Renting and leasing of recreational and sports goods
type: Concept
notation: 77.21
definition: List hosts the classification for the activities according to the Council Regulation 3037 90 EEC
status: valid
status modified: 2016-06-08
accepted date: 2016-06-08
in scheme: NACEValue

Renting of video tapes and disks
type: Concept
notation: 77.22
definition: List hosts the classification for the activities according to the Council Regulation 3037 90 EEC
status: valid
status modified: 2016-06-08
accepted date: 2016-06-08
in scheme: NACEValue

Renting and leasing of other personal and household goods
type: Concept
notation: 77.29
definition: List hosts the classification for the activities according to the Council Regulation 3037 90 EEC
status: valid
status modified: 2016-06-08
accepted date: 2016-06-08
in scheme: NACEValue

Renting and leasing of agricultural machinery and equipment
type: Concept
notation: 77.31
definition: List hosts the classification for the activities according to the Council Regulation 3037 90 EEC
status: valid
status modified: 2016-06-08
accepted date: 2016-06-08
in scheme: NACEValue

Renting and leasing of construction and civil engineering machinery and equipment
type: Concept
notation: 77.32
definition: List hosts the classification for the activities according to the Council Regulation 3037 90 EEC
status: valid
status modified: 2016-06-08
accepted date: 2016-06-08
in scheme: NACEValue

Renting and leasing of office machinery and equipment including computers
type: Concept
notation: 77.33
definition: List hosts the classification for the activities according to the Council Regulation 3037 90 EEC
status: valid
status modified: 2016-06-08
accepted date: 2016-06-08
in scheme: NACEValue

Renting and leasing of water transport equipment
type: Concept
notation: 77.34
definition: List hosts the classification for the activities according to the Council Regulation 3037 90 EEC
status: valid
status modified: 2016-06-08
accepted date: 2016-06-08
in scheme: NACEValue

Renting and leasing of air transport equipment
type: Concept
notation: 77.35
definition: List hosts the classification for the activities according to the Council Regulation 3037 90 EEC
status: valid
status modified: 2016-06-08
accepted date: 2016-06-08
in scheme: NACEValue

Renting and leasing of other machinery equipment and tangible goods n e c
type: Concept
notation: 77.39
definition: List hosts the classification for the activities according to the Council Regulation 3037 90 EEC
status: valid
status modified: 2016-06-08
accepted date: 2016-06-08
in scheme: NACEValue

Leasing of intellectual property and similar products except copyrighted works
type: Concept
notation: 77.40
definition: List hosts the classification for the activities according to the Council Regulation 3037 90 EEC
status: valid
status modified: 2016-06-08
accepted date: 2016-06-08
in scheme: NACEValue

Activities of employment placement agencies
type: Concept
notation: 78.10
definition: List hosts the classification for the activities according to the Council Regulation 3037 90 EEC
status: valid
status modified: 2016-06-08
accepted date: 2016-06-08
in scheme: NACEValue

Temporary employment agency activities
type: Concept
notation: 78.20
definition: List hosts the classification for the activities according to the Council Regulation 3037 90 EEC
status: valid
status modified: 2016-06-08
accepted date: 2016-06-08
in scheme: NACEValue

Other human resources provision
type: Concept
notation: 78.30
definition: List hosts the classification for the activities according to the Council Regulation 3037 90 EEC
status: valid
status modified: 2016-06-08
accepted date: 2016-06-08
in scheme: NACEValue

Travel agency activities
type: Concept
notation: 79.11
definition: List hosts the classification for the activities according to the Council Regulation 3037 90 EEC
status: valid
status modified: 2016-06-08
accepted date: 2016-06-08
in scheme: NACEValue

Tour operator activities
type: Concept
notation: 79.12
definition: List hosts the classification for the activities according to the Council Regulation 3037 90 EEC
status: valid
status modified: 2016-06-08
accepted date: 2016-06-08
in scheme: NACEValue

Other reservation service and related activities
type: Concept
notation: 79.90
definition: List hosts the classification for the activities according to the Council Regulation 3037 90 EEC
status: valid
status modified: 2016-06-08
accepted date: 2016-06-08
in scheme: NACEValue

Private security activities
type: Concept
notation: 80.10
definition: List hosts the classification for the activities according to the Council Regulation 3037 90 EEC
status: valid
status modified: 2016-06-08
accepted date: 2016-06-08
in scheme: NACEValue

Security systems service activities
type: Concept
notation: 80.20
definition: List hosts the classification for the activities according to the Council Regulation 3037 90 EEC
status: valid
status modified: 2016-06-08
accepted date: 2016-06-08
in scheme: NACEValue

Investigation activities
type: Concept
notation: 80.30
definition: List hosts the classification for the activities according to the Council Regulation 3037 90 EEC
status: valid
status modified: 2016-06-08
accepted date: 2016-06-08
in scheme: NACEValue

Combined facilities support activities
type: Concept
notation: 81.10
definition: List hosts the classification for the activities according to the Council Regulation 3037 90 EEC
status: valid
status modified: 2016-06-08
accepted date: 2016-06-08
in scheme: NACEValue

General cleaning of buildings
type: Concept
notation: 81.21
definition: List hosts the classification for the activities according to the Council Regulation 3037 90 EEC
status: valid
status modified: 2016-06-08
accepted date: 2016-06-08
in scheme: NACEValue

Other building and industrial cleaning activities
type: Concept
notation: 81.22
definition: List hosts the classification for the activities according to the Council Regulation 3037 90 EEC
status: valid
status modified: 2016-06-08
accepted date: 2016-06-08
in scheme: NACEValue

Other cleaning activities
type: Concept
notation: 81.29
definition: List hosts the classification for the activities according to the Council Regulation 3037 90 EEC
status: valid
status modified: 2016-06-08
accepted date: 2016-06-08
in scheme: NACEValue

Landscape service activities
type: Concept
notation: 81.30
definition: List hosts the classification for the activities according to the Council Regulation 3037 90 EEC
status: valid
status modified: 2016-06-08
accepted date: 2016-06-08
in scheme: NACEValue

Combined office administrative service activities
type: Concept
notation: 82.11
definition: List hosts the classification for the activities according to the Council Regulation 3037 90 EEC
status: valid
status modified: 2016-06-08
accepted date: 2016-06-08
in scheme: NACEValue

Photocopying document preparation and other specialised office support activities
type: Concept
notation: 82.19
definition: List hosts the classification for the activities according to the Council Regulation 3037 90 EEC
status: valid
status modified: 2016-06-08
accepted date: 2016-06-08
in scheme: NACEValue

Activities of call centres
type: Concept
notation: 82.20
definition: List hosts the classification for the activities according to the Council Regulation 3037 90 EEC
status: valid
status modified: 2016-06-08
accepted date: 2016-06-08
in scheme: NACEValue

Organisation of conventions and trade shows
type: Concept
notation: 82.30
definition: List hosts the classification for the activities according to the Council Regulation 3037 90 EEC
status: valid
status modified: 2016-06-08
accepted date: 2016-06-08
in scheme: NACEValue

Activities of collection agencies and credit bureaus
type: Concept
notation: 82.91
definition: List hosts the classification for the activities according to the Council Regulation 3037 90 EEC
status: valid
status modified: 2016-06-08
accepted date: 2016-06-08
in scheme: NACEValue

Packaging activities
type: Concept
notation: 82.92
definition: List hosts the classification for the activities according to the Council Regulation 3037 90 EEC
status: valid
status modified: 2016-06-08
accepted date: 2016-06-08
in scheme: NACEValue

Other business support service activities n e c
type: Concept
notation: 82.99
definition: List hosts the classification for the activities according to the Council Regulation 3037 90 EEC
status: valid
status modified: 2016-06-08
accepted date: 2016-06-08
in scheme: NACEValue

General public administration activities
type: Concept
notation: 84.11
definition: List hosts the classification for the activities according to the Council Regulation 3037 90 EEC
status: valid
status modified: 2016-06-08
accepted date: 2016-06-08
in scheme: NACEValue

Regulation of the activities of providing health care education cultural services and other social services excluding social security
type: Concept
notation: 84.12
definition: List hosts the classification for the activities according to the Council Regulation 3037 90 EEC
status: valid
status modified: 2016-06-08
accepted date: 2016-06-08
in scheme: NACEValue

Regulation of and contribution to more efficient operation of businesses
type: Concept
notation: 84.13
definition: List hosts the classification for the activities according to the Council Regulation 3037 90 EEC
status: valid
status modified: 2016-06-08
accepted date: 2016-06-08
in scheme: NACEValue

Foreign affairs
type: Concept
notation: 84.21
definition: List hosts the classification for the activities according to the Council Regulation 3037 90 EEC
status: valid
status modified: 2016-06-08
accepted date: 2016-06-08
in scheme: NACEValue

Defence activities
type: Concept
notation: 84.22
definition: List hosts the classification for the activities according to the Council Regulation 3037 90 EEC
status: valid
status modified: 2016-06-08
accepted date: 2016-06-08
in scheme: NACEValue

Justice and judicial activities
type: Concept
notation: 84.23
definition: List hosts the classification for the activities according to the Council Regulation 3037 90 EEC
status: valid
status modified: 2016-06-08
accepted date: 2016-06-08
in scheme: NACEValue

Public order and safety activities
type: Concept
notation: 84.24
definition: List hosts the classification for the activities according to the Council Regulation 3037 90 EEC
status: valid
status modified: 2016-06-08
accepted date: 2016-06-08
in scheme: NACEValue

Fire service activities
type: Concept
notation: 84.25
definition: List hosts the classification for the activities according to the Council Regulation 3037 90 EEC
status: valid
status modified: 2016-06-08
accepted date: 2016-06-08
in scheme: NACEValue

Compulsory social security activities
type: Concept
notation: 84.30
definition: List hosts the classification for the activities according to the Council Regulation 3037 90 EEC
status: valid
status modified: 2016-06-08
accepted date: 2016-06-08
in scheme: NACEValue

Pre-primary education
type: Concept
notation: 85.10
definition: List hosts the classification for the activities according to the Council Regulation 3037 90 EEC
status: valid
status modified: 2016-06-08
accepted date: 2016-06-08
in scheme: NACEValue

Primary education
type: Concept
notation: 85.20
definition: List hosts the classification for the activities according to the Council Regulation 3037 90 EEC
status: valid
status modified: 2016-06-08
accepted date: 2016-06-08
in scheme: NACEValue

General secondary education
type: Concept
notation: 85.31
definition: List hosts the classification for the activities according to the Council Regulation 3037 90 EEC
status: valid
status modified: 2016-06-08
accepted date: 2016-06-08
in scheme: NACEValue

Technical and vocational secondary education
type: Concept
notation: 85.32
definition: List hosts the classification for the activities according to the Council Regulation 3037 90 EEC
status: valid
status modified: 2016-06-08
accepted date: 2016-06-08
in scheme: NACEValue

Post-secondary non-tertiary education
type: Concept
notation: 85.41
definition: List hosts the classification for the activities according to the Council Regulation 3037 90 EEC
status: valid
status modified: 2016-06-08
accepted date: 2016-06-08
in scheme: NACEValue

Tertiary education
type: Concept
notation: 85.42
definition: List hosts the classification for the activities according to the Council Regulation 3037 90 EEC
status: valid
status modified: 2016-06-08
accepted date: 2016-06-08
in scheme: NACEValue

Sports and recreation education
type: Concept
notation: 85.51
definition: List hosts the classification for the activities according to the Council Regulation 3037 90 EEC
status: valid
status modified: 2016-06-08
accepted date: 2016-06-08
in scheme: NACEValue

Cultural education
type: Concept
notation: 85.52
definition: List hosts the classification for the activities according to the Council Regulation 3037 90 EEC
status: valid
status modified: 2016-06-08
accepted date: 2016-06-08
in scheme: NACEValue

Driving school activities
type: Concept
notation: 85.53
definition: List hosts the classification for the activities according to the Council Regulation 3037 90 EEC
status: valid
status modified: 2016-06-08
accepted date: 2016-06-08
in scheme: NACEValue

Other education n e c
type: Concept
notation: 85.59
definition: List hosts the classification for the activities according to the Council Regulation 3037 90 EEC
status: valid
status modified: 2016-06-08
accepted date: 2016-06-08
in scheme: NACEValue

Educational support activities
type: Concept
notation: 85.60
definition: List hosts the classification for the activities according to the Council Regulation 3037 90 EEC
status: valid
status modified: 2016-06-08
accepted date: 2016-06-08
in scheme: NACEValue

Hospital activities
type: Concept
notation: 86.10
definition: List hosts the classification for the activities according to the Council Regulation 3037 90 EEC
status: valid
status modified: 2016-06-08
accepted date: 2016-06-08
in scheme: NACEValue

General medical practice activities
type: Concept
notation: 86.21
definition: List hosts the classification for the activities according to the Council Regulation 3037 90 EEC
status: valid
status modified: 2016-06-08
accepted date: 2016-06-08
in scheme: NACEValue

Specialist medical practice activities
type: Concept
notation: 86.22
definition: List hosts the classification for the activities according to the Council Regulation 3037 90 EEC
status: valid
status modified: 2016-06-08
accepted date: 2016-06-08
in scheme: NACEValue

Dental practice activities
type: Concept
notation: 86.23
definition: List hosts the classification for the activities according to the Council Regulation 3037 90 EEC
status: valid
status modified: 2016-06-08
accepted date: 2016-06-08
in scheme: NACEValue

Other human health activities
type: Concept
notation: 86.90
definition: List hosts the classification for the activities according to the Council Regulation 3037 90 EEC
status: valid
status modified: 2016-06-08
accepted date: 2016-06-08
in scheme: NACEValue

Residential nursing care activities
type: Concept
notation: 87.10
definition: List hosts the classification for the activities according to the Council Regulation 3037 90 EEC
status: valid
status modified: 2016-06-08
accepted date: 2016-06-08
in scheme: NACEValue

Residential care activities for mental retardation mental health and substance abuse
type: Concept
notation: 87.20
definition: List hosts the classification for the activities according to the Council Regulation 3037 90 EEC
status: valid
status modified: 2016-06-08
accepted date: 2016-06-08
in scheme: NACEValue

Residential care activities for the elderly and disabled
type: Concept
notation: 87.30
definition: List hosts the classification for the activities according to the Council Regulation 3037 90 EEC
status: valid
status modified: 2016-06-08
accepted date: 2016-06-08
in scheme: NACEValue

Other residential care activities
type: Concept
notation: 87.90
definition: List hosts the classification for the activities according to the Council Regulation 3037 90 EEC
status: valid
status modified: 2016-06-08
accepted date: 2016-06-08
in scheme: NACEValue

Social work activities without accommodation for the elderly and disabled
type: Concept
notation: 88.10
definition: List hosts the classification for the activities according to the Council Regulation 3037 90 EEC
status: valid
status modified: 2016-06-08
accepted date: 2016-06-08
in scheme: NACEValue

Child day-care activities
type: Concept
notation: 88.91
definition: List hosts the classification for the activities according to the Council Regulation 3037 90 EEC
status: valid
status modified: 2016-06-08
accepted date: 2016-06-08
in scheme: NACEValue

Other social work activities without accommodation n e c
type: Concept
notation: 88.99
definition: List hosts the classification for the activities according to the Council Regulation 3037 90 EEC
status: valid
status modified: 2016-06-08
accepted date: 2016-06-08
in scheme: NACEValue

Performing arts
type: Concept
notation: 90.01
definition: List hosts the classification for the activities according to the Council Regulation 3037 90 EEC
status: valid
status modified: 2016-06-08
accepted date: 2016-06-08
in scheme: NACEValue

Support activities to performing arts
type: Concept
notation: 90.02
definition: List hosts the classification for the activities according to the Council Regulation 3037 90 EEC
status: valid
status modified: 2016-06-08
accepted date: 2016-06-08
in scheme: NACEValue

Artistic creation
type: Concept
notation: 90.03
definition: List hosts the classification for the activities according to the Council Regulation 3037 90 EEC
status: valid
status modified: 2016-06-08
accepted date: 2016-06-08
in scheme: NACEValue

Operation of arts facilities
type: Concept
notation: 90.04
definition: List hosts the classification for the activities according to the Council Regulation 3037 90 EEC
status: valid
status modified: 2016-06-08
accepted date: 2016-06-08
in scheme: NACEValue

Library and archives activities
type: Concept
notation: 91.01
definition: List hosts the classification for the activities according to the Council Regulation 3037 90 EEC
status: valid
status modified: 2016-06-08
accepted date: 2016-06-08
in scheme: NACEValue

Museums activities
type: Concept
notation: 91.02
definition: List hosts the classification for the activities according to the Council Regulation 3037 90 EEC
status: valid
status modified: 2016-06-08
accepted date: 2016-06-08
in scheme: NACEValue

Operation of historical sites and buildings and similar visitor attractions
type: Concept
notation: 91.03
definition: List hosts the classification for the activities according to the Council Regulation 3037 90 EEC
status: valid
status modified: 2016-06-08
accepted date: 2016-06-08
in scheme: NACEValue

Botanical and zoological gardens and nature reserves activities
type: Concept
notation: 91.04
definition: List hosts the classification for the activities according to the Council Regulation 3037 90 EEC
status: valid
status modified: 2016-06-08
accepted date: 2016-06-08
in scheme: NACEValue

Gambling and betting activities
type: Concept
notation: 92.00
definition: List hosts the classification for the activities according to the Council Regulation 3037 90 EEC
status: valid
status modified: 2016-06-08
accepted date: 2016-06-08
in scheme: NACEValue

Operation of sports facilities
type: Concept
notation: 93.11
definition: List hosts the classification for the activities according to the Council Regulation 3037 90 EEC
status: valid
status modified: 2016-06-08
accepted date: 2016-06-08
in scheme: NACEValue

Activities of sport clubs
type: Concept
notation: 93.12
definition: List hosts the classification for the activities according to the Council Regulation 3037 90 EEC
status: valid
status modified: 2016-06-08
accepted date: 2016-06-08
in scheme: NACEValue

Fitness facilities
type: Concept
notation: 93.13
definition: List hosts the classification for the activities according to the Council Regulation 3037 90 EEC
status: valid
status modified: 2016-06-08
accepted date: 2016-06-08
in scheme: NACEValue

Other sports activities
type: Concept
notation: 93.19
definition: List hosts the classification for the activities according to the Council Regulation 3037 90 EEC
status: valid
status modified: 2016-06-08
accepted date: 2016-06-08
in scheme: NACEValue

Activities of amusement parks and theme parks
type: Concept
notation: 93.21
definition: List hosts the classification for the activities according to the Council Regulation 3037 90 EEC
status: valid
status modified: 2016-06-08
accepted date: 2016-06-08
in scheme: NACEValue

Other amusement and recreation activities
type: Concept
notation: 93.29
definition: List hosts the classification for the activities according to the Council Regulation 3037 90 EEC
status: valid
status modified: 2016-06-08
accepted date: 2016-06-08
in scheme: NACEValue

Activities of business and employers membership organisations
type: Concept
notation: 94.11
definition: List hosts the classification for the activities according to the Council Regulation 3037 90 EEC
status: valid
status modified: 2016-06-08
accepted date: 2016-06-08
in scheme: NACEValue

Activities of professional membership organisations
type: Concept
notation: 94.12
definition: List hosts the classification for the activities according to the Council Regulation 3037 90 EEC
status: valid
status modified: 2016-06-08
accepted date: 2016-06-08
in scheme: NACEValue

Activities of trade unions
type: Concept
notation: 94.20
definition: List hosts the classification for the activities according to the Council Regulation 3037 90 EEC
status: valid
status modified: 2016-06-08
accepted date: 2016-06-08
in scheme: NACEValue

Activities of religious organisations
type: Concept
notation: 94.91
definition: List hosts the classification for the activities according to the Council Regulation 3037 90 EEC
status: valid
status modified: 2016-06-08
accepted date: 2016-06-08
in scheme: NACEValue

Activities of political organisations
type: Concept
notation: 94.92
definition: List hosts the classification for the activities according to the Council Regulation 3037 90 EEC
status: valid
status modified: 2016-06-08
accepted date: 2016-06-08
in scheme: NACEValue

Activities of other membership organisations n e c
type: Concept
notation: 94.99
definition: List hosts the classification for the activities according to the Council Regulation 3037 90 EEC
status: valid
status modified: 2016-06-08
accepted date: 2016-06-08
in scheme: NACEValue

Repair of computers and peripheral equipment
type: Concept
notation: 95.11
definition: List hosts the classification for the activities according to the Council Regulation 3037 90 EEC
status: valid
status modified: 2016-06-08
accepted date: 2016-06-08
in scheme: NACEValue

Repair of communication equipment
type: Concept
notation: 95.12
definition: List hosts the classification for the activities according to the Council Regulation 3037 90 EEC
status: valid
status modified: 2016-06-08
accepted date: 2016-06-08
in scheme: NACEValue

Repair of consumer electronics
type: Concept
notation: 95.21
definition: List hosts the classification for the activities according to the Council Regulation 3037 90 EEC
status: valid
status modified: 2016-06-08
accepted date: 2016-06-08
in scheme: NACEValue

Repair of household appliances and home and garden equipment
type: Concept
notation: 95.22
definition: List hosts the classification for the activities according to the Council Regulation 3037 90 EEC
status: valid
status modified: 2016-06-08
accepted date: 2016-06-08
in scheme: NACEValue

Repair of footwear and leather goods
type: Concept
notation: 95.23
definition: List hosts the classification for the activities according to the Council Regulation 3037 90 EEC
status: valid
status modified: 2016-06-08
accepted date: 2016-06-08
in scheme: NACEValue

Repair of furniture and home furnishings
type: Concept
notation: 95.24
definition: List hosts the classification for the activities according to the Council Regulation 3037 90 EEC
status: valid
status modified: 2016-06-08
accepted date: 2016-06-08
in scheme: NACEValue

Repair of watches clocks and jewellery
type: Concept
notation: 95.25
definition: List hosts the classification for the activities according to the Council Regulation 3037 90 EEC
status: valid
status modified: 2016-06-08
accepted date: 2016-06-08
in scheme: NACEValue

Repair of other personal and household goods
type: Concept
notation: 95.29
definition: List hosts the classification for the activities according to the Council Regulation 3037 90 EEC
status: valid
status modified: 2016-06-08
accepted date: 2016-06-08
in scheme: NACEValue

Washing and dry- cleaning of textile and fur products
type: Concept
notation: 96.01
definition: List hosts the classification for the activities according to the Council Regulation 3037 90 EEC
status: valid
status modified: 2016-06-08
accepted date: 2016-06-08
in scheme: NACEValue

Hairdressing and other beauty treatment
type: Concept
notation: 96.02
definition: List hosts the classification for the activities according to the Council Regulation 3037 90 EEC
status: valid
status modified: 2016-06-08
accepted date: 2016-06-08
in scheme: NACEValue

Funeral and related activities
type: Concept
notation: 96.03
definition: List hosts the classification for the activities according to the Council Regulation 3037 90 EEC
status: valid
status modified: 2016-06-08
accepted date: 2016-06-08
in scheme: NACEValue

Physical well-being activities
type: Concept
notation: 96.04
definition: List hosts the classification for the activities according to the Council Regulation 3037 90 EEC
status: valid
status modified: 2016-06-08
accepted date: 2016-06-08
in scheme: NACEValue

Other personal service activities n e c
type: Concept
notation: 96.09
definition: List hosts the classification for the activities according to the Council Regulation 3037 90 EEC
status: valid
status modified: 2016-06-08
accepted date: 2016-06-08
in scheme: NACEValue

Activities of households as employers of domestic personnel
type: Concept
notation: 97.00
definition: List hosts the classification for the activities according to the Council Regulation 3037 90 EEC
status: valid
status modified: 2016-06-08
accepted date: 2016-06-08
in scheme: NACEValue

Undifferentiated goods- and services-producing activities of private households for own use
type: Concept
notation: 98.00
definition: Undifferentiated goods- and services-producing activities of private households for own use
status: valid
status modified: 2017-02-08
in scheme: NACEValue

Undifferentiated goods-producing activities of private households for own use
type: Concept
notation: 98.10
definition: List hosts the classification for the activities according to the Council Regulation 3037 90 EEC
status: valid
status modified: 2016-06-08
accepted date: 2016-06-08
in scheme: NACEValue

Undifferentiated service-producing activities of private households for own use
type: Concept
notation: 98.20
definition: List hosts the classification for the activities according to the Council Regulation 3037 90 EEC
status: valid
status modified: 2016-06-08
accepted date: 2016-06-08
in scheme: NACEValue

Activities of extraterritorial organisations and bodies
type: Concept
notation: 99.00
definition: List hosts the classification for the activities according to the Council Regulation 3037 90 EEC
status: valid
status modified: 2016-06-08
accepted date: 2016-06-08
in scheme: NACEValue

"Growing of cereals, other than rice, leguminous crops and oil seeds"
type: Concept
notation: A.01.11
definition: "Growing of cereals, other than rice, leguminous crops and oil seeds"
status: valid
status modified: 2025-03-27
accepted date: 2025-03-27
in scheme: NACEValue

Growing of rice
type: Concept
notation: A.01.12
definition: Growing of rice
status: valid
status modified: 2025-03-27
accepted date: 2025-03-27
in scheme: NACEValue

"Growing of vegetables and melons, roots and tubers"
type: Concept
notation: A.01.13
definition: "Growing of vegetables and melons, roots and tubers"
status: valid
status modified: 2025-03-27
accepted date: 2025-03-27
in scheme: NACEValue

Growing of sugar cane
type: Concept
notation: A.01.14
definition: Growing of sugar cane
status: valid
status modified: 2025-03-27
accepted date: 2025-03-27
in scheme: NACEValue

Growing of tobacco
type: Concept
notation: A.01.15
definition: Growing of tobacco
status: valid
status modified: 2025-03-27
accepted date: 2025-03-27
in scheme: NACEValue

Growing of fibre crops
type: Concept
notation: A.01.16
definition: Growing of fibre crops
status: valid
status modified: 2025-03-27
accepted date: 2025-03-27
in scheme: NACEValue

Growing of other non-perennial crops
type: Concept
notation: A.01.19
definition: Growing of other non-perennial crops
status: valid
status modified: 2025-03-27
accepted date: 2025-03-27
in scheme: NACEValue

Growing of grapes
type: Concept
notation: A.01.21
definition: Growing of grapes
status: valid
status modified: 2025-03-27
accepted date: 2025-03-27
in scheme: NACEValue

Growing of tropical and subtropical fruits
type: Concept
notation: A.01.22
definition: Growing of tropical and subtropical fruits
status: valid
status modified: 2025-03-27
accepted date: 2025-03-27
in scheme: NACEValue

Growing of citrus fruits
type: Concept
notation: A.01.23
definition: Growing of citrus fruits
status: valid
status modified: 2025-03-27
accepted date: 2025-03-27
in scheme: NACEValue

Growing of pome fruits and stone fruits
type: Concept
notation: A.01.24
definition: Growing of pome fruits and stone fruits
status: valid
status modified: 2025-03-27
accepted date: 2025-03-27
in scheme: NACEValue

Growing of other tree and bush fruits and nuts
type: Concept
notation: A.01.25
definition: Growing of other tree and bush fruits and nuts
status: valid
status modified: 2025-03-27
accepted date: 2025-03-27
in scheme: NACEValue

Growing of oleaginous fruits
type: Concept
notation: A.01.26
definition: Growing of oleaginous fruits
status: valid
status modified: 2025-03-27
accepted date: 2025-03-27
in scheme: NACEValue

Growing of beverage crops
type: Concept
notation: A.01.27
definition: Growing of beverage crops
status: valid
status modified: 2025-03-27
accepted date: 2025-03-27
in scheme: NACEValue

"Growing of spices, aromatic, drug and pharmaceutical crops"
type: Concept
notation: A.01.28
definition: "Growing of spices, aromatic, drug and pharmaceutical crops"
status: valid
status modified: 2025-03-27
accepted date: 2025-03-27
in scheme: NACEValue

Growing of other perennial crops
type: Concept
notation: A.01.29
definition: Growing of other perennial crops
status: valid
status modified: 2025-03-27
accepted date: 2025-03-27
in scheme: NACEValue

Plant propagation
type: Concept
notation: A.01.30
definition: Plant propagation
status: valid
status modified: 2025-03-27
accepted date: 2025-03-27
in scheme: NACEValue

Raising of other cattle and buffaloes
type: Concept
notation: A.01.42
definition: Raising of other cattle and buffaloes
status: valid
status modified: 2025-03-27
accepted date: 2025-03-27
in scheme: NACEValue

Raising of horses and other equines
type: Concept
notation: A.01.43
definition: Raising of horses and other equines
status: valid
status modified: 2025-03-27
accepted date: 2025-03-27
in scheme: NACEValue

Raising of camels and camelids
type: Concept
notation: A.01.44
definition: Raising of camels and camelids
status: valid
status modified: 2025-03-27
accepted date: 2025-03-27
in scheme: NACEValue

Raising of sheep and goats
type: Concept
notation: A.01.45
definition: Raising of sheep and goats
status: valid
status modified: 2025-03-27
accepted date: 2025-03-27
in scheme: NACEValue

Raising of swine and pigs
type: Concept
notation: A.01.46
definition: Raising of swine and pigs
status: valid
status modified: 2025-03-27
accepted date: 2025-03-27
in scheme: NACEValue

Raising of poultry
type: Concept
notation: A.01.47
definition: Raising of poultry
status: valid
status modified: 2025-03-27
accepted date: 2025-03-27
in scheme: NACEValue

Raising of other animals
type: Concept
notation: A.01.48
definition: Raising of other animals
status: valid
status modified: 2025-03-27
accepted date: 2025-03-27
in scheme: NACEValue

Mixed farming
type: Concept
notation: A.01.50
definition: Mixed farming
status: valid
status modified: 2025-03-27
accepted date: 2025-03-27
in scheme: NACEValue

Support activities for crop production
type: Concept
notation: A.01.61
definition: Support activities for crop production
status: valid
status modified: 2025-03-27
accepted date: 2025-03-27
in scheme: NACEValue

Support activities for animal production
type: Concept
notation: A.01.62
definition: Support activities for animal production
status: valid
status modified: 2025-03-27
accepted date: 2025-03-27
in scheme: NACEValue

Post-harvest crop activities and seed processing for propagation
type: Concept
notation: A.01.63
definition: Post-harvest crop activities and seed processing for propagation
status: valid
status modified: 2025-03-27
accepted date: 2025-03-27
in scheme: NACEValue

"Hunting, trapping and related service activities"
type: Concept
notation: A.01.70
definition: "Hunting, trapping and related service activities"
status: valid
status modified: 2025-03-27
accepted date: 2025-03-27
in scheme: NACEValue

Silviculture and other forestry activities
type: Concept
notation: A.02.10
definition: Silviculture and other forestry activities
status: valid
status modified: 2025-03-27
accepted date: 2025-03-27
in scheme: NACEValue

Logging
type: Concept
notation: A.02.20
definition: Logging
status: valid
status modified: 2025-03-27
accepted date: 2025-03-27
in scheme: NACEValue

Gathering of wild growing non-wood products
type: Concept
notation: A.02.30
definition: Gathering of wild growing non-wood products
status: valid
status modified: 2025-03-27
accepted date: 2025-03-27
in scheme: NACEValue

Support services to forestry
type: Concept
notation: A.02.40
definition: Support services to forestry
status: valid
status modified: 2025-03-27
accepted date: 2025-03-27
in scheme: NACEValue

Marine fishing
type: Concept
notation: A.03.11
definition: Marine fishing
status: valid
status modified: 2025-03-27
accepted date: 2025-03-27
in scheme: NACEValue

Freshwater fishing
type: Concept
notation: A.03.12
definition: Freshwater fishing
status: valid
status modified: 2025-03-27
accepted date: 2025-03-27
in scheme: NACEValue

Marine aquaculture
type: Concept
notation: A.03.21
definition: Marine aquaculture
status: valid
status modified: 2025-03-27
accepted date: 2025-03-27
in scheme: NACEValue

Freshwater aquaculture
type: Concept
notation: A.03.22
definition: Freshwater aquaculture
status: valid
status modified: 2025-03-27
accepted date: 2025-03-27
in scheme: NACEValue

Support activities for fishing and aquaculture
type: Concept
notation: A.03.30
definition: Support activities for fishing and aquaculture
status: valid
status modified: 2025-03-27
accepted date: 2025-03-27
in scheme: NACEValue

Mining of hard coal
type: Concept
notation: B.05.10
definition: Mining of hard coal
status: valid
status modified: 2025-03-27
accepted date: 2025-03-27
in scheme: NACEValue

Mining of lignite
type: Concept
notation: B.05.20
definition: Mining of lignite
status: valid
status modified: 2025-03-27
accepted date: 2025-03-27
in scheme: NACEValue

Extraction of crude petroleum
type: Concept
notation: B.06.10
definition: Extraction of crude petroleum
status: valid
status modified: 2025-03-27
accepted date: 2025-03-27
in scheme: NACEValue

Extraction of natural gas
type: Concept
notation: B.06.20
definition: Extraction of natural gas
status: valid
status modified: 2025-03-27
accepted date: 2025-03-27
in scheme: NACEValue

Mining of iron ores
type: Concept
notation: B.07.10
definition: Mining of iron ores
status: valid
status modified: 2025-03-27
accepted date: 2025-03-27
in scheme: NACEValue

Mining of uranium and thorium ores
type: Concept
notation: B.07.21
definition: Mining of uranium and thorium ores
status: valid
status modified: 2025-03-27
accepted date: 2025-03-27
in scheme: NACEValue

Mining of other non-ferrous metal ores
type: Concept
notation: B.07.29
definition: Mining of other non-ferrous metal ores
status: valid
status modified: 2025-03-27
accepted date: 2025-03-27
in scheme: NACEValue

"Quarrying of ornamental stone, limestone, gypsum, slate and other stone"
type: Concept
notation: B.08.11
definition: "Quarrying of ornamental stone, limestone, gypsum, slate and other stone"
status: valid
status modified: 2025-03-27
accepted date: 2025-03-27
in scheme: NACEValue

Operation of gravel and sand pits and mining of clay and kaolin
type: Concept
notation: B.08.12
definition: Operation of gravel and sand pits and mining of clay and kaolin
status: valid
status modified: 2025-03-27
accepted date: 2025-03-27
in scheme: NACEValue

Mining of chemical and fertiliser minerals
type: Concept
notation: B.08.91
definition: Mining of chemical and fertiliser minerals
status: valid
status modified: 2025-03-27
accepted date: 2025-03-27
in scheme: NACEValue

Extraction of peat
type: Concept
notation: B.08.92
definition: Extraction of peat
status: valid
status modified: 2025-03-27
accepted date: 2025-03-27
in scheme: NACEValue

Extraction of salt
type: Concept
notation: B.08.93
definition: Extraction of salt
status: valid
status modified: 2025-03-27
accepted date: 2025-03-27
in scheme: NACEValue

Other mining and quarrying n.e.c.
type: Concept
notation: B.08.99
definition: Other mining and quarrying n.e.c.
status: valid
status modified: 2025-03-27
accepted date: 2025-03-27
in scheme: NACEValue

Support activities for petroleum and natural gas extraction
type: Concept
notation: B.09.10
definition: Support activities for petroleum and natural gas extraction
status: valid
status modified: 2025-03-27
accepted date: 2025-03-27
in scheme: NACEValue

Support activities for other mining and quarrying
type: Concept
notation: B.09.90
definition: Support activities for other mining and quarrying
status: valid
status modified: 2025-03-27
accepted date: 2025-03-27
in scheme: NACEValue

"Processing and preserving of meat, except of poultry meat"
type: Concept
notation: C.10.11
definition: "Processing and preserving of meat, except of poultry meat"
status: valid
status modified: 2025-03-27
accepted date: 2025-03-27
in scheme: NACEValue

Processing and preserving of poultry meat
type: Concept
notation: C.10.12
definition: Processing and preserving of poultry meat
status: valid
status modified: 2025-03-27
accepted date: 2025-03-27
in scheme: NACEValue

Production of meat and poultry meat products
type: Concept
notation: C.10.13
definition: Production of meat and poultry meat products
status: valid
status modified: 2025-03-27
accepted date: 2025-03-27
in scheme: NACEValue

"Processing and preserving of fish, crustaceans and molluscs"
type: Concept
notation: C.10.20
definition: "Processing and preserving of fish, crustaceans and molluscs"
status: valid
status modified: 2025-03-27
accepted date: 2025-03-27
in scheme: NACEValue

Processing and preserving of potatoes
type: Concept
notation: C.10.31
definition: Processing and preserving of potatoes
status: valid
status modified: 2025-03-27
accepted date: 2025-03-27
in scheme: NACEValue

Manufacture of fruit and vegetable juice
type: Concept
notation: C.10.32
definition: Manufacture of fruit and vegetable juice
status: valid
status modified: 2025-03-27
accepted date: 2025-03-27
in scheme: NACEValue

Other processing and preserving of fruit and vegetables
type: Concept
notation: C.10.39
definition: Other processing and preserving of fruit and vegetables
status: valid
status modified: 2025-03-27
accepted date: 2025-03-27
in scheme: NACEValue

Manufacture of oils and fats
type: Concept
notation: C.10.41
definition: Manufacture of oils and fats
status: valid
status modified: 2025-03-27
accepted date: 2025-03-27
in scheme: NACEValue

Manufacture of margarine and similar edible fats
type: Concept
notation: C.10.42
definition: Manufacture of margarine and similar edible fats
status: valid
status modified: 2025-03-27
accepted date: 2025-03-27
in scheme: NACEValue

Manufacture of dairy products
type: Concept
notation: C.10.51
definition: Manufacture of dairy products
status: valid
status modified: 2025-03-27
accepted date: 2025-03-27
in scheme: NACEValue

Manufacture of ice cream and other edible ice
type: Concept
notation: C.10.52
definition: Manufacture of ice cream and other edible ice
status: valid
status modified: 2025-03-27
accepted date: 2025-03-27
in scheme: NACEValue

Manufacture of grain mill products
type: Concept
notation: C.10.61
definition: Manufacture of grain mill products
status: valid
status modified: 2025-03-27
accepted date: 2025-03-27
in scheme: NACEValue

Manufacture of starches and starch products
type: Concept
notation: C.10.62
definition: Manufacture of starches and starch products
status: valid
status modified: 2025-03-27
accepted date: 2025-03-27
in scheme: NACEValue

Manufacture of bread; manufacture of fresh pastry goods and cakes
type: Concept
notation: C.10.71
definition: Manufacture of bread; manufacture of fresh pastry goods and cakes
status: valid
status modified: 2025-03-27
accepted date: 2025-03-27
in scheme: NACEValue

"Manufacture of rusks, biscuits, preserved pastries and cakes"
type: Concept
notation: C.10.72
definition: "Manufacture of rusks, biscuits, preserved pastries and cakes"
status: valid
status modified: 2025-03-27
accepted date: 2025-03-27
in scheme: NACEValue

Manufacture of farinaceous products
type: Concept
notation: C.10.73
definition: Manufacture of farinaceous products
status: valid
status modified: 2025-03-27
accepted date: 2025-03-27
in scheme: NACEValue

Manufacture of sugar
type: Concept
notation: C.10.81
definition: Manufacture of sugar
status: valid
status modified: 2025-03-27
accepted date: 2025-03-27
in scheme: NACEValue

"Manufacture of cocoa, chocolate and sugar confectionery"
type: Concept
notation: C.10.82
definition: "Manufacture of cocoa, chocolate and sugar confectionery"
status: valid
status modified: 2025-03-27
accepted date: 2025-03-27
in scheme: NACEValue

Processing of tea and coffee
type: Concept
notation: C.10.83
definition: Processing of tea and coffee
status: valid
status modified: 2025-03-27
accepted date: 2025-03-27
in scheme: NACEValue

Manufacture of condiments and seasonings
type: Concept
notation: C.10.84
definition: Manufacture of condiments and seasonings
status: valid
status modified: 2025-03-27
accepted date: 2025-03-27
in scheme: NACEValue

Manufacture of prepared meals and dishes
type: Concept
notation: C.10.85
definition: Manufacture of prepared meals and dishes
status: valid
status modified: 2025-03-27
accepted date: 2025-03-27
in scheme: NACEValue

Manufacture of homogenised food preparations and dietetic food
type: Concept
notation: C.10.86
definition: Manufacture of homogenised food preparations and dietetic food
status: valid
status modified: 2025-03-27
accepted date: 2025-03-27
in scheme: NACEValue

Manufacture of other food products n.e.c.
type: Concept
notation: C.10.89
definition: Manufacture of other food products n.e.c.
status: valid
status modified: 2025-03-27
accepted date: 2025-03-27
in scheme: NACEValue

Manufacture of prepared feeds for farm animals
type: Concept
notation: C.10.91
definition: Manufacture of prepared feeds for farm animals
status: valid
status modified: 2025-03-27
accepted date: 2025-03-27
in scheme: NACEValue

Manufacture of prepared pet foods
type: Concept
notation: C.10.92
definition: Manufacture of prepared pet foods
status: valid
status modified: 2025-03-27
accepted date: 2025-03-27
in scheme: NACEValue

"Distilling, rectifying and blending of spirits"
type: Concept
notation: C.11.01
definition: "Distilling, rectifying and blending of spirits"
status: valid
status modified: 2025-03-27
accepted date: 2025-03-27
in scheme: NACEValue

Manufacture of wine from grape
type: Concept
notation: C.11.02
definition: Manufacture of wine from grape
status: valid
status modified: 2025-03-27
accepted date: 2025-03-27
in scheme: NACEValue

Manufacture of cider and other fruit fermented beverages
type: Concept
notation: C.11.03
definition: Manufacture of cider and other fruit fermented beverages
status: valid
status modified: 2025-03-27
accepted date: 2025-03-27
in scheme: NACEValue

Manufacture of other non-distilled fermented beverages
type: Concept
notation: C.11.04
definition: Manufacture of other non-distilled fermented beverages
status: valid
status modified: 2025-03-27
accepted date: 2025-03-27
in scheme: NACEValue

Manufacture of beer
type: Concept
notation: C.11.05
definition: Manufacture of beer
status: valid
status modified: 2025-03-27
accepted date: 2025-03-27
in scheme: NACEValue

Manufacture of malt
type: Concept
notation: C.11.06
definition: Manufacture of malt
status: valid
status modified: 2025-03-27
accepted date: 2025-03-27
in scheme: NACEValue

Manufacture of soft drinks and bottled waters
type: Concept
notation: C.11.07
definition: Manufacture of soft drinks and bottled waters
status: valid
status modified: 2025-03-27
accepted date: 2025-03-27
in scheme: NACEValue

Manufacture of tobacco products
type: Concept
notation: C.12.00
definition: Manufacture of tobacco products
status: valid
status modified: 2025-03-27
accepted date: 2025-03-27
in scheme: NACEValue

Preparation and spinning of textile fibres
type: Concept
notation: C.13.10
definition: Preparation and spinning of textile fibres
status: valid
status modified: 2025-03-27
accepted date: 2025-03-27
in scheme: NACEValue

Weaving of textiles
type: Concept
notation: C.13.20
definition: Weaving of textiles
status: valid
status modified: 2025-03-27
accepted date: 2025-03-27
in scheme: NACEValue

Finishing of textiles
type: Concept
notation: C.13.30
definition: Finishing of textiles
status: valid
status modified: 2025-03-27
accepted date: 2025-03-27
in scheme: NACEValue

Manufacture of knitted and crocheted fabrics
type: Concept
notation: C.13.91
definition: Manufacture of knitted and crocheted fabrics
status: valid
status modified: 2025-03-27
accepted date: 2025-03-27
in scheme: NACEValue

Manufacture of household textiles and made-up furnishing articles
type: Concept
notation: C.13.92
definition: Manufacture of household textiles and made-up furnishing articles
status: valid
status modified: 2025-03-27
accepted date: 2025-03-27
in scheme: NACEValue

Manufacture of carpets and rugs
type: Concept
notation: C.13.93
definition: Manufacture of carpets and rugs
status: valid
status modified: 2025-03-27
accepted date: 2025-03-27
in scheme: NACEValue

"Manufacture of cordage, rope, twine and netting"
type: Concept
notation: C.13.94
definition: "Manufacture of cordage, rope, twine and netting"
status: valid
status modified: 2025-03-27
accepted date: 2025-03-27
in scheme: NACEValue

Manufacture of non-wovens and non-woven articles
type: Concept
notation: C.13.95
definition: Manufacture of non-wovens and non-woven articles
status: valid
status modified: 2025-03-27
accepted date: 2025-03-27
in scheme: NACEValue

Manufacture of other technical and industrial textiles
type: Concept
notation: C.13.96
definition: Manufacture of other technical and industrial textiles
status: valid
status modified: 2025-03-27
accepted date: 2025-03-27
in scheme: NACEValue

Manufacture of other textiles n.e.c.
type: Concept
notation: C.13.99
definition: Manufacture of other textiles n.e.c.
status: valid
status modified: 2025-03-27
accepted date: 2025-03-27
in scheme: NACEValue

Manufacture of knitted and crocheted apparel
type: Concept
notation: C.14.10
definition: Manufacture of knitted and crocheted apparel
status: valid
status modified: 2025-03-27
accepted date: 2025-03-27
in scheme: NACEValue

Manufacture of outerwear
type: Concept
notation: C.14.21
definition: Manufacture of outerwear
status: valid
status modified: 2025-03-27
accepted date: 2025-03-27
in scheme: NACEValue

Manufacture of underwear
type: Concept
notation: C.14.22
definition: Manufacture of underwear
status: valid
status modified: 2025-03-27
accepted date: 2025-03-27
in scheme: NACEValue

Manufacture of workwear
type: Concept
notation: C.14.23
definition: Manufacture of workwear
status: valid
status modified: 2025-03-27
accepted date: 2025-03-27
in scheme: NACEValue

Manufacture of leather clothes and fur apparel
type: Concept
notation: C.14.24
definition: Manufacture of leather clothes and fur apparel
status: valid
status modified: 2025-03-27
accepted date: 2025-03-27
in scheme: NACEValue

Manufacture of other wearing apparel and accessories n.e.c.
type: Concept
notation: C.14.29
definition: Manufacture of other wearing apparel and accessories n.e.c.
status: valid
status modified: 2025-03-27
accepted date: 2025-03-27
in scheme: NACEValue

"Tanning, dressing, dyeing of leather and fur"
type: Concept
notation: C.15.11
definition: "Tanning, dressing, dyeing of leather and fur"
status: valid
status modified: 2025-03-27
accepted date: 2025-03-27
in scheme: NACEValue

"Manufacture of luggage, handbags, saddlery and harness of any material"
type: Concept
notation: C.15.12
definition: "Manufacture of luggage, handbags, saddlery and harness of any material"
status: valid
status modified: 2025-03-27
accepted date: 2025-03-27
in scheme: NACEValue

Manufacture of footwear
type: Concept
notation: C.15.20
definition: Manufacture of footwear
status: valid
status modified: 2025-03-27
accepted date: 2025-03-27
in scheme: NACEValue

Sawmilling and planing of wood
type: Concept
notation: C.16.11
definition: Sawmilling and planing of wood
status: valid
status modified: 2025-03-27
accepted date: 2025-03-27
in scheme: NACEValue

Processing and finishing of wood
type: Concept
notation: C.16.12
definition: Processing and finishing of wood
status: valid
status modified: 2025-03-27
accepted date: 2025-03-27
in scheme: NACEValue

Manufacture of veneer sheets and wood-based panels
type: Concept
notation: C.16.21
definition: Manufacture of veneer sheets and wood-based panels
status: valid
status modified: 2025-03-27
accepted date: 2025-03-27
in scheme: NACEValue

Manufacture of assembled parquet floors
type: Concept
notation: C.16.22
definition: Manufacture of assembled parquet floors
status: valid
status modified: 2025-03-27
accepted date: 2025-03-27
in scheme: NACEValue

Manufacture of other builders' carpentry and joinery
type: Concept
notation: C.16.23
definition: Manufacture of other builders' carpentry and joinery
status: valid
status modified: 2025-03-27
accepted date: 2025-03-27
in scheme: NACEValue

Manufacture of wooden containers
type: Concept
notation: C.16.24
definition: Manufacture of wooden containers
status: valid
status modified: 2025-03-27
accepted date: 2025-03-27
in scheme: NACEValue

Manufacture of doors and windows of wood
type: Concept
notation: C.16.25
definition: Manufacture of doors and windows of wood
status: valid
status modified: 2025-03-27
accepted date: 2025-03-27
in scheme: NACEValue

Manufacture of solid fuels from vegetable biomass
type: Concept
notation: C.16.26
definition: Manufacture of solid fuels from vegetable biomass
status: valid
status modified: 2025-03-27
accepted date: 2025-03-27
in scheme: NACEValue

Finishing of wooden products
type: Concept
notation: C.16.27
definition: Finishing of wooden products
status: valid
status modified: 2025-03-27
accepted date: 2025-03-27
in scheme: NACEValue

"Manufacture of other products of wood and articles of cork, straw and plaiting materials"
type: Concept
notation: C.16.28
definition: "Manufacture of other products of wood and articles of cork, straw and plaiting materials"
status: valid
status modified: 2025-03-27
accepted date: 2025-03-27
in scheme: NACEValue

Manufacture of pulp
type: Concept
notation: C.17.11
definition: Manufacture of pulp
status: valid
status modified: 2025-03-27
accepted date: 2025-03-27
in scheme: NACEValue

Manufacture of paper and paperboard
type: Concept
notation: C.17.12
definition: Manufacture of paper and paperboard
status: valid
status modified: 2025-03-27
accepted date: 2025-03-27
in scheme: NACEValue

"Manufacture of corrugated paper, paperboard and containers of paper and paperboard"
type: Concept
notation: C.17.21
definition: "Manufacture of corrugated paper, paperboard and containers of paper and paperboard"
status: valid
status modified: 2025-03-27
accepted date: 2025-03-27
in scheme: NACEValue

Manufacture of household and sanitary goods and of toilet requisites
type: Concept
notation: C.17.22
definition: Manufacture of household and sanitary goods and of toilet requisites
status: valid
status modified: 2025-03-27
accepted date: 2025-03-27
in scheme: NACEValue

Manufacture of paper stationery
type: Concept
notation: C.17.23
definition: Manufacture of paper stationery
status: valid
status modified: 2025-03-27
accepted date: 2025-03-27
in scheme: NACEValue

Manufacture of wallpaper
type: Concept
notation: C.17.24
definition: Manufacture of wallpaper
status: valid
status modified: 2025-03-27
accepted date: 2025-03-27
in scheme: NACEValue

Manufacture of other articles of paper and paperboard
type: Concept
notation: C.17.25
definition: Manufacture of other articles of paper and paperboard
status: valid
status modified: 2025-03-27
accepted date: 2025-03-27
in scheme: NACEValue

Printing of newspapers
type: Concept
notation: C.18.11
definition: Printing of newspapers
status: valid
status modified: 2025-03-27
accepted date: 2025-03-27
in scheme: NACEValue

Other printing
type: Concept
notation: C.18.12
definition: Other printing
status: valid
status modified: 2025-03-27
accepted date: 2025-03-27
in scheme: NACEValue

Pre-press and pre-media services
type: Concept
notation: C.18.13
definition: Pre-press and pre-media services
status: valid
status modified: 2025-03-27
accepted date: 2025-03-27
in scheme: NACEValue

Binding and related services
type: Concept
notation: C.18.14
definition: Binding and related services
status: valid
status modified: 2025-03-27
accepted date: 2025-03-27
in scheme: NACEValue

Reproduction of recorded media
type: Concept
notation: C.18.20
definition: Reproduction of recorded media
status: valid
status modified: 2025-03-27
accepted date: 2025-03-27
in scheme: NACEValue

Manufacture of coke oven products
type: Concept
notation: C.19.10
definition: Manufacture of coke oven products
status: valid
status modified: 2025-03-27
accepted date: 2025-03-27
in scheme: NACEValue

Manufacture of refined petroleum products and fossil fuel products
type: Concept
notation: C.19.20
definition: Manufacture of refined petroleum products and fossil fuel products
status: valid
status modified: 2025-03-27
accepted date: 2025-03-27
in scheme: NACEValue

Manufacture of industrial gases
type: Concept
notation: C.20.11
definition: Manufacture of industrial gases
status: valid
status modified: 2025-03-27
accepted date: 2025-03-27
in scheme: NACEValue

Manufacture of dyes and pigments
type: Concept
notation: C.20.12
definition: Manufacture of dyes and pigments
status: valid
status modified: 2025-03-27
accepted date: 2025-03-27
in scheme: NACEValue

Manufacture of other inorganic basic chemicals
type: Concept
notation: C.20.13
definition: Manufacture of other inorganic basic chemicals
status: valid
status modified: 2025-03-27
accepted date: 2025-03-27
in scheme: NACEValue

Manufacture of other organic basic chemicals
type: Concept
notation: C.20.14
definition: Manufacture of other organic basic chemicals
status: valid
status modified: 2025-03-27
accepted date: 2025-03-27
in scheme: NACEValue

Manufacture of fertilisers and nitrogen compounds
type: Concept
notation: C.20.15
definition: Manufacture of fertilisers and nitrogen compounds
status: valid
status modified: 2025-03-27
accepted date: 2025-03-27
in scheme: NACEValue

Manufacture of plastics in primary forms
type: Concept
notation: C.20.16
definition: Manufacture of plastics in primary forms
status: valid
status modified: 2025-03-27
accepted date: 2025-03-27
in scheme: NACEValue

Manufacture of synthetic rubber in primary forms
type: Concept
notation: C.20.17
definition: Manufacture of synthetic rubber in primary forms
status: valid
status modified: 2025-03-27
accepted date: 2025-03-27
in scheme: NACEValue

"Manufacture of pesticides, disinfectants and other agrochemical products"
type: Concept
notation: C.20.20
definition: "Manufacture of pesticides, disinfectants and other agrochemical products"
status: valid
status modified: 2025-03-27
accepted date: 2025-03-27
in scheme: NACEValue

"Manufacture of paints, varnishes and similar coatings, printing ink and mastics"
type: Concept
notation: C.20.30
definition: "Manufacture of paints, varnishes and similar coatings, printing ink and mastics"
status: valid
status modified: 2025-03-27
accepted date: 2025-03-27
in scheme: NACEValue

"Manufacture of soap and detergents, cleaning and polishing preparations"
type: Concept
notation: C.20.41
definition: "Manufacture of soap and detergents, cleaning and polishing preparations"
status: valid
status modified: 2025-03-27
accepted date: 2025-03-27
in scheme: NACEValue

Manufacture of perfumes and toilet preparations
type: Concept
notation: C.20.42
definition: Manufacture of perfumes and toilet preparations
status: valid
status modified: 2025-03-27
accepted date: 2025-03-27
in scheme: NACEValue

Manufacture of liquid biofuels
type: Concept
notation: C.20.51
definition: Manufacture of liquid biofuels
status: valid
status modified: 2025-03-27
accepted date: 2025-03-27
in scheme: NACEValue

Manufacture of other chemical products n.e.c.
type: Concept
notation: C.20.59
definition: Manufacture of other chemical products n.e.c.
status: valid
status modified: 2025-03-27
accepted date: 2025-03-27
in scheme: NACEValue

Manufacture of man-made fibres
type: Concept
notation: C.20.60
definition: Manufacture of man-made fibres
status: valid
status modified: 2025-03-27
accepted date: 2025-03-27
in scheme: NACEValue

Manufacture of basic pharmaceutical products
type: Concept
notation: C.21.10
definition: Manufacture of basic pharmaceutical products
status: valid
status modified: 2025-03-27
accepted date: 2025-03-27
in scheme: NACEValue

Manufacture of pharmaceutical preparations
type: Concept
notation: C.21.20
definition: Manufacture of pharmaceutical preparations
status: valid
status modified: 2025-03-27
accepted date: 2025-03-27
in scheme: NACEValue

"Manufacture, retreading and rebuilding of rubber tyres and manufacture of tubes"
type: Concept
notation: C.22.11
definition: "Manufacture, retreading and rebuilding of rubber tyres and manufacture of tubes"
status: valid
status modified: 2025-03-27
accepted date: 2025-03-27
in scheme: NACEValue

Manufacture of other rubber products
type: Concept
notation: C.22.12
definition: Manufacture of other rubber products
status: valid
status modified: 2025-03-27
accepted date: 2025-03-27
in scheme: NACEValue

"Manufacture of plastic plates, sheets, tubes and profiles"
type: Concept
notation: C.22.21
definition: "Manufacture of plastic plates, sheets, tubes and profiles"
status: valid
status modified: 2025-03-27
accepted date: 2025-03-27
in scheme: NACEValue

Manufacture of plastic packing goods
type: Concept
notation: C.22.22
definition: Manufacture of plastic packing goods
status: valid
status modified: 2025-03-27
accepted date: 2025-03-27
in scheme: NACEValue

Manufacture of doors and windows of plastic
type: Concept
notation: C.22.23
definition: Manufacture of doors and windows of plastic
status: valid
status modified: 2025-03-27
accepted date: 2025-03-27
in scheme: NACEValue

Manufacture of builders’ ware of plastic
type: Concept
notation: C.22.24
definition: Manufacture of builders’ ware of plastic
status: valid
status modified: 2025-03-27
accepted date: 2025-03-27
in scheme: NACEValue

Processing and finishing of plastic products
type: Concept
notation: C.22.25
definition: Processing and finishing of plastic products
status: valid
status modified: 2025-03-27
accepted date: 2025-03-27
in scheme: NACEValue

Manufacture of other plastic products
type: Concept
notation: C.22.26
definition: Manufacture of other plastic products
status: valid
status modified: 2025-03-27
accepted date: 2025-03-27
in scheme: NACEValue

Manufacture of flat glass
type: Concept
notation: C.23.11
definition: Manufacture of flat glass
status: valid
status modified: 2025-03-27
accepted date: 2025-03-27
in scheme: NACEValue

Shaping and processing of flat glass
type: Concept
notation: C.23.12
definition: Shaping and processing of flat glass
status: valid
status modified: 2025-03-27
accepted date: 2025-03-27
in scheme: NACEValue

Manufacture of hollow glass
type: Concept
notation: C.23.13
definition: Manufacture of hollow glass
status: valid
status modified: 2025-03-27
accepted date: 2025-03-27
in scheme: NACEValue

Manufacture of glass fibres
type: Concept
notation: C.23.14
definition: Manufacture of glass fibres
status: valid
status modified: 2025-03-27
accepted date: 2025-03-27
in scheme: NACEValue

"Manufacture and processing of other glass, including technical glassware"
type: Concept
notation: C.23.15
definition: "Manufacture and processing of other glass, including technical glassware"
status: valid
status modified: 2025-03-27
accepted date: 2025-03-27
in scheme: NACEValue

Manufacture of refractory products
type: Concept
notation: C.23.20
definition: Manufacture of refractory products
status: valid
status modified: 2025-03-27
accepted date: 2025-03-27
in scheme: NACEValue

Manufacture of ceramic tiles and flags
type: Concept
notation: C.23.31
definition: Manufacture of ceramic tiles and flags
status: valid
status modified: 2025-03-27
accepted date: 2025-03-27
in scheme: NACEValue

"Manufacture of bricks, tiles and construction products, in baked clay"
type: Concept
notation: C.23.32
definition: "Manufacture of bricks, tiles and construction products, in baked clay"
status: valid
status modified: 2025-03-27
accepted date: 2025-03-27
in scheme: NACEValue

Manufacture of ceramic household and ornamental articles
type: Concept
notation: C.23.41
definition: Manufacture of ceramic household and ornamental articles
status: valid
status modified: 2025-03-27
accepted date: 2025-03-27
in scheme: NACEValue

Manufacture of ceramic sanitary fixtures
type: Concept
notation: C.23.42
definition: Manufacture of ceramic sanitary fixtures
status: valid
status modified: 2025-03-27
accepted date: 2025-03-27
in scheme: NACEValue

Manufacture of ceramic insulators and insulating fittings
type: Concept
notation: C.23.43
definition: Manufacture of ceramic insulators and insulating fittings
status: valid
status modified: 2025-03-27
accepted date: 2025-03-27
in scheme: NACEValue

Manufacture of other technical ceramic products
type: Concept
notation: C.23.44
definition: Manufacture of other technical ceramic products
status: valid
status modified: 2025-03-27
accepted date: 2025-03-27
in scheme: NACEValue

Manufacture of other ceramic products
type: Concept
notation: C.23.45
definition: Manufacture of other ceramic products
status: valid
status modified: 2025-03-27
accepted date: 2025-03-27
in scheme: NACEValue

Manufacture of cement
type: Concept
notation: C.23.51
definition: Manufacture of cement
status: valid
status modified: 2025-03-27
accepted date: 2025-03-27
in scheme: NACEValue

Manufacture of lime and plaster
type: Concept
notation: C.23.52
definition: Manufacture of lime and plaster
status: valid
status modified: 2025-03-27
accepted date: 2025-03-27
in scheme: NACEValue

Manufacture of concrete products for construction purposes
type: Concept
notation: C.23.61
definition: Manufacture of concrete products for construction purposes
status: valid
status modified: 2025-03-27
accepted date: 2025-03-27
in scheme: NACEValue

Manufacture of plaster products for construction purposes
type: Concept
notation: C.23.62
definition: Manufacture of plaster products for construction purposes
status: valid
status modified: 2025-03-27
accepted date: 2025-03-27
in scheme: NACEValue

Manufacture of ready-mixed concrete
type: Concept
notation: C.23.63
definition: Manufacture of ready-mixed concrete
status: valid
status modified: 2025-03-27
accepted date: 2025-03-27
in scheme: NACEValue

Manufacture of mortars
type: Concept
notation: C.23.64
definition: Manufacture of mortars
status: valid
status modified: 2025-03-27
accepted date: 2025-03-27
in scheme: NACEValue

Manufacture of fibre cement
type: Concept
notation: C.23.65
definition: Manufacture of fibre cement
status: valid
status modified: 2025-03-27
accepted date: 2025-03-27
in scheme: NACEValue

"Manufacture of other articles of concrete, cement and plaster"
type: Concept
notation: C.23.66
definition: "Manufacture of other articles of concrete, cement and plaster"
status: valid
status modified: 2025-03-27
accepted date: 2025-03-27
in scheme: NACEValue

"Cutting, shaping and finishing of stone"
type: Concept
notation: C.23.70
definition: "Cutting, shaping and finishing of stone"
status: valid
status modified: 2025-03-27
accepted date: 2025-03-27
in scheme: NACEValue

Manufacture of abrasive products
type: Concept
notation: C.23.91
definition: Manufacture of abrasive products
status: valid
status modified: 2025-03-27
accepted date: 2025-03-27
in scheme: NACEValue

Manufacture of other non-metallic mineral products n.e.c.
type: Concept
notation: C.23.99
definition: Manufacture of other non-metallic mineral products n.e.c.
status: valid
status modified: 2025-03-27
accepted date: 2025-03-27
in scheme: NACEValue

Manufacture of basic iron and steel and of ferro-alloys
type: Concept
notation: C.24.10
definition: Manufacture of basic iron and steel and of ferro-alloys
status: valid
status modified: 2025-03-27
accepted date: 2025-03-27
in scheme: NACEValue

"Manufacture of tubes, pipes, hollow profiles and related fittings, of steel"
type: Concept
notation: C.24.20
definition: "Manufacture of tubes, pipes, hollow profiles and related fittings, of steel"
status: valid
status modified: 2025-03-27
accepted date: 2025-03-27
in scheme: NACEValue

Cold drawing of bars
type: Concept
notation: C.24.31
definition: Cold drawing of bars
status: valid
status modified: 2025-03-27
accepted date: 2025-03-27
in scheme: NACEValue

Cold rolling of narrow strip
type: Concept
notation: C.24.32
definition: Cold rolling of narrow strip
status: valid
status modified: 2025-03-27
accepted date: 2025-03-27
in scheme: NACEValue

Cold forming or folding
type: Concept
notation: C.24.33
definition: Cold forming or folding
status: valid
status modified: 2025-03-27
accepted date: 2025-03-27
in scheme: NACEValue

Cold drawing of wire
type: Concept
notation: C.24.34
definition: Cold drawing of wire
status: valid
status modified: 2025-03-27
accepted date: 2025-03-27
in scheme: NACEValue

Precious metals production
type: Concept
notation: C.24.41
definition: Precious metals production
status: valid
status modified: 2025-03-27
accepted date: 2025-03-27
in scheme: NACEValue

Aluminium production
type: Concept
notation: C.24.42
definition: Aluminium production
status: valid
status modified: 2025-03-27
accepted date: 2025-03-27
in scheme: NACEValue

"Lead, zinc and tin production"
type: Concept
notation: C.24.43
definition: "Lead, zinc and tin production"
status: valid
status modified: 2025-03-27
accepted date: 2025-03-27
in scheme: NACEValue

Copper production
type: Concept
notation: C.24.44
definition: Copper production
status: valid
status modified: 2025-03-27
accepted date: 2025-03-27
in scheme: NACEValue

Other non-ferrous metal production
type: Concept
notation: C.24.45
definition: Other non-ferrous metal production
status: valid
status modified: 2025-03-27
accepted date: 2025-03-27
in scheme: NACEValue

Processing of nuclear fuel
type: Concept
notation: C.24.46
definition: Processing of nuclear fuel
status: valid
status modified: 2025-03-27
accepted date: 2025-03-27
in scheme: NACEValue

Casting of iron
type: Concept
notation: C.24.51
definition: Casting of iron
status: valid
status modified: 2025-03-27
accepted date: 2025-03-27
in scheme: NACEValue

Casting of steel
type: Concept
notation: C.24.52
definition: Casting of steel
status: valid
status modified: 2025-03-27
accepted date: 2025-03-27
in scheme: NACEValue

Casting of light metals
type: Concept
notation: C.24.53
definition: Casting of light metals
status: valid
status modified: 2025-03-27
accepted date: 2025-03-27
in scheme: NACEValue

Casting of other non-ferrous metals
type: Concept
notation: C.24.54
definition: Casting of other non-ferrous metals
status: valid
status modified: 2025-03-27
accepted date: 2025-03-27
in scheme: NACEValue

Manufacture of metal structures and parts of structures
type: Concept
notation: C.25.11
definition: Manufacture of metal structures and parts of structures
status: valid
status modified: 2025-03-27
accepted date: 2025-03-27
in scheme: NACEValue

Manufacture of doors and windows of metal
type: Concept
notation: C.25.12
definition: Manufacture of doors and windows of metal
status: valid
status modified: 2025-03-27
accepted date: 2025-03-27
in scheme: NACEValue

"Manufacture of central heating radiators, steam generators and boilers"
type: Concept
notation: C.25.21
definition: "Manufacture of central heating radiators, steam generators and boilers"
status: valid
status modified: 2025-03-27
accepted date: 2025-03-27
in scheme: NACEValue

"Manufacture of other tanks, reservoirs and containers of metal"
type: Concept
notation: C.25.22
definition: "Manufacture of other tanks, reservoirs and containers of metal"
status: valid
status modified: 2025-03-27
accepted date: 2025-03-27
in scheme: NACEValue

Manufacture of weapons and ammunition
type: Concept
notation: C.25.30
definition: Manufacture of weapons and ammunition
status: valid
status modified: 2025-03-27
accepted date: 2025-03-27
in scheme: NACEValue

Forging and shaping metal and powder metallurgy
type: Concept
notation: C.25.40
definition: Forging and shaping metal and powder metallurgy
status: valid
status modified: 2025-03-27
accepted date: 2025-03-27
in scheme: NACEValue

Coating of metals
type: Concept
notation: C.25.51
definition: Coating of metals
status: valid
status modified: 2025-03-27
accepted date: 2025-03-27
in scheme: NACEValue

Heat treatment of metals
type: Concept
notation: C.25.52
definition: Heat treatment of metals
status: valid
status modified: 2025-03-27
accepted date: 2025-03-27
in scheme: NACEValue

Machining of metals
type: Concept
notation: C.25.53
definition: Machining of metals
status: valid
status modified: 2025-03-27
accepted date: 2025-03-27
in scheme: NACEValue

Manufacture of cutlery
type: Concept
notation: C.25.61
definition: Manufacture of cutlery
status: valid
status modified: 2025-03-27
accepted date: 2025-03-27
in scheme: NACEValue

Manufacture of locks and hinges
type: Concept
notation: C.25.62
definition: Manufacture of locks and hinges
status: valid
status modified: 2025-03-27
accepted date: 2025-03-27
in scheme: NACEValue

Manufacture of tools
type: Concept
notation: C.25.63
definition: Manufacture of tools
status: valid
status modified: 2025-03-27
accepted date: 2025-03-27
in scheme: NACEValue

Manufacture of steel drums and similar containers
type: Concept
notation: C.25.91
definition: Manufacture of steel drums and similar containers
status: valid
status modified: 2025-03-27
accepted date: 2025-03-27
in scheme: NACEValue

Manufacture of light metal packaging
type: Concept
notation: C.25.92
definition: Manufacture of light metal packaging
status: valid
status modified: 2025-03-27
accepted date: 2025-03-27
in scheme: NACEValue

"Manufacture of wire products, chain and springs"
type: Concept
notation: C.25.93
definition: "Manufacture of wire products, chain and springs"
status: valid
status modified: 2025-03-27
accepted date: 2025-03-27
in scheme: NACEValue

Manufacture of fasteners and screw machine products
type: Concept
notation: C.25.94
definition: Manufacture of fasteners and screw machine products
status: valid
status modified: 2025-03-27
accepted date: 2025-03-27
in scheme: NACEValue

Manufacture of other fabricated metal products n.e.c.
type: Concept
notation: C.25.99
definition: Manufacture of other fabricated metal products n.e.c.
status: valid
status modified: 2025-03-27
accepted date: 2025-03-27
in scheme: NACEValue

Manufacture of electronic components
type: Concept
notation: C.26.11
definition: Manufacture of electronic components
status: valid
status modified: 2025-03-27
accepted date: 2025-03-27
in scheme: NACEValue

Manufacture of loaded electronic boards
type: Concept
notation: C.26.12
definition: Manufacture of loaded electronic boards
status: valid
status modified: 2025-03-27
accepted date: 2025-03-27
in scheme: NACEValue

Manufacture of computers and peripheral equipment
type: Concept
notation: C.26.20
definition: Manufacture of computers and peripheral equipment
status: valid
status modified: 2025-03-27
accepted date: 2025-03-27
in scheme: NACEValue

Manufacture of communication equipment
type: Concept
notation: C.26.30
definition: Manufacture of communication equipment
status: valid
status modified: 2025-03-27
accepted date: 2025-03-27
in scheme: NACEValue

Manufacture of consumer electronics
type: Concept
notation: C.26.40
definition: Manufacture of consumer electronics
status: valid
status modified: 2025-03-27
accepted date: 2025-03-27
in scheme: NACEValue

"Manufacture of instruments and appliances for measuring, testing and navigation"
type: Concept
notation: C.26.51
definition: "Manufacture of instruments and appliances for measuring, testing and navigation"
status: valid
status modified: 2025-03-27
accepted date: 2025-03-27
in scheme: NACEValue

Manufacture of watches and clocks
type: Concept
notation: C.26.52
definition: Manufacture of watches and clocks
status: valid
status modified: 2025-03-27
accepted date: 2025-03-27
in scheme: NACEValue

"Manufacture of irradiation, electromedical and electrotherapeutic equipment"
type: Concept
notation: C.26.60
definition: "Manufacture of irradiation, electromedical and electrotherapeutic equipment"
status: valid
status modified: 2025-03-27
accepted date: 2025-03-27
in scheme: NACEValue

"Manufacture of optical instruments, magnetic and optical media and photographic equipment"
type: Concept
notation: C.26.70
definition: "Manufacture of optical instruments, magnetic and optical media and photographic equipment"
status: valid
status modified: 2025-03-27
accepted date: 2025-03-27
in scheme: NACEValue

"Manufacture of electric motors, generators and transformers"
type: Concept
notation: C.27.11
definition: "Manufacture of electric motors, generators and transformers"
status: valid
status modified: 2025-03-27
accepted date: 2025-03-27
in scheme: NACEValue

Manufacture of electricity distribution and control apparatus
type: Concept
notation: C.27.12
definition: Manufacture of electricity distribution and control apparatus
status: valid
status modified: 2025-03-27
accepted date: 2025-03-27
in scheme: NACEValue

Manufacture of batteries and accumulators
type: Concept
notation: C.27.20
definition: Manufacture of batteries and accumulators
status: valid
status modified: 2025-03-27
accepted date: 2025-03-27
in scheme: NACEValue

Manufacture of fibre optic cables
type: Concept
notation: C.27.31
definition: Manufacture of fibre optic cables
status: valid
status modified: 2025-03-27
accepted date: 2025-03-27
in scheme: NACEValue

Manufacture of other electronic and electric wires and cables
type: Concept
notation: C.27.32
definition: Manufacture of other electronic and electric wires and cables
status: valid
status modified: 2025-03-27
accepted date: 2025-03-27
in scheme: NACEValue

Manufacture of wiring devices
type: Concept
notation: C.27.33
definition: Manufacture of wiring devices
status: valid
status modified: 2025-03-27
accepted date: 2025-03-27
in scheme: NACEValue

Manufacture of lighting equipment
type: Concept
notation: C.27.40
definition: Manufacture of lighting equipment
status: valid
status modified: 2025-03-27
accepted date: 2025-03-27
in scheme: NACEValue

Manufacture of electric domestic appliances
type: Concept
notation: C.27.51
definition: Manufacture of electric domestic appliances
status: valid
status modified: 2025-03-27
accepted date: 2025-03-27
in scheme: NACEValue

Manufacture of non-electric domestic appliances
type: Concept
notation: C.27.52
definition: Manufacture of non-electric domestic appliances
status: valid
status modified: 2025-03-27
accepted date: 2025-03-27
in scheme: NACEValue

Manufacture of other electrical equipment
type: Concept
notation: C.27.90
definition: Manufacture of other electrical equipment
status: valid
status modified: 2025-03-27
accepted date: 2025-03-27
in scheme: NACEValue

"Manufacture of engines and turbines, except aircraft, vehicle and cycle engines"
type: Concept
notation: C.28.11
definition: "Manufacture of engines and turbines, except aircraft, vehicle and cycle engines"
status: valid
status modified: 2025-03-27
accepted date: 2025-03-27
in scheme: NACEValue

Manufacture of fluid power equipment
type: Concept
notation: C.28.12
definition: Manufacture of fluid power equipment
status: valid
status modified: 2025-03-27
accepted date: 2025-03-27
in scheme: NACEValue

Manufacture of other pumps and compressors
type: Concept
notation: C.28.13
definition: Manufacture of other pumps and compressors
status: valid
status modified: 2025-03-27
accepted date: 2025-03-27
in scheme: NACEValue

Manufacture of other taps and valves
type: Concept
notation: C.28.14
definition: Manufacture of other taps and valves
status: valid
status modified: 2025-03-27
accepted date: 2025-03-27
in scheme: NACEValue

"Manufacture of bearings, gears, gearing and driving elements"
type: Concept
notation: C.28.15
definition: "Manufacture of bearings, gears, gearing and driving elements"
status: valid
status modified: 2025-03-27
accepted date: 2025-03-27
in scheme: NACEValue

"Manufacture of ovens, furnaces and permanent household heating equipment"
type: Concept
notation: C.28.21
definition: "Manufacture of ovens, furnaces and permanent household heating equipment"
status: valid
status modified: 2025-03-27
accepted date: 2025-03-27
in scheme: NACEValue

Manufacture of lifting and handling equipment
type: Concept
notation: C.28.22
definition: Manufacture of lifting and handling equipment
status: valid
status modified: 2025-03-27
accepted date: 2025-03-27
in scheme: NACEValue

"Manufacture of office machinery and equipment, except computers and peripheral equipment"
type: Concept
notation: C.28.23
definition: "Manufacture of office machinery and equipment, except computers and peripheral equipment"
status: valid
status modified: 2025-03-27
accepted date: 2025-03-27
in scheme: NACEValue

Manufacture of power-driven hand tools
type: Concept
notation: C.28.24
definition: Manufacture of power-driven hand tools
status: valid
status modified: 2025-03-27
accepted date: 2025-03-27
in scheme: NACEValue

Manufacture of non-domestic air conditioning equipment
type: Concept
notation: C.28.25
definition: Manufacture of non-domestic air conditioning equipment
status: valid
status modified: 2025-03-27
accepted date: 2025-03-27
in scheme: NACEValue

Manufacture of other general-purpose machinery n.e.c.
type: Concept
notation: C.28.29
definition: Manufacture of other general-purpose machinery n.e.c.
status: valid
status modified: 2025-03-27
accepted date: 2025-03-27
in scheme: NACEValue

Manufacture of agricultural and forestry machinery
type: Concept
notation: C.28.30
definition: Manufacture of agricultural and forestry machinery
status: valid
status modified: 2025-03-27
accepted date: 2025-03-27
in scheme: NACEValue

Manufacture of metal forming machinery and machine tools for metal work
type: Concept
notation: C.28.41
definition: Manufacture of metal forming machinery and machine tools for metal work
status: valid
status modified: 2025-03-27
accepted date: 2025-03-27
in scheme: NACEValue

Manufacture of other machine tools
type: Concept
notation: C.28.42
definition: Manufacture of other machine tools
status: valid
status modified: 2025-03-27
accepted date: 2025-03-27
in scheme: NACEValue

Manufacture of machinery for metallurgy
type: Concept
notation: C.28.91
definition: Manufacture of machinery for metallurgy
status: valid
status modified: 2025-03-27
accepted date: 2025-03-27
in scheme: NACEValue

"Manufacture of machinery for mining, quarrying and construction"
type: Concept
notation: C.28.92
definition: "Manufacture of machinery for mining, quarrying and construction"
status: valid
status modified: 2025-03-27
accepted date: 2025-03-27
in scheme: NACEValue

"Manufacture of machinery for food, beverage and tobacco processing"
type: Concept
notation: C.28.93
definition: "Manufacture of machinery for food, beverage and tobacco processing"
status: valid
status modified: 2025-03-27
accepted date: 2025-03-27
in scheme: NACEValue

"Manufacture of machinery for textile, apparel and leather production"
type: Concept
notation: C.28.94
definition: "Manufacture of machinery for textile, apparel and leather production"
status: valid
status modified: 2025-03-27
accepted date: 2025-03-27
in scheme: NACEValue

Manufacture of machinery for paper and paperboard production
type: Concept
notation: C.28.95
definition: Manufacture of machinery for paper and paperboard production
status: valid
status modified: 2025-03-27
accepted date: 2025-03-27
in scheme: NACEValue

Manufacture of plastics and rubber machinery
type: Concept
notation: C.28.96
definition: Manufacture of plastics and rubber machinery
status: valid
status modified: 2025-03-27
accepted date: 2025-03-27
in scheme: NACEValue

Manufacture of additive manufacturing machinery
type: Concept
notation: C.28.97
definition: Manufacture of additive manufacturing machinery
status: valid
status modified: 2025-03-27
accepted date: 2025-03-27
in scheme: NACEValue

Manufacture of other special-purpose machinery n.e.c.
type: Concept
notation: C.28.99
definition: Manufacture of other special-purpose machinery n.e.c.
status: valid
status modified: 2025-03-27
accepted date: 2025-03-27
in scheme: NACEValue

Manufacture of motor vehicles
type: Concept
notation: C.29.10
definition: Manufacture of motor vehicles
status: valid
status modified: 2025-03-27
accepted date: 2025-03-27
in scheme: NACEValue

Manufacture of bodies and coachwork for motor vehicles; manufacture of trailers and semi-trailers
type: Concept
notation: C.29.20
definition: Manufacture of bodies and coachwork for motor vehicles; manufacture of trailers and semi-trailers
status: valid
status modified: 2025-03-27
accepted date: 2025-03-27
in scheme: NACEValue

Manufacture of electrical and electronic equipment for motor vehicles
type: Concept
notation: C.29.31
definition: Manufacture of electrical and electronic equipment for motor vehicles
status: valid
status modified: 2025-03-27
accepted date: 2025-03-27
in scheme: NACEValue

Manufacture of other parts and accessories for motor vehicles
type: Concept
notation: C.29.32
definition: Manufacture of other parts and accessories for motor vehicles
status: valid
status modified: 2025-03-27
accepted date: 2025-03-27
in scheme: NACEValue

Building of civilian ships and floating structures
type: Concept
notation: C.30.11
definition: Building of civilian ships and floating structures
status: valid
status modified: 2025-03-27
accepted date: 2025-03-27
in scheme: NACEValue

Building of pleasure and sporting boats
type: Concept
notation: C.30.12
definition: Building of pleasure and sporting boats
status: valid
status modified: 2025-03-27
accepted date: 2025-03-27
in scheme: NACEValue

Building of military ships and vessels
type: Concept
notation: C.30.13
definition: Building of military ships and vessels
status: valid
status modified: 2025-03-27
accepted date: 2025-03-27
in scheme: NACEValue

Manufacture of railway locomotives and rolling stock
type: Concept
notation: C.30.20
definition: Manufacture of railway locomotives and rolling stock
status: valid
status modified: 2025-03-27
accepted date: 2025-03-27
in scheme: NACEValue

Manufacture of civilian air and spacecraft and related machinery
type: Concept
notation: C.30.31
definition: Manufacture of civilian air and spacecraft and related machinery
status: valid
status modified: 2025-03-27
accepted date: 2025-03-27
in scheme: NACEValue

Manufacture of military air and spacecraft and related machinery
type: Concept
notation: C.30.32
definition: Manufacture of military air and spacecraft and related machinery
status: valid
status modified: 2025-03-27
accepted date: 2025-03-27
in scheme: NACEValue

Manufacture of military fighting vehicles
type: Concept
notation: C.30.40
definition: Manufacture of military fighting vehicles
status: valid
status modified: 2025-03-27
accepted date: 2025-03-27
in scheme: NACEValue

Manufacture of motorcycles
type: Concept
notation: C.30.91
definition: Manufacture of motorcycles
status: valid
status modified: 2025-03-27
accepted date: 2025-03-27
in scheme: NACEValue

Manufacture of bicycles and invalid carriages
type: Concept
notation: C.30.92
definition: Manufacture of bicycles and invalid carriages
status: valid
status modified: 2025-03-27
accepted date: 2025-03-27
in scheme: NACEValue

Manufacture of other transport equipment n.e.c.
type: Concept
notation: C.30.99
definition: Manufacture of other transport equipment n.e.c.
status: valid
status modified: 2025-03-27
accepted date: 2025-03-27
in scheme: NACEValue

Manufacture of furniture
type: Concept
notation: C.31.00
definition: Manufacture of furniture
status: valid
status modified: 2025-03-27
accepted date: 2025-03-27
in scheme: NACEValue

Striking of coins
type: Concept
notation: C.32.11
definition: Striking of coins
status: valid
status modified: 2025-03-27
accepted date: 2025-03-27
in scheme: NACEValue

Manufacture of jewellery and related articles
type: Concept
notation: C.32.12
definition: Manufacture of jewellery and related articles
status: valid
status modified: 2025-03-27
accepted date: 2025-03-27
in scheme: NACEValue

Manufacture of imitation jewellery and related articles
type: Concept
notation: C.32.13
definition: Manufacture of imitation jewellery and related articles
status: valid
status modified: 2025-03-27
accepted date: 2025-03-27
in scheme: NACEValue

Manufacture of musical instruments
type: Concept
notation: C.32.20
definition: Manufacture of musical instruments
status: valid
status modified: 2025-03-27
accepted date: 2025-03-27
in scheme: NACEValue

Manufacture of sports goods
type: Concept
notation: C.32.30
definition: Manufacture of sports goods
status: valid
status modified: 2025-03-27
accepted date: 2025-03-27
in scheme: NACEValue

Manufacture of games and toys
type: Concept
notation: C.32.40
definition: Manufacture of games and toys
status: valid
status modified: 2025-03-27
accepted date: 2025-03-27
in scheme: NACEValue

Manufacture of medical and dental instruments and supplies
type: Concept
notation: C.32.50
definition: Manufacture of medical and dental instruments and supplies
status: valid
status modified: 2025-03-27
accepted date: 2025-03-27
in scheme: NACEValue

Manufacture of brooms and brushes
type: Concept
notation: C.32.91
definition: Manufacture of brooms and brushes
status: valid
status modified: 2025-03-27
accepted date: 2025-03-27
in scheme: NACEValue

Other manufacturing n.e.c.
type: Concept
notation: C.32.99
definition: Other manufacturing n.e.c.
status: valid
status modified: 2025-03-27
accepted date: 2025-03-27
in scheme: NACEValue

Repair and maintenance of fabricated metal products
type: Concept
notation: C.33.11
definition: Repair and maintenance of fabricated metal products
status: valid
status modified: 2025-03-27
accepted date: 2025-03-27
in scheme: NACEValue

Repair and maintenance of machinery
type: Concept
notation: C.33.12
definition: Repair and maintenance of machinery
status: valid
status modified: 2025-03-27
accepted date: 2025-03-27
in scheme: NACEValue

Repair and maintenance of electronic and optical equipment
type: Concept
notation: C.33.13
definition: Repair and maintenance of electronic and optical equipment
status: valid
status modified: 2025-03-27
accepted date: 2025-03-27
in scheme: NACEValue

Repair and maintenance of electrical equipment
type: Concept
notation: C.33.14
definition: Repair and maintenance of electrical equipment
status: valid
status modified: 2025-03-27
accepted date: 2025-03-27
in scheme: NACEValue

Repair and maintenance of civilian ships and boats
type: Concept
notation: C.33.15
definition: Repair and maintenance of civilian ships and boats
status: valid
status modified: 2025-03-27
accepted date: 2025-03-27
in scheme: NACEValue

Repair and maintenance of civilian air and spacecraft
type: Concept
notation: C.33.16
definition: Repair and maintenance of civilian air and spacecraft
status: valid
status modified: 2025-03-27
accepted date: 2025-03-27
in scheme: NACEValue

Repair and maintenance of other civilian transport equipment
type: Concept
notation: C.33.17
definition: Repair and maintenance of other civilian transport equipment
status: valid
status modified: 2025-03-27
accepted date: 2025-03-27
in scheme: NACEValue

"Repair and maintenance of military fighting vehicles, ships, boats, air and spacecraft"
type: Concept
notation: C.33.18
definition: "Repair and maintenance of military fighting vehicles, ships, boats, air and spacecraft"
status: valid
status modified: 2025-03-27
accepted date: 2025-03-27
in scheme: NACEValue

Repair and maintenance of other equipment
type: Concept
notation: C.33.19
definition: Repair and maintenance of other equipment
status: valid
status modified: 2025-03-27
accepted date: 2025-03-27
in scheme: NACEValue

Installation of industrial machinery and equipment
type: Concept
notation: C.33.20
definition: Installation of industrial machinery and equipment
status: valid
status modified: 2025-03-27
accepted date: 2025-03-27
in scheme: NACEValue

Production of electricity from non-renewable sources
type: Concept
notation: D.35.11
definition: Production of electricity from non-renewable sources
status: valid
status modified: 2025-03-27
accepted date: 2025-03-27
in scheme: NACEValue

Production of electricity from renewable sources
type: Concept
notation: D.35.12
definition: Production of electricity from renewable sources
status: valid
status modified: 2025-03-27
accepted date: 2025-03-27
in scheme: NACEValue

Transmission of electricity
type: Concept
notation: D.35.13
definition: Transmission of electricity
status: valid
status modified: 2025-03-27
accepted date: 2025-03-27
in scheme: NACEValue

Distribution of electricity
type: Concept
notation: D.35.14
definition: Distribution of electricity
status: valid
status modified: 2025-03-27
accepted date: 2025-03-27
in scheme: NACEValue

Trade of electricity
type: Concept
notation: D.35.15
definition: Trade of electricity
status: valid
status modified: 2025-03-27
accepted date: 2025-03-27
in scheme: NACEValue

Storage of electricity
type: Concept
notation: D.35.16
definition: Storage of electricity
status: valid
status modified: 2025-03-27
accepted date: 2025-03-27
in scheme: NACEValue

Manufacture of gas
type: Concept
notation: D.35.21
definition: Manufacture of gas
status: valid
status modified: 2025-03-27
accepted date: 2025-03-27
in scheme: NACEValue

Distribution of gaseous fuels through mains
type: Concept
notation: D.35.22
definition: Distribution of gaseous fuels through mains
status: valid
status modified: 2025-03-27
accepted date: 2025-03-27
in scheme: NACEValue

Trade of gas through mains
type: Concept
notation: D.35.23
definition: Trade of gas through mains
status: valid
status modified: 2025-03-27
accepted date: 2025-03-27
in scheme: NACEValue

Storage of gas as part of network supply services
type: Concept
notation: D.35.24
definition: Storage of gas as part of network supply services
status: valid
status modified: 2025-03-27
accepted date: 2025-03-27
in scheme: NACEValue

Steam and air conditioning supply
type: Concept
notation: D.35.30
definition: Steam and air conditioning supply
status: valid
status modified: 2025-03-27
accepted date: 2025-03-27
in scheme: NACEValue

Activities of brokers and agents for electric power and natural gas
type: Concept
notation: D.35.40
definition: Activities of brokers and agents for electric power and natural gas
status: valid
status modified: 2025-03-27
accepted date: 2025-03-27
in scheme: NACEValue

"Water collection, treatment and supply"
type: Concept
notation: E.36.00
definition: "Water collection, treatment and supply"
status: valid
status modified: 2025-03-27
accepted date: 2025-03-27
in scheme: NACEValue

Sewerage
type: Concept
notation: E.37.00
definition: Sewerage
status: valid
status modified: 2025-03-27
accepted date: 2025-03-27
in scheme: NACEValue

Collection of non-hazardous waste
type: Concept
notation: E.38.11
definition: Collection of non-hazardous waste
status: valid
status modified: 2025-03-27
accepted date: 2025-03-27
in scheme: NACEValue

Collection of hazardous waste
type: Concept
notation: E.38.12
definition: Collection of hazardous waste
status: valid
status modified: 2025-03-27
accepted date: 2025-03-27
in scheme: NACEValue

Materials recovery
type: Concept
notation: E.38.21
definition: Materials recovery
status: valid
status modified: 2025-03-27
accepted date: 2025-03-27
in scheme: NACEValue

Energy recovery
type: Concept
notation: E.38.22
definition: Energy recovery
status: valid
status modified: 2025-03-27
accepted date: 2025-03-27
in scheme: NACEValue

Other waste recovery
type: Concept
notation: E.38.23
definition: Other waste recovery
status: valid
status modified: 2025-03-27
accepted date: 2025-03-27
in scheme: NACEValue

Incineration without energy recovery
type: Concept
notation: E.38.31
definition: Incineration without energy recovery
status: valid
status modified: 2025-03-27
accepted date: 2025-03-27
in scheme: NACEValue

Landfilling or permanent storage
type: Concept
notation: E.38.32
definition: Landfilling or permanent storage
status: valid
status modified: 2025-03-27
accepted date: 2025-03-27
in scheme: NACEValue

Other waste disposal
type: Concept
notation: E.38.33
definition: Other waste disposal
status: valid
status modified: 2025-03-27
accepted date: 2025-03-27
in scheme: NACEValue

Remediation activities and other waste management service activities
type: Concept
notation: E.39.00
definition: Remediation activities and other waste management service activities
status: valid
status modified: 2025-03-27
accepted date: 2025-03-27
in scheme: NACEValue

Construction of residential and non-residential buildings
type: Concept
notation: F.41.00
definition: Construction of residential and non-residential buildings
status: valid
status modified: 2025-03-27
accepted date: 2025-03-27
in scheme: NACEValue

Construction of roads and motorways
type: Concept
notation: F.42.11
definition: Construction of roads and motorways
status: valid
status modified: 2025-03-27
accepted date: 2025-03-27
in scheme: NACEValue

Construction of railways and underground railways
type: Concept
notation: F.42.12
definition: Construction of railways and underground railways
status: valid
status modified: 2025-03-27
accepted date: 2025-03-27
in scheme: NACEValue

Construction of bridges and tunnels
type: Concept
notation: F.42.13
definition: Construction of bridges and tunnels
status: valid
status modified: 2025-03-27
accepted date: 2025-03-27
in scheme: NACEValue

Construction of utility projects for fluids
type: Concept
notation: F.42.21
definition: Construction of utility projects for fluids
status: valid
status modified: 2025-03-27
accepted date: 2025-03-27
in scheme: NACEValue

Construction of utility projects for electricity and telecommunications
type: Concept
notation: F.42.22
definition: Construction of utility projects for electricity and telecommunications
status: valid
status modified: 2025-03-27
accepted date: 2025-03-27
in scheme: NACEValue

Construction of water projects
type: Concept
notation: F.42.91
definition: Construction of water projects
status: valid
status modified: 2025-03-27
accepted date: 2025-03-27
in scheme: NACEValue

Construction of other civil engineering projects n.e.c.
type: Concept
notation: F.42.99
definition: Construction of other civil engineering projects n.e.c.
status: valid
status modified: 2025-03-27
accepted date: 2025-03-27
in scheme: NACEValue

Demolition
type: Concept
notation: F.43.11
definition: Demolition
status: valid
status modified: 2025-03-27
accepted date: 2025-03-27
in scheme: NACEValue

Site preparation
type: Concept
notation: F.43.12
definition: Site preparation
status: valid
status modified: 2025-03-27
accepted date: 2025-03-27
in scheme: NACEValue

Test drilling and boring
type: Concept
notation: F.43.13
definition: Test drilling and boring
status: valid
status modified: 2025-03-27
accepted date: 2025-03-27
in scheme: NACEValue

Electrical installation
type: Concept
notation: F.43.21
definition: Electrical installation
status: valid
status modified: 2025-03-27
accepted date: 2025-03-27
in scheme: NACEValue

"Plumbing, heat and air-conditioning installation"
type: Concept
notation: F.43.22
definition: "Plumbing, heat and air-conditioning installation"
status: valid
status modified: 2025-03-27
accepted date: 2025-03-27
in scheme: NACEValue

Installation of insulation
type: Concept
notation: F.43.23
definition: Installation of insulation
status: valid
status modified: 2025-03-27
accepted date: 2025-03-27
in scheme: NACEValue

Other construction installation
type: Concept
notation: F.43.24
definition: Other construction installation
status: valid
status modified: 2025-03-27
accepted date: 2025-03-27
in scheme: NACEValue

Plastering
type: Concept
notation: F.43.31
definition: Plastering
status: valid
status modified: 2025-03-27
accepted date: 2025-03-27
in scheme: NACEValue

Joinery installation
type: Concept
notation: F.43.32
definition: Joinery installation
status: valid
status modified: 2025-03-27
accepted date: 2025-03-27
in scheme: NACEValue

Floor and wall covering
type: Concept
notation: F.43.33
definition: Floor and wall covering
status: valid
status modified: 2025-03-27
accepted date: 2025-03-27
in scheme: NACEValue

Painting and glazing
type: Concept
notation: F.43.34
definition: Painting and glazing
status: valid
status modified: 2025-03-27
accepted date: 2025-03-27
in scheme: NACEValue

Other building completion and finishing
type: Concept
notation: F.43.35
definition: Other building completion and finishing
status: valid
status modified: 2025-03-27
accepted date: 2025-03-27
in scheme: NACEValue

Roofing activities
type: Concept
notation: F.43.41
definition: Roofing activities
status: valid
status modified: 2025-03-27
accepted date: 2025-03-27
in scheme: NACEValue

Other specialised construction activities in construction of buildings
type: Concept
notation: F.43.42
definition: Other specialised construction activities in construction of buildings
status: valid
status modified: 2025-03-27
accepted date: 2025-03-27
in scheme: NACEValue

Specialised construction activities in civil engineering
type: Concept
notation: F.43.50
definition: Specialised construction activities in civil engineering
status: valid
status modified: 2025-03-27
accepted date: 2025-03-27
in scheme: NACEValue

Intermediation service activities for specialised construction services
type: Concept
notation: F.43.60
definition: Intermediation service activities for specialised construction services
status: valid
status modified: 2025-03-27
accepted date: 2025-03-27
in scheme: NACEValue

Masonry and bricklaying activities
type: Concept
notation: F.43.91
definition: Masonry and bricklaying activities
status: valid
status modified: 2025-03-27
accepted date: 2025-03-27
in scheme: NACEValue

Other specialised construction activities n.e.c.
type: Concept
notation: F.43.99
definition: Other specialised construction activities n.e.c.
status: valid
status modified: 2025-03-27
accepted date: 2025-03-27
in scheme: NACEValue

"Activities of agents involved in the wholesale of agricultural raw materials, live animals, textile raw materials and semi-finished goods"
type: Concept
notation: G.46.11
definition: "Activities of agents involved in the wholesale of agricultural raw materials, live animals, textile raw materials and semi-finished goods"
status: valid
status modified: 2025-03-27
accepted date: 2025-03-27
in scheme: NACEValue

"Activities of agents involved in the wholesale of fuels, ores, metals and industrial chemicals"
type: Concept
notation: G.46.12
definition: "Activities of agents involved in the wholesale of fuels, ores, metals and industrial chemicals"
status: valid
status modified: 2025-03-27
accepted date: 2025-03-27
in scheme: NACEValue

Activities of agents involved in the wholesale of timber and building materials
type: Concept
notation: G.46.13
definition: Activities of agents involved in the wholesale of timber and building materials
status: valid
status modified: 2025-03-27
accepted date: 2025-03-27
in scheme: NACEValue

"Activities of agents involved in the wholesale of machinery, industrial equipment, ships and aircraft"
type: Concept
notation: G.46.14
definition: "Activities of agents involved in the wholesale of machinery, industrial equipment, ships and aircraft"
status: valid
status modified: 2025-03-27
accepted date: 2025-03-27
in scheme: NACEValue

"Activities of agents involved in the wholesale of furniture, household goods, hardware and ironmongery"
type: Concept
notation: G.46.15
definition: "Activities of agents involved in the wholesale of furniture, household goods, hardware and ironmongery"
status: valid
status modified: 2025-03-27
accepted date: 2025-03-27
in scheme: NACEValue

"Activities of agents involved in the wholesale of textiles, clothing, fur, footwear and leather goods"
type: Concept
notation: G.46.16
definition: "Activities of agents involved in the wholesale of textiles, clothing, fur, footwear and leather goods"
status: valid
status modified: 2025-03-27
accepted date: 2025-03-27
in scheme: NACEValue

"Activities of agents involved in the wholesale of food, beverages and tobacco"
type: Concept
notation: G.46.17
definition: "Activities of agents involved in the wholesale of food, beverages and tobacco"
status: valid
status modified: 2025-03-27
accepted date: 2025-03-27
in scheme: NACEValue

Activities of agents involved in the wholesale of other particular products
type: Concept
notation: G.46.18
definition: Activities of agents involved in the wholesale of other particular products
status: valid
status modified: 2025-03-27
accepted date: 2025-03-27
in scheme: NACEValue

Activities of agents involved in non-specialised wholesale
type: Concept
notation: G.46.19
definition: Activities of agents involved in non-specialised wholesale
status: valid
status modified: 2025-03-27
accepted date: 2025-03-27
in scheme: NACEValue

"Wholesale of grain, unmanufactured tobacco, seeds and animal feeds"
type: Concept
notation: G.46.21
definition: "Wholesale of grain, unmanufactured tobacco, seeds and animal feeds"
status: valid
status modified: 2025-03-27
accepted date: 2025-03-27
in scheme: NACEValue

Wholesale of flowers and plants
type: Concept
notation: G.46.22
definition: Wholesale of flowers and plants
status: valid
status modified: 2025-03-27
accepted date: 2025-03-27
in scheme: NACEValue

Wholesale of live animals
type: Concept
notation: G.46.23
definition: Wholesale of live animals
status: valid
status modified: 2025-03-27
accepted date: 2025-03-27
in scheme: NACEValue

"Wholesale of hides, skins and leather"
type: Concept
notation: G.46.24
definition: "Wholesale of hides, skins and leather"
status: valid
status modified: 2025-03-27
accepted date: 2025-03-27
in scheme: NACEValue

Wholesale of fruit and vegetables
type: Concept
notation: G.46.31
definition: Wholesale of fruit and vegetables
status: valid
status modified: 2025-03-27
accepted date: 2025-03-27
in scheme: NACEValue

"Wholesale of meat, meat products, fish and fish products"
type: Concept
notation: G.46.32
definition: "Wholesale of meat, meat products, fish and fish products"
status: valid
status modified: 2025-03-27
accepted date: 2025-03-27
in scheme: NACEValue

"Wholesale of dairy products, eggs and edible oils and fats"
type: Concept
notation: G.46.33
definition: "Wholesale of dairy products, eggs and edible oils and fats"
status: valid
status modified: 2025-03-27
accepted date: 2025-03-27
in scheme: NACEValue

Wholesale of beverages
type: Concept
notation: G.46.34
definition: Wholesale of beverages
status: valid
status modified: 2025-03-27
accepted date: 2025-03-27
in scheme: NACEValue

Wholesale of tobacco products
type: Concept
notation: G.46.35
definition: Wholesale of tobacco products
status: valid
status modified: 2025-03-27
accepted date: 2025-03-27
in scheme: NACEValue

"Wholesale of sugar, chocolate and sugar confectionery"
type: Concept
notation: G.46.36
definition: "Wholesale of sugar, chocolate and sugar confectionery"
status: valid
status modified: 2025-03-27
accepted date: 2025-03-27
in scheme: NACEValue

"Wholesale of coffee, tea, cocoa and spices"
type: Concept
notation: G.46.37
definition: "Wholesale of coffee, tea, cocoa and spices"
status: valid
status modified: 2025-03-27
accepted date: 2025-03-27
in scheme: NACEValue

Wholesale of other food
type: Concept
notation: G.46.38
definition: Wholesale of other food
status: valid
status modified: 2025-03-27
accepted date: 2025-03-27
in scheme: NACEValue

"Non-specialised wholesale of food, beverages and tobacco"
type: Concept
notation: G.46.39
definition: "Non-specialised wholesale of food, beverages and tobacco"
status: valid
status modified: 2025-03-27
accepted date: 2025-03-27
in scheme: NACEValue

Wholesale of textiles
type: Concept
notation: G.46.41
definition: Wholesale of textiles
status: valid
status modified: 2025-03-27
accepted date: 2025-03-27
in scheme: NACEValue

Wholesale of clothing and footwear
type: Concept
notation: G.46.42
definition: Wholesale of clothing and footwear
status: valid
status modified: 2025-03-27
accepted date: 2025-03-27
in scheme: NACEValue

Wholesale of electrical household appliances
type: Concept
notation: G.46.43
definition: Wholesale of electrical household appliances
status: valid
status modified: 2025-03-27
accepted date: 2025-03-27
in scheme: NACEValue

Wholesale of china and glassware and cleaning materials
type: Concept
notation: G.46.44
definition: Wholesale of china and glassware and cleaning materials
status: valid
status modified: 2025-03-27
accepted date: 2025-03-27
in scheme: NACEValue

Wholesale of perfume and cosmetics
type: Concept
notation: G.46.45
definition: Wholesale of perfume and cosmetics
status: valid
status modified: 2025-03-27
accepted date: 2025-03-27
in scheme: NACEValue

Wholesale of pharmaceutical and medical goods
type: Concept
notation: G.46.46
definition: Wholesale of pharmaceutical and medical goods
status: valid
status modified: 2025-03-27
accepted date: 2025-03-27
in scheme: NACEValue

"Wholesale of household, office and shop furniture, carpets and lighting equipment"
type: Concept
notation: G.46.47
definition: "Wholesale of household, office and shop furniture, carpets and lighting equipment"
status: valid
status modified: 2025-03-27
accepted date: 2025-03-27
in scheme: NACEValue

Wholesale of watches and jewellery
type: Concept
notation: G.46.48
definition: Wholesale of watches and jewellery
status: valid
status modified: 2025-03-27
accepted date: 2025-03-27
in scheme: NACEValue

Wholesale of other household goods
type: Concept
notation: G.46.49
definition: Wholesale of other household goods
status: valid
status modified: 2025-03-27
accepted date: 2025-03-27
in scheme: NACEValue

Wholesale of information and communication equipment
type: Concept
notation: G.46.50
definition: Wholesale of information and communication equipment
status: valid
status modified: 2025-03-27
accepted date: 2025-03-27
in scheme: NACEValue

"Wholesale of agricultural machinery, equipment and supplies"
type: Concept
notation: G.46.61
definition: "Wholesale of agricultural machinery, equipment and supplies"
status: valid
status modified: 2025-03-27
accepted date: 2025-03-27
in scheme: NACEValue

Wholesale of machine tools
type: Concept
notation: G.46.62
definition: Wholesale of machine tools
status: valid
status modified: 2025-03-27
accepted date: 2025-03-27
in scheme: NACEValue

"Wholesale of mining, construction and civil engineering machinery"
type: Concept
notation: G.46.63
definition: "Wholesale of mining, construction and civil engineering machinery"
status: valid
status modified: 2025-03-27
accepted date: 2025-03-27
in scheme: NACEValue

Wholesale of other machinery and equipment
type: Concept
notation: G.46.64
definition: Wholesale of other machinery and equipment
status: valid
status modified: 2025-03-27
accepted date: 2025-03-27
in scheme: NACEValue

Wholesale of motor vehicles
type: Concept
notation: G.46.71
definition: Wholesale of motor vehicles
status: valid
status modified: 2025-03-27
accepted date: 2025-03-27
in scheme: NACEValue

Wholesale of motor vehicle parts and accessories
type: Concept
notation: G.46.72
definition: Wholesale of motor vehicle parts and accessories
status: valid
status modified: 2025-03-27
accepted date: 2025-03-27
in scheme: NACEValue

"Wholesale of motorcycles, motorcycle parts and accessories"
type: Concept
notation: G.46.73
definition: "Wholesale of motorcycles, motorcycle parts and accessories"
status: valid
status modified: 2025-03-27
accepted date: 2025-03-27
in scheme: NACEValue

"Wholesale of solid, liquid and gaseous fuels and related products"
type: Concept
notation: G.46.81
definition: "Wholesale of solid, liquid and gaseous fuels and related products"
status: valid
status modified: 2025-03-27
accepted date: 2025-03-27
in scheme: NACEValue

Wholesale of metals and metal ores
type: Concept
notation: G.46.82
definition: Wholesale of metals and metal ores
status: valid
status modified: 2025-03-27
accepted date: 2025-03-27
in scheme: NACEValue

"Wholesale of wood, construction materials and sanitary equipment"
type: Concept
notation: G.46.83
definition: "Wholesale of wood, construction materials and sanitary equipment"
status: valid
status modified: 2025-03-27
accepted date: 2025-03-27
in scheme: NACEValue

"Wholesale of hardware, plumbing and heating equipment and supplies"
type: Concept
notation: G.46.84
definition: "Wholesale of hardware, plumbing and heating equipment and supplies"
status: valid
status modified: 2025-03-27
accepted date: 2025-03-27
in scheme: NACEValue

Wholesale of chemical products
type: Concept
notation: G.46.85
definition: Wholesale of chemical products
status: valid
status modified: 2025-03-27
accepted date: 2025-03-27
in scheme: NACEValue

Wholesale of other intermediate products
type: Concept
notation: G.46.86
definition: Wholesale of other intermediate products
status: valid
status modified: 2025-03-27
accepted date: 2025-03-27
in scheme: NACEValue

Wholesale of waste and scrap
type: Concept
notation: G.46.87
definition: Wholesale of waste and scrap
status: valid
status modified: 2025-03-27
accepted date: 2025-03-27
in scheme: NACEValue

Other specialised wholesale n.e.c.
type: Concept
notation: G.46.89
definition: Other specialised wholesale n.e.c.
status: valid
status modified: 2025-03-27
accepted date: 2025-03-27
in scheme: NACEValue

Non-specialised wholesale trade
type: Concept
notation: G.46.90
definition: Non-specialised wholesale trade
status: valid
status modified: 2025-03-27
accepted date: 2025-03-27
in scheme: NACEValue

"Non-specialised retail sale of predominately food, beverages or tobacco"
type: Concept
notation: G.47.11
definition: "Non-specialised retail sale of predominately food, beverages or tobacco"
status: valid
status modified: 2025-03-27
accepted date: 2025-03-27
in scheme: NACEValue

Other non-specialised retail sale
type: Concept
notation: G.47.12
definition: Other non-specialised retail sale
status: valid
status modified: 2025-03-27
accepted date: 2025-03-27
in scheme: NACEValue

Retail sale of fruit and vegetables
type: Concept
notation: G.47.21
definition: Retail sale of fruit and vegetables
status: valid
status modified: 2025-03-27
accepted date: 2025-03-27
in scheme: NACEValue

Retail sale of meat and meat products
type: Concept
notation: G.47.22
definition: Retail sale of meat and meat products
status: valid
status modified: 2025-03-27
accepted date: 2025-03-27
in scheme: NACEValue

"Retail sale of fish, crustaceans and molluscs"
type: Concept
notation: G.47.23
definition: "Retail sale of fish, crustaceans and molluscs"
status: valid
status modified: 2025-03-27
accepted date: 2025-03-27
in scheme: NACEValue

"Retail sale of bread, cake and confectionery"
type: Concept
notation: G.47.24
definition: "Retail sale of bread, cake and confectionery"
status: valid
status modified: 2025-03-27
accepted date: 2025-03-27
in scheme: NACEValue

Retail sale of beverages
type: Concept
notation: G.47.25
definition: Retail sale of beverages
status: valid
status modified: 2025-03-27
accepted date: 2025-03-27
in scheme: NACEValue

Retail sale of tobacco products
type: Concept
notation: G.47.26
definition: Retail sale of tobacco products
status: valid
status modified: 2025-03-27
accepted date: 2025-03-27
in scheme: NACEValue

Retail sale of other food
type: Concept
notation: G.47.27
definition: Retail sale of other food
status: valid
status modified: 2025-03-27
accepted date: 2025-03-27
in scheme: NACEValue

Retail sale of automotive fuel
type: Concept
notation: G.47.30
definition: Retail sale of automotive fuel
status: valid
status modified: 2025-03-27
accepted date: 2025-03-27
in scheme: NACEValue

Retail sale of information and communication equipment
type: Concept
notation: G.47.40
definition: Retail sale of information and communication equipment
status: valid
status modified: 2025-03-27
accepted date: 2025-03-27
in scheme: NACEValue

Retail sale of textiles
type: Concept
notation: G.47.51
definition: Retail sale of textiles
status: valid
status modified: 2025-03-27
accepted date: 2025-03-27
in scheme: NACEValue

"Retail sale of hardware, building materials, paints and glass"
type: Concept
notation: G.47.52
definition: "Retail sale of hardware, building materials, paints and glass"
status: valid
status modified: 2025-03-27
accepted date: 2025-03-27
in scheme: NACEValue

"Retail sale of carpets, rugs, wall and floor coverings"
type: Concept
notation: G.47.53
definition: "Retail sale of carpets, rugs, wall and floor coverings"
status: valid
status modified: 2025-03-27
accepted date: 2025-03-27
in scheme: NACEValue

Retail sale of electrical household appliances
type: Concept
notation: G.47.54
definition: Retail sale of electrical household appliances
status: valid
status modified: 2025-03-27
accepted date: 2025-03-27
in scheme: NACEValue

"Retail sale of furniture, lighting equipment, tableware and other household goods"
type: Concept
notation: G.47.55
definition: "Retail sale of furniture, lighting equipment, tableware and other household goods"
status: valid
status modified: 2025-03-27
accepted date: 2025-03-27
in scheme: NACEValue

Retail sale of books
type: Concept
notation: G.47.61
definition: Retail sale of books
status: valid
status modified: 2025-03-27
accepted date: 2025-03-27
in scheme: NACEValue

"Retail sale of newspapers, and other periodical publications and stationery"
type: Concept
notation: G.47.62
definition: "Retail sale of newspapers, and other periodical publications and stationery"
status: valid
status modified: 2025-03-27
accepted date: 2025-03-27
in scheme: NACEValue

Retail sale of sporting equipment
type: Concept
notation: G.47.63
definition: Retail sale of sporting equipment
status: valid
status modified: 2025-03-27
accepted date: 2025-03-27
in scheme: NACEValue

Retail sale of games and toys
type: Concept
notation: G.47.64
definition: Retail sale of games and toys
status: valid
status modified: 2025-03-27
accepted date: 2025-03-27
in scheme: NACEValue

Retail sale of cultural and recreational goods n.e.c.
type: Concept
notation: G.47.69
definition: Retail sale of cultural and recreational goods n.e.c.
status: valid
status modified: 2025-03-27
accepted date: 2025-03-27
in scheme: NACEValue

Retail sale of clothing
type: Concept
notation: G.47.71
definition: Retail sale of clothing
status: valid
status modified: 2025-03-27
accepted date: 2025-03-27
in scheme: NACEValue

Retail sale of footwear and leather goods
type: Concept
notation: G.47.72
definition: Retail sale of footwear and leather goods
status: valid
status modified: 2025-03-27
accepted date: 2025-03-27
in scheme: NACEValue

Retail sale of pharmaceutical products
type: Concept
notation: G.47.73
definition: Retail sale of pharmaceutical products
status: valid
status modified: 2025-03-27
accepted date: 2025-03-27
in scheme: NACEValue

Retail sale of medical and orthopaedic goods
type: Concept
notation: G.47.74
definition: Retail sale of medical and orthopaedic goods
status: valid
status modified: 2025-03-27
accepted date: 2025-03-27
in scheme: NACEValue

Retail sale of cosmetic and toilet articles
type: Concept
notation: G.47.75
definition: Retail sale of cosmetic and toilet articles
status: valid
status modified: 2025-03-27
accepted date: 2025-03-27
in scheme: NACEValue

"Retail sale of flowers, plants, fertilisers, pets and pet food"
type: Concept
notation: G.47.76
definition: "Retail sale of flowers, plants, fertilisers, pets and pet food"
status: valid
status modified: 2025-03-27
accepted date: 2025-03-27
in scheme: NACEValue

Retail sale of watches and jewellery
type: Concept
notation: G.47.77
definition: Retail sale of watches and jewellery
status: valid
status modified: 2025-03-27
accepted date: 2025-03-27
in scheme: NACEValue

Retail sale of other new goods
type: Concept
notation: G.47.78
definition: Retail sale of other new goods
status: valid
status modified: 2025-03-27
accepted date: 2025-03-27
in scheme: NACEValue

Retail sale of second-hand goods
type: Concept
notation: G.47.79
definition: Retail sale of second-hand goods
status: valid
status modified: 2025-03-27
accepted date: 2025-03-27
in scheme: NACEValue

Retail sale of motor vehicles
type: Concept
notation: G.47.81
definition: Retail sale of motor vehicles
status: valid
status modified: 2025-03-27
accepted date: 2025-03-27
in scheme: NACEValue

Retail sale of motor vehicle parts and accessories
type: Concept
notation: G.47.82
definition: Retail sale of motor vehicle parts and accessories
status: valid
status modified: 2025-03-27
accepted date: 2025-03-27
in scheme: NACEValue

"Retail sale of motorcycles, motorcycle parts and accessories"
type: Concept
notation: G.47.83
definition: "Retail sale of motorcycles, motorcycle parts and accessories"
status: valid
status modified: 2025-03-27
accepted date: 2025-03-27
in scheme: NACEValue

Intermediation service activities for non-specialised retail sale
type: Concept
notation: G.47.91
definition: Intermediation service activities for non-specialised retail sale
status: valid
status modified: 2025-03-27
accepted date: 2025-03-27
in scheme: NACEValue

Intermediation service activities for specialised retail sale
type: Concept
notation: G.47.92
definition: Intermediation service activities for specialised retail sale
status: valid
status modified: 2025-03-27
accepted date: 2025-03-27
in scheme: NACEValue

Passenger heavy rail transport
type: Concept
notation: H.49.11
definition: Passenger heavy rail transport
status: valid
status modified: 2025-03-27
accepted date: 2025-03-27
in scheme: NACEValue

Other passenger rail transport
type: Concept
notation: H.49.12
definition: Other passenger rail transport
status: valid
status modified: 2025-03-27
accepted date: 2025-03-27
in scheme: NACEValue

Freight rail transport
type: Concept
notation: H.49.20
definition: Freight rail transport
status: valid
status modified: 2025-03-27
accepted date: 2025-03-27
in scheme: NACEValue

Scheduled passenger transport by road
type: Concept
notation: H.49.31
definition: Scheduled passenger transport by road
status: valid
status modified: 2025-03-27
accepted date: 2025-03-27
in scheme: NACEValue

Non-scheduled passenger transport by road
type: Concept
notation: H.49.32
definition: Non-scheduled passenger transport by road
status: valid
status modified: 2025-03-27
accepted date: 2025-03-27
in scheme: NACEValue

On-demand passenger transport service activities by vehicle with driver
type: Concept
notation: H.49.33
definition: On-demand passenger transport service activities by vehicle with driver
status: valid
status modified: 2025-03-27
accepted date: 2025-03-27
in scheme: NACEValue

Passenger transport by cableways and ski lifts
type: Concept
notation: H.49.34
definition: Passenger transport by cableways and ski lifts
status: valid
status modified: 2025-03-27
accepted date: 2025-03-27
in scheme: NACEValue

Other passenger land transport n.e.c.
type: Concept
notation: H.49.39
definition: Other passenger land transport n.e.c.
status: valid
status modified: 2025-03-27
accepted date: 2025-03-27
in scheme: NACEValue

Freight transport by road
type: Concept
notation: H.49.41
definition: Freight transport by road
status: valid
status modified: 2025-03-27
accepted date: 2025-03-27
in scheme: NACEValue

Removal services
type: Concept
notation: H.49.42
definition: Removal services
status: valid
status modified: 2025-03-27
accepted date: 2025-03-27
in scheme: NACEValue

Transport via pipeline
type: Concept
notation: H.49.50
definition: Transport via pipeline
status: valid
status modified: 2025-03-27
accepted date: 2025-03-27
in scheme: NACEValue

Sea and coastal passenger water transport
type: Concept
notation: H.50.10
definition: Sea and coastal passenger water transport
status: valid
status modified: 2025-03-27
accepted date: 2025-03-27
in scheme: NACEValue

Sea and coastal freight water transport
type: Concept
notation: H.50.20
definition: Sea and coastal freight water transport
status: valid
status modified: 2025-03-27
accepted date: 2025-03-27
in scheme: NACEValue

Inland passenger water transport
type: Concept
notation: H.50.30
definition: Inland passenger water transport
status: valid
status modified: 2025-03-27
accepted date: 2025-03-27
in scheme: NACEValue

Inland freight water transport
type: Concept
notation: H.50.40
definition: Inland freight water transport
status: valid
status modified: 2025-03-27
accepted date: 2025-03-27
in scheme: NACEValue

Passenger air transport
type: Concept
notation: H.51.10
definition: Passenger air transport
status: valid
status modified: 2025-03-27
accepted date: 2025-03-27
in scheme: NACEValue

Freight air transport
type: Concept
notation: H.51.21
definition: Freight air transport
status: valid
status modified: 2025-03-27
accepted date: 2025-03-27
in scheme: NACEValue

Space transport
type: Concept
notation: H.51.22
definition: Space transport
status: valid
status modified: 2025-03-27
accepted date: 2025-03-27
in scheme: NACEValue

Warehousing and storage
type: Concept
notation: H.52.10
definition: Warehousing and storage
status: valid
status modified: 2025-03-27
accepted date: 2025-03-27
in scheme: NACEValue

Service activities incidental to land transportation
type: Concept
notation: H.52.21
definition: Service activities incidental to land transportation
status: valid
status modified: 2025-03-27
accepted date: 2025-03-27
in scheme: NACEValue

Service activities incidental to water transportation
type: Concept
notation: H.52.22
definition: Service activities incidental to water transportation
status: valid
status modified: 2025-03-27
accepted date: 2025-03-27
in scheme: NACEValue

Service activities incidental to air transportation
type: Concept
notation: H.52.23
definition: Service activities incidental to air transportation
status: valid
status modified: 2025-03-27
accepted date: 2025-03-27
in scheme: NACEValue

Cargo handling
type: Concept
notation: H.52.24
definition: Cargo handling
status: valid
status modified: 2025-03-27
accepted date: 2025-03-27
in scheme: NACEValue

Logistics service activities
type: Concept
notation: H.52.25
definition: Logistics service activities
status: valid
status modified: 2025-03-27
accepted date: 2025-03-27
in scheme: NACEValue

Other support activities for transportation
type: Concept
notation: H.52.26
definition: Other support activities for transportation
status: valid
status modified: 2025-03-27
accepted date: 2025-03-27
in scheme: NACEValue

Intermediation service activities for freight transportation
type: Concept
notation: H.52.31
definition: Intermediation service activities for freight transportation
status: valid
status modified: 2025-03-27
accepted date: 2025-03-27
in scheme: NACEValue

Intermediation service activities for passenger transportation
type: Concept
notation: H.52.32
definition: Intermediation service activities for passenger transportation
status: valid
status modified: 2025-03-27
accepted date: 2025-03-27
in scheme: NACEValue

Postal activities under universal service obligation
type: Concept
notation: H.53.10
definition: Postal activities under universal service obligation
status: valid
status modified: 2025-03-27
accepted date: 2025-03-27
in scheme: NACEValue

Other postal and courier activities
type: Concept
notation: H.53.20
definition: Other postal and courier activities
status: valid
status modified: 2025-03-27
accepted date: 2025-03-27
in scheme: NACEValue

Intermediation service activities for postal and courier activities
type: Concept
notation: H.53.30
definition: Intermediation service activities for postal and courier activities
status: valid
status modified: 2025-03-27
accepted date: 2025-03-27
in scheme: NACEValue

Hotels and similar accommodation
type: Concept
notation: I.55.10
definition: Hotels and similar accommodation
status: valid
status modified: 2025-03-27
accepted date: 2025-03-27
in scheme: NACEValue

Holiday and other short-stay accommodation
type: Concept
notation: I.55.20
definition: Holiday and other short-stay accommodation
status: valid
status modified: 2025-03-27
accepted date: 2025-03-27
in scheme: NACEValue

Camping grounds and recreational vehicle parks
type: Concept
notation: I.55.30
definition: Camping grounds and recreational vehicle parks
status: valid
status modified: 2025-03-27
accepted date: 2025-03-27
in scheme: NACEValue

Intermediation service activities for accommodation
type: Concept
notation: I.55.40
definition: Intermediation service activities for accommodation
status: valid
status modified: 2025-03-27
accepted date: 2025-03-27
in scheme: NACEValue

Other accommodation
type: Concept
notation: I.55.90
definition: Other accommodation
status: valid
status modified: 2025-03-27
accepted date: 2025-03-27
in scheme: NACEValue

Restaurant activities
type: Concept
notation: I.56.11
definition: Restaurant activities
status: valid
status modified: 2025-03-27
accepted date: 2025-03-27
in scheme: NACEValue

Mobile food service activities
type: Concept
notation: I.56.12
definition: Mobile food service activities
status: valid
status modified: 2025-03-27
accepted date: 2025-03-27
in scheme: NACEValue

Event catering activities
type: Concept
notation: I.56.21
definition: Event catering activities
status: valid
status modified: 2025-03-27
accepted date: 2025-03-27
in scheme: NACEValue

Contract catering service activities and other food service activities
type: Concept
notation: I.56.22
definition: Contract catering service activities and other food service activities
status: valid
status modified: 2025-03-27
accepted date: 2025-03-27
in scheme: NACEValue

Beverage serving activities
type: Concept
notation: I.56.30
definition: Beverage serving activities
status: valid
status modified: 2025-03-27
accepted date: 2025-03-27
in scheme: NACEValue

Intermediation service activities for food and beverage services activities
type: Concept
notation: I.56.40
definition: Intermediation service activities for food and beverage services activities
status: valid
status modified: 2025-03-27
accepted date: 2025-03-27
in scheme: NACEValue

Publishing of books
type: Concept
notation: J.58.11
definition: Publishing of books
status: valid
status modified: 2025-03-27
accepted date: 2025-03-27
in scheme: NACEValue

Publishing of newspapers
type: Concept
notation: J.58.12
definition: Publishing of newspapers
status: valid
status modified: 2025-03-27
accepted date: 2025-03-27
in scheme: NACEValue

Publishing of journals and periodicals
type: Concept
notation: J.58.13
definition: Publishing of journals and periodicals
status: valid
status modified: 2025-03-27
accepted date: 2025-03-27
in scheme: NACEValue

"Other publishing activities, except software publishing"
type: Concept
notation: J.58.19
definition: "Other publishing activities, except software publishing"
status: valid
status modified: 2025-03-27
accepted date: 2025-03-27
in scheme: NACEValue

Publishing of video games
type: Concept
notation: J.58.21
definition: Publishing of video games
status: valid
status modified: 2025-03-27
accepted date: 2025-03-27
in scheme: NACEValue

Other software publishing
type: Concept
notation: J.58.29
definition: Other software publishing
status: valid
status modified: 2025-03-27
accepted date: 2025-03-27
in scheme: NACEValue

"Motion picture, video and television programme production activities"
type: Concept
notation: J.59.11
definition: "Motion picture, video and television programme production activities"
status: valid
status modified: 2025-03-27
accepted date: 2025-03-27
in scheme: NACEValue

"Motion picture, video and television programme post-production activities"
type: Concept
notation: J.59.12
definition: "Motion picture, video and television programme post-production activities"
status: valid
status modified: 2025-03-27
accepted date: 2025-03-27
in scheme: NACEValue

Motion picture and video distribution activities
type: Concept
notation: J.59.13
definition: Motion picture and video distribution activities
status: valid
status modified: 2025-03-27
accepted date: 2025-03-27
in scheme: NACEValue

Motion picture projection activities
type: Concept
notation: J.59.14
definition: Motion picture projection activities
status: valid
status modified: 2025-03-27
accepted date: 2025-03-27
in scheme: NACEValue

Sound recording and music publishing activities
type: Concept
notation: J.59.20
definition: Sound recording and music publishing activities
status: valid
status modified: 2025-03-27
accepted date: 2025-03-27
in scheme: NACEValue

Radio broadcasting and audio distribution activities
type: Concept
notation: J.60.10
definition: Radio broadcasting and audio distribution activities
status: valid
status modified: 2025-03-27
accepted date: 2025-03-27
in scheme: NACEValue

"Television programming, broadcasting and video distribution activities"
type: Concept
notation: J.60.20
definition: "Television programming, broadcasting and video distribution activities"
status: valid
status modified: 2025-03-27
accepted date: 2025-03-27
in scheme: NACEValue

News agency activities
type: Concept
notation: J.60.31
definition: News agency activities
status: valid
status modified: 2025-03-27
accepted date: 2025-03-27
in scheme: NACEValue

Other content distribution activities
type: Concept
notation: J.60.39
definition: Other content distribution activities
status: valid
status modified: 2025-03-27
accepted date: 2025-03-27
in scheme: NACEValue

"Wired, wireless, and satellite telecommunication activities"
type: Concept
notation: K.61.10
definition: "Wired, wireless, and satellite telecommunication activities"
status: valid
status modified: 2025-03-27
accepted date: 2025-03-27
in scheme: NACEValue

Telecommunication reselling activities and intermediation service activities for telecommunication
type: Concept
notation: K.61.20
definition: Telecommunication reselling activities and intermediation service activities for telecommunication
status: valid
status modified: 2025-03-27
accepted date: 2025-03-27
in scheme: NACEValue

Other telecommunication activities
type: Concept
notation: K.61.90
definition: Other telecommunication activities
status: valid
status modified: 2025-03-27
accepted date: 2025-03-27
in scheme: NACEValue

Computer programming activities
type: Concept
notation: K.62.10
definition: Computer programming activities
status: valid
status modified: 2025-03-27
accepted date: 2025-03-27
in scheme: NACEValue

Computer consultancy and computer facilities management activities
type: Concept
notation: K.62.20
definition: Computer consultancy and computer facilities management activities
status: valid
status modified: 2025-03-27
accepted date: 2025-03-27
in scheme: NACEValue

Other information technology and computer service activities
type: Concept
notation: K.62.90
definition: Other information technology and computer service activities
status: valid
status modified: 2025-03-27
accepted date: 2025-03-27
in scheme: NACEValue

"Computing infrastructure, data processing, hosting and related activities"
type: Concept
notation: K.63.10
definition: "Computing infrastructure, data processing, hosting and related activities"
status: valid
status modified: 2025-03-27
accepted date: 2025-03-27
in scheme: NACEValue

Web search portal activities
type: Concept
notation: K.63.91
definition: Web search portal activities
status: valid
status modified: 2025-03-27
accepted date: 2025-03-27
in scheme: NACEValue

Other information service activities
type: Concept
notation: K.63.92
definition: Other information service activities
status: valid
status modified: 2025-03-27
accepted date: 2025-03-27
in scheme: NACEValue

Central banking
type: Concept
notation: L.64.11
definition: Central banking
status: valid
status modified: 2025-03-27
accepted date: 2025-03-27
in scheme: NACEValue

Other monetary intermediation
type: Concept
notation: L.64.19
definition: Other monetary intermediation
status: valid
status modified: 2025-03-27
accepted date: 2025-03-27
in scheme: NACEValue

Activities of holding companies
type: Concept
notation: L.64.21
definition: Activities of holding companies
status: valid
status modified: 2025-03-27
accepted date: 2025-03-27
in scheme: NACEValue

Activities of financing conduits
type: Concept
notation: L.64.22
definition: Activities of financing conduits
status: valid
status modified: 2025-03-27
accepted date: 2025-03-27
in scheme: NACEValue

Activities of money market and non-money market investments funds
type: Concept
notation: L.64.31
definition: Activities of money market and non-money market investments funds
status: valid
status modified: 2025-03-27
accepted date: 2025-03-27
in scheme: NACEValue

"Activities of trust, estate and agency accounts"
type: Concept
notation: L.64.32
definition: "Activities of trust, estate and agency accounts"
status: valid
status modified: 2025-03-27
accepted date: 2025-03-27
in scheme: NACEValue

Financial leasing
type: Concept
notation: L.64.91
definition: Financial leasing
status: valid
status modified: 2025-03-27
accepted date: 2025-03-27
in scheme: NACEValue

Other credit granting
type: Concept
notation: L.64.92
definition: Other credit granting
status: valid
status modified: 2025-03-27
accepted date: 2025-03-27
in scheme: NACEValue

"Other financial service activities, except insurance and pension funding n.e.c."
type: Concept
notation: L.64.99
definition: "Other financial service activities, except insurance and pension funding n.e.c."
status: valid
status modified: 2025-03-27
accepted date: 2025-03-27
in scheme: NACEValue

Life insurance
type: Concept
notation: L.65.11
definition: Life insurance
status: valid
status modified: 2025-03-27
accepted date: 2025-03-27
in scheme: NACEValue

Non-life insurance
type: Concept
notation: L.65.12
definition: Non-life insurance
status: valid
status modified: 2025-03-27
accepted date: 2025-03-27
in scheme: NACEValue

Reinsurance
type: Concept
notation: L.65.20
definition: Reinsurance
status: valid
status modified: 2025-03-27
accepted date: 2025-03-27
in scheme: NACEValue

Pension funding
type: Concept
notation: L.65.30
definition: Pension funding
status: valid
status modified: 2025-03-27
accepted date: 2025-03-27
in scheme: NACEValue

Administration of financial markets
type: Concept
notation: L.66.11
definition: Administration of financial markets
status: valid
status modified: 2025-03-27
accepted date: 2025-03-27
in scheme: NACEValue

Security and commodity contracts brokerage
type: Concept
notation: L.66.12
definition: Security and commodity contracts brokerage
status: valid
status modified: 2025-03-27
accepted date: 2025-03-27
in scheme: NACEValue

"Other activities auxiliary to financial services, except insurance and pension funding"
type: Concept
notation: L.66.19
definition: "Other activities auxiliary to financial services, except insurance and pension funding"
status: valid
status modified: 2025-03-27
accepted date: 2025-03-27
in scheme: NACEValue

Risk and damage evaluation
type: Concept
notation: L.66.21
definition: Risk and damage evaluation
status: valid
status modified: 2025-03-27
accepted date: 2025-03-27
in scheme: NACEValue

Activities of insurance agents and brokers
type: Concept
notation: L.66.22
definition: Activities of insurance agents and brokers
status: valid
status modified: 2025-03-27
accepted date: 2025-03-27
in scheme: NACEValue

Activities auxiliary to insurance and pension funding n.e.c.
type: Concept
notation: L.66.29
definition: Activities auxiliary to insurance and pension funding n.e.c.
status: valid
status modified: 2025-03-27
accepted date: 2025-03-27
in scheme: NACEValue

Fund management activities
type: Concept
notation: L.66.30
definition: Fund management activities
status: valid
status modified: 2025-03-27
accepted date: 2025-03-27
in scheme: NACEValue

Buying and selling of own real estate
type: Concept
notation: M.68.11
definition: Buying and selling of own real estate
status: valid
status modified: 2025-03-27
accepted date: 2025-03-27
in scheme: NACEValue

Development of building projects
type: Concept
notation: M.68.12
definition: Development of building projects
status: valid
status modified: 2025-03-27
accepted date: 2025-03-27
in scheme: NACEValue

Rental and operating of own or leased real estate
type: Concept
notation: M.68.20
definition: Rental and operating of own or leased real estate
status: valid
status modified: 2025-03-27
accepted date: 2025-03-27
in scheme: NACEValue

Intermediation service activities for real estate activities
type: Concept
notation: M.68.31
definition: Intermediation service activities for real estate activities
status: valid
status modified: 2025-03-27
accepted date: 2025-03-27
in scheme: NACEValue

Other real estate activities on a fee or contract basis
type: Concept
notation: M.68.32
definition: Other real estate activities on a fee or contract basis
status: valid
status modified: 2025-03-27
accepted date: 2025-03-27
in scheme: NACEValue

Legal activities
type: Concept
notation: N.69.10
definition: Legal activities
status: valid
status modified: 2025-03-27
accepted date: 2025-03-27
in scheme: NACEValue

"Accounting, bookkeeping and auditing activities; tax consultancy"
type: Concept
notation: N.69.20
definition: "Accounting, bookkeeping and auditing activities; tax consultancy"
status: valid
status modified: 2025-03-27
accepted date: 2025-03-27
in scheme: NACEValue

Activities of head offices
type: Concept
notation: N.70.10
definition: Activities of head offices
status: valid
status modified: 2025-03-27
accepted date: 2025-03-27
in scheme: NACEValue

Business and other management consultancy activities
type: Concept
notation: N.70.20
definition: Business and other management consultancy activities
status: valid
status modified: 2025-03-27
accepted date: 2025-03-27
in scheme: NACEValue

Architectural activities
type: Concept
notation: N.71.11
definition: Architectural activities
status: valid
status modified: 2025-03-27
accepted date: 2025-03-27
in scheme: NACEValue

Engineering activities and related technical consultancy
type: Concept
notation: N.71.12
definition: Engineering activities and related technical consultancy
status: valid
status modified: 2025-03-27
accepted date: 2025-03-27
in scheme: NACEValue

Technical testing and analysis
type: Concept
notation: N.71.20
definition: Technical testing and analysis
status: valid
status modified: 2025-03-27
accepted date: 2025-03-27
in scheme: NACEValue

Research and experimental development on natural sciences and engineering
type: Concept
notation: N.72.10
definition: Research and experimental development on natural sciences and engineering
status: valid
status modified: 2025-03-27
accepted date: 2025-03-27
in scheme: NACEValue

Research and experimental development on social sciences and humanities
type: Concept
notation: N.72.20
definition: Research and experimental development on social sciences and humanities
status: valid
status modified: 2025-03-27
accepted date: 2025-03-27
in scheme: NACEValue

Activities of advertising agencies
type: Concept
notation: N.73.11
definition: Activities of advertising agencies
status: valid
status modified: 2025-03-27
accepted date: 2025-03-27
in scheme: NACEValue

Media representation
type: Concept
notation: N.73.12
definition: Media representation
status: valid
status modified: 2025-03-27
accepted date: 2025-03-27
in scheme: NACEValue

Market research and public opinion polling
type: Concept
notation: N.73.20
definition: Market research and public opinion polling
status: valid
status modified: 2025-03-27
accepted date: 2025-03-27
in scheme: NACEValue

Public relations and communication activities
type: Concept
notation: N.73.30
definition: Public relations and communication activities
status: valid
status modified: 2025-03-27
accepted date: 2025-03-27
in scheme: NACEValue

Industrial product and fashion design activities
type: Concept
notation: N.74.11
definition: Industrial product and fashion design activities
status: valid
status modified: 2025-03-27
accepted date: 2025-03-27
in scheme: NACEValue

Graphic design and visual communication activities
type: Concept
notation: N.74.12
definition: Graphic design and visual communication activities
status: valid
status modified: 2025-03-27
accepted date: 2025-03-27
in scheme: NACEValue

Interior design activities
type: Concept
notation: N.74.13
definition: Interior design activities
status: valid
status modified: 2025-03-27
accepted date: 2025-03-27
in scheme: NACEValue

Other specialised design activities
type: Concept
notation: N.74.14
definition: Other specialised design activities
status: valid
status modified: 2025-03-27
accepted date: 2025-03-27
in scheme: NACEValue

Photographic activities
type: Concept
notation: N.74.20
definition: Photographic activities
status: valid
status modified: 2025-03-27
accepted date: 2025-03-27
in scheme: NACEValue

Translation and interpretation activities
type: Concept
notation: N.74.30
definition: Translation and interpretation activities
status: valid
status modified: 2025-03-27
accepted date: 2025-03-27
in scheme: NACEValue

Patent brokering and marketing service activities
type: Concept
notation: N.74.91
definition: Patent brokering and marketing service activities
status: valid
status modified: 2025-03-27
accepted date: 2025-03-27
in scheme: NACEValue

"All other professional, scientific and technical activities n.e.c."
type: Concept
notation: N.74.99
definition: "All other professional, scientific and technical activities n.e.c."
status: valid
status modified: 2025-03-27
accepted date: 2025-03-27
in scheme: NACEValue

Veterinary activities
type: Concept
notation: N.75.00
definition: Veterinary activities
status: valid
status modified: 2025-03-27
accepted date: 2025-03-27
in scheme: NACEValue

Rental and leasing of cars and light motor vehicles
type: Concept
notation: O.77.11
definition: Rental and leasing of cars and light motor vehicles
status: valid
status modified: 2025-03-27
accepted date: 2025-03-27
in scheme: NACEValue

Rental and leasing of trucks
type: Concept
notation: O.77.12
definition: Rental and leasing of trucks
status: valid
status modified: 2025-03-27
accepted date: 2025-03-27
in scheme: NACEValue

Rental and leasing of recreational and sports goods
type: Concept
notation: O.77.21
definition: Rental and leasing of recreational and sports goods
status: valid
status modified: 2025-03-27
accepted date: 2025-03-27
in scheme: NACEValue

Rental and leasing of other personal and household goods
type: Concept
notation: O.77.22
definition: Rental and leasing of other personal and household goods
status: valid
status modified: 2025-03-27
accepted date: 2025-03-27
in scheme: NACEValue

Rental and leasing of agricultural machinery and equipment
type: Concept
notation: O.77.31
definition: Rental and leasing of agricultural machinery and equipment
status: valid
status modified: 2025-03-27
accepted date: 2025-03-27
in scheme: NACEValue

Rental and leasing of construction and civil engineering machinery and equipment
type: Concept
notation: O.77.32
definition: Rental and leasing of construction and civil engineering machinery and equipment
status: valid
status modified: 2025-03-27
accepted date: 2025-03-27
in scheme: NACEValue

"Rental and leasing of office machinery, equipment and computers"
type: Concept
notation: O.77.33
definition: "Rental and leasing of office machinery, equipment and computers"
status: valid
status modified: 2025-03-27
accepted date: 2025-03-27
in scheme: NACEValue

Rental and leasing of water transport equipment
type: Concept
notation: O.77.34
definition: Rental and leasing of water transport equipment
status: valid
status modified: 2025-03-27
accepted date: 2025-03-27
in scheme: NACEValue

Rental and leasing of air transport equipment
type: Concept
notation: O.77.35
definition: Rental and leasing of air transport equipment
status: valid
status modified: 2025-03-27
accepted date: 2025-03-27
in scheme: NACEValue

"Rental and leasing of other machinery, equipment and tangible goods n.e.c."
type: Concept
notation: O.77.39
definition: "Rental and leasing of other machinery, equipment and tangible goods n.e.c."
status: valid
status modified: 2025-03-27
accepted date: 2025-03-27
in scheme: NACEValue

"Leasing of intellectual property and similar products, except copyrighted works"
type: Concept
notation: O.77.40
definition: "Leasing of intellectual property and similar products, except copyrighted works"
status: valid
status modified: 2025-03-27
accepted date: 2025-03-27
in scheme: NACEValue

"Intermediation service activities for rental and leasing of cars, motorhomes and trailers"
type: Concept
notation: O.77.51
definition: "Intermediation service activities for rental and leasing of cars, motorhomes and trailers"
status: valid
status modified: 2025-03-27
accepted date: 2025-03-27
in scheme: NACEValue

Intermediation service activities for rental and leasing of other tangible goods and non-financial intangible assets
type: Concept
notation: O.77.52
definition: Intermediation service activities for rental and leasing of other tangible goods and non-financial intangible assets
status: valid
status modified: 2025-03-27
accepted date: 2025-03-27
in scheme: NACEValue

Activities of employment placement agencies
type: Concept
notation: O.78.10
definition: Activities of employment placement agencies
status: valid
status modified: 2025-03-27
accepted date: 2025-03-27
in scheme: NACEValue

Temporary employment agency activities and other human resource provisions
type: Concept
notation: O.78.20
definition: Temporary employment agency activities and other human resource provisions
status: valid
status modified: 2025-03-27
accepted date: 2025-03-27
in scheme: NACEValue

Travel agency activities
type: Concept
notation: O.79.11
definition: Travel agency activities
status: valid
status modified: 2025-03-27
accepted date: 2025-03-27
in scheme: NACEValue

Tour operator activities
type: Concept
notation: O.79.12
definition: Tour operator activities
status: valid
status modified: 2025-03-27
accepted date: 2025-03-27
in scheme: NACEValue

Other reservation service and related activities
type: Concept
notation: O.79.90
definition: Other reservation service and related activities
status: valid
status modified: 2025-03-27
accepted date: 2025-03-27
in scheme: NACEValue

Investigation and private security activities
type: Concept
notation: O.80.01
definition: Investigation and private security activities
status: valid
status modified: 2025-03-27
accepted date: 2025-03-27
in scheme: NACEValue

Security activities n.e.c.
type: Concept
notation: O.80.09
definition: Security activities n.e.c.
status: valid
status modified: 2025-03-27
accepted date: 2025-03-27
in scheme: NACEValue

Combined facilities support activities
type: Concept
notation: O.81.10
definition: Combined facilities support activities
status: valid
status modified: 2025-03-27
accepted date: 2025-03-27
in scheme: NACEValue

General cleaning of buildings
type: Concept
notation: O.81.21
definition: General cleaning of buildings
status: valid
status modified: 2025-03-27
accepted date: 2025-03-27
in scheme: NACEValue

Other building and industrial cleaning activities
type: Concept
notation: O.81.22
definition: Other building and industrial cleaning activities
status: valid
status modified: 2025-03-27
accepted date: 2025-03-27
in scheme: NACEValue

Other cleaning activities
type: Concept
notation: O.81.23
definition: Other cleaning activities
status: valid
status modified: 2025-03-27
accepted date: 2025-03-27
in scheme: NACEValue

Landscape service activities
type: Concept
notation: O.81.30
definition: Landscape service activities
status: valid
status modified: 2025-03-27
accepted date: 2025-03-27
in scheme: NACEValue

Office administrative and support activities
type: Concept
notation: O.82.10
definition: Office administrative and support activities
status: valid
status modified: 2025-03-27
accepted date: 2025-03-27
in scheme: NACEValue

Activities of call centres
type: Concept
notation: O.82.20
definition: Activities of call centres
status: valid
status modified: 2025-03-27
accepted date: 2025-03-27
in scheme: NACEValue

Organisation of conventions and trade shows
type: Concept
notation: O.82.30
definition: Organisation of conventions and trade shows
status: valid
status modified: 2025-03-27
accepted date: 2025-03-27
in scheme: NACEValue

Intermediation service activities for business support service activities n.e.c.
type: Concept
notation: O.82.40
definition: Intermediation service activities for business support service activities n.e.c.
status: valid
status modified: 2025-03-27
accepted date: 2025-03-27
in scheme: NACEValue

Activities of collection agencies and credit bureaus
type: Concept
notation: O.82.91
definition: Activities of collection agencies and credit bureaus
status: valid
status modified: 2025-03-27
accepted date: 2025-03-27
in scheme: NACEValue

Packaging activities
type: Concept
notation: O.82.92
definition: Packaging activities
status: valid
status modified: 2025-03-27
accepted date: 2025-03-27
in scheme: NACEValue

Other business support service activities n.e.c.
type: Concept
notation: O.82.99
definition: Other business support service activities n.e.c.
status: valid
status modified: 2025-03-27
accepted date: 2025-03-27
in scheme: NACEValue

General public administration activities
type: Concept
notation: P.84.11
definition: General public administration activities
status: valid
status modified: 2025-03-27
accepted date: 2025-03-27
in scheme: NACEValue

"Regulation of health care, education, cultural services and other social services"
type: Concept
notation: P.84.12
definition: "Regulation of health care, education, cultural services and other social services"
status: valid
status modified: 2025-03-27
accepted date: 2025-03-27
in scheme: NACEValue

Regulation of and contribution to more efficient operation of businesses
type: Concept
notation: P.84.13
definition: Regulation of and contribution to more efficient operation of businesses
status: valid
status modified: 2025-03-27
accepted date: 2025-03-27
in scheme: NACEValue

Foreign affairs
type: Concept
notation: P.84.21
definition: Foreign affairs
status: valid
status modified: 2025-03-27
accepted date: 2025-03-27
in scheme: NACEValue

Defence activities
type: Concept
notation: P.84.22
definition: Defence activities
status: valid
status modified: 2025-03-27
accepted date: 2025-03-27
in scheme: NACEValue

Justice and judicial activities
type: Concept
notation: P.84.23
definition: Justice and judicial activities
status: valid
status modified: 2025-03-27
accepted date: 2025-03-27
in scheme: NACEValue

Public order and safety activities
type: Concept
notation: P.84.24
definition: Public order and safety activities
status: valid
status modified: 2025-03-27
accepted date: 2025-03-27
in scheme: NACEValue

Fire service activities
type: Concept
notation: P.84.25
definition: Fire service activities
status: valid
status modified: 2025-03-27
accepted date: 2025-03-27
in scheme: NACEValue

Compulsory social security activities
type: Concept
notation: P.84.30
definition: Compulsory social security activities
status: valid
status modified: 2025-03-27
accepted date: 2025-03-27
in scheme: NACEValue

Pre-primary education
type: Concept
notation: Q.85.10
definition: Pre-primary education
status: valid
status modified: 2025-03-27
accepted date: 2025-03-27
in scheme: NACEValue

Primary education
type: Concept
notation: Q.85.20
definition: Primary education
status: valid
status modified: 2025-03-27
accepted date: 2025-03-27
in scheme: NACEValue

General secondary education
type: Concept
notation: Q.85.31
definition: General secondary education
status: valid
status modified: 2025-03-27
accepted date: 2025-03-27
in scheme: NACEValue

Vocational secondary education
type: Concept
notation: Q.85.32
definition: Vocational secondary education
status: valid
status modified: 2025-03-27
accepted date: 2025-03-27
in scheme: NACEValue

Post-secondary non-tertiary education
type: Concept
notation: Q.85.33
definition: Post-secondary non-tertiary education
status: valid
status modified: 2025-03-27
accepted date: 2025-03-27
in scheme: NACEValue

Tertiary education
type: Concept
notation: Q.85.40
definition: Tertiary education
status: valid
status modified: 2025-03-27
accepted date: 2025-03-27
in scheme: NACEValue

Sports and recreation education
type: Concept
notation: Q.85.51
definition: Sports and recreation education
status: valid
status modified: 2025-03-27
accepted date: 2025-03-27
in scheme: NACEValue

Cultural education
type: Concept
notation: Q.85.52
definition: Cultural education
status: valid
status modified: 2025-03-27
accepted date: 2025-03-27
in scheme: NACEValue

Driving school activities
type: Concept
notation: Q.85.53
definition: Driving school activities
status: valid
status modified: 2025-03-27
accepted date: 2025-03-27
in scheme: NACEValue

Other education n.e.c.
type: Concept
notation: Q.85.59
definition: Other education n.e.c.
status: valid
status modified: 2025-03-27
accepted date: 2025-03-27
in scheme: NACEValue

Intermediation service activities for courses and tutors
type: Concept
notation: Q.85.61
definition: Intermediation service activities for courses and tutors
status: valid
status modified: 2025-03-27
accepted date: 2025-03-27
in scheme: NACEValue

Educational support activities n.e.c.
type: Concept
notation: Q.85.69
definition: Educational support activities n.e.c.
status: valid
status modified: 2025-03-27
accepted date: 2025-03-27
in scheme: NACEValue

Hospital activities
type: Concept
notation: R.86.10
definition: Hospital activities
status: valid
status modified: 2025-03-27
accepted date: 2025-03-27
in scheme: NACEValue

General medical practice activities
type: Concept
notation: R.86.21
definition: General medical practice activities
status: valid
status modified: 2025-03-27
accepted date: 2025-03-27
in scheme: NACEValue

Medical specialists activities
type: Concept
notation: R.86.22
definition: Medical specialists activities
status: valid
status modified: 2025-03-27
accepted date: 2025-03-27
in scheme: NACEValue

Dental practice care activities
type: Concept
notation: R.86.23
definition: Dental practice care activities
status: valid
status modified: 2025-03-27
accepted date: 2025-03-27
in scheme: NACEValue

Diagnostic imaging services and medical laboratory activities
type: Concept
notation: R.86.91
definition: Diagnostic imaging services and medical laboratory activities
status: valid
status modified: 2025-03-27
accepted date: 2025-03-27
in scheme: NACEValue

Patient transportation by ambulance
type: Concept
notation: R.86.92
definition: Patient transportation by ambulance
status: valid
status modified: 2025-03-27
accepted date: 2025-03-27
in scheme: NACEValue

"Activities of psychologists and psychotherapists, except medical doctors"
type: Concept
notation: R.86.93
definition: "Activities of psychologists and psychotherapists, except medical doctors"
status: valid
status modified: 2025-03-27
accepted date: 2025-03-27
in scheme: NACEValue

Nursing and midwifery activities
type: Concept
notation: R.86.94
definition: Nursing and midwifery activities
status: valid
status modified: 2025-03-27
accepted date: 2025-03-27
in scheme: NACEValue

Physiotherapy activities
type: Concept
notation: R.86.95
definition: Physiotherapy activities
status: valid
status modified: 2025-03-27
accepted date: 2025-03-27
in scheme: NACEValue

"Traditional, complementary and alternative medicine activities"
type: Concept
notation: R.86.96
definition: "Traditional, complementary and alternative medicine activities"
status: valid
status modified: 2025-03-27
accepted date: 2025-03-27
in scheme: NACEValue

"Intermediation service activities for medical, dental and other human health services"
type: Concept
notation: R.86.97
definition: "Intermediation service activities for medical, dental and other human health services"
status: valid
status modified: 2025-03-27
accepted date: 2025-03-27
in scheme: NACEValue

Other human health activities n.e.c.
type: Concept
notation: R.86.99
definition: Other human health activities n.e.c.
status: valid
status modified: 2025-03-27
accepted date: 2025-03-27
in scheme: NACEValue

Residential nursing care activities
type: Concept
notation: R.87.10
definition: Residential nursing care activities
status: valid
status modified: 2025-03-27
accepted date: 2025-03-27
in scheme: NACEValue

Residential care activities for persons living with or having a diagnosis of a mental illness or substance abuse
type: Concept
notation: R.87.20
definition: Residential care activities for persons living with or having a diagnosis of a mental illness or substance abuse
status: valid
status modified: 2025-03-27
accepted date: 2025-03-27
in scheme: NACEValue

Residential care activities for older persons or persons with physical disabilities
type: Concept
notation: R.87.30
definition: Residential care activities for older persons or persons with physical disabilities
status: valid
status modified: 2025-03-27
accepted date: 2025-03-27
in scheme: NACEValue

Intermediation service activities for residential care activities
type: Concept
notation: R.87.91
definition: Intermediation service activities for residential care activities
status: valid
status modified: 2025-03-27
accepted date: 2025-03-27
in scheme: NACEValue

Other residential care activities n.e.c.
type: Concept
notation: R.87.99
definition: Other residential care activities n.e.c.
status: valid
status modified: 2025-03-27
accepted date: 2025-03-27
in scheme: NACEValue

Social work activities without accommodation for older persons or persons with disabilities
type: Concept
notation: R.88.10
definition: Social work activities without accommodation for older persons or persons with disabilities
status: valid
status modified: 2025-03-27
accepted date: 2025-03-27
in scheme: NACEValue

Child day-care activities
type: Concept
notation: R.88.91
definition: Child day-care activities
status: valid
status modified: 2025-03-27
accepted date: 2025-03-27
in scheme: NACEValue

Other social work activities without accommodation n.e.c.
type: Concept
notation: R.88.99
definition: Other social work activities without accommodation n.e.c.
status: valid
status modified: 2025-03-27
accepted date: 2025-03-27
in scheme: NACEValue

Literary creation and musical composition activities
type: Concept
notation: S.90.11
definition: Literary creation and musical composition activities
status: valid
status modified: 2025-03-27
accepted date: 2025-03-27
in scheme: NACEValue

Visual arts creation activities
type: Concept
notation: S.90.12
definition: Visual arts creation activities
status: valid
status modified: 2025-03-27
accepted date: 2025-03-27
in scheme: NACEValue

Other arts creation activities
type: Concept
notation: S.90.13
definition: Other arts creation activities
status: valid
status modified: 2025-03-27
accepted date: 2025-03-27
in scheme: NACEValue

Activities of performing arts
type: Concept
notation: S.90.20
definition: Activities of performing arts
status: valid
status modified: 2025-03-27
accepted date: 2025-03-27
in scheme: NACEValue

Operation of arts facilities and sites
type: Concept
notation: S.90.31
definition: Operation of arts facilities and sites
status: valid
status modified: 2025-03-27
accepted date: 2025-03-27
in scheme: NACEValue

Other support activities to arts and performing arts
type: Concept
notation: S.90.39
definition: Other support activities to arts and performing arts
status: valid
status modified: 2025-03-27
accepted date: 2025-03-27
in scheme: NACEValue

Library activities
type: Concept
notation: S.91.11
definition: Library activities
status: valid
status modified: 2025-03-27
accepted date: 2025-03-27
in scheme: NACEValue

Archive activities
type: Concept
notation: S.91.12
definition: Archive activities
status: valid
status modified: 2025-03-27
accepted date: 2025-03-27
in scheme: NACEValue

Museum and collection activities
type: Concept
notation: S.91.21
definition: Museum and collection activities
status: valid
status modified: 2025-03-27
accepted date: 2025-03-27
in scheme: NACEValue

Historical site and monument activities
type: Concept
notation: S.91.22
definition: Historical site and monument activities
status: valid
status modified: 2025-03-27
accepted date: 2025-03-27
in scheme: NACEValue

"Conservation, restoration and other support activities for cultural heritage"
type: Concept
notation: S.91.30
definition: "Conservation, restoration and other support activities for cultural heritage"
status: valid
status modified: 2025-03-27
accepted date: 2025-03-27
in scheme: NACEValue

Botanical and zoological garden activities
type: Concept
notation: S.91.41
definition: Botanical and zoological garden activities
status: valid
status modified: 2025-03-27
accepted date: 2025-03-27
in scheme: NACEValue

Nature reserve activities
type: Concept
notation: S.91.42
definition: Nature reserve activities
status: valid
status modified: 2025-03-27
accepted date: 2025-03-27
in scheme: NACEValue

Gambling and betting activities
type: Concept
notation: S.92.00
definition: Gambling and betting activities
status: valid
status modified: 2025-03-27
accepted date: 2025-03-27
in scheme: NACEValue

Operation of sports facilities
type: Concept
notation: S.93.11
definition: Operation of sports facilities
status: valid
status modified: 2025-03-27
accepted date: 2025-03-27
in scheme: NACEValue

Activities of sports clubs
type: Concept
notation: S.93.12
definition: Activities of sports clubs
status: valid
status modified: 2025-03-27
accepted date: 2025-03-27
in scheme: NACEValue

Activities of fitness centres
type: Concept
notation: S.93.13
definition: Activities of fitness centres
status: valid
status modified: 2025-03-27
accepted date: 2025-03-27
in scheme: NACEValue

Sports activities n.e.c.
type: Concept
notation: S.93.19
definition: Sports activities n.e.c.
status: valid
status modified: 2025-03-27
accepted date: 2025-03-27
in scheme: NACEValue

Activities of amusement parks and theme parks
type: Concept
notation: S.93.21
definition: Activities of amusement parks and theme parks
status: valid
status modified: 2025-03-27
accepted date: 2025-03-27
in scheme: NACEValue

Amusement and recreation activities n.e.c.
type: Concept
notation: S.93.29
definition: Amusement and recreation activities n.e.c.
status: valid
status modified: 2025-03-27
accepted date: 2025-03-27
in scheme: NACEValue

Activities of business and employers membership organisations
type: Concept
notation: T.94.11
definition: Activities of business and employers membership organisations
status: valid
status modified: 2025-03-27
accepted date: 2025-03-27
in scheme: NACEValue

Activities of professional membership organisations
type: Concept
notation: T.94.12
definition: Activities of professional membership organisations
status: valid
status modified: 2025-03-27
accepted date: 2025-03-27
in scheme: NACEValue

Activities of trade unions
type: Concept
notation: T.94.20
definition: Activities of trade unions
status: valid
status modified: 2025-03-27
accepted date: 2025-03-27
in scheme: NACEValue

Activities of religious organisations
type: Concept
notation: T.94.91
definition: Activities of religious organisations
status: valid
status modified: 2025-03-27
accepted date: 2025-03-27
in scheme: NACEValue

Activities of political organisations
type: Concept
notation: T.94.92
definition: Activities of political organisations
status: valid
status modified: 2025-03-27
accepted date: 2025-03-27
in scheme: NACEValue

Activities of other membership organisations n.e.c.
type: Concept
notation: T.94.99
definition: Activities of other membership organisations n.e.c.
status: valid
status modified: 2025-03-27
accepted date: 2025-03-27
in scheme: NACEValue

Repair and maintenance of computers and communication equipment
type: Concept
notation: T.95.10
definition: Repair and maintenance of computers and communication equipment
status: valid
status modified: 2025-03-27
accepted date: 2025-03-27
in scheme: NACEValue

Repair and maintenance of consumer electronics
type: Concept
notation: T.95.21
definition: Repair and maintenance of consumer electronics
status: valid
status modified: 2025-03-27
accepted date: 2025-03-27
in scheme: NACEValue

Repair and maintenance of household appliances and home and garden equipment
type: Concept
notation: T.95.22
definition: Repair and maintenance of household appliances and home and garden equipment
status: valid
status modified: 2025-03-27
accepted date: 2025-03-27
in scheme: NACEValue

Repair and maintenance of footwear and leather goods
type: Concept
notation: T.95.23
definition: Repair and maintenance of footwear and leather goods
status: valid
status modified: 2025-03-27
accepted date: 2025-03-27
in scheme: NACEValue

Repair and maintenance of furniture and home furnishings
type: Concept
notation: T.95.24
definition: Repair and maintenance of furniture and home furnishings
status: valid
status modified: 2025-03-27
accepted date: 2025-03-27
in scheme: NACEValue

"Repair and maintenance of watches, clocks and jewellery"
type: Concept
notation: T.95.25
definition: "Repair and maintenance of watches, clocks and jewellery"
status: valid
status modified: 2025-03-27
accepted date: 2025-03-27
in scheme: NACEValue

Repair and maintenance of personal and household goods n.e.c.
type: Concept
notation: T.95.29
definition: Repair and maintenance of personal and household goods n.e.c.
status: valid
status modified: 2025-03-27
accepted date: 2025-03-27
in scheme: NACEValue

Repair and maintenance of motor vehicles
type: Concept
notation: T.95.31
definition: Repair and maintenance of motor vehicles
status: valid
status modified: 2025-03-27
accepted date: 2025-03-27
in scheme: NACEValue

Repair and maintenance of motorcycles
type: Concept
notation: T.95.32
definition: Repair and maintenance of motorcycles
status: valid
status modified: 2025-03-27
accepted date: 2025-03-27
in scheme: NACEValue

"Intermediation service activities for repair and maintenance of computers, personal and household goods, and motor vehicles and motorcycles"
type: Concept
notation: T.95.40
definition: "Intermediation service activities for repair and maintenance of computers, personal and household goods, and motor vehicles and motorcycles"
status: valid
status modified: 2025-03-27
accepted date: 2025-03-27
in scheme: NACEValue

Washing and cleaning of textile and fur products
type: Concept
notation: T.96.10
definition: Washing and cleaning of textile and fur products
status: valid
status modified: 2025-03-27
accepted date: 2025-03-27
in scheme: NACEValue

Hairdressing and barber activities
type: Concept
notation: T.96.21
definition: Hairdressing and barber activities
status: valid
status modified: 2025-03-27
accepted date: 2025-03-27
in scheme: NACEValue

Beauty care and other beauty treatment activities
type: Concept
notation: T.96.22
definition: Beauty care and other beauty treatment activities
status: valid
status modified: 2025-03-27
accepted date: 2025-03-27
in scheme: NACEValue

"Day spa, sauna and steam bath activities"
type: Concept
notation: T.96.23
definition: "Day spa, sauna and steam bath activities"
status: valid
status modified: 2025-03-27
accepted date: 2025-03-27
in scheme: NACEValue

Funeral and related activities
type: Concept
notation: T.96.30
definition: Funeral and related activities
status: valid
status modified: 2025-03-27
accepted date: 2025-03-27
in scheme: NACEValue

Intermediation service activities for personal services
type: Concept
notation: T.96.40
definition: Intermediation service activities for personal services
status: valid
status modified: 2025-03-27
accepted date: 2025-03-27
in scheme: NACEValue

Provision of domestic personal service activities
type: Concept
notation: T.96.91
definition: Provision of domestic personal service activities
status: valid
status modified: 2025-03-27
accepted date: 2025-03-27
in scheme: NACEValue

Other personal service activities n.e.c.
type: Concept
notation: T.96.99
definition: Other personal service activities n.e.c.
status: valid
status modified: 2025-03-27
accepted date: 2025-03-27
in scheme: NACEValue

Activities of households as employers of domestic personnel
type: Concept
notation: U.97.00
definition: Activities of households as employers of domestic personnel
status: valid
status modified: 2025-03-27
accepted date: 2025-03-27
in scheme: NACEValue

Undifferentiated goods-producing activities of private households for own use
type: Concept
notation: U.98.10
definition: Undifferentiated goods-producing activities of private households for own use
status: valid
status modified: 2025-03-27
accepted date: 2025-03-27
in scheme: NACEValue

Undifferentiated service-producing activities of private households for own use
type: Concept
notation: U.98.20
definition: Undifferentiated service-producing activities of private households for own use
status: valid
status modified: 2025-03-27
accepted date: 2025-03-27
in scheme: NACEValue

Activities of extraterritorial organisations and bodies
type: Concept
notation: V.99.00
definition: Activities of extraterritorial organisations and bodies
status: valid
status modified: 2025-03-27
accepted date: 2025-03-27
in scheme: NACEValue

Raising of dairy cattle
type: Concept
notation: A.01.41
definition: Raising of dairy cattle
status: valid
status modified: 2025-06-16
accepted date: 2025-06-16
in scheme: NACEValue