BATAELValue
type: ConceptScheme
notation: BATAELValue
is part of: euregistryonindustrialsites
registration status: Released
user modified: antogfed
date modified: 2025-03-12 13:29:20.0
vocabulary type: Common
is numeric concept identifiers: false
is notations equal identifiers: false

Production of Chlor-alkali - Cl2 - BAT13-I
type: Concept
notation: CAK-Cl2-BAT13-I
definition: 4, Chemical industry: 4,2 Production of inorganic chemicals, such as: (a) gases, such as ammonia, chlorine or hydrogen chloride, fluorine or hydrogen fluoride, carbon oxides, sulphur compounds, nitrogen oxides, hydrogen, sulphur dioxide, carbonyl chloride; (c) bases, such as ammonium hydroxide, potassium hydroxide, sodium hydroxide; Reducing free chlorine to water. The BAT-AEL emission level is 0,05 - 0,2 mg/l.
status: valid
status modified: 2019-04-23
accepted date: 2019-04-23
in scheme: BATAELValue

Production of Chlor-alkali - Cl2 - BAT8-I
type: Concept
notation: CAK-Cl2-BAT8-I
definition: 4, Chemical industry: 4,2 Production of inorganic chemicals, such as: (a) gases, such as ammonia, chlorine or hydrogen chloride, fluorine or hydrogen fluoride, carbon oxides, sulphur compounds, nitrogen oxides, hydrogen, sulphur dioxide, carbonyl chloride; (c) bases, such as ammonium hydroxide, potassium hydroxide, sodium hydroxide; Chlorine absorption unit; features (i)-(xv) (see list); Reducing chlorine and chlorine dioxide emissions to air. The BAT-AEL emission level is 0,2 - 1 mg/Nm3.
status: valid
status modified: 2019-04-23
accepted date: 2019-04-23
in scheme: BATAELValue

Production of Cement, Lime and Magnesium Oxide - CO - BAT48
type: Concept
notation: CLM-CO-BAT48
definition: 3, Mineral industry: 3,1 Production of cement, lime and magnesium oxide: (b) production of lime in kilns with a production capacity exceeding 50�tonnes per day; PFRK, OSK, LRK, PRK; Reducing carbon monoxide (CO) emissions to air. The BAT-AEL emission level is < 500 mg/Nm3.
status: valid
status modified: 2019-04-23
accepted date: 2019-04-23
in scheme: BATAELValue

Production of Cement, Lime and Magnesium Oxide - CO - BAT63
type: Concept
notation: CLM-CO-BAT63
definition: 3, Mineral industry: 3,1 Production of cement, lime and magnesium oxide: (c) production of magnesium oxide in kilns with a production capacity exceeding 50�tonnes per day; Techniques (a)-(c) (see table); Reducing carbon monoxide (CO) emissions to air. The BAT-AEL emission level is < 50 - 1000 mg/Nm3.
status: valid
status modified: 2019-04-23
accepted date: 2019-04-23
in scheme: BATAELValue

Production of Cement, Lime and Magnesium Oxide - Dust - BAT16
type: Concept
notation: CLM-Dust-BAT16
definition: 3, Mineral industry: 3,1 Production of cement, lime and magnesium oxide: (a) production of cement clinker in rotary kilns with a production capacity exceeding 500�tonnes per day or in other kilns with a production capacity exceeding 50�tonnes per day; Dry flue-gas cleaning with a filter (usually fabric filter); Reducing dust emissions to air. The BAT-AEL emission level is < 10 mg/Nm3.
status: valid
status modified: 2019-04-23
accepted date: 2019-04-23
in scheme: BATAELValue

Production of Cement, Lime and Magnesium Oxide - Dust - BAT17
type: Concept
notation: CLM-Dust-BAT17
definition: 3, Mineral industry: 3,1 Production of cement, lime and magnesium oxide: (a) production of cement clinker in rotary kilns with a production capacity exceeding 500�tonnes per day or in other kilns with a production capacity exceeding 50�tonnes per day; ESPs, fabric filters, hybrid filters; Reducing dust emissions to air. The BAT-AEL emission level is < 10 - 20 mg/Nm3.
status: valid
status modified: 2019-04-23
accepted date: 2019-04-23
in scheme: BATAELValue

Production of Cement, Lime and Magnesium Oxide - Dust - BAT18
type: Concept
notation: CLM-Dust-BAT18
definition: 3, Mineral industry: 3,1 Production of cement, lime and magnesium oxide: (a) production of cement clinker in rotary kilns with a production capacity exceeding 500�tonnes per day or in other kilns with a production capacity exceeding 50�tonnes per day; ESPs, fabric filters, hybrid filters; Reducing dust emissions to air. The BAT-AEL emission level is < 10 - 20 mg/Nm3.
status: valid
status modified: 2019-04-23
accepted date: 2019-04-23
in scheme: BATAELValue

Production of Cement, Lime and Magnesium Oxide - Dust - BAT42-I
type: Concept
notation: CLM-Dust-BAT42-I
definition: 3, Mineral industry: 3,1 Production of cement, lime and magnesium oxide: (b) production of lime in kilns with a production capacity exceeding 50�tonnes per day; Fabric filter; Reducing dust emissions to air. The BAT-AEL emission level is < 10 mg/Nm3.
status: valid
status modified: 2019-04-23
accepted date: 2019-04-23
in scheme: BATAELValue

Production of Cement, Lime and Magnesium Oxide - Dust - BAT42-II
type: Concept
notation: CLM-Dust-BAT42-II
definition: 3, Mineral industry: 3,1 Production of cement, lime and magnesium oxide: (b) production of lime in kilns with a production capacity exceeding 50�tonnes per day; Wet scrubber; Reducing dust emissions to air. The BAT-AEL emission level is < 10 - 20 mg/Nm3.
status: valid
status modified: 2019-04-23
accepted date: 2019-04-23
in scheme: BATAELValue

Production of Cement, Lime and Magnesium Oxide - Dust - BAT43-I
type: Concept
notation: CLM-Dust-BAT43-I
definition: 3, Mineral industry: 3,1 Production of cement, lime and magnesium oxide: (b) production of lime in kilns with a production capacity exceeding 50�tonnes per day; Fabric filter; Reducing dust emissions to air. The BAT-AEL emission level is < 10 mg/Nm3.
status: valid
status modified: 2019-04-23
accepted date: 2019-04-23
in scheme: BATAELValue

Production of Cement, Lime and Magnesium Oxide - Dust - BAT43-II
type: Concept
notation: CLM-Dust-BAT43-II
definition: 3, Mineral industry: 3,1 Production of cement, lime and magnesium oxide: (b) production of lime in kilns with a production capacity exceeding 50�tonnes per day; ESP or other filters; Reducing dust emissions to air. The BAT-AEL emission level is < 20 mg/Nm3.
status: valid
status modified: 2019-04-23
accepted date: 2019-04-23
in scheme: BATAELValue

Production of Cement, Lime and Magnesium Oxide - Dust - BAT59
type: Concept
notation: CLM-Dust-BAT59
definition: 3, Mineral industry: 3,1 Production of cement, lime and magnesium oxide: (c) production of magnesium oxide in kilns with a production capacity exceeding 50�tonnes per day; Fabric filters, centrifugal separators/ cyclones, wet dust separators; Reducing dust emissions to air. The BAT-AEL emission level is < 10 mg/Nm3.
status: valid
status modified: 2019-04-23
accepted date: 2019-04-23
in scheme: BATAELValue

Production of Cement, Lime and Magnesium Oxide - Dust - BAT60
type: Concept
notation: CLM-Dust-BAT60
definition: 3, Mineral industry: 3,1 Production of cement, lime and magnesium oxide: (c) production of magnesium oxide in kilns with a production capacity exceeding 50�tonnes per day; ESPs, fabric filters, centrifugal separators / cyclones, wet dust separators; Reducing dust emissions to air. The BAT-AEL emission level is < 20 - 35 mg/Nm3.
status: valid
status modified: 2019-04-23
accepted date: 2019-04-23
in scheme: BATAELValue

Production of Cement, Lime and Magnesium Oxide - HCl - BAT25
type: Concept
notation: CLM-HCl-BAT25
definition: 3, Mineral industry: 3,1 Production of cement, lime and magnesium oxide: (a) production of cement clinker in rotary kilns with a production capacity exceeding 500�tonnes per day or in other kilns with a production capacity exceeding 50�tonnes per day; Primary techniques (a)-(b) (see table); Reducing hydrogen chloride (HCl) emissions to air. The BAT-AEL emission level is < 10 mg/Nm3.
status: valid
status modified: 2019-04-23
accepted date: 2019-04-23
in scheme: BATAELValue

Production of Cement, Lime and Magnesium Oxide - HCl - BAT51-I
type: Concept
notation: CLM-HCl-BAT51-I
definition: 3, Mineral industry: 3,1 Production of cement, lime and magnesium oxide: (b) production of lime in kilns with a production capacity exceeding 50�tonnes per day; Primary techniques (a)-(b) (see table), when using waste; Reducing hydrogen chloride (HCl) emissions to air. The BAT-AEL emission level is < 10 mg/Nm3.
status: valid
status modified: 2019-04-23
accepted date: 2019-04-23
in scheme: BATAELValue

Production of Cement, Lime and Magnesium Oxide - HF - BAT26
type: Concept
notation: CLM-HF-BAT26
definition: 3, Mineral industry: 3,1 Production of cement, lime and magnesium oxide: (a) production of cement clinker in rotary kilns with a production capacity exceeding 500�tonnes per day or in other kilns with a production capacity exceeding 50�tonnes per day; Primary techniques (a)-(b) (see table); Reducing hydrogen fluoride (HF) emissions to air. The BAT-AEL emission level is < 1 mg/Nm3.
status: valid
status modified: 2019-04-23
accepted date: 2019-04-23
in scheme: BATAELValue

Production of Cement, Lime and Magnesium Oxide - HF - BAT51-II
type: Concept
notation: CLM-HF-BAT51-II
definition: 3, Mineral industry: 3,1 Production of cement, lime and magnesium oxide: (b) production of lime in kilns with a production capacity exceeding 50�tonnes per day; Primary techniques (a)-(b) (see table), when using waste; Reducing hydrogen fluoride (HF) emissions to air. The BAT-AEL emission level is < 1 mg/Nm3.
status: valid
status modified: 2019-04-23
accepted date: 2019-04-23
in scheme: BATAELValue

Production of Cement, Lime and Magnesium Oxide - Hg - BAT28-I
type: Concept
notation: CLM-Hg-BAT28-I
definition: 3, Mineral industry: 3,1 Production of cement, lime and magnesium oxide: (a) production of cement clinker in rotary kilns with a production capacity exceeding 500�tonnes per day or in other kilns with a production capacity exceeding 50�tonnes per day; Techniques (a)-(c) (see table); Reducing mercury emissions to air. The BAT-AEL emission level is < 0,05 mg/Nm3.
status: valid
status modified: 2019-04-23
accepted date: 2019-04-23
in scheme: BATAELValue

Production of Cement, Lime and Magnesium Oxide - Hg - BAT53-I
type: Concept
notation: CLM-Hg-BAT53-I
definition: 3, Mineral industry: 3,1 Production of cement, lime and magnesium oxide: (b) production of lime in kilns with a production capacity exceeding 50�tonnes per day; Techniques (a)-(d) (see table), when using wastes; Reducing metals emissions to air. The BAT-AEL emission level is < 0,05 mg/Nm3.
status: valid
status modified: 2019-04-23
accepted date: 2019-04-23
in scheme: BATAELValue

Production of Cement, Lime and Magnesium Oxide - Metals - BAT28-II
type: Concept
notation: CLM-Metals-BAT28-II
definition: 3, Mineral industry: 3,1 Production of cement, lime and magnesium oxide: (a) production of cement clinker in rotary kilns with a production capacity exceeding 500�tonnes per day or in other kilns with a production capacity exceeding 50�tonnes per day; Techniques (a)-(c) (see table); Reducing metals emissions to air. The BAT-AEL emission level is < 0,05 mg/Nm3.
status: valid
status modified: 2019-04-23
accepted date: 2019-04-23
in scheme: BATAELValue

Production of Cement, Lime and Magnesium Oxide - Metals - BAT28-III
type: Concept
notation: CLM-Metals-BAT28-III
definition: 3, Mineral industry: 3,1 Production of cement, lime and magnesium oxide: (a) production of cement clinker in rotary kilns with a production capacity exceeding 500�tonnes per day or in other kilns with a production capacity exceeding 50�tonnes per day; Techniques (a)-(c) (see table); Reducing metals emissions to air. The BAT-AEL emission level is < 0,5 mg/Nm3.
status: valid
status modified: 2019-04-23
accepted date: 2019-04-23
in scheme: BATAELValue

Production of Cement, Lime and Magnesium Oxide - Metals - BAT53-II
type: Concept
notation: CLM-Metals-BAT53-II
definition: 3, Mineral industry: 3,1 Production of cement, lime and magnesium oxide: (b) production of lime in kilns with a production capacity exceeding 50�tonnes per day; Techniques (a)-(d) (see table), when using wastes; Reducing metals emissions to air. The BAT-AEL emission level is < 0,05 mg/Nm3.
status: valid
status modified: 2019-04-23
accepted date: 2019-04-23
in scheme: BATAELValue

Production of Cement, Lime and Magnesium Oxide - Metals - BAT53-III
type: Concept
notation: CLM-Metals-BAT53-III
definition: 3, Mineral industry: 3,1 Production of cement, lime and magnesium oxide: (b) production of lime in kilns with a production capacity exceeding 50�tonnes per day; Techniques (a)-(d) (see table), when using wastes; Reducing metals emissions to air. The BAT-AEL emission level is < 0,5 mg/Nm3.
status: valid
status modified: 2019-04-23
accepted date: 2019-04-23
in scheme: BATAELValue

Production of Cement, Lime and Magnesium Oxide - NH3 - BAT20
type: Concept
notation: CLM-NH3-BAT20
definition: 3, Mineral industry: 3,1 Production of cement, lime and magnesium oxide: (a) production of cement clinker in rotary kilns with a production capacity exceeding 500�tonnes per day or in other kilns with a production capacity exceeding 50�tonnes per day; SNCR; techniques (a)-(c) (see table); Reducing ammonia slip emissions to air. The BAT-AEL emission level is < 30 - 50 mg/Nm3.
status: valid
status modified: 2019-04-23
accepted date: 2019-04-23
in scheme: BATAELValue

Production of Cement, Lime and Magnesium Oxide - NH3 - BAT46
type: Concept
notation: CLM-NH3-BAT46
definition: 3, Mineral industry: 3,1 Production of cement, lime and magnesium oxide: (b) production of lime in kilns with a production capacity exceeding 50�tonnes per day; SNCR; Reducing ammonia slip emissions to air. The BAT-AEL emission level is < 30 mg/Nm3.
status: valid
status modified: 2019-04-23
accepted date: 2019-04-23
in scheme: BATAELValue

Production of Cement, Lime and Magnesium Oxide - NO2 - BAT19-I
type: Concept
notation: CLM-NO2-BAT19-I
definition: 3, Mineral industry: 3,1 Production of cement, lime and magnesium oxide: (a) production of cement clinker in rotary kilns with a production capacity exceeding 500�tonnes per day or in other kilns with a production capacity exceeding 50�tonnes per day; Preheater kilns; Reducing nitrogen oxides (NOx) emissions to air. The BAT-AEL emission level is < 200 - 450 mg/Nm3.
status: valid
status modified: 2019-04-23
accepted date: 2019-04-23
in scheme: BATAELValue

Production of Cement, Lime and Magnesium Oxide - NO2 - BAT19-II
type: Concept
notation: CLM-NO2-BAT19-II
definition: 3, Mineral industry: 3,1 Production of cement, lime and magnesium oxide: (a) production of cement clinker in rotary kilns with a production capacity exceeding 500�tonnes per day or in other kilns with a production capacity exceeding 50�tonnes per day; Lepol and long rotary kilns; Reducing nitrogen oxides (NOx) emissions to air. The BAT-AEL emission level is 400 - 800 mg/Nm3.
status: valid
status modified: 2019-04-23
accepted date: 2019-04-23
in scheme: BATAELValue

Production of Cement, Lime and Magnesium Oxide - NO2 - BAT45-I
type: Concept
notation: CLM-NO2-BAT45-I
definition: 3, Mineral industry: 3,1 Production of cement, lime and magnesium oxide: (b) production of lime in kilns with a production capacity exceeding 50�tonnes per day; PFRK, ASK, MFSK, OSK; Reducing nitrogen oxides (NOx) emissions to air. The BAT-AEL emission level is 100 - 350 mg/Nm3.
status: valid
status modified: 2019-04-23
accepted date: 2019-04-23
in scheme: BATAELValue

Production of Cement, Lime and Magnesium Oxide - NO2 - BAT45-II
type: Concept
notation: CLM-NO2-BAT45-II
definition: 3, Mineral industry: 3,1 Production of cement, lime and magnesium oxide: (b) production of lime in kilns with a production capacity exceeding 50�tonnes per day; LRK, PRK; Reducing nitrogen oxides (NOx) emissions to air. The BAT-AEL emission level is < 200 - 500 mg/Nm3.
status: valid
status modified: 2019-04-23
accepted date: 2019-04-23
in scheme: BATAELValue

Production of Cement, Lime and Magnesium Oxide - NO2 - BAT62
type: Concept
notation: CLM-NO2-BAT62
definition: 3, Mineral industry: 3,1 Production of cement, lime and magnesium oxide: (c) production of magnesium oxide in kilns with a production capacity exceeding 50�tonnes per day; Techniques (a)-(b) (see table); Reducing nitrogen oxides (NOx) emissions to air. The BAT-AEL emission level is < 500 - 1500 mg/Nm3.
status: valid
status modified: 2019-04-23
accepted date: 2019-04-23
in scheme: BATAELValue

Production of Cement, Lime and Magnesium Oxide - PCDD.F - BAT27
type: Concept
notation: CLM-PCDD.F-BAT27
definition: 3, Mineral industry: 3,1 Production of cement, lime and magnesium oxide: (a) production of cement clinker in rotary kilns with a production capacity exceeding 500�tonnes per day or in other kilns with a production capacity exceeding 50�tonnes per day; Techniques (a)-(f) (see table); Reducing PCDD/F emissions to air. The BAT-AEL emission level is < 0,05 - 0,1 ng/Nm3.
status: valid
status modified: 2019-04-23
accepted date: 2019-04-23
in scheme: BATAELValue

Production of Cement, Lime and Magnesium Oxide - PCDD.F - BAT52
type: Concept
notation: CLM-PCDD.F-BAT52
definition: 3, Mineral industry: 3,1 Production of cement, lime and magnesium oxide: (b) production of lime in kilns with a production capacity exceeding 50�tonnes per day; Primary techniques (a)-(c) (see table); Reducing PCDD/F emissions to air. The BAT-AEL emission level is < 0,05 - 0,1 ng/Nm3.
status: valid
status modified: 2019-04-23
accepted date: 2019-04-23
in scheme: BATAELValue

Production of Cement, Lime and Magnesium Oxide - SO2 - BAT21
type: Concept
notation: CLM-SO2-BAT21
definition: 3, Mineral industry: 3,1 Production of cement, lime and magnesium oxide: (a) production of cement clinker in rotary kilns with a production capacity exceeding 500�tonnes per day or in other kilns with a production capacity exceeding 50�tonnes per day; Absorbent addition, wet scrubber; Reducing sulphur oxides (SOx) emissions to air. The BAT-AEL emission level is < 50 - 400 mg/Nm3.
status: valid
status modified: 2019-04-23
accepted date: 2019-04-23
in scheme: BATAELValue

Production of Cement, Lime and Magnesium Oxide - SO2 - BAT47-I
type: Concept
notation: CLM-SO2-BAT47-I
definition: 3, Mineral industry: 3,1 Production of cement, lime and magnesium oxide: (b) production of lime in kilns with a production capacity exceeding 50�tonnes per day; PFRK, ASK, MFSK, OSK, PRK; Reducing SOX emissions to air. The BAT-AEL emission level is < 50 - 200 mg/Nm3.
status: valid
status modified: 2019-04-23
accepted date: 2019-04-23
in scheme: BATAELValue

Production of Cement, Lime and Magnesium Oxide - SO2 - BAT47-II
type: Concept
notation: CLM-SO2-BAT47-II
definition: 3, Mineral industry: 3,1 Production of cement, lime and magnesium oxide: (b) production of lime in kilns with a production capacity exceeding 50�tonnes per day; LRK; Reducing SOX emissions to air. The BAT-AEL emission level is < 50 - 400 mg/Nm3.
status: valid
status modified: 2019-04-23
accepted date: 2019-04-23
in scheme: BATAELValue

Production of Cement, Lime and Magnesium Oxide - SO2 - BAT65
type: Concept
notation: CLM-SO2-BAT65
definition: 3, Mineral industry: 3,1 Production of cement, lime and magnesium oxide: (c) production of magnesium oxide in kilns with a production capacity exceeding 50�tonnes per day; Primary and secondary techniques (a)-(d) (see table); Reducing sulphur oxides (SOx) emissions to air. The BAT-AEL emission level is < 50 - 400 mg/Nm3.
status: valid
status modified: 2019-04-23
accepted date: 2019-04-23
in scheme: BATAELValue

Production of Cement, Lime and Magnesium Oxide - TOC - BAT50-I
type: Concept
notation: CLM-TOC-BAT50-I
definition: 3, Mineral industry: 3,1 Production of cement, lime and magnesium oxide: (b) production of lime in kilns with a production capacity exceeding 50�tonnes per day; LRK, PRK; Reducing total organic carbon (TOC) emissions to air. The BAT-AEL emission level is < 10 mg/Nm3.
status: valid
status modified: 2019-04-23
accepted date: 2019-04-23
in scheme: BATAELValue

Production of Cement, Lime and Magnesium Oxide - TOC - BAT50-II
type: Concept
notation: CLM-TOC-BAT50-II
definition: 3, Mineral industry: 3,1 Production of cement, lime and magnesium oxide: (b) production of lime in kilns with a production capacity exceeding 50�tonnes per day; ASK, MFSK, PFRK; Reducing total organic carbon (TOC) emissions to air. The BAT-AEL emission level is < 30 mg/Nm3.
status: valid
status modified: 2019-04-23
accepted date: 2019-04-23
in scheme: BATAELValue

Common Waste Water and Waste Gas Treatment/ Management Systems in the Chemical Sector - AOX - BAT10-XIII
type: Concept
notation: CWW-AOX-BAT10-XIII
definition: 4, Chemical industry: 4.1, Production of organic chemicals; 4.2, Production of inorganic chemicals; 4.3, Production of phosphorous-, nitrogen- or potassium-based fertilisers; 4.4, Production of plant protection products or of biocides; 4.5, Production of pharmaceutical products including intermediates; 4.6. Production of explosives. Reducing adsorbable organically bound halogens (AOX) to water. The BAT-AEL emission level is 0,2 - 1 mg/l.
status: valid
status modified: 2019-04-23
accepted date: 2019-04-23
in scheme: BATAELValue

Common Waste Water and Waste Gas Treatment/ Management Systems in the Chemical Sector - AOX - BAT10-XIV
type: Concept
notation: CWW-AOX-BAT10-XIV
definition: 6, Other activities: 6,11 Independently operated treatment of waste water not covered by Directive 91/271/EEC and discharged by an installation undertaking activities covered under Section 4. of Annex I Reducing adsorbable organically bound halogens (AOX) to water. The BAT-AEL emission level is 0,2 - 1 mg/l.
status: valid
status modified: 2019-04-23
accepted date: 2019-04-23
in scheme: BATAELValue

Common Waste Water and Waste Gas Treatment/ Management Systems in the Chemical Sector - COD - BAT10-III
type: Concept
notation: CWW-COD-BAT10-III
definition: 4, Chemical industry: 4.1, Production of organic chemicals; 4.2, Production of inorganic chemicals; 4.3, Production of phosphorous-, nitrogen- or potassium-based fertilisers; 4.4, Production of plant protection products or of biocides; 4.5, Production of pharmaceutical products including intermediates; 4.6. Production of explosives. Reducing chemical oxygen demand (COD) to water. The BAT-AEL emission level is < 30 - 100 mg/l.
status: valid
status modified: 2019-04-23
accepted date: 2019-04-23
in scheme: BATAELValue

Common Waste Water and Waste Gas Treatment/ Management Systems in the Chemical Sector - COD - BAT10-IV
type: Concept
notation: CWW-COD-BAT10-IV
definition: 6, Other activities: 6,11 Independently operated treatment of waste water not covered by Directive 91/271/EEC and discharged by an installation undertaking activities covered under Section 4. of Annex I Reducing chemical oxygen demand (COD) to water. The BAT-AEL emission level is < 30 - 100 mg/l.
status: valid
status modified: 2019-04-23
accepted date: 2019-04-23
in scheme: BATAELValue

Common Waste Water and Waste Gas Treatment/ Management Systems in the Chemical Sector - Cr - BAT10-XV
type: Concept
notation: CWW-Cr-BAT10-XV
definition: 4, Chemical industry: 4.1, Production of organic chemicals; 4.2, Production of inorganic chemicals; 4.3, Production of phosphorous-, nitrogen- or potassium-based fertilisers; 4.4, Production of plant protection products or of biocides; 4.5, Production of pharmaceutical products including intermediates; 4.6. Production of explosives. Reducing chromium to water. The BAT-AEL emission level is 5 - 25 ?g/l.
status: valid
status modified: 2019-04-23
accepted date: 2019-04-23
in scheme: BATAELValue

Common Waste Water and Waste Gas Treatment/ Management Systems in the Chemical Sector - Cr - BAT10-XVI
type: Concept
notation: CWW-Cr-BAT10-XVI
definition: 6, Other activities: 6,11 Independently operated treatment of waste water not covered by Directive 91/271/EEC and discharged by an installation undertaking activities covered under Section 4. of Annex I Reducing chromium to water. The BAT-AEL emission level is 5 - 25 ?g/l.
status: valid
status modified: 2019-04-23
accepted date: 2019-04-23
in scheme: BATAELValue

Common Waste Water and Waste Gas Treatment/ Management Systems in the Chemical Sector - Cu - BAT10-XVII
type: Concept
notation: CWW-Cu-BAT10-XVII
definition: 4, Chemical industry: 4.1, Production of organic chemicals; 4.2, Production of inorganic chemicals; 4.3, Production of phosphorous-, nitrogen- or potassium-based fertilisers; 4.4, Production of plant protection products or of biocides; 4.5, Production of pharmaceutical products including intermediates; 4.6. Production of explosives. Reducing copper to water. The BAT-AEL emission level is 5 - 50 ?g/l.
status: valid
status modified: 2019-04-23
accepted date: 2019-04-23
in scheme: BATAELValue

Common Waste Water and Waste Gas Treatment/ Management Systems in the Chemical Sector - Cu - BAT10-XVIII
type: Concept
notation: CWW-Cu-BAT10-XVIII
definition: 6, Other activities: 6,11 Independently operated treatment of waste water not covered by Directive 91/271/EEC and discharged by an installation undertaking activities covered under Section 4. of Annex I Reducing copper to water. The BAT-AEL emission level is 5 - 50 ?g/l.
status: valid
status modified: 2019-04-23
accepted date: 2019-04-23
in scheme: BATAELValue

Common Waste Water and Waste Gas Treatment/ Management Systems in the Chemical Sector - InorgN - BAT10-IX
type: Concept
notation: CWW-InorgN-BAT10-IX
definition: 4, Chemical industry: 4.1, Production of organic chemicals; 4.2, Production of inorganic chemicals; 4.3, Production of phosphorous-, nitrogen- or potassium-based fertilisers; 4.4, Production of plant protection products or of biocides; 4.5, Production of pharmaceutical products including intermediates; 4.6. Production of explosives. Reducing total inorganic nitrogen (N inorg) to water. The BAT-AEL emission level is 5 - 20 mg/l.
status: valid
status modified: 2019-04-23
accepted date: 2019-04-23
in scheme: BATAELValue

Common Waste Water and Waste Gas Treatment/ Management Systems in the Chemical Sector - InorgN - BAT10-X
type: Concept
notation: CWW-InorgN-BAT10-X
definition: 6, Other activities: 6,11 Independently operated treatment of waste water not covered by Directive 91/271/EEC and discharged by an installation undertaking activities covered under Section 4. of Annex I Reducing total inorganic nitrogen (N inorg) to water. The BAT-AEL emission level is 5 - 20 mg/l.
status: valid
status modified: 2019-04-23
accepted date: 2019-04-23
in scheme: BATAELValue

Common Waste Water and Waste Gas Treatment/ Management Systems in the Chemical Sector - Ni - BAT10-XIX
type: Concept
notation: CWW-Ni-BAT10-XIX
definition: 4, Chemical industry: 4.1, Production of organic chemicals; 4.2, Production of inorganic chemicals; 4.3, Production of phosphorous-, nitrogen- or potassium-based fertilisers; 4.4, Production of plant protection products or of biocides; 4.5, Production of pharmaceutical products including intermediates; 4.6. Production of explosives. Reducing nickel to water. The BAT-AEL emission level is 5 - 50 ?g/l.
status: valid
status modified: 2019-04-23
accepted date: 2019-04-23
in scheme: BATAELValue

Common Waste Water and Waste Gas Treatment/ Management Systems in the Chemical Sector - Ni - BAT10-XX
type: Concept
notation: CWW-Ni-BAT10-XX
definition: 6, Other activities: 6,11 Independently operated treatment of waste water not covered by Directive 91/271/EEC and discharged by an installation undertaking activities covered under Section 4. of Annex I Reducing nickel to water. The BAT-AEL emission level is 5 - 50 ?g/l.
status: valid
status modified: 2019-04-23
accepted date: 2019-04-23
in scheme: BATAELValue

Common Waste Water and Waste Gas Treatment/ Management Systems in the Chemical Sector - TN - BAT10-VII
type: Concept
notation: CWW-TN-BAT10-VII
definition: 4, Chemical industry: 4.1, Production of organic chemicals; 4.2, Production of inorganic chemicals; 4.3, Production of phosphorous-, nitrogen- or potassium-based fertilisers; 4.4, Production of plant protection products or of biocides; 4.5, Production of pharmaceutical products including intermediates; 4.6. Production of explosives. Reducing total nitrogen (TN) to water. The BAT-AEL emission level is 5 - 25 mg/l.
status: valid
status modified: 2019-04-23
accepted date: 2019-04-23
in scheme: BATAELValue

Common Waste Water and Waste Gas Treatment/ Management Systems in the Chemical Sector - TN - BAT10-VIII
type: Concept
notation: CWW-TN-BAT10-VIII
definition: 6, Other activities: 6,11 Independently operated treatment of waste water not covered by Directive 91/271/EEC and discharged by an installation undertaking activities covered under Section 4. of Annex I Reducing total nitrogen (TN) to water. The BAT-AEL emission level is 5 - 25 mg/l.
status: valid
status modified: 2019-04-23
accepted date: 2019-04-23
in scheme: BATAELValue

Common Waste Water and Waste Gas Treatment/ Management Systems in the Chemical Sector - TOC - BAT10-I
type: Concept
notation: CWW-TOC-BAT10-I
definition: 4, Chemical industry: 4.1, Production of organic chemicals; 4.2, Production of inorganic chemicals; 4.3, Production of phosphorous-, nitrogen- or potassium-based fertilisers; 4.4, Production of plant protection products or of biocides; 4.5, Production of pharmaceutical products including intermediates; 4.6. Production of explosives. Reducing total organic carbon (TOC) to water. The BAT-AEL emission level is < 10 - 33 mg/l.
status: valid
status modified: 2019-04-23
accepted date: 2019-04-23
in scheme: BATAELValue

Common Waste Water and Waste Gas Treatment/ Management Systems in the Chemical Sector - TOC - BAT10-II
type: Concept
notation: CWW-TOC-BAT10-II
definition: 6, Other activities: 6,11 Independently operated treatment of waste water not covered by Directive 91/271/EEC and discharged by an installation undertaking activities covered under Section 4. of Annex I Reducing total organic carbon (TOC) to water. The BAT-AEL emission level is < 10 - 33 mg/l.
status: valid
status modified: 2019-04-23
accepted date: 2019-04-23
in scheme: BATAELValue

Common Waste Water and Waste Gas Treatment/ Management Systems in the Chemical Sector - TP - BAT10-XI
type: Concept
notation: CWW-TP-BAT10-XI
definition: 4, Chemical industry: 4.1, Production of organic chemicals; 4.2, Production of inorganic chemicals; 4.3, Production of phosphorous-, nitrogen- or potassium-based fertilisers; 4.4, Production of plant protection products or of biocides; 4.5, Production of pharmaceutical products including intermediates; 4.6. Production of explosives. Reducing total phosphorus (TP) to water. The BAT-AEL emission level is 0,5 - 3 mg/l.
status: valid
status modified: 2019-04-23
accepted date: 2019-04-23
in scheme: BATAELValue

Common Waste Water and Waste Gas Treatment/ Management Systems in the Chemical Sector - TP - BAT10-XII
type: Concept
notation: CWW-TP-BAT10-XII
definition: 6, Other activities: 6,11 Independently operated treatment of waste water not covered by Directive 91/271/EEC and discharged by an installation undertaking activities covered under Section 4. of Annex I Reducing total phosphorus (TP) to water. The BAT-AEL emission level is 0,5 - 3 mg/l.
status: valid
status modified: 2019-04-23
accepted date: 2019-04-23
in scheme: BATAELValue

Common Waste Water and Waste Gas Treatment/ Management Systems in the Chemical Sector - TSS - BAT10-V
type: Concept
notation: CWW-TSS-BAT10-V
definition: 4, Chemical industry: 4.1, Production of organic chemicals; 4.2, Production of inorganic chemicals; 4.3, Production of phosphorous-, nitrogen- or potassium-based fertilisers; 4.4, Production of plant protection products or of biocides; 4.5, Production of pharmaceutical products including intermediates; 4.6. Production of explosives. Reducing total suspended solids (TSS) to water. The BAT-AEL emission level is 5 - 35 mg/l.
status: valid
status modified: 2019-04-23
accepted date: 2019-04-23
in scheme: BATAELValue

Common Waste Water and Waste Gas Treatment/ Management Systems in the Chemical Sector - TSS - BAT10-VI
type: Concept
notation: CWW-TSS-BAT10-VI
definition: 6, Other activities: 6,11 Independently operated treatment of waste water not covered by Directive 91/271/EEC and discharged by an installation undertaking activities covered under Section 4. of Annex I Reducing total suspended solids (TSS) to water. The BAT-AEL emission level is 5 - 35 mg/l.
status: valid
status modified: 2019-04-23
accepted date: 2019-04-23
in scheme: BATAELValue

Common Waste Water and Waste Gas Treatment/ Management Systems in the Chemical Sector - Zn - BAT10-XXI
type: Concept
notation: CWW-Zn-BAT10-XXI
definition: 4, Chemical industry: 4.1, Production of organic chemicals; 4.2, Production of inorganic chemicals; 4.3, Production of phosphorous-, nitrogen- or potassium-based fertilisers; 4.4, Production of plant protection products or of biocides; 4.5, Production of pharmaceutical products including intermediates; 4.6. Production of explosives. Reducing zinc to water. The BAT-AEL emission level is 20 - 300 ?g/l.
status: valid
status modified: 2019-04-23
accepted date: 2019-04-23
in scheme: BATAELValue

Common Waste Water and Waste Gas Treatment/ Management Systems in the Chemical Sector - Zn - BAT10-XXII
type: Concept
notation: CWW-Zn-BAT10-XXII
definition: 6, Other activities: 6,11 Independently operated treatment of waste water not covered by Directive 91/271/EEC and discharged by an installation undertaking activities covered under Section 4. of Annex I Reducing zinc to water. The BAT-AEL emission level is 20 - 300 ?g/l.
status: valid
status modified: 2019-04-23
accepted date: 2019-04-23
in scheme: BATAELValue

Food, Drink and Milk Industries - COD - BAT12-I
type: Concept
notation: FDM-COD-BAT12-I
definition: Other activities reducing chemical oxygen demand (COD) to water. The BAT-AEL emission level is 25�100 mg/l.
status: valid
status modified: 2020-05-25
accepted date: 2020-05-25
in scheme: BATAELValue

Food, Drink and Milk Industries - Dust - BAT17-I
type: Concept
notation: FDM-Dust-BAT17-I
definition: Other activities reducing dust emissions to air. The BAT-AEL emission level is < 2�10 mg/Nm3.
status: valid
status modified: 2020-05-25
accepted date: 2020-05-25
in scheme: BATAELValue

Food, Drink and Milk Industries - Dust - BAT17-II
type: Concept
notation: FDM-Dust-BAT17-II
definition: Other activities reducing dust emissions to air. The BAT-AEL emission level is < 2�5 mg/Nm3.
status: valid
status modified: 2020-05-25
accepted date: 2020-05-25
in scheme: BATAELValue

Food, Drink and Milk Industries - Dust - BAT17-III
type: Concept
notation: FDM-Dust-BAT17-III
definition: Other activities reducing dust emissions to air. The BAT-AEL emission level is < 2�20 mg/Nm3.
status: valid
status modified: 2020-05-25
accepted date: 2020-05-25
in scheme: BATAELValue

Food, Drink and Milk Industries - Dust - BAT20-I
type: Concept
notation: FDM-Dust-BAT20-I
definition: Other activities reducing dust emissions to air. The BAT-AEL emission level is < 2�10 mg/Nm3.
status: valid
status modified: 2020-05-25
accepted date: 2020-05-25
in scheme: BATAELValue

Food, Drink and Milk Industries - Dust - BAT20-II
type: Concept
notation: FDM-Dust-BAT20-II
definition: Other activities reducing dust emissions to air. The BAT-AEL emission level is < 2�5 mg/Nm3.
status: valid
status modified: 2020-05-25
accepted date: 2020-05-25
in scheme: BATAELValue

Food, Drink and Milk Industries - Dust - BAT23
type: Concept
notation: FDM-Dust-BAT23
definition: Other activities reducing dust emissions to air. The BAT-AEL emission level is < 2�10 mg/Nm3.
status: valid
status modified: 2020-05-25
accepted date: 2020-05-25
in scheme: BATAELValue

Food, Drink and Milk Industries - Dust - BAT28
type: Concept
notation: FDM-Dust-BAT28
definition: Other activities reducing dust emissions to air. The BAT-AEL emission level is < 2�5 mg/Nm3.
status: valid
status modified: 2020-05-25
accepted date: 2020-05-25
in scheme: BATAELValue

Food, Drink and Milk Industries - Dust - BAT31-I
type: Concept
notation: FDM-Dust-BAT31-I
definition: Other activities reducing dust emissions to air. The BAT-AEL emission level is < 2�10 mg/Nm3.
status: valid
status modified: 2020-05-25
accepted date: 2020-05-25
in scheme: BATAELValue

Food, Drink and Milk Industries - Dust - BAT31-II
type: Concept
notation: FDM-Dust-BAT31-II
definition: Other activities reducing dust emissions to air. The BAT-AEL emission level is < 2�5 mg/Nm3.
status: valid
status modified: 2020-05-25
accepted date: 2020-05-25
in scheme: BATAELValue

Food, Drink and Milk Industries - Dust - BAT34-I
type: Concept
notation: FDM-Dust-BAT34-I
definition: Other activities reducing dust emissions to air. The BAT-AEL emission level is < 2�10 mg/Nm3.
status: valid
status modified: 2020-05-25
accepted date: 2020-05-25
in scheme: BATAELValue

Food, Drink and Milk Industries - Dust - BAT34-II
type: Concept
notation: FDM-Dust-BAT34-II
definition: Other activities reducing dust emissions to air. The BAT-AEL emission level is < 2�5 mg/Nm3.
status: valid
status modified: 2020-05-25
accepted date: 2020-05-25
in scheme: BATAELValue

Food, Drink and Milk Industries - Dust - BAT36
type: Concept
notation: FDM-Dust-BAT36
definition: Other activities reducing dust emissions to air. The BAT-AEL emission level is 5�100 mg/Nm3.
status: valid
status modified: 2020-05-25
accepted date: 2020-05-25
in scheme: BATAELValue

Food, Drink and Milk Industries - SOx - BAT37
type: Concept
notation: FDM-SOx-BAT37
definition: Other activities reducing sulphur oxides (SOx) emissions to air. The BAT-AEL emission level is 30�100 mg/Nm3.
status: valid
status modified: 2020-05-25
accepted date: 2020-05-25
in scheme: BATAELValue

Food, Drink and Milk Industries - TN - BAT12-III
type: Concept
notation: FDM-TN-BAT12-III
definition: Other activities reducing total nitrogen to water. The BAT-AEL emission level is 2�20 mg/l.
status: valid
status modified: 2020-05-25
accepted date: 2020-05-25
in scheme: BATAELValue

Food, Drink and Milk Industries - TP - BAT12-IV
type: Concept
notation: FDM-TP-BAT12-IV
definition: Other activities reducing total phosphorus to water. The BAT-AEL emission level is 0.2�2 mg/l.
status: valid
status modified: 2020-05-25
accepted date: 2020-05-25
in scheme: BATAELValue

Food, Drink and Milk Industries - TSS - BAT12-II
type: Concept
notation: FDM-TSS-BAT12-II
definition: Other activities reducing total suspended solids to water. The BAT-AEL emission level is 4�50 mg/l.
status: valid
status modified: 2020-05-25
accepted date: 2020-05-25
in scheme: BATAELValue

Food, Drink and Milk Industries - TVOC - BAT26
type: Concept
notation: FDM-TVOC-BAT26
definition: Other activities reducing volatile organic compounds (VOC) emissions to air. The BAT-AEL emission level is 15�50 mg/Nm3.
status: valid
status modified: 2020-05-25
accepted date: 2020-05-25
in scheme: BATAELValue

Food, Drink and Milk Industries - TVOC - BAT29
type: Concept
notation: FDM-TVOC-BAT29
definition: Other activities reducing volatile organic compounds (VOC) emissions to air. The BAT-AEL emission level is 3�50 mg/Nm3.
status: valid
status modified: 2020-05-25
accepted date: 2020-05-25
in scheme: BATAELValue

Ferrous metals processing - BAT 31
type: Concept
notation: FMP-COD-BAT31-III
definition: 2, Production and processing of metals: 2.3 Processing of ferrous metals for (a) operation of hot rolling mills with a capacity exceeding 20 tonnes of crude steel per hour; (c) application of protective fused metal coats with an input exceeding 2 tonnes of crude steel per hour; this includes hot dip coating and batch galvanising. 2.6 Surface treatment of ferrous metals using electrolytic or chemical processes where the volume of the treatment vats exceeds 30 m3, when it is carried out in cold rolling, wire drawing or batch galvanising. 6.11 Independently operated treatment of waste water not covered by Directive 91/271/EEC, provided that the main pollutant load originates from the activities covered by these BAT conclusions Reducing chemical oxygen demand (COD) to water. The BAT-AEL emission level is 30�90 mg/l.
status: valid
status modified: 2025-03-12
accepted date: 2025-03-12
in scheme: BATAELValue

Ferrous metals processing - BAT 31
type: Concept
notation: FMP-Cd-BAT31-V
definition: 2, Production and processing of metals: 2.3 Processing of ferrous metals for (a) operation of hot rolling mills with a capacity exceeding 20 tonnes of crude steel per hour; (c) application of protective fused metal coats with an input exceeding 2 tonnes of crude steel per hour; this includes hot dip coating and batch galvanising. 2.6 Surface treatment of ferrous metals using electrolytic or chemical processes where the volume of the treatment vats exceeds 30 m3, when it is carried out in cold rolling, wire drawing or batch galvanising. 6.11 Independently operated treatment of waste water not covered by Directive 91/271/EEC, provided that the main pollutant load originates from the activities covered by these BAT conclusions Reducing cadmium to water. The BAT-AEL emission level is 1�5 ?g/l.
status: valid
status modified: 2025-03-12
accepted date: 2025-03-12
in scheme: BATAELValue

Ferrous metals processing - BAT 31
type: Concept
notation: FMP-Cd-BAT31-XXI
definition: 2, Production and processing of metals: 2.3 Processing of ferrous metals for (a) operation of hot rolling mills with a capacity exceeding 20 tonnes of crude steel per hour; (c) application of protective fused metal coats with an input exceeding 2 tonnes of crude steel per hour; this includes hot dip coating and batch galvanising. 2.6 Surface treatment of ferrous metals using electrolytic or chemical processes where the volume of the treatment vats exceeds 30 m3, when it is carried out in cold rolling, wire drawing or batch galvanising. 6.11 Independently operated treatment of waste water not covered by Directive 91/271/EEC, provided that the main pollutant load originates from the activities covered by these BAT conclusions Reducing cadmium to water. The BAT-AEL emission level is 1�5 ?g/l.
status: valid
status modified: 2025-03-12
accepted date: 2025-03-12
in scheme: BATAELValue

Manufacture of Glass - Amines - BAT63-V
type: Concept
notation: GLS-Amines-BAT63-V
definition: 3, Mineral industry: 3,4 Melting mineral substances including the production of mineral fibres with a melting capacity exceeding 20�tonnes per day; Techniques (i)-(v) (see table); Reducing amines emissions to air. The BAT-AEL emission level is < 3 mg/Nm3.
status: valid
status modified: 2019-04-23
accepted date: 2019-04-23
in scheme: BATAELValue

Manufacture of Glass - Amines - BAT63-XI
type: Concept
notation: GLS-Amines-BAT63-XI
definition: 3, Mineral industry: 3,4 Melting mineral substances including the production of mineral fibres with a melting capacity exceeding 20�tonnes per day; Techniques (i)-(v) (see table); Reducing amines emissions to air. The BAT-AEL emission level is < 2 mg/Nm3.
status: valid
status modified: 2019-04-23
accepted date: 2019-04-23
in scheme: BATAELValue

Manufacture of Glass - Amines - BAT63-XVIII
type: Concept
notation: GLS-Amines-BAT63-XVIII
definition: 3, Mineral industry: 3,4 Melting mineral substances including the production of mineral fibres with a melting capacity exceeding 20�tonnes per day; Techniques (i)-(v) (see table); Reducing amines emissions to air. The BAT-AEL emission level is < 0,01 kg/t.
status: valid
status modified: 2019-04-23
accepted date: 2019-04-23
in scheme: BATAELValue

Manufacture of Glass - As - BAT13-IX
type: Concept
notation: GLS-As-BAT13-IX
definition: 3, Mineral industry: 3,3 Manufacture of glass including glass fibre with a melting capacity exceeding 20 tonnes per day Reducing arsenic to water. The BAT-AEL emission level is < 0,3 mg/l.
status: valid
status modified: 2019-04-23
accepted date: 2019-04-23
in scheme: BATAELValue

Manufacture of Glass - B - BAT13-XVIII
type: Concept
notation: GLS-B-BAT13-XVIII
definition: 3, Mineral industry: 3,3 Manufacture of glass including glass fibre with a melting capacity exceeding 20 tonnes per day Reducing boron to water. The BAT-AEL emission level is < 1 - 3 mg/l.
status: valid
status modified: 2019-04-23
accepted date: 2019-04-23
in scheme: BATAELValue

Manufacture of Glass - Ba - BAT13-X
type: Concept
notation: GLS-Ba-BAT13-X
definition: 3, Mineral industry: 3,3 Manufacture of glass including glass fibre with a melting capacity exceeding 20 tonnes per day Reducing barium to water. The BAT-AEL emission level is < 3 mg/l.
status: valid
status modified: 2019-04-23
accepted date: 2019-04-23
in scheme: BATAELValue

Manufacture of Glass - C - BAT37-IV
type: Concept
notation: GLS-C-BAT37-IV
definition: 3, Mineral industry: 3,3 Manufacture of glass including glass fibre with a melting capacity exceeding 20 tonnes per day; Techniques (i)-(iii) (see table); Reducing total volatile organic compounds emissions to air. The BAT-AEL emission level is < 20 mg/Nm3.
status: valid
status modified: 2019-04-23
accepted date: 2019-04-23
in scheme: BATAELValue

Ferrous metals processing - BAT 31
type: Concept
notation: FMP-Cr-BAT31-VI
definition: 2, Production and processing of metals: 2.3 Processing of ferrous metals for (a) operation of hot rolling mills with a capacity exceeding 20 tonnes of crude steel per hour; (c) application of protective fused metal coats with an input exceeding 2 tonnes of crude steel per hour; this includes hot dip coating and batch galvanising. 2.6 Surface treatment of ferrous metals using electrolytic or chemical processes where the volume of the treatment vats exceeds 30 m3, when it is carried out in cold rolling, wire drawing or batch galvanising. 6.11 Independently operated treatment of waste water not covered by Directive 91/271/EEC, provided that the main pollutant load originates from the activities covered by these BAT conclusions Reducing chromium to water. The BAT-AEL emission level is 0.01�0.1 mg/l.
status: valid
status modified: 2025-03-12
accepted date: 2025-03-12
in scheme: BATAELValue

Ferrous metals processing - BAT 31
type: Concept
notation: FMP-Cr-BAT31-VII
definition: 2, Production and processing of metals: 2.3 Processing of ferrous metals for (a) operation of hot rolling mills with a capacity exceeding 20 tonnes of crude steel per hour; (c) application of protective fused metal coats with an input exceeding 2 tonnes of crude steel per hour; this includes hot dip coating and batch galvanising. 2.6 Surface treatment of ferrous metals using electrolytic or chemical processes where the volume of the treatment vats exceeds 30 m3, when it is carried out in cold rolling, wire drawing or batch galvanising. 6.11 Independently operated treatment of waste water not covered by Directive 91/271/EEC, provided that the main pollutant load originates from the activities covered by these BAT conclusions Reducing chromium to water. The BAT-AEL emission level is 0.01�0.3 mg/l.
status: valid
status modified: 2025-03-12
accepted date: 2025-03-12
in scheme: BATAELValue

Ferrous metals processing - BAT 31
type: Concept
notation: FMP-Cr-BAT31-XXII
definition: 2, Production and processing of metals: 2.3 Processing of ferrous metals for (a) operation of hot rolling mills with a capacity exceeding 20 tonnes of crude steel per hour; (c) application of protective fused metal coats with an input exceeding 2 tonnes of crude steel per hour; this includes hot dip coating and batch galvanising. 2.6 Surface treatment of ferrous metals using electrolytic or chemical processes where the volume of the treatment vats exceeds 30 m3, when it is carried out in cold rolling, wire drawing or batch galvanising. 6.11 Independently operated treatment of waste water not covered by Directive 91/271/EEC, provided that the main pollutant load originates from the activities covered by these BAT conclusions Reducing chromium to water. The BAT-AEL emission level is 0.01�0.1 mg/l.
status: valid
status modified: 2025-03-12
accepted date: 2025-03-12
in scheme: BATAELValue

Ferrous metals processing - BAT 31
type: Concept
notation: FMP-Cr-BAT31-XXIII
definition: 2, Production and processing of metals: 2.3 Processing of ferrous metals for (a) operation of hot rolling mills with a capacity exceeding 20 tonnes of crude steel per hour; (c) application of protective fused metal coats with an input exceeding 2 tonnes of crude steel per hour; this includes hot dip coating and batch galvanising. 2.6 Surface treatment of ferrous metals using electrolytic or chemical processes where the volume of the treatment vats exceeds 30 m3, when it is carried out in cold rolling, wire drawing or batch galvanising. 6.11 Independently operated treatment of waste water not covered by Directive 91/271/EEC, provided that the main pollutant load originates from the activities covered by these BAT conclusions Reducing chromium to water. The BAT-AEL emission level is 0.01�0.3 mg/l.
status: valid
status modified: 2025-03-12
accepted date: 2025-03-12
in scheme: BATAELValue

Ferrous metals processing - BAT 31
type: Concept
notation: FMP-CrVI-BAT31-VIII
definition: 2, Production and processing of metals: 2.3 Processing of ferrous metals for (a) operation of hot rolling mills with a capacity exceeding 20 tonnes of crude steel per hour; (c) application of protective fused metal coats with an input exceeding 2 tonnes of crude steel per hour; this includes hot dip coating and batch galvanising. 2.6 Surface treatment of ferrous metals using electrolytic or chemical processes where the volume of the treatment vats exceeds 30 m3, when it is carried out in cold rolling, wire drawing or batch galvanising. 6.11 Independently operated treatment of waste water not covered by Directive 91/271/EEC, provided that the main pollutant load originates from the activities covered by these BAT conclusions Reducing hexavalent chromium to water. The BAT-AEL emission level is 10�50 ?g/l.
status: valid
status modified: 2025-03-12
accepted date: 2025-03-12
in scheme: BATAELValue

Ferrous metals processing - BAT 31
type: Concept
notation: FMP-CrVI-BAT31-XXIV
definition: 2, Production and processing of metals: 2.3 Processing of ferrous metals for (a) operation of hot rolling mills with a capacity exceeding 20 tonnes of crude steel per hour; (c) application of protective fused metal coats with an input exceeding 2 tonnes of crude steel per hour; this includes hot dip coating and batch galvanising. 2.6 Surface treatment of ferrous metals using electrolytic or chemical processes where the volume of the treatment vats exceeds 30 m3, when it is carried out in cold rolling, wire drawing or batch galvanising. 6.11 Independently operated treatment of waste water not covered by Directive 91/271/EEC, provided that the main pollutant load originates from the activities covered by these BAT conclusions Reducing hexavalent chromium to water. The BAT-AEL emission level is 10�50 ?g/l.
status: valid
status modified: 2025-03-12
accepted date: 2025-03-12
in scheme: BATAELValue

Manufacture of Glass - C - BAT63-VI
type: Concept
notation: GLS-C-BAT63-VI
definition: 3, Mineral industry: 3,4 Melting mineral substances including the production of mineral fibres with a melting capacity exceeding 20�tonnes per day; Techniques (i)-(v) (see table); Reducing total volatile organic compounds emissions to air. The BAT-AEL emission level is 10 - 30 mg/Nm3.
status: valid
status modified: 2019-04-23
accepted date: 2019-04-23
in scheme: BATAELValue

Manufacture of Glass - C - BAT63-XII
type: Concept
notation: GLS-C-BAT63-XII
definition: 3, Mineral industry: 3,4 Melting mineral substances including the production of mineral fibres with a melting capacity exceeding 20�tonnes per day; Techniques (i)-(v) (see table); Reducing total volatile organic compounds emissions to air. The BAT-AEL emission level is < 10 mg/Nm3.
status: valid
status modified: 2019-04-23
accepted date: 2019-04-23
in scheme: BATAELValue

Manufacture of Glass - C - BAT63-XIX
type: Concept
notation: GLS-C-BAT63-XIX
definition: 3, Mineral industry: 3,4 Melting mineral substances including the production of mineral fibres with a melting capacity exceeding 20�tonnes per day; Techniques (i)-(v) (see table); Reducing total volatile organic compounds emissions to air. The BAT-AEL emission level is < 0,065 kg/t.
status: valid
status modified: 2019-04-23
accepted date: 2019-04-23
in scheme: BATAELValue

Manufacture of Glass - C - BAT70
type: Concept
notation: GLS-C-BAT70
definition: 3, Mineral industry: 3,4 Melting mineral substances including the production of mineral fibres with a melting capacity exceeding 20�tonnes per day; Techniques (i)-(iii) (see table); Reducing volatile organic compounds emissions to air. The BAT-AEL emission level is 10 - 20 mg/Nm3.
status: valid
status modified: 2019-04-23
accepted date: 2019-04-23
in scheme: BATAELValue

Manufacture of Glass - C6H6O - BAT13-XIX
type: Concept
notation: GLS-C6H6O-BAT13-XIX
definition: 3, Mineral industry: 3,3 Manufacture of glass including glass fibre with a melting capacity exceeding 20 tonnes per day Reducing phenol to water. The BAT-AEL emission level is < 1 mg/l.
status: valid
status modified: 2019-04-23
accepted date: 2019-04-23
in scheme: BATAELValue

Manufacture of Glass - C6H6O - BAT63-II
type: Concept
notation: GLS-C6H6O-BAT63-II
definition: 3, Mineral industry: 3,4 Melting mineral substances including the production of mineral fibres with a melting capacity exceeding 20�tonnes per day; Techniques (i)-(v) (see table); Reducing phenol emissions to air. The BAT-AEL emission level is < 5 - 10 mg/Nm3.
status: valid
status modified: 2019-04-23
accepted date: 2019-04-23
in scheme: BATAELValue

Ferrous metals processing - BAT 20
type: Concept
notation: FMP-Dust-BAT20
definition: 2, Production and processing of metals: 2.3 Processing of ferrous metals for (a) operation of hot rolling mills with a capacity exceeding 20 tonnes of crude steel per hour; (c) application of protective fused metal coats with an input exceeding 2 tonnes of crude steel per hour; this includes hot dip coating and batch galvanising. 2.6 Surface treatment of ferrous metals using electrolytic or chemical processes where the volume of the treatment vats exceeds 30 m3, when it is carried out in cold rolling, wire drawing or batch galvanising. 6.11 Independently operated treatment of waste water not covered by Directive 91/271/EEC, provided that the main pollutant load originates from the activities covered by these BAT conclusions; Reducing dust emissions to air. The BAT-AEL emission level is < 2�10 mg/Nm3.
status: valid
status modified: 2025-03-12
accepted date: 2025-03-12
in scheme: BATAELValue

Ferrous metals processing - BAT 26
type: Concept
notation: FMP-Dust-BAT26
definition: 2, Production and processing of metals: 2.3 Processing of ferrous metals for (a) operation of hot rolling mills with a capacity exceeding 20 tonnes of crude steel per hour; (c) application of protective fused metal coats with an input exceeding 2 tonnes of crude steel per hour; this includes hot dip coating and batch galvanising. 2.6 Surface treatment of ferrous metals using electrolytic or chemical processes where the volume of the treatment vats exceeds 30 m3, when it is carried out in cold rolling, wire drawing or batch galvanising. 6.11 Independently operated treatment of waste water not covered by Directive 91/271/EEC, provided that the main pollutant load originates from the activities covered by these BAT conclusions; Reducing dust emissions to air. The BAT-AEL emission level is < 2�5 mg/Nm3.
status: valid
status modified: 2025-03-12
accepted date: 2025-03-12
in scheme: BATAELValue

Ferrous metals processing - BAT 29
type: Concept
notation: FMP-Dust-BAT29-I
definition: 2, Production and processing of metals: 2.3 Processing of ferrous metals for (a) operation of hot rolling mills with a capacity exceeding 20 tonnes of crude steel per hour; (c) application of protective fused metal coats with an input exceeding 2 tonnes of crude steel per hour; this includes hot dip coating and batch galvanising. 2.6 Surface treatment of ferrous metals using electrolytic or chemical processes where the volume of the treatment vats exceeds 30 m3, when it is carried out in cold rolling, wire drawing or batch galvanising. 6.11 Independently operated treatment of waste water not covered by Directive 91/271/EEC, provided that the main pollutant load originates from the activities covered by these BAT conclusions; Reducing dust emissions to air. The BAT-AEL emission level is < 2�15 mg/Nm3.
status: valid
status modified: 2025-03-12
accepted date: 2025-03-12
in scheme: BATAELValue

Ferrous metals processing - BAT 29
type: Concept
notation: FMP-Dust-BAT29-VII
definition: 2, Production and processing of metals: 2.3 Processing of ferrous metals for (a) operation of hot rolling mills with a capacity exceeding 20 tonnes of crude steel per hour; (c) application of protective fused metal coats with an input exceeding 2 tonnes of crude steel per hour; this includes hot dip coating and batch galvanising. 2.6 Surface treatment of ferrous metals using electrolytic or chemical processes where the volume of the treatment vats exceeds 30 m3, when it is carried out in cold rolling, wire drawing or batch galvanising. 6.11 Independently operated treatment of waste water not covered by Directive 91/271/EEC, provided that the main pollutant load originates from the activities covered by these BAT conclusions; Reducing dust emissions to air. The BAT-AEL emission level is < 2�10 mg/Nm3.
status: valid
status modified: 2025-03-12
accepted date: 2025-03-12
in scheme: BATAELValue

Ferrous metals processing - BAT 42
type: Concept
notation: FMP-Dust-BAT42-I
definition: 2, Production and processing of metals: 2.3 Processing of ferrous metals for (a) operation of hot rolling mills with a capacity exceeding 20 tonnes of crude steel per hour; (c) application of protective fused metal coats with an input exceeding 2 tonnes of crude steel per hour; this includes hot dip coating and batch galvanising. 2.6 Surface treatment of ferrous metals using electrolytic or chemical processes where the volume of the treatment vats exceeds 30 m3, when it is carried out in cold rolling, wire drawing or batch galvanising. 6.11 Independently operated treatment of waste water not covered by Directive 91/271/EEC, provided that the main pollutant load originates from the activities covered by these BAT conclusions; Reducing dust emissions to air. The BAT-AEL emission level is < 2�5 mg/Nm3.
status: valid
status modified: 2025-03-12
accepted date: 2025-03-12
in scheme: BATAELValue

Ferrous metals processing - BAT 42
type: Concept
notation: FMP-Dust-BAT42-II
definition: 2, Production and processing of metals: 2.3 Processing of ferrous metals for (a) operation of hot rolling mills with a capacity exceeding 20 tonnes of crude steel per hour; (c) application of protective fused metal coats with an input exceeding 2 tonnes of crude steel per hour; this includes hot dip coating and batch galvanising. 2.6 Surface treatment of ferrous metals using electrolytic or chemical processes where the volume of the treatment vats exceeds 30 m3, when it is carried out in cold rolling, wire drawing or batch galvanising. 6.11 Independently operated treatment of waste water not covered by Directive 91/271/EEC, provided that the main pollutant load originates from the activities covered by these BAT conclusions; Reducing dust emissions to air. The BAT-AEL emission level is < 2�7 mg/Nm3.
status: valid
status modified: 2025-03-12
accepted date: 2025-03-12
in scheme: BATAELValue

Manufacture of Glass - C6H6O - BAT63-VIII
type: Concept
notation: GLS-C6H6O-BAT63-VIII
definition: 3, Mineral industry: 3,4 Melting mineral substances including the production of mineral fibres with a melting capacity exceeding 20�tonnes per day; Techniques (i)-(v) (see table); Reducing phenol emissions to air. The BAT-AEL emission level is < 2 - 5 mg/Nm3.
status: valid
status modified: 2019-04-23
accepted date: 2019-04-23
in scheme: BATAELValue

Manufacture of Glass - C6H6O - BAT63-XV
type: Concept
notation: GLS-C6H6O-BAT63-XV
definition: 3, Mineral industry: 3,4 Melting mineral substances including the production of mineral fibres with a melting capacity exceeding 20�tonnes per day; Techniques (i)-(v) (see table); Reducing phenol emissions to air. The BAT-AEL emission level is < 0,03 kg/t.
status: valid
status modified: 2019-04-23
accepted date: 2019-04-23
in scheme: BATAELValue

Manufacture of Glass - CH2O - BAT37-II
type: Concept
notation: GLS-CH2O-BAT37-II
definition: 3, Mineral industry: 3,3 Manufacture of glass including glass fibre with a melting capacity exceeding 20 tonnes per day; Techniques (i)-(iii) (see table); Reducing formaldehyde emissions to air. The BAT-AEL emission level is < 10 mg/Nm3.
status: valid
status modified: 2019-04-23
accepted date: 2019-04-23
in scheme: BATAELValue

Manufacture of Glass - CH2O - BAT63-III
type: Concept
notation: GLS-CH2O-BAT63-III
definition: 3, Mineral industry: 3,4 Melting mineral substances including the production of mineral fibres with a melting capacity exceeding 20�tonnes per day; Techniques (i)-(v) (see table); Reducing formaldehyde emissions to air. The BAT-AEL emission level is < 2 - 5 mg/Nm3.
status: valid
status modified: 2019-04-23
accepted date: 2019-04-23
in scheme: BATAELValue

Manufacture of Glass - CH2O - BAT63-IX
type: Concept
notation: GLS-CH2O-BAT63-IX
definition: 3, Mineral industry: 3,4 Melting mineral substances including the production of mineral fibres with a melting capacity exceeding 20�tonnes per day; Techniques (i)-(v) (see table); Reducing formaldehyde emissions to air. The BAT-AEL emission level is < 2 - 5 mg/Nm3.
status: valid
status modified: 2019-04-23
accepted date: 2019-04-23
in scheme: BATAELValue

Manufacture of Glass - CH2O - BAT63-XVI
type: Concept
notation: GLS-CH2O-BAT63-XVI
definition: 3, Mineral industry: 3,4 Melting mineral substances including the production of mineral fibres with a melting capacity exceeding 20�tonnes per day; Techniques (i)-(v) (see table); Reducing formaldehyde emissions to air. The BAT-AEL emission level is < 0,03 kg/t.
status: valid
status modified: 2019-04-23
accepted date: 2019-04-23
in scheme: BATAELValue

Ferrous metals processing - BAT 46
type: Concept
notation: FMP-Dust-BAT46-I
definition: 2, Production and processing of metals: 2.3 Processing of ferrous metals for (a) operation of hot rolling mills with a capacity exceeding 20 tonnes of crude steel per hour; (c) application of protective fused metal coats with an input exceeding 2 tonnes of crude steel per hour; this includes hot dip coating and batch galvanising. 2.6 Surface treatment of ferrous metals using electrolytic or chemical processes where the volume of the treatment vats exceeds 30 m3, when it is carried out in cold rolling, wire drawing or batch galvanising. 6.11 Independently operated treatment of waste water not covered by Directive 91/271/EEC, provided that the main pollutant load originates from the activities covered by these BAT conclusions; Reducing dust emissions to air. The BAT-AEL emission level is < 2�5 mg/Nm3.
status: valid
status modified: 2025-03-12
accepted date: 2025-03-12
in scheme: BATAELValue

Ferrous metals processing - BAT 51
type: Concept
notation: FMP-Dust-BAT51-I
definition: 2, Production and processing of metals: 2.3 Processing of ferrous metals for (a) operation of hot rolling mills with a capacity exceeding 20 tonnes of crude steel per hour; (c) application of protective fused metal coats with an input exceeding 2 tonnes of crude steel per hour; this includes hot dip coating and batch galvanising. 2.6 Surface treatment of ferrous metals using electrolytic or chemical processes where the volume of the treatment vats exceeds 30 m3, when it is carried out in cold rolling, wire drawing or batch galvanising. 6.11 Independently operated treatment of waste water not covered by Directive 91/271/EEC, provided that the main pollutant load originates from the activities covered by these BAT conclusions; Reducing dust emissions to air. The BAT-AEL emission level is < 2�5 mg/Nm3.
status: valid
status modified: 2025-03-12
accepted date: 2025-03-12
in scheme: BATAELValue

Ferrous metals processing - BAT 52
type: Concept
notation: FMP-Dust-BAT52
definition: 2, Production and processing of metals: 2.3 Processing of ferrous metals for (a) operation of hot rolling mills with a capacity exceeding 20 tonnes of crude steel per hour; (c) application of protective fused metal coats with an input exceeding 2 tonnes of crude steel per hour; this includes hot dip coating and batch galvanising. 2.6 Surface treatment of ferrous metals using electrolytic or chemical processes where the volume of the treatment vats exceeds 30 m3, when it is carried out in cold rolling, wire drawing or batch galvanising. 6.11 Independently operated treatment of waste water not covered by Directive 91/271/EEC, provided that the main pollutant load originates from the activities covered by these BAT conclusions; Reducing dust emissions to air. The BAT-AEL emission level is < 2�5 mg/Nm3.
status: valid
status modified: 2025-03-12
accepted date: 2025-03-12
in scheme: BATAELValue

Ferrous metals processing - BAT 31
type: Concept
notation: FMP-F-BAT31-XIX
definition: 2, Production and processing of metals: 2.3 Processing of ferrous metals for (a) operation of hot rolling mills with a capacity exceeding 20 tonnes of crude steel per hour; (c) application of protective fused metal coats with an input exceeding 2 tonnes of crude steel per hour; this includes hot dip coating and batch galvanising. 2.6 Surface treatment of ferrous metals using electrolytic or chemical processes where the volume of the treatment vats exceeds 30 m3, when it is carried out in cold rolling, wire drawing or batch galvanising. 6.11 Independently operated treatment of waste water not covered by Directive 91/271/EEC, provided that the main pollutant load originates from the activities covered by these BAT conclusions Reducing fluorides to water. The BAT-AEL emission level is 1�15 mg/l.
status: valid
status modified: 2025-03-12
accepted date: 2025-03-12
in scheme: BATAELValue

Ferrous metals processing - BAT 31
type: Concept
notation: FMP-F-BAT31-XXXIV
definition: 2, Production and processing of metals: 2.3 Processing of ferrous metals for (a) operation of hot rolling mills with a capacity exceeding 20 tonnes of crude steel per hour; (c) application of protective fused metal coats with an input exceeding 2 tonnes of crude steel per hour; this includes hot dip coating and batch galvanising. 2.6 Surface treatment of ferrous metals using electrolytic or chemical processes where the volume of the treatment vats exceeds 30 m3, when it is carried out in cold rolling, wire drawing or batch galvanising. 6.11 Independently operated treatment of waste water not covered by Directive 91/271/EEC, provided that the main pollutant load originates from the activities covered by these BAT conclusions Reducing fluorides to water. The BAT-AEL emission level is 1�15 mg/l.
status: valid
status modified: 2025-03-12
accepted date: 2025-03-12
in scheme: BATAELValue

Ferrous metals processing - BAT 31
type: Concept
notation: FMP-Fe-BAT31-IX
definition: 2, Production and processing of metals: 2.3 Processing of ferrous metals for (a) operation of hot rolling mills with a capacity exceeding 20 tonnes of crude steel per hour; (c) application of protective fused metal coats with an input exceeding 2 tonnes of crude steel per hour; this includes hot dip coating and batch galvanising. 2.6 Surface treatment of ferrous metals using electrolytic or chemical processes where the volume of the treatment vats exceeds 30 m3, when it is carried out in cold rolling, wire drawing or batch galvanising. 6.11 Independently operated treatment of waste water not covered by Directive 91/271/EEC, provided that the main pollutant load originates from the activities covered by these BAT conclusions Reducing iron to water. The BAT-AEL emission level is 1�5 mg/l.
status: valid
status modified: 2025-03-12
accepted date: 2025-03-12
in scheme: BATAELValue

Manufacture of Glass - CO - BAT9
type: Concept
notation: GLS-CO-BAT9
definition: 3, Mineral industry: 3,3 Manufacture of glass including glass fibre with a melting capacity exceeding 20 tonnes per day; Techniques (see table); Reducing carbon monoxide (CO) emissions to air. The BAT-AEL emission level is < 100 mg/Nm3.
status: valid
status modified: 2019-04-23
accepted date: 2019-04-23
in scheme: BATAELValue

Manufacture of Glass - COD - BAT13-III
type: Concept
notation: GLS-COD-BAT13-III
definition: 3, Mineral industry: 3,3 Manufacture of glass including glass fibre with a melting capacity exceeding 20 tonnes per day Reducing chemical oxygen demand (COD) to water. The BAT-AEL emission level is < 5 - 130 mg/l.
status: valid
status modified: 2019-04-23
accepted date: 2019-04-23
in scheme: BATAELValue

Manufacture of Glass - Cd - BAT13-XIV
type: Concept
notation: GLS-Cd-BAT13-XIV
definition: 3, Mineral industry: 3,3 Manufacture of glass including glass fibre with a melting capacity exceeding 20 tonnes per day Reducing cadmium to water. The BAT-AEL emission level is < 0,05 mg/l.
status: valid
status modified: 2019-04-23
accepted date: 2019-04-23
in scheme: BATAELValue

Manufacture of Glass - Cr - BAT13-XIII
type: Concept
notation: GLS-Cr-BAT13-XIII
definition: 3, Mineral industry: 3,3 Manufacture of glass including glass fibre with a melting capacity exceeding 20 tonnes per day Reducing chromium to water. The BAT-AEL emission level is < 0,3 mg/l.
status: valid
status modified: 2019-04-23
accepted date: 2019-04-23
in scheme: BATAELValue

Manufacture of Glass - Cu - BAT13-XII
type: Concept
notation: GLS-Cu-BAT13-XII
definition: 3, Mineral industry: 3,3 Manufacture of glass including glass fibre with a melting capacity exceeding 20 tonnes per day Reducing copper to water. The BAT-AEL emission level is < 0,3 mg/l.
status: valid
status modified: 2019-04-23
accepted date: 2019-04-23
in scheme: BATAELValue

Manufacture of Glass - Dust - BAT16-I
type: Concept
notation: GLS-Dust-BAT16-I
definition: 3, Mineral industry: 3,3 Manufacture of glass including glass fibre with a melting capacity exceeding 20 tonnes per day; Flue-gas cleaning system such as electrostatic precipitator or bag filter (see table); Reducing dust emissions to air. The BAT-AEL emission level is < 10 - 20 mg/Nm3.
status: valid
status modified: 2019-04-23
accepted date: 2019-04-23
in scheme: BATAELValue

Ferrous metals processing - BAT 31
type: Concept
notation: FMP-Fe-BAT31-XXV
definition: 2, Production and processing of metals: 2.3 Processing of ferrous metals for (a) operation of hot rolling mills with a capacity exceeding 20 tonnes of crude steel per hour; (c) application of protective fused metal coats with an input exceeding 2 tonnes of crude steel per hour; this includes hot dip coating and batch galvanising. 2.6 Surface treatment of ferrous metals using electrolytic or chemical processes where the volume of the treatment vats exceeds 30 m3, when it is carried out in cold rolling, wire drawing or batch galvanising. 6.11 Independently operated treatment of waste water not covered by Directive 91/271/EEC, provided that the main pollutant load originates from the activities covered by these BAT conclusions Reducing iron to water. The BAT-AEL emission level is 1�5 mg/l.
status: valid
status modified: 2025-03-12
accepted date: 2025-03-12
in scheme: BATAELValue

Ferrous metals processing - BAT 24
type: Concept
notation: FMP-HCl-BAT24-I
definition: 2, Production and processing of metals: 2.3 Processing of ferrous metals for (a) operation of hot rolling mills with a capacity exceeding 20 tonnes of crude steel per hour; (c) application of protective fused metal coats with an input exceeding 2 tonnes of crude steel per hour; this includes hot dip coating and batch galvanising. 2.6 Surface treatment of ferrous metals using electrolytic or chemical processes where the volume of the treatment vats exceeds 30 m3, when it is carried out in cold rolling, wire drawing or batch galvanising. 6.11 Independently operated treatment of waste water not covered by Directive 91/271/EEC, provided that the main pollutant load originates from the activities covered by these BAT conclusions; Reducing hydrogen chloride emissions to air. The BAT-AEL emission level is < 2�10 mg/Nm3.
status: valid
status modified: 2025-03-12
accepted date: 2025-03-12
in scheme: BATAELValue

Ferrous metals processing - BAT 24
type: Concept
notation: FMP-HCl-BAT24-IV
definition: 2, Production and processing of metals: 2.3 Processing of ferrous metals for (a) operation of hot rolling mills with a capacity exceeding 20 tonnes of crude steel per hour; (c) application of protective fused metal coats with an input exceeding 2 tonnes of crude steel per hour; this includes hot dip coating and batch galvanising. 2.6 Surface treatment of ferrous metals using electrolytic or chemical processes where the volume of the treatment vats exceeds 30 m3, when it is carried out in cold rolling, wire drawing or batch galvanising. 6.11 Independently operated treatment of waste water not covered by Directive 91/271/EEC, provided that the main pollutant load originates from the activities covered by these BAT conclusions; Reducing hydrogen chloride emissions to air. The BAT-AEL emission level is < 2�10 mg/Nm3.
status: valid
status modified: 2025-03-12
accepted date: 2025-03-12
in scheme: BATAELValue

Ferrous metals processing - BAT 29
type: Concept
notation: FMP-HCl-BAT29-II
definition: 2, Production and processing of metals: 2.3 Processing of ferrous metals for (a) operation of hot rolling mills with a capacity exceeding 20 tonnes of crude steel per hour; (c) application of protective fused metal coats with an input exceeding 2 tonnes of crude steel per hour; this includes hot dip coating and batch galvanising. 2.6 Surface treatment of ferrous metals using electrolytic or chemical processes where the volume of the treatment vats exceeds 30 m3, when it is carried out in cold rolling, wire drawing or batch galvanising. 6.11 Independently operated treatment of waste water not covered by Directive 91/271/EEC, provided that the main pollutant load originates from the activities covered by these BAT conclusions; Reducing hydrogen chloride emissions to air. The BAT-AEL emission level is < 2�15 mg/Nm3.
status: valid
status modified: 2025-03-12
accepted date: 2025-03-12
in scheme: BATAELValue

Ferrous metals processing - BAT 62
type: Concept
notation: FMP-HCl-BAT62
definition: 2, Production and processing of metals: 2.3 Processing of ferrous metals for (a) operation of hot rolling mills with a capacity exceeding 20 tonnes of crude steel per hour; (c) application of protective fused metal coats with an input exceeding 2 tonnes of crude steel per hour; this includes hot dip coating and batch galvanising. 2.6 Surface treatment of ferrous metals using electrolytic or chemical processes where the volume of the treatment vats exceeds 30 m3, when it is carried out in cold rolling, wire drawing or batch galvanising. 6.11 Independently operated treatment of waste water not covered by Directive 91/271/EEC, provided that the main pollutant load originates from the activities covered by these BAT conclusions; Reducing hydrogen chloride emissions to air. The BAT-AEL emission level is < 2 � 6 mg/Nm3.
status: valid
status modified: 2025-03-12
accepted date: 2025-03-12
in scheme: BATAELValue

Ferrous metals processing - BAT 24
type: Concept
notation: FMP-HF-BAT24-II
definition: 2, Production and processing of metals: 2.3 Processing of ferrous metals for (a) operation of hot rolling mills with a capacity exceeding 20 tonnes of crude steel per hour; (c) application of protective fused metal coats with an input exceeding 2 tonnes of crude steel per hour; this includes hot dip coating and batch galvanising. 2.6 Surface treatment of ferrous metals using electrolytic or chemical processes where the volume of the treatment vats exceeds 30 m3, when it is carried out in cold rolling, wire drawing or batch galvanising. 6.11 Independently operated treatment of waste water not covered by Directive 91/271/EEC, provided that the main pollutant load originates from the activities covered by these BAT conclusions; Reducing hydrogen fluoride emissions to air. The BAT-AEL emission level is < 1 mg/Nm3.
status: valid
status modified: 2025-03-12
accepted date: 2025-03-12
in scheme: BATAELValue

Manufacture of Glass - Dust - BAT16-II
type: Concept
notation: GLS-Dust-BAT16-II
definition: 3, Mineral industry: 3,3 Manufacture of glass including glass fibre with a melting capacity exceeding 20 tonnes per day; Flue-gas cleaning system such as electrostatic precipitator or bag filter (see table); Reducing dust emissions to air. The BAT-AEL emission level is < 0,015 - 0,06 kg/t.
status: valid
status modified: 2019-04-23
accepted date: 2019-04-23
in scheme: BATAELValue

Manufacture of Glass - Dust - BAT22-I
type: Concept
notation: GLS-Dust-BAT22-I
definition: 3, Mineral industry: 3,3 Manufacture of glass including glass fibre with a melting capacity exceeding 20 tonnes per day; Techniques (i)-(iii) (see table); Reducing dust emissions to air. The BAT-AEL emission level is < 10 mg/Nm3.
status: valid
status modified: 2019-04-23
accepted date: 2019-04-23
in scheme: BATAELValue

Manufacture of Glass - Dust - BAT24-I
type: Concept
notation: GLS-Dust-BAT24-I
definition: 3, Mineral industry: 3,3 Manufacture of glass including glass fibre with a melting capacity exceeding 20 tonnes per day; Electrostatic precipitator or bag filter system; Reducing dust emissions to air. The BAT-AEL emission level is < 10 - 20 mg/Nm3.
status: valid
status modified: 2019-04-23
accepted date: 2019-04-23
in scheme: BATAELValue

Manufacture of Glass - Dust - BAT24-II
type: Concept
notation: GLS-Dust-BAT24-II
definition: 3, Mineral industry: 3,3 Manufacture of glass including glass fibre with a melting capacity exceeding 20 tonnes per day; Electrostatic precipitator or bag filter system; Reducing dust emissions to air. The BAT-AEL emission level is < 0,025 - 0,05 kg/t.
status: valid
status modified: 2019-04-23
accepted date: 2019-04-23
in scheme: BATAELValue

Manufacture of Glass - Dust - BAT31-I
type: Concept
notation: GLS-Dust-BAT31-I
definition: 3, Mineral industry: 3,3 Manufacture of glass including glass fibre with a melting capacity exceeding 20 tonnes per day; Techniques (i)-(iv) (see table); Reducing dust emissions to air. The BAT-AEL emission level is < 15 - 20 mg/Nm3.
status: valid
status modified: 2019-04-23
accepted date: 2019-04-23
in scheme: BATAELValue

Manufacture of Glass - Dust - BAT32-I
type: Concept
notation: GLS-Dust-BAT32-I
definition: 3, Mineral industry: 3,3 Manufacture of glass including glass fibre with a melting capacity exceeding 20 tonnes per day; Techniques (i)-(iii) (see table); Reducing dust emissions to air. The BAT-AEL emission level is < 10 - 20 mg/Nm3.
status: valid
status modified: 2019-04-23
accepted date: 2019-04-23
in scheme: BATAELValue

Ferrous metals processing - BAT 29
type: Concept
notation: FMP-HF-BAT29-V
definition: 2, Production and processing of metals: 2.3 Processing of ferrous metals for (a) operation of hot rolling mills with a capacity exceeding 20 tonnes of crude steel per hour; (c) application of protective fused metal coats with an input exceeding 2 tonnes of crude steel per hour; this includes hot dip coating and batch galvanising. 2.6 Surface treatment of ferrous metals using electrolytic or chemical processes where the volume of the treatment vats exceeds 30 m3, when it is carried out in cold rolling, wire drawing or batch galvanising. 6.11 Independently operated treatment of waste water not covered by Directive 91/271/EEC, provided that the main pollutant load originates from the activities covered by these BAT conclusions; Reducing hydrogen fluoride emissions to air. The BAT-AEL emission level is < 1 mg/Nm3.
status: valid
status modified: 2025-03-12
accepted date: 2025-03-12
in scheme: BATAELValue

Ferrous metals processing - BAT 31
type: Concept
notation: FMP-HOI-BAT31-IV
definition: 2, Production and processing of metals: 2.3 Processing of ferrous metals for (a) operation of hot rolling mills with a capacity exceeding 20 tonnes of crude steel per hour; (c) application of protective fused metal coats with an input exceeding 2 tonnes of crude steel per hour; this includes hot dip coating and batch galvanising. 2.6 Surface treatment of ferrous metals using electrolytic or chemical processes where the volume of the treatment vats exceeds 30 m3, when it is carried out in cold rolling, wire drawing or batch galvanising. 6.11 Independently operated treatment of waste water not covered by Directive 91/271/EEC, provided that the main pollutant load originates from the activities covered by these BAT conclusions Reducing hydrocarbon oil index to water. The BAT-AEL emission level is 0.5�4 mg/l.
status: valid
status modified: 2025-03-12
accepted date: 2025-03-12
in scheme: BATAELValue

Ferrous metals processing - BAT 31
type: Concept
notation: FMP-HOI-BAT31-XX
definition: 2, Production and processing of metals: 2.3 Processing of ferrous metals for (a) operation of hot rolling mills with a capacity exceeding 20 tonnes of crude steel per hour; (c) application of protective fused metal coats with an input exceeding 2 tonnes of crude steel per hour; this includes hot dip coating and batch galvanising. 2.6 Surface treatment of ferrous metals using electrolytic or chemical processes where the volume of the treatment vats exceeds 30 m3, when it is carried out in cold rolling, wire drawing or batch galvanising. 6.11 Independently operated treatment of waste water not covered by Directive 91/271/EEC, provided that the main pollutant load originates from the activities covered by these BAT conclusions Reducing hydrocarbon oil index to water. The BAT-AEL emission level is 0.5�4 mg/l.
status: valid
status modified: 2025-03-12
accepted date: 2025-03-12
in scheme: BATAELValue

Ferrous metals processing - BAT 31
type: Concept
notation: FMP-Hg-BAT31-X
definition: 2, Production and processing of metals: 2.3 Processing of ferrous metals for (a) operation of hot rolling mills with a capacity exceeding 20 tonnes of crude steel per hour; (c) application of protective fused metal coats with an input exceeding 2 tonnes of crude steel per hour; this includes hot dip coating and batch galvanising. 2.6 Surface treatment of ferrous metals using electrolytic or chemical processes where the volume of the treatment vats exceeds 30 m3, when it is carried out in cold rolling, wire drawing or batch galvanising. 6.11 Independently operated treatment of waste water not covered by Directive 91/271/EEC, provided that the main pollutant load originates from the activities covered by these BAT conclusions Reducing mercury to water. The BAT-AEL emission level is 0.1�0.5 ?g/l.
status: valid
status modified: 2025-03-12
accepted date: 2025-03-12
in scheme: BATAELValue

Ferrous metals processing - BAT 31
type: Concept
notation: FMP-Hg-BAT31-XXVI
definition: 2, Production and processing of metals: 2.3 Processing of ferrous metals for (a) operation of hot rolling mills with a capacity exceeding 20 tonnes of crude steel per hour; (c) application of protective fused metal coats with an input exceeding 2 tonnes of crude steel per hour; this includes hot dip coating and batch galvanising. 2.6 Surface treatment of ferrous metals using electrolytic or chemical processes where the volume of the treatment vats exceeds 30 m3, when it is carried out in cold rolling, wire drawing or batch galvanising. 6.11 Independently operated treatment of waste water not covered by Directive 91/271/EEC, provided that the main pollutant load originates from the activities covered by these BAT conclusions Reducing mercury to water. The BAT-AEL emission level is 0.1�0.5 ?g/l.
status: valid
status modified: 2025-03-12
accepted date: 2025-03-12
in scheme: BATAELValue

Ferrous metals processing - BAT 22
type: Concept
notation: FMP-NOx-BAT22-I
definition: 2, Production and processing of metals: 2.3 Processing of ferrous metals for (a) operation of hot rolling mills with a capacity exceeding 20 tonnes of crude steel per hour; (c) application of protective fused metal coats with an input exceeding 2 tonnes of crude steel per hour; this includes hot dip coating and batch galvanising. 2.6 Surface treatment of ferrous metals using electrolytic or chemical processes where the volume of the treatment vats exceeds 30 m3, when it is carried out in cold rolling, wire drawing or batch galvanising. 6.11 Independently operated treatment of waste water not covered by Directive 91/271/EEC, provided that the main pollutant load originates from the activities covered by these BAT conclusions; Reducing nitrous oxides (Nox) emissions to air. The BAT-AEL emission level is 80�200 mg/Nm3.
status: valid
status modified: 2025-03-12
accepted date: 2025-03-12
in scheme: BATAELValue

Manufacture of Glass - Dust - BAT32-II
type: Concept
notation: GLS-Dust-BAT32-II
definition: 3, Mineral industry: 3,3 Manufacture of glass including glass fibre with a melting capacity exceeding 20 tonnes per day; Techniques (i)-(iii) (see table); Reducing dust emissions to air. The BAT-AEL emission level is < 0,045 - 0,09 kg/t.
status: valid
status modified: 2019-04-23
accepted date: 2019-04-23
in scheme: BATAELValue

Manufacture of Glass - Dust - BAT37-I
type: Concept
notation: GLS-Dust-BAT37-I
definition: 3, Mineral industry: 3,3 Manufacture of glass including glass fibre with a melting capacity exceeding 20 tonnes per day; Techniques (i)-(iii) (see table); Reducing dust emissions to air. The BAT-AEL emission level is < 5 - 20 mg/Nm3.
status: valid
status modified: 2019-04-23
accepted date: 2019-04-23
in scheme: BATAELValue

Manufacture of Glass - Dust - BAT37-V
type: Concept
notation: GLS-Dust-BAT37-V
definition: 3, Mineral industry: 3,3 Manufacture of glass including glass fibre with a melting capacity exceeding 20 tonnes per day; Techniques (i)-(iii) (see table); Reducing dust emissions to air. The BAT-AEL emission level is < 5 - 20 mg/Nm3.
status: valid
status modified: 2019-04-23
accepted date: 2019-04-23
in scheme: BATAELValue

Manufacture of Glass - Dust - BAT38-I
type: Concept
notation: GLS-Dust-BAT38-I
definition: 3, Mineral industry: 3,3 Manufacture of glass including glass fibre with a melting capacity exceeding 20 tonnes per day; Techniques (i)-(v) (see table); Reducing dust emissions to air. The BAT-AEL emission level is < 10 - 20 mg/Nm3.
status: valid
status modified: 2019-04-23
accepted date: 2019-04-23
in scheme: BATAELValue

Manufacture of Glass - Dust - BAT38-II
type: Concept
notation: GLS-Dust-BAT38-II
definition: 3, Mineral industry: 3,3 Manufacture of glass including glass fibre with a melting capacity exceeding 20 tonnes per day; Techniques (i)-(v) and batch formulations with significant amounts of dangerous substances (EC No 1272/2008); Reducing dust emissions to air. The BAT-AEL emission level is < 1 - 10 mg/Nm3.
status: valid
status modified: 2019-04-23
accepted date: 2019-04-23
in scheme: BATAELValue

Manufacture of Glass - Dust - BAT38-III
type: Concept
notation: GLS-Dust-BAT38-III
definition: 3, Mineral industry: 3,3 Manufacture of glass including glass fibre with a melting capacity exceeding 20 tonnes per day; Techniques (i)-(v) (see table); Reducing dust emissions to air. The BAT-AEL emission level is < 0,03 - 0,06 kg/t.
status: valid
status modified: 2019-04-23
accepted date: 2019-04-23
in scheme: BATAELValue

Ferrous metals processing - BAT 22
type: Concept
notation: FMP-NOx-BAT22-II
definition: 2, Production and processing of metals: 2.3 Processing of ferrous metals for (a) operation of hot rolling mills with a capacity exceeding 20 tonnes of crude steel per hour; (c) application of protective fused metal coats with an input exceeding 2 tonnes of crude steel per hour; this includes hot dip coating and batch galvanising. 2.6 Surface treatment of ferrous metals using electrolytic or chemical processes where the volume of the treatment vats exceeds 30 m3, when it is carried out in cold rolling, wire drawing or batch galvanising. 6.11 Independently operated treatment of waste water not covered by Directive 91/271/EEC, provided that the main pollutant load originates from the activities covered by these BAT conclusions; Reducing nitrous oxides (Nox) emissions to air. The BAT-AEL emission level is 100�350 mg/Nm3.
status: valid
status modified: 2025-03-12
accepted date: 2025-03-12
in scheme: BATAELValue

Ferrous metals processing - BAT 22
type: Concept
notation: FMP-NOx-BAT22-III
definition: 2, Production and processing of metals: 2.3 Processing of ferrous metals for (a) operation of hot rolling mills with a capacity exceeding 20 tonnes of crude steel per hour; (c) application of protective fused metal coats with an input exceeding 2 tonnes of crude steel per hour; this includes hot dip coating and batch galvanising. 2.6 Surface treatment of ferrous metals using electrolytic or chemical processes where the volume of the treatment vats exceeds 30 m3, when it is carried out in cold rolling, wire drawing or batch galvanising. 6.11 Independently operated treatment of waste water not covered by Directive 91/271/EEC, provided that the main pollutant load originates from the activities covered by these BAT conclusions; Reducing nitrous oxides (Nox) emissions to air. The BAT-AEL emission level is 100�250 mg/Nm3.
status: valid
status modified: 2025-03-12
accepted date: 2025-03-12
in scheme: BATAELValue

Ferrous metals processing - BAT 22
type: Concept
notation: FMP-NOx-BAT22-IV
definition: 2, Production and processing of metals: 2.3 Processing of ferrous metals for (a) operation of hot rolling mills with a capacity exceeding 20 tonnes of crude steel per hour; (c) application of protective fused metal coats with an input exceeding 2 tonnes of crude steel per hour; this includes hot dip coating and batch galvanising. 2.6 Surface treatment of ferrous metals using electrolytic or chemical processes where the volume of the treatment vats exceeds 30 m3, when it is carried out in cold rolling, wire drawing or batch galvanising. 6.11 Independently operated treatment of waste water not covered by Directive 91/271/EEC, provided that the main pollutant load originates from the activities covered by these BAT conclusions; Reducing nitrous oxides (Nox) emissions to air. The BAT-AEL emission level is 100�200 mg/Nm3.
status: valid
status modified: 2025-03-12
accepted date: 2025-03-12
in scheme: BATAELValue

Ferrous metals processing - BAT 22
type: Concept
notation: FMP-NOx-BAT22-IX
definition: 2, Production and processing of metals: 2.3 Processing of ferrous metals for (a) operation of hot rolling mills with a capacity exceeding 20 tonnes of crude steel per hour; (c) application of protective fused metal coats with an input exceeding 2 tonnes of crude steel per hour; this includes hot dip coating and batch galvanising. 2.6 Surface treatment of ferrous metals using electrolytic or chemical processes where the volume of the treatment vats exceeds 30 m3, when it is carried out in cold rolling, wire drawing or batch galvanising. 6.11 Independently operated treatment of waste water not covered by Directive 91/271/EEC, provided that the main pollutant load originates from the activities covered by these BAT conclusions; Reducing nitrous oxides (Nox) emissions to air. The BAT-AEL emission level is 100�300 mg/Nm3.
status: valid
status modified: 2025-03-12
accepted date: 2025-03-12
in scheme: BATAELValue

Ferrous metals processing - BAT 22
type: Concept
notation: FMP-NOx-BAT22-V
definition: 2, Production and processing of metals: 2.3 Processing of ferrous metals for (a) operation of hot rolling mills with a capacity exceeding 20 tonnes of crude steel per hour; (c) application of protective fused metal coats with an input exceeding 2 tonnes of crude steel per hour; this includes hot dip coating and batch galvanising. 2.6 Surface treatment of ferrous metals using electrolytic or chemical processes where the volume of the treatment vats exceeds 30 m3, when it is carried out in cold rolling, wire drawing or batch galvanising. 6.11 Independently operated treatment of waste water not covered by Directive 91/271/EEC, provided that the main pollutant load originates from the activities covered by these BAT conclusions; Reducing nitrous oxides (Nox) emissions to air. The BAT-AEL emission level is 100�350 mg/Nm3.
status: valid
status modified: 2025-03-12
accepted date: 2025-03-12
in scheme: BATAELValue

Ferrous metals processing - BAT 22
type: Concept
notation: FMP-NOx-BAT22-VI
definition: 2, Production and processing of metals: 2.3 Processing of ferrous metals for (a) operation of hot rolling mills with a capacity exceeding 20 tonnes of crude steel per hour; (c) application of protective fused metal coats with an input exceeding 2 tonnes of crude steel per hour; this includes hot dip coating and batch galvanising. 2.6 Surface treatment of ferrous metals using electrolytic or chemical processes where the volume of the treatment vats exceeds 30 m3, when it is carried out in cold rolling, wire drawing or batch galvanising. 6.11 Independently operated treatment of waste water not covered by Directive 91/271/EEC, provided that the main pollutant load originates from the activities covered by these BAT conclusions; Reducing nitrous oxides (Nox) emissions to air. The BAT-AEL emission level is 100�550 mg/Nm3.
status: valid
status modified: 2025-03-12
accepted date: 2025-03-12
in scheme: BATAELValue

Manufacture of Glass - Dust - BAT38-IV
type: Concept
notation: GLS-Dust-BAT38-IV
definition: 3, Mineral industry: 3,3 Manufacture of glass including glass fibre with a melting capacity exceeding 20 tonnes per day; Techniques (i)-(v) and batch formulations with significant amounts of dangerous substances (EC No 1272/2008); Reducing dust emissions to air. The BAT-AEL emission level is < 0,003 - 0,03 kg/t.
status: valid
status modified: 2019-04-23
accepted date: 2019-04-23
in scheme: BATAELValue

Manufacture of Glass - Dust - BAT46-I
type: Concept
notation: GLS-Dust-BAT46-I
definition: 3, Mineral industry: 3,3 Manufacture of glass including glass fibre with a melting capacity exceeding 20 tonnes per day; Techniques (i)-(ii) (see table); Reducing dust emissions to air. The BAT-AEL emission level is < 1 - 10 mg/Nm3.
status: valid
status modified: 2019-04-23
accepted date: 2019-04-23
in scheme: BATAELValue

Manufacture of Glass - Dust - BAT48-I
type: Concept
notation: GLS-Dust-BAT48-I
definition: 3, Mineral industry: 3,3 Manufacture of glass including glass fibre with a melting capacity exceeding 20 tonnes per day; Techniques (i)-(iii) (see table); Reducing dust emissions to air. The BAT-AEL emission level is < 10 - 20 mg/Nm3.
status: valid
status modified: 2019-04-23
accepted date: 2019-04-23
in scheme: BATAELValue

Manufacture of Glass - Dust - BAT48-II
type: Concept
notation: GLS-Dust-BAT48-II
definition: 3, Mineral industry: 3,3 Manufacture of glass including glass fibre with a melting capacity exceeding 20 tonnes per day; Techniques (i)-(iii) (see table) and batch formulations with significant amounts of dangerous substances (EC No 1272/2008); Reducing dust emissions to air. The BAT-AEL emission level is < 1 - 10 mg/Nm3.
status: valid
status modified: 2019-04-23
accepted date: 2019-04-23
in scheme: BATAELValue

Manufacture of Glass - Dust - BAT48-III
type: Concept
notation: GLS-Dust-BAT48-III
definition: 3, Mineral industry: 3,3 Manufacture of glass including glass fibre with a melting capacity exceeding 20 tonnes per day; Techniques (i)-(iii) (see table); Reducing dust emissions to air. The BAT-AEL emission level is < 0,03 - 0,13 kg/t.
status: valid
status modified: 2019-04-23
accepted date: 2019-04-23
in scheme: BATAELValue

Ferrous metals processing - BAT 22
type: Concept
notation: FMP-NOx-BAT22-VII
definition: 2, Production and processing of metals: 2.3 Processing of ferrous metals for (a) operation of hot rolling mills with a capacity exceeding 20 tonnes of crude steel per hour; (c) application of protective fused metal coats with an input exceeding 2 tonnes of crude steel per hour; this includes hot dip coating and batch galvanising. 2.6 Surface treatment of ferrous metals using electrolytic or chemical processes where the volume of the treatment vats exceeds 30 m3, when it is carried out in cold rolling, wire drawing or batch galvanising. 6.11 Independently operated treatment of waste water not covered by Directive 91/271/EEC, provided that the main pollutant load originates from the activities covered by these BAT conclusions; Reducing nitrous oxides (Nox) emissions to air. The BAT-AEL emission level is 100�250 mg/Nm3.
status: valid
status modified: 2025-03-12
accepted date: 2025-03-12
in scheme: BATAELValue

Ferrous metals processing - BAT 22
type: Concept
notation: FMP-NOx-BAT22-VIII
definition: 2, Production and processing of metals: 2.3 Processing of ferrous metals for (a) operation of hot rolling mills with a capacity exceeding 20 tonnes of crude steel per hour; (c) application of protective fused metal coats with an input exceeding 2 tonnes of crude steel per hour; this includes hot dip coating and batch galvanising. 2.6 Surface treatment of ferrous metals using electrolytic or chemical processes where the volume of the treatment vats exceeds 30 m3, when it is carried out in cold rolling, wire drawing or batch galvanising. 6.11 Independently operated treatment of waste water not covered by Directive 91/271/EEC, provided that the main pollutant load originates from the activities covered by these BAT conclusions; Reducing nitrous oxides (Nox) emissions to air. The BAT-AEL emission level is 100�300 mg/Nm3.
status: valid
status modified: 2025-03-12
accepted date: 2025-03-12
in scheme: BATAELValue

Ferrous metals processing - BAT 22
type: Concept
notation: FMP-NOx-BAT22-X
definition: 2, Production and processing of metals: 2.3 Processing of ferrous metals for (a) operation of hot rolling mills with a capacity exceeding 20 tonnes of crude steel per hour; (c) application of protective fused metal coats with an input exceeding 2 tonnes of crude steel per hour; this includes hot dip coating and batch galvanising. 2.6 Surface treatment of ferrous metals using electrolytic or chemical processes where the volume of the treatment vats exceeds 30 m3, when it is carried out in cold rolling, wire drawing or batch galvanising. 6.11 Independently operated treatment of waste water not covered by Directive 91/271/EEC, provided that the main pollutant load originates from the activities covered by these BAT conclusions; Reducing nitrous oxides (Nox) emissions to air. The BAT-AEL emission level is 100�550 mg/Nm3.
status: valid
status modified: 2025-03-12
accepted date: 2025-03-12
in scheme: BATAELValue

Ferrous metals processing - BAT 22
type: Concept
notation: FMP-NOx-BAT22-XI
definition: 2, Production and processing of metals: 2.3 Processing of ferrous metals for (a) operation of hot rolling mills with a capacity exceeding 20 tonnes of crude steel per hour; (c) application of protective fused metal coats with an input exceeding 2 tonnes of crude steel per hour; this includes hot dip coating and batch galvanising. 2.6 Surface treatment of ferrous metals using electrolytic or chemical processes where the volume of the treatment vats exceeds 30 m3, when it is carried out in cold rolling, wire drawing or batch galvanising. 6.11 Independently operated treatment of waste water not covered by Directive 91/271/EEC, provided that the main pollutant load originates from the activities covered by these BAT conclusions; Reducing nitrous oxides (Nox) emissions to air. The BAT-AEL emission level is 100�250 mg/Nm3.
status: valid
status modified: 2025-03-12
accepted date: 2025-03-12
in scheme: BATAELValue

Ferrous metals processing - BAT 22
type: Concept
notation: FMP-NOx-BAT22-XII
definition: 2, Production and processing of metals: 2.3 Processing of ferrous metals for (a) operation of hot rolling mills with a capacity exceeding 20 tonnes of crude steel per hour; (c) application of protective fused metal coats with an input exceeding 2 tonnes of crude steel per hour; this includes hot dip coating and batch galvanising. 2.6 Surface treatment of ferrous metals using electrolytic or chemical processes where the volume of the treatment vats exceeds 30 m3, when it is carried out in cold rolling, wire drawing or batch galvanising. 6.11 Independently operated treatment of waste water not covered by Directive 91/271/EEC, provided that the main pollutant load originates from the activities covered by these BAT conclusions; Reducing nitrous oxides (Nox) emissions to air. The BAT-AEL emission level is 100�300 mg/Nm3.
status: valid
status modified: 2025-03-12
accepted date: 2025-03-12
in scheme: BATAELValue

Ferrous metals processing - BAT 22
type: Concept
notation: FMP-NOx-BAT22-XIII
definition: 2, Production and processing of metals: 2.3 Processing of ferrous metals for (a) operation of hot rolling mills with a capacity exceeding 20 tonnes of crude steel per hour; (c) application of protective fused metal coats with an input exceeding 2 tonnes of crude steel per hour; this includes hot dip coating and batch galvanising. 2.6 Surface treatment of ferrous metals using electrolytic or chemical processes where the volume of the treatment vats exceeds 30 m3, when it is carried out in cold rolling, wire drawing or batch galvanising. 6.11 Independently operated treatment of waste water not covered by Directive 91/271/EEC, provided that the main pollutant load originates from the activities covered by these BAT conclusions; Reducing nitrous oxides (Nox) emissions to air. The BAT-AEL emission level is 100�550 mg/Nm3.
status: valid
status modified: 2025-03-12
accepted date: 2025-03-12
in scheme: BATAELValue

Manufacture of Glass - Dust - BAT48-IV
type: Concept
notation: GLS-Dust-BAT48-IV
definition: 3, Mineral industry: 3,3 Manufacture of glass including glass fibre with a melting capacity exceeding 20 tonnes per day; Techniques (i)-(iii) (see table) and batch formulations with significant amounts of dangerous substances (EC No 1272/2008); Reducing dust emissions to air. The BAT-AEL emission level is < 0,003 - 0,065 kg/t.
status: valid
status modified: 2019-04-23
accepted date: 2019-04-23
in scheme: BATAELValue

Manufacture of Glass - Dust - BAT54-I
type: Concept
notation: GLS-Dust-BAT54-I
definition: 3, Mineral industry: 3,3 Manufacture of glass including glass fibre with a melting capacity exceeding 20 tonnes per day; Techniques (i)-(ii) (see table); Reducing dust emissions to air. The BAT-AEL emission level is 1 - 10 mg/Nm3.
status: valid
status modified: 2019-04-23
accepted date: 2019-04-23
in scheme: BATAELValue

Manufacture of Glass - Dust - BAT56-I
type: Concept
notation: GLS-Dust-BAT56-I
definition: 3, Mineral industry: 3,4 Melting mineral substances including the production of mineral fibres with a melting capacity exceeding 20�tonnes per day; Electrostatic precipitator or bag filter system; Reducing dust emissions to air. The BAT-AEL emission level is < 10 - 20 mg/Nm3.
status: valid
status modified: 2019-04-23
accepted date: 2019-04-23
in scheme: BATAELValue

Manufacture of Glass - Dust - BAT56-II
type: Concept
notation: GLS-Dust-BAT56-II
definition: 3, Mineral industry: 3,4 Melting mineral substances including the production of mineral fibres with a melting capacity exceeding 20�tonnes per day; Electrostatic precipitator or bag filter system; Reducing dust emissions to air. The BAT-AEL emission level is < 0,02 - 0,05 kg/t.
status: valid
status modified: 2019-04-23
accepted date: 2019-04-23
in scheme: BATAELValue

Manufacture of Glass - Dust - BAT64
type: Concept
notation: GLS-Dust-BAT64
definition: 3, Mineral industry: 3,4 Melting mineral substances including the production of mineral fibres with a melting capacity exceeding 20�tonnes per day; Flue-gas cleaning by bag filter system; Reducing dust emissions to air. The BAT-AEL emission level is < 5 - 20 mg/Nm3.
status: valid
status modified: 2019-04-23
accepted date: 2019-04-23
in scheme: BATAELValue

Ferrous metals processing - BAT 22
type: Concept
notation: FMP-NOx-BAT22-XIV
definition: 2, Production and processing of metals: 2.3 Processing of ferrous metals for (a) operation of hot rolling mills with a capacity exceeding 20 tonnes of crude steel per hour; (c) application of protective fused metal coats with an input exceeding 2 tonnes of crude steel per hour; this includes hot dip coating and batch galvanising. 2.6 Surface treatment of ferrous metals using electrolytic or chemical processes where the volume of the treatment vats exceeds 30 m3, when it is carried out in cold rolling, wire drawing or batch galvanising. 6.11 Independently operated treatment of waste water not covered by Directive 91/271/EEC, provided that the main pollutant load originates from the activities covered by these BAT conclusions; Reducing nitrous oxides (Nox) emissions to air. The BAT-AEL emission level is 70�300 mg/Nm3.
status: valid
status modified: 2025-03-12
accepted date: 2025-03-12
in scheme: BATAELValue

Ferrous metals processing - BAT 24
type: Concept
notation: FMP-NOx-BAT25
definition: 2, Production and processing of metals: 2.3 Processing of ferrous metals for (a) operation of hot rolling mills with a capacity exceeding 20 tonnes of crude steel per hour; (c) application of protective fused metal coats with an input exceeding 2 tonnes of crude steel per hour; this includes hot dip coating and batch galvanising. 2.6 Surface treatment of ferrous metals using electrolytic or chemical processes where the volume of the treatment vats exceeds 30 m3, when it is carried out in cold rolling, wire drawing or batch galvanising. 6.11 Independently operated treatment of waste water not covered by Directive 91/271/EEC, provided that the main pollutant load originates from the activities covered by these BAT conclusions; Reducing nitrous oxides (Nox) emissions to air. The BAT-AEL emission level is 10�200 mg/Nm3.
status: valid
status modified: 2025-03-12
accepted date: 2025-03-12
in scheme: BATAELValue

Ferrous metals processing - BAT 29
type: Concept
notation: FMP-NOx-BAT29-IV
definition: 2, Production and processing of metals: 2.3 Processing of ferrous metals for (a) operation of hot rolling mills with a capacity exceeding 20 tonnes of crude steel per hour; (c) application of protective fused metal coats with an input exceeding 2 tonnes of crude steel per hour; this includes hot dip coating and batch galvanising. 2.6 Surface treatment of ferrous metals using electrolytic or chemical processes where the volume of the treatment vats exceeds 30 m3, when it is carried out in cold rolling, wire drawing or batch galvanising. 6.11 Independently operated treatment of waste water not covered by Directive 91/271/EEC, provided that the main pollutant load originates from the activities covered by these BAT conclusions; Reducing nitrous oxides (Nox) emissions to air. The BAT-AEL emission level is 50�180 mg/Nm3.
status: valid
status modified: 2025-03-12
accepted date: 2025-03-12
in scheme: BATAELValue

Ferrous metals processing - BAT 29
type: Concept
notation: FMP-NOx-BAT29-VI
definition: 2, Production and processing of metals: 2.3 Processing of ferrous metals for (a) operation of hot rolling mills with a capacity exceeding 20 tonnes of crude steel per hour; (c) application of protective fused metal coats with an input exceeding 2 tonnes of crude steel per hour; this includes hot dip coating and batch galvanising. 2.6 Surface treatment of ferrous metals using electrolytic or chemical processes where the volume of the treatment vats exceeds 30 m3, when it is carried out in cold rolling, wire drawing or batch galvanising. 6.11 Independently operated treatment of waste water not covered by Directive 91/271/EEC, provided that the main pollutant load originates from the activities covered by these BAT conclusions; Reducing nitrous oxides (Nox) emissions to air. The BAT-AEL emission level is 50�100 mg/Nm3.
status: valid
status modified: 2025-03-12
accepted date: 2025-03-12
in scheme: BATAELValue

Ferrous metals processing - BAT 29
type: Concept
notation: FMP-NOx-BAT29-VII
definition: 2, Production and processing of metals: 2.3 Processing of ferrous metals for (a) operation of hot rolling mills with a capacity exceeding 20 tonnes of crude steel per hour; (c) application of protective fused metal coats with an input exceeding 2 tonnes of crude steel per hour; this includes hot dip coating and batch galvanising. 2.6 Surface treatment of ferrous metals using electrolytic or chemical processes where the volume of the treatment vats exceeds 30 m3, when it is carried out in cold rolling, wire drawing or batch galvanising. 6.11 Independently operated treatment of waste water not covered by Directive 91/271/EEC, provided that the main pollutant load originates from the activities covered by these BAT conclusions; Reducing nitrous oxides (Nox) emissions to air. The BAT-AEL emission level is 50�200 mg/Nm3.
status: valid
status modified: 2025-03-12
accepted date: 2025-03-12
in scheme: BATAELValue

Ferrous metals processing - BAT 31
type: Concept
notation: FMP-Ni-BAT31-XI
definition: 2, Production and processing of metals: 2.3 Processing of ferrous metals for (a) operation of hot rolling mills with a capacity exceeding 20 tonnes of crude steel per hour; (c) application of protective fused metal coats with an input exceeding 2 tonnes of crude steel per hour; this includes hot dip coating and batch galvanising. 2.6 Surface treatment of ferrous metals using electrolytic or chemical processes where the volume of the treatment vats exceeds 30 m3, when it is carried out in cold rolling, wire drawing or batch galvanising. 6.11 Independently operated treatment of waste water not covered by Directive 91/271/EEC, provided that the main pollutant load originates from the activities covered by these BAT conclusions Reducing nickel to water. The BAT-AEL emission level is 0.01�0. 2 mg/l.
status: valid
status modified: 2025-03-12
accepted date: 2025-03-12
in scheme: BATAELValue

Manufacture of Glass - Dust - BAT65
type: Concept
notation: GLS-Dust-BAT65
definition: 3, Mineral industry: 3,4 Melting mineral substances including the production of mineral fibres with a melting capacity exceeding 20�tonnes per day; Techniques (i)-(iii) (see table); Reducing dust emissions to air. The BAT-AEL emission level is 1 - 5 mg/Nm3.
status: valid
status modified: 2019-04-23
accepted date: 2019-04-23
in scheme: BATAELValue

Manufacture of Glass - Dust - BAT71-I
type: Concept
notation: GLS-Dust-BAT71-I
definition: 3, Mineral industry: 3,4 Melting mineral substances including the production of mineral fibres with a melting capacity exceeding 20�tonnes per day; Electrostatic precipitator or bag filter system; Reducing dust emissions to air. The BAT-AEL emission level is < 10 - 20 mg/Nm3.
status: valid
status modified: 2019-04-23
accepted date: 2019-04-23
in scheme: BATAELValue

Manufacture of Glass - Dust - BAT71-II
type: Concept
notation: GLS-Dust-BAT71-II
definition: 3, Mineral industry: 3,4 Melting mineral substances including the production of mineral fibres with a melting capacity exceeding 20�tonnes per day; Electrostatic precipitator or bag filter system; Reducing dust emissions to air. The BAT-AEL emission level is < 0,05 - 0,15 kg/t.
status: valid
status modified: 2019-04-23
accepted date: 2019-04-23
in scheme: BATAELValue

Manufacture of Glass - Dust - BAT76-I
type: Concept
notation: GLS-Dust-BAT76-I
definition: 3, Mineral industry: 3,4 Melting mineral substances including the production of mineral fibres with a melting capacity exceeding 20�tonnes per day; Techniques (i)-(iii) (see table); Reducing dust emissions to air. The BAT-AEL emission level is 5 - 10 mg/Nm3.
status: valid
status modified: 2019-04-23
accepted date: 2019-04-23
in scheme: BATAELValue

Manufacture of Glass - F - BAT13-V
type: Concept
notation: GLS-F-BAT13-V
definition: 3, Mineral industry: 3,3 Manufacture of glass including glass fibre with a melting capacity exceeding 20 tonnes per day Reducing fluorides to water. The BAT-AEL emission level is < 6 mg/l.
status: valid
status modified: 2019-04-23
accepted date: 2019-04-23
in scheme: BATAELValue

Manufacture of Glass - H2S - BAT61-I
type: Concept
notation: GLS-H2S-BAT61-I
definition: 3, Mineral industry: 3,4 Melting mineral substances including the production of mineral fibres with a melting capacity exceeding 20�tonnes per day; Waste gas incineration system to oxidise hydrogen sulphide to SO2; Reducing hydrogen sulphide emissions to air. The BAT-AEL emission level is < 2 mg/Nm3.
status: valid
status modified: 2019-04-23
accepted date: 2019-04-23
in scheme: BATAELValue

Ferrous metals processing - BAT 31
type: Concept
notation: FMP-Ni-BAT31-XII
definition: 2, Production and processing of metals: 2.3 Processing of ferrous metals for (a) operation of hot rolling mills with a capacity exceeding 20 tonnes of crude steel per hour; (c) application of protective fused metal coats with an input exceeding 2 tonnes of crude steel per hour; this includes hot dip coating and batch galvanising. 2.6 Surface treatment of ferrous metals using electrolytic or chemical processes where the volume of the treatment vats exceeds 30 m3, when it is carried out in cold rolling, wire drawing or batch galvanising. 6.11 Independently operated treatment of waste water not covered by Directive 91/271/EEC, provided that the main pollutant load originates from the activities covered by these BAT conclusions Reducing nickel to water. The BAT-AEL emission level is 0.01�0.4 mg/l.
status: valid
status modified: 2025-03-12
accepted date: 2025-03-12
in scheme: BATAELValue

Ferrous metals processing - BAT 31
type: Concept
notation: FMP-Ni-BAT31-XXVII
definition: 2, Production and processing of metals: 2.3 Processing of ferrous metals for (a) operation of hot rolling mills with a capacity exceeding 20 tonnes of crude steel per hour; (c) application of protective fused metal coats with an input exceeding 2 tonnes of crude steel per hour; this includes hot dip coating and batch galvanising. 2.6 Surface treatment of ferrous metals using electrolytic or chemical processes where the volume of the treatment vats exceeds 30 m3, when it is carried out in cold rolling, wire drawing or batch galvanising. 6.11 Independently operated treatment of waste water not covered by Directive 91/271/EEC, provided that the main pollutant load originates from the activities covered by these BAT conclusions Reducing nickel to water. The BAT-AEL emission level is 0.01�0. 2 mg/l.
status: valid
status modified: 2025-03-12
accepted date: 2025-03-12
in scheme: BATAELValue

Ferrous metals processing - BAT 31
type: Concept
notation: FMP-Ni-BAT31-XXVIII
definition: 2, Production and processing of metals: 2.3 Processing of ferrous metals for (a) operation of hot rolling mills with a capacity exceeding 20 tonnes of crude steel per hour; (c) application of protective fused metal coats with an input exceeding 2 tonnes of crude steel per hour; this includes hot dip coating and batch galvanising. 2.6 Surface treatment of ferrous metals using electrolytic or chemical processes where the volume of the treatment vats exceeds 30 m3, when it is carried out in cold rolling, wire drawing or batch galvanising. 6.11 Independently operated treatment of waste water not covered by Directive 91/271/EEC, provided that the main pollutant load originates from the activities covered by these BAT conclusions Reducing nickel to water. The BAT-AEL emission level is 0.01�0.4 mg/l.
status: valid
status modified: 2025-03-12
accepted date: 2025-03-12
in scheme: BATAELValue

Ferrous metals processing - BAT 42
type: Concept
notation: FMP-Ni-BAT42-III
definition: 2, Production and processing of metals: 2.3 Processing of ferrous metals for (a) operation of hot rolling mills with a capacity exceeding 20 tonnes of crude steel per hour; (c) application of protective fused metal coats with an input exceeding 2 tonnes of crude steel per hour; this includes hot dip coating and batch galvanising. 2.6 Surface treatment of ferrous metals using electrolytic or chemical processes where the volume of the treatment vats exceeds 30 m3, when it is carried out in cold rolling, wire drawing or batch galvanising. 6.11 Independently operated treatment of waste water not covered by Directive 91/271/EEC, provided that the main pollutant load originates from the activities covered by these BAT conclusions; Reducing nickel emissions to air. The BAT-AEL emission level is 0.01�0.1 mg/Nm3.
status: valid
status modified: 2025-03-12
accepted date: 2025-03-12
in scheme: BATAELValue

Ferrous metals processing - BAT 46
type: Concept
notation: FMP-Ni-BAT46-II
definition: 2, Production and processing of metals: 2.3 Processing of ferrous metals for (a) operation of hot rolling mills with a capacity exceeding 20 tonnes of crude steel per hour; (c) application of protective fused metal coats with an input exceeding 2 tonnes of crude steel per hour; this includes hot dip coating and batch galvanising. 2.6 Surface treatment of ferrous metals using electrolytic or chemical processes where the volume of the treatment vats exceeds 30 m3, when it is carried out in cold rolling, wire drawing or batch galvanising. 6.11 Independently operated treatment of waste water not covered by Directive 91/271/EEC, provided that the main pollutant load originates from the activities covered by these BAT conclusions; Reducing nickel emissions to air. The BAT-AEL emission level is 0.01�0.1 mg/Nm3.
status: valid
status modified: 2025-03-12
accepted date: 2025-03-12
in scheme: BATAELValue

Ferrous metals processing - BAT 31
type: Concept
notation: FMP-TP-BAT31-XVIII
definition: 2, Production and processing of metals: 2.3 Processing of ferrous metals for (a) operation of hot rolling mills with a capacity exceeding 20 tonnes of crude steel per hour; (c) application of protective fused metal coats with an input exceeding 2 tonnes of crude steel per hour; this includes hot dip coating and batch galvanising. 2.6 Surface treatment of ferrous metals using electrolytic or chemical processes where the volume of the treatment vats exceeds 30 m3, when it is carried out in cold rolling, wire drawing or batch galvanising. 6.11 Independently operated treatment of waste water not covered by Directive 91/271/EEC, provided that the main pollutant load originates from the activities covered by these BAT conclusions Reducing total phosphorus to water. The BAT-AEL emission level is 0. 2�1 mg/l.
status: valid
status modified: 2025-03-12
accepted date: 2025-03-12
in scheme: BATAELValue

Manufacture of Glass - H2S - BAT61-II
type: Concept
notation: GLS-H2S-BAT61-II
definition: 3, Mineral industry: 3,4 Melting mineral substances including the production of mineral fibres with a melting capacity exceeding 20�tonnes per day; Waste gas incineration system to oxidise hydrogen sulphide to SO2; Reducing hydrogen sulphide emissions to air. The BAT-AEL emission level is < 0,005 kg/t.
status: valid
status modified: 2019-04-23
accepted date: 2019-04-23
in scheme: BATAELValue

Manufacture of Glass - HCl - BAT20-I
type: Concept
notation: GLS-HCl-BAT20-I
definition: 3, Mineral industry: 3,3 Manufacture of glass including glass fibre with a melting capacity exceeding 20 tonnes per day; Techniques (i)-(ii) (see table); Reducing hydrogen chloride emissions to air. The BAT-AEL emission level is < 10 - 20 mg/Nm3.
status: valid
status modified: 2019-04-23
accepted date: 2019-04-23
in scheme: BATAELValue

Manufacture of Glass - HCl - BAT20-III
type: Concept
notation: GLS-HCl-BAT20-III
definition: 3, Mineral industry: 3,3 Manufacture of glass including glass fibre with a melting capacity exceeding 20 tonnes per day; Techniques (i)-(ii) (see table); Reducing hydrogen chloride emissions to air. The BAT-AEL emission level is < 0,02 - 0,03 kg/t.
status: valid
status modified: 2019-04-23
accepted date: 2019-04-23
in scheme: BATAELValue

Manufacture of Glass - HCl - BAT22-IV
type: Concept
notation: GLS-HCl-BAT22-IV
definition: 3, Mineral industry: 3,3 Manufacture of glass including glass fibre with a melting capacity exceeding 20 tonnes per day; Techniques (i)-(iii) (see table); Reducing hydrogen chloride emissions to air. The BAT-AEL emission level is < 30 mg/Nm3.
status: valid
status modified: 2019-04-23
accepted date: 2019-04-23
in scheme: BATAELValue

Manufacture of Glass - HCl - BAT28-I
type: Concept
notation: GLS-HCl-BAT28-I
definition: 3, Mineral industry: 3,3 Manufacture of glass including glass fibre with a melting capacity exceeding 20 tonnes per day; Techniques (i)-(ii) (see table); Reducing hydrogen chloride emissions to air. The BAT-AEL emission level is < 10 - 25 mg/Nm3.
status: valid
status modified: 2019-04-23
accepted date: 2019-04-23
in scheme: BATAELValue

Manufacture of Glass - HCl - BAT28-III
type: Concept
notation: GLS-HCl-BAT28-III
definition: 3, Mineral industry: 3,3 Manufacture of glass including glass fibre with a melting capacity exceeding 20 tonnes per day; Techniques (i)-(ii) (see table); Reducing hydrogen chloride emissions to air. The BAT-AEL emission level is < 0,025 - 0,0625 kg/t.
status: valid
status modified: 2019-04-23
accepted date: 2019-04-23
in scheme: BATAELValue

Ferrous metals processing - BAT 31
type: Concept
notation: FMP-Pb-BAT31-XIII
definition: 2, Production and processing of metals: 2.3 Processing of ferrous metals for (a) operation of hot rolling mills with a capacity exceeding 20 tonnes of crude steel per hour; (c) application of protective fused metal coats with an input exceeding 2 tonnes of crude steel per hour; this includes hot dip coating and batch galvanising. 2.6 Surface treatment of ferrous metals using electrolytic or chemical processes where the volume of the treatment vats exceeds 30 m3, when it is carried out in cold rolling, wire drawing or batch galvanising. 6.11 Independently operated treatment of waste water not covered by Directive 91/271/EEC, provided that the main pollutant load originates from the activities covered by these BAT conclusions Reducing lead to water. The BAT-AEL emission level is 5�20 ?g/l.
status: valid
status modified: 2025-03-12
accepted date: 2025-03-12
in scheme: BATAELValue

Ferrous metals processing - BAT 31
type: Concept
notation: FMP-Pb-BAT31-XIV
definition: 2, Production and processing of metals: 2.3 Processing of ferrous metals for (a) operation of hot rolling mills with a capacity exceeding 20 tonnes of crude steel per hour; (c) application of protective fused metal coats with an input exceeding 2 tonnes of crude steel per hour; this includes hot dip coating and batch galvanising. 2.6 Surface treatment of ferrous metals using electrolytic or chemical processes where the volume of the treatment vats exceeds 30 m3, when it is carried out in cold rolling, wire drawing or batch galvanising. 6.11 Independently operated treatment of waste water not covered by Directive 91/271/EEC, provided that the main pollutant load originates from the activities covered by these BAT conclusions Reducing lead to water. The BAT-AEL emission level is 5�35 ?g/l.
status: valid
status modified: 2025-03-12
accepted date: 2025-03-12
in scheme: BATAELValue

Ferrous metals processing - BAT 31
type: Concept
notation: FMP-Pb-BAT31-XV
definition: 2, Production and processing of metals: 2.3 Processing of ferrous metals for (a) operation of hot rolling mills with a capacity exceeding 20 tonnes of crude steel per hour; (c) application of protective fused metal coats with an input exceeding 2 tonnes of crude steel per hour; this includes hot dip coating and batch galvanising. 2.6 Surface treatment of ferrous metals using electrolytic or chemical processes where the volume of the treatment vats exceeds 30 m3, when it is carried out in cold rolling, wire drawing or batch galvanising. 6.11 Independently operated treatment of waste water not covered by Directive 91/271/EEC, provided that the main pollutant load originates from the activities covered by these BAT conclusions Reducing lead to water. The BAT-AEL emission level is 5�50 ?g/l.
status: valid
status modified: 2025-03-12
accepted date: 2025-03-12
in scheme: BATAELValue

Ferrous metals processing - BAT 31
type: Concept
notation: FMP-Pb-BAT31-XXIX
definition: 2, Production and processing of metals: 2.3 Processing of ferrous metals for (a) operation of hot rolling mills with a capacity exceeding 20 tonnes of crude steel per hour; (c) application of protective fused metal coats with an input exceeding 2 tonnes of crude steel per hour; this includes hot dip coating and batch galvanising. 2.6 Surface treatment of ferrous metals using electrolytic or chemical processes where the volume of the treatment vats exceeds 30 m3, when it is carried out in cold rolling, wire drawing or batch galvanising. 6.11 Independently operated treatment of waste water not covered by Directive 91/271/EEC, provided that the main pollutant load originates from the activities covered by these BAT conclusions Reducing lead to water. The BAT-AEL emission level is 5�20 ?g/l.
status: valid
status modified: 2025-03-12
accepted date: 2025-03-12
in scheme: BATAELValue

Ferrous metals processing - BAT 31
type: Concept
notation: FMP-Pb-BAT31-XXX
definition: 2, Production and processing of metals: 2.3 Processing of ferrous metals for (a) operation of hot rolling mills with a capacity exceeding 20 tonnes of crude steel per hour; (c) application of protective fused metal coats with an input exceeding 2 tonnes of crude steel per hour; this includes hot dip coating and batch galvanising. 2.6 Surface treatment of ferrous metals using electrolytic or chemical processes where the volume of the treatment vats exceeds 30 m3, when it is carried out in cold rolling, wire drawing or batch galvanising. 6.11 Independently operated treatment of waste water not covered by Directive 91/271/EEC, provided that the main pollutant load originates from the activities covered by these BAT conclusions Reducing lead to water. The BAT-AEL emission level is 5�35 ?g/l.
status: valid
status modified: 2025-03-12
accepted date: 2025-03-12
in scheme: BATAELValue

Ferrous metals processing - BAT 31
type: Concept
notation: FMP-Pb-BAT31-XXXI
definition: 2, Production and processing of metals: 2.3 Processing of ferrous metals for (a) operation of hot rolling mills with a capacity exceeding 20 tonnes of crude steel per hour; (c) application of protective fused metal coats with an input exceeding 2 tonnes of crude steel per hour; this includes hot dip coating and batch galvanising. 2.6 Surface treatment of ferrous metals using electrolytic or chemical processes where the volume of the treatment vats exceeds 30 m3, when it is carried out in cold rolling, wire drawing or batch galvanising. 6.11 Independently operated treatment of waste water not covered by Directive 91/271/EEC, provided that the main pollutant load originates from the activities covered by these BAT conclusions Reducing lead to water. The BAT-AEL emission level is 5�50 ?g/l.
status: valid
status modified: 2025-03-12
accepted date: 2025-03-12
in scheme: BATAELValue

Manufacture of Glass - HCl - BAT31-II
type: Concept
notation: GLS-HCl-BAT31-II
definition: 3, Mineral industry: 3,3 Manufacture of glass including glass fibre with a melting capacity exceeding 20 tonnes per day; Techniques (i)-(iv) (see table); Reducing hydrogen chloride emissions to air. The BAT-AEL emission level is < 10 mg/Nm3.
status: valid
status modified: 2019-04-23
accepted date: 2019-04-23
in scheme: BATAELValue

Manufacture of Glass - HCl - BAT35-I
type: Concept
notation: GLS-HCl-BAT35-I
definition: 3, Mineral industry: 3,3 Manufacture of glass including glass fibre with a melting capacity exceeding 20 tonnes per day; Techniques (i)-(iv) (see table); Reducing hydrogen chloride emissions to air. The BAT-AEL emission level is < 10 mg/Nm3.
status: valid
status modified: 2019-04-23
accepted date: 2019-04-23
in scheme: BATAELValue

Manufacture of Glass - HCl - BAT35-III
type: Concept
notation: GLS-HCl-BAT35-III
definition: 3, Mineral industry: 3,3 Manufacture of glass including glass fibre with a melting capacity exceeding 20 tonnes per day; Techniques (i)-(iv) (see table); Reducing hydrogen chloride emissions to air. The BAT-AEL emission level is < 0,05 kg/t.
status: valid
status modified: 2019-04-23
accepted date: 2019-04-23
in scheme: BATAELValue

Manufacture of Glass - HCl - BAT42-I
type: Concept
notation: GLS-HCl-BAT42-I
definition: 3, Mineral industry: 3,3 Manufacture of glass including glass fibre with a melting capacity exceeding 20 tonnes per day; Techniques (i)-(iv) (see table); Reducing hydrogen chloride emissions to air. The BAT-AEL emission level is < 10 - 20 mg/Nm3.
status: valid
status modified: 2019-04-23
accepted date: 2019-04-23
in scheme: BATAELValue

Manufacture of Glass - HCl - BAT42-III
type: Concept
notation: GLS-HCl-BAT42-III
definition: 3, Mineral industry: 3,3 Manufacture of glass including glass fibre with a melting capacity exceeding 20 tonnes per day; Techniques (i)-(iv) (see table); Reducing hydrogen chloride emissions to air. The BAT-AEL emission level is < 0,03 - 0,06 kg/t.
status: valid
status modified: 2019-04-23
accepted date: 2019-04-23
in scheme: BATAELValue

Manufacture of Glass - HCl - BAT52-I
type: Concept
notation: GLS-HCl-BAT52-I
definition: 3, Mineral industry: 3,3 Manufacture of glass including glass fibre with a melting capacity exceeding 20 tonnes per day; Techniques (i)-(iii) (see table); Reducing hydrogen chloride emissions to air. The BAT-AEL emission level is < 10 - 20 mg/Nm3.
status: valid
status modified: 2019-04-23
accepted date: 2019-04-23
in scheme: BATAELValue

Ferrous metals processing - BAT 42
type: Concept
notation: FMP-Pb-BAT42-IV
definition: 2, Production and processing of metals: 2.3 Processing of ferrous metals for (a) operation of hot rolling mills with a capacity exceeding 20 tonnes of crude steel per hour; (c) application of protective fused metal coats with an input exceeding 2 tonnes of crude steel per hour; this includes hot dip coating and batch galvanising. 2.6 Surface treatment of ferrous metals using electrolytic or chemical processes where the volume of the treatment vats exceeds 30 m3, when it is carried out in cold rolling, wire drawing or batch galvanising. 6.11 Independently operated treatment of waste water not covered by Directive 91/271/EEC, provided that the main pollutant load originates from the activities covered by these BAT conclusions; Reducing lead emissions to air. The BAT-AEL emission level is 0.01�0.035 mg/Nm3.
status: valid
status modified: 2025-03-12
accepted date: 2025-03-12
in scheme: BATAELValue

Ferrous metals processing - BAT 46
type: Concept
notation: FMP-Pb-BAT46-III
definition: 2, Production and processing of metals: 2.3 Processing of ferrous metals for (a) operation of hot rolling mills with a capacity exceeding 20 tonnes of crude steel per hour; (c) application of protective fused metal coats with an input exceeding 2 tonnes of crude steel per hour; this includes hot dip coating and batch galvanising. 2.6 Surface treatment of ferrous metals using electrolytic or chemical processes where the volume of the treatment vats exceeds 30 m3, when it is carried out in cold rolling, wire drawing or batch galvanising. 6.11 Independently operated treatment of waste water not covered by Directive 91/271/EEC, provided that the main pollutant load originates from the activities covered by these BAT conclusions; Reducing lead emissions to air. The BAT-AEL emission level is ? 0.003 mg/Nm3.
status: valid
status modified: 2025-03-12
accepted date: 2025-03-12
in scheme: BATAELValue

Ferrous metals processing - BAT 51
type: Concept
notation: FMP-Pb-BAT51-II
definition: 2, Production and processing of metals: 2.3 Processing of ferrous metals for (a) operation of hot rolling mills with a capacity exceeding 20 tonnes of crude steel per hour; (c) application of protective fused metal coats with an input exceeding 2 tonnes of crude steel per hour; this includes hot dip coating and batch galvanising. 2.6 Surface treatment of ferrous metals using electrolytic or chemical processes where the volume of the treatment vats exceeds 30 m3, when it is carried out in cold rolling, wire drawing or batch galvanising. 6.11 Independently operated treatment of waste water not covered by Directive 91/271/EEC, provided that the main pollutant load originates from the activities covered by these BAT conclusions; Reducing lead emissions to air. The BAT-AEL emission level is ? 0.5 mg/Nm3.
status: valid
status modified: 2025-03-12
accepted date: 2025-03-12
in scheme: BATAELValue

Ferrous metals processing - BAT 21
type: Concept
notation: FMP-SO2-BAT21-I
definition: 2, Production and processing of metals: 2.3 Processing of ferrous metals for (a) operation of hot rolling mills with a capacity exceeding 20 tonnes of crude steel per hour; (c) application of protective fused metal coats with an input exceeding 2 tonnes of crude steel per hour; this includes hot dip coating and batch galvanising. 2.6 Surface treatment of ferrous metals using electrolytic or chemical processes where the volume of the treatment vats exceeds 30 m3, when it is carried out in cold rolling, wire drawing or batch galvanising. 6.11 Independently operated treatment of waste water not covered by Directive 91/271/EEC, provided that the main pollutant load originates from the activities covered by these BAT conclusions; Reducing sulphur oxides emissions to air. The BAT-AEL emission level is 50�200 mg/Nm3.
status: valid
status modified: 2025-03-12
accepted date: 2025-03-12
in scheme: BATAELValue

Ferrous metals processing - BAT 21
type: Concept
notation: FMP-SO2-BAT21-II
definition: 2, Production and processing of metals: 2.3 Processing of ferrous metals for (a) operation of hot rolling mills with a capacity exceeding 20 tonnes of crude steel per hour; (c) application of protective fused metal coats with an input exceeding 2 tonnes of crude steel per hour; this includes hot dip coating and batch galvanising. 2.6 Surface treatment of ferrous metals using electrolytic or chemical processes where the volume of the treatment vats exceeds 30 m3, when it is carried out in cold rolling, wire drawing or batch galvanising. 6.11 Independently operated treatment of waste water not covered by Directive 91/271/EEC, provided that the main pollutant load originates from the activities covered by these BAT conclusions; Reducing sulphur oxides emissions to air. The BAT-AEL emission level is 20�100 mg/Nm3.
status: valid
status modified: 2025-03-12
accepted date: 2025-03-12
in scheme: BATAELValue

Ferrous metals processing - BAT 29
type: Concept
notation: FMP-SO2-BAT29-III
definition: 2, Production and processing of metals: 2.3 Processing of ferrous metals for (a) operation of hot rolling mills with a capacity exceeding 20 tonnes of crude steel per hour; (c) application of protective fused metal coats with an input exceeding 2 tonnes of crude steel per hour; this includes hot dip coating and batch galvanising. 2.6 Surface treatment of ferrous metals using electrolytic or chemical processes where the volume of the treatment vats exceeds 30 m3, when it is carried out in cold rolling, wire drawing or batch galvanising. 6.11 Independently operated treatment of waste water not covered by Directive 91/271/EEC, provided that the main pollutant load originates from the activities covered by these BAT conclusions; Reducing sulphur oxides emissions to air. The BAT-AEL emission level is < 10 mg/Nm3.
status: valid
status modified: 2025-03-12
accepted date: 2025-03-12
in scheme: BATAELValue

Manufacture of Glass - HCl - BAT52-III
type: Concept
notation: GLS-HCl-BAT52-III
definition: 3, Mineral industry: 3,3 Manufacture of glass including glass fibre with a melting capacity exceeding 20 tonnes per day; Techniques (i)-(iii) (see table); Reducing hydrogen chloride emissions to air. The BAT-AEL emission level is < 0,03 - 0,05 kg/t.
status: valid
status modified: 2019-04-23
accepted date: 2019-04-23
in scheme: BATAELValue

Manufacture of Glass - HCl - BAT60-I
type: Concept
notation: GLS-HCl-BAT60-I
definition: 3, Mineral industry: 3,4 Melting mineral substances including the production of mineral fibres with a melting capacity exceeding 20�tonnes per day; Techniques (i)-(ii) (see table); for glass wool; Reducing hydrogen chloride emissions to air. The BAT-AEL emission level is < 5 - 10 mg/Nm3.
status: valid
status modified: 2019-04-23
accepted date: 2019-04-23
in scheme: BATAELValue

Manufacture of Glass - HCl - BAT60-II
type: Concept
notation: GLS-HCl-BAT60-II
definition: 3, Mineral industry: 3,4 Melting mineral substances including the production of mineral fibres with a melting capacity exceeding 20�tonnes per day; Techniques (i)-(ii) (see table); for stone wool; Reducing hydrogen chloride emissions to air. The BAT-AEL emission level is < 10 - 30 mg/Nm3.
status: valid
status modified: 2019-04-23
accepted date: 2019-04-23
in scheme: BATAELValue

Manufacture of Glass - HCl - BAT60-IV
type: Concept
notation: GLS-HCl-BAT60-IV
definition: 3, Mineral industry: 3,4 Melting mineral substances including the production of mineral fibres with a melting capacity exceeding 20�tonnes per day; Techniques (i)-(ii) (see table); for glass wool; Reducing hydrogen chloride emissions to air. The BAT-AEL emission level is < 0,01 - 0,02 kg/t.
status: valid
status modified: 2019-04-23
accepted date: 2019-04-23
in scheme: BATAELValue

Manufacture of Glass - HCl - BAT60-V
type: Concept
notation: GLS-HCl-BAT60-V
definition: 3, Mineral industry: 3,4 Melting mineral substances including the production of mineral fibres with a melting capacity exceeding 20�tonnes per day; Techniques (i)-(ii) (see table); for stone wool; Reducing hydrogen chloride emissions to air. The BAT-AEL emission level is < 0,025 - 0,075 kg/t.
status: valid
status modified: 2019-04-23
accepted date: 2019-04-23
in scheme: BATAELValue

Ferrous metals processing - BAT 24
type: Concept
notation: FMP-SOx-BAT24-III
definition: 2, Production and processing of metals: 2.3 Processing of ferrous metals for (a) operation of hot rolling mills with a capacity exceeding 20 tonnes of crude steel per hour; (c) application of protective fused metal coats with an input exceeding 2 tonnes of crude steel per hour; this includes hot dip coating and batch galvanising. 2.6 Surface treatment of ferrous metals using electrolytic or chemical processes where the volume of the treatment vats exceeds 30 m3, when it is carried out in cold rolling, wire drawing or batch galvanising. 6.11 Independently operated treatment of waste water not covered by Directive 91/271/EEC, provided that the main pollutant load originates from the activities covered by these BAT conclusions; Reducing sulphur oxides emissions to air. The BAT-AEL emission level is < 1�6 mg/Nm3.
status: valid
status modified: 2025-03-12
accepted date: 2025-03-12
in scheme: BATAELValue

Ferrous metals processing - BAT 24
type: Concept
notation: FMP-SOx-BAT24-V
definition: 2, Production and processing of metals: 2.3 Processing of ferrous metals for (a) operation of hot rolling mills with a capacity exceeding 20 tonnes of crude steel per hour; (c) application of protective fused metal coats with an input exceeding 2 tonnes of crude steel per hour; this includes hot dip coating and batch galvanising. 2.6 Surface treatment of ferrous metals using electrolytic or chemical processes where the volume of the treatment vats exceeds 30 m3, when it is carried out in cold rolling, wire drawing or batch galvanising. 6.11 Independently operated treatment of waste water not covered by Directive 91/271/EEC, provided that the main pollutant load originates from the activities covered by these BAT conclusions; Reducing sulphur oxides emissions to air. The BAT-AEL emission level is < 1�6 mg/Nm3.
status: valid
status modified: 2025-03-12
accepted date: 2025-03-12
in scheme: BATAELValue

Ferrous metals processing - BAT 31
type: Concept
notation: FMP-Sn-BAT31-XVI
definition: 2, Production and processing of metals: 2.3 Processing of ferrous metals for (a) operation of hot rolling mills with a capacity exceeding 20 tonnes of crude steel per hour; (c) application of protective fused metal coats with an input exceeding 2 tonnes of crude steel per hour; this includes hot dip coating and batch galvanising. 2.6 Surface treatment of ferrous metals using electrolytic or chemical processes where the volume of the treatment vats exceeds 30 m3, when it is carried out in cold rolling, wire drawing or batch galvanising. 6.11 Independently operated treatment of waste water not covered by Directive 91/271/EEC, provided that the main pollutant load originates from the activities covered by these BAT conclusions Reducing tin to water. The BAT-AEL emission level is 0.01�0. 2 mg/l.
status: valid
status modified: 2025-03-12
accepted date: 2025-03-12
in scheme: BATAELValue

Ferrous metals processing - BAT 31
type: Concept
notation: FMP-Sn-BAT31-XXXII
definition: 2, Production and processing of metals: 2.3 Processing of ferrous metals for (a) operation of hot rolling mills with a capacity exceeding 20 tonnes of crude steel per hour; (c) application of protective fused metal coats with an input exceeding 2 tonnes of crude steel per hour; this includes hot dip coating and batch galvanising. 2.6 Surface treatment of ferrous metals using electrolytic or chemical processes where the volume of the treatment vats exceeds 30 m3, when it is carried out in cold rolling, wire drawing or batch galvanising. 6.11 Independently operated treatment of waste water not covered by Directive 91/271/EEC, provided that the main pollutant load originates from the activities covered by these BAT conclusions Reducing tin to water. The BAT-AEL emission level is 0.01�0. 2 mg/l.
status: valid
status modified: 2025-03-12
accepted date: 2025-03-12
in scheme: BATAELValue

Ferrous metals processing - BAT 31
type: Concept
notation: FMP-TOC-BAT31-II
definition: 2, Production and processing of metals: 2.3 Processing of ferrous metals for (a) operation of hot rolling mills with a capacity exceeding 20 tonnes of crude steel per hour; (c) application of protective fused metal coats with an input exceeding 2 tonnes of crude steel per hour; this includes hot dip coating and batch galvanising. 2.6 Surface treatment of ferrous metals using electrolytic or chemical processes where the volume of the treatment vats exceeds 30 m3, when it is carried out in cold rolling, wire drawing or batch galvanising. 6.11 Independently operated treatment of waste water not covered by Directive 91/271/EEC, provided that the main pollutant load originates from the activities covered by these BAT conclusions Reducing total organic carbon to water. The BAT-AEL emission level is 10�30 mg/l.
status: valid
status modified: 2025-03-12
accepted date: 2025-03-12
in scheme: BATAELValue

Ferrous metals processing - BAT 31
type: Concept
notation: FMP-TSS-BAT31-I
definition: 2, Production and processing of metals: 2.3 Processing of ferrous metals for (a) operation of hot rolling mills with a capacity exceeding 20 tonnes of crude steel per hour; (c) application of protective fused metal coats with an input exceeding 2 tonnes of crude steel per hour; this includes hot dip coating and batch galvanising. 2.6 Surface treatment of ferrous metals using electrolytic or chemical processes where the volume of the treatment vats exceeds 30 m3, when it is carried out in cold rolling, wire drawing or batch galvanising. 6.11 Independently operated treatment of waste water not covered by Directive 91/271/EEC, provided that the main pollutant load originates from the activities covered by these BAT conclusions Reducing total suspended solids to water. The BAT-AEL emission level is 5�30 mg/l.
status: valid
status modified: 2025-03-12
accepted date: 2025-03-12
in scheme: BATAELValue

Manufacture of Glass - HCl - BAT68-I
type: Concept
notation: GLS-HCl-BAT68-I
definition: 3, Mineral industry: 3,4 Melting mineral substances including the production of mineral fibres with a melting capacity exceeding 20�tonnes per day; Raw materials selection for batch formulation with low content of chlorine and fluorine; Reducing hydrogen chloride emissions to air. The BAT-AEL emission level is < 10 mg/Nm3.
status: valid
status modified: 2019-04-23
accepted date: 2019-04-23
in scheme: BATAELValue

Manufacture of Glass - HCl - BAT74-I
type: Concept
notation: GLS-HCl-BAT74-I
definition: 3, Mineral industry: 3,4 Melting mineral substances including the production of mineral fibres with a melting capacity exceeding 20�tonnes per day; Techniques (i)-(iii) (see table); Reducing hydrogen chloride emissions to air. The BAT-AEL emission level is < 10 mg/Nm3.
status: valid
status modified: 2019-04-23
accepted date: 2019-04-23
in scheme: BATAELValue

Manufacture of Glass - HCl - BAT74-III
type: Concept
notation: GLS-HCl-BAT74-III
definition: 3, Mineral industry: 3,4 Melting mineral substances including the production of mineral fibres with a melting capacity exceeding 20�tonnes per day; Techniques (i)-(iii) (see table); Reducing hydrogen chloride emissions to air. The BAT-AEL emission level is < 0,05 kg/t.
status: valid
status modified: 2019-04-23
accepted date: 2019-04-23
in scheme: BATAELValue

Manufacture of Glass - HF - BAT20-II
type: Concept
notation: GLS-HF-BAT20-II
definition: 3, Mineral industry: 3,3 Manufacture of glass including glass fibre with a melting capacity exceeding 20 tonnes per day; Techniques (i)-(ii) (see table); Reducing hydrogen fluoride emissions to air. The BAT-AEL emission level is < 1 - 5 mg/Nm3.
status: valid
status modified: 2019-04-23
accepted date: 2019-04-23
in scheme: BATAELValue

Manufacture of Glass - HF - BAT20-IV
type: Concept
notation: GLS-HF-BAT20-IV
definition: 3, Mineral industry: 3,3 Manufacture of glass including glass fibre with a melting capacity exceeding 20 tonnes per day; Techniques (i)-(ii) (see table); Reducing hydrogen fluoride emissions to air. The BAT-AEL emission level is 0,001 - 0,008 kg/t.
status: valid
status modified: 2019-04-23
accepted date: 2019-04-23
in scheme: BATAELValue

Ferrous metals processing - BAT 48
type: Concept
notation: FMP-TVOC-BAT48
definition: 2, Production and processing of metals: 2.3 Processing of ferrous metals for (a) operation of hot rolling mills with a capacity exceeding 20 tonnes of crude steel per hour; (c) application of protective fused metal coats with an input exceeding 2 tonnes of crude steel per hour; this includes hot dip coating and batch galvanising. 2.6 Surface treatment of ferrous metals using electrolytic or chemical processes where the volume of the treatment vats exceeds 30 m3, when it is carried out in cold rolling, wire drawing or batch galvanising. 6.11 Independently operated treatment of waste water not covered by Directive 91/271/EEC, provided that the main pollutant load originates from the activities covered by these BAT conclusions; Reducing total volatile organic compounds emissions to air. The BAT-AEL emission level is < 3�8 mg/Nm3.
status: valid
status modified: 2025-03-12
accepted date: 2025-03-12
in scheme: BATAELValue

Ferrous metals processing - BAT 31
type: Concept
notation: FMP-Zn-BAT31-XVII
definition: 2, Production and processing of metals: 2.3 Processing of ferrous metals for (a) operation of hot rolling mills with a capacity exceeding 20 tonnes of crude steel per hour; (c) application of protective fused metal coats with an input exceeding 2 tonnes of crude steel per hour; this includes hot dip coating and batch galvanising. 2.6 Surface treatment of ferrous metals using electrolytic or chemical processes where the volume of the treatment vats exceeds 30 m3, when it is carried out in cold rolling, wire drawing or batch galvanising. 6.11 Independently operated treatment of waste water not covered by Directive 91/271/EEC, provided that the main pollutant load originates from the activities covered by these BAT conclusions Reducing zinc to water. The BAT-AEL emission level is 0.05�1 mg/l.
status: valid
status modified: 2025-03-12
accepted date: 2025-03-12
in scheme: BATAELValue

Ferrous metals processing - BAT 31
type: Concept
notation: FMP-Zn-BAT31-XXXIII
definition: 2, Production and processing of metals: 2.3 Processing of ferrous metals for (a) operation of hot rolling mills with a capacity exceeding 20 tonnes of crude steel per hour; (c) application of protective fused metal coats with an input exceeding 2 tonnes of crude steel per hour; this includes hot dip coating and batch galvanising. 2.6 Surface treatment of ferrous metals using electrolytic or chemical processes where the volume of the treatment vats exceeds 30 m3, when it is carried out in cold rolling, wire drawing or batch galvanising. 6.11 Independently operated treatment of waste water not covered by Directive 91/271/EEC, provided that the main pollutant load originates from the activities covered by these BAT conclusions Reducing zinc to water. The BAT-AEL emission level is 0.05�1 mg/l.
status: valid
status modified: 2025-03-12
accepted date: 2025-03-12
in scheme: BATAELValue

Manufacture of Glass - HF - BAT28-II
type: Concept
notation: GLS-HF-BAT28-II
definition: 3, Mineral industry: 3,3 Manufacture of glass including glass fibre with a melting capacity exceeding 20 tonnes per day; Techniques (i)-(ii) (see table); Reducing hydrogen fluoride emissions to air. The BAT-AEL emission level is < 1 - 4 mg/Nm3.
status: valid
status modified: 2019-04-23
accepted date: 2019-04-23
in scheme: BATAELValue

Manufacture of Glass - HF - BAT28-IV
type: Concept
notation: GLS-HF-BAT28-IV
definition: 3, Mineral industry: 3,3 Manufacture of glass including glass fibre with a melting capacity exceeding 20 tonnes per day; Techniques (i)-(ii) (see table); Reducing hydrogen fluoride emissions to air. The BAT-AEL emission level is < 0,0025 - 0,01 kg/t.
status: valid
status modified: 2019-04-23
accepted date: 2019-04-23
in scheme: BATAELValue

Manufacture of Glass - HF - BAT31-III
type: Concept
notation: GLS-HF-BAT31-III
definition: 3, Mineral industry: 3,3 Manufacture of glass including glass fibre with a melting capacity exceeding 20 tonnes per day; Techniques (i)-(iv) (see table); Reducing hydrogen fluoride emissions to air. The BAT-AEL emission level is < 1 - 5 mg/Nm3.
status: valid
status modified: 2019-04-23
accepted date: 2019-04-23
in scheme: BATAELValue

Manufacture of Glass - HF - BAT35-II
type: Concept
notation: GLS-HF-BAT35-II
definition: 3, Mineral industry: 3,3 Manufacture of glass including glass fibre with a melting capacity exceeding 20 tonnes per day; Techniques (i)-(iv) (see table); Reducing hydrogen fluoride emissions to air. The BAT-AEL emission level is < 5 - 15 mg/Nm3.
status: valid
status modified: 2019-04-23
accepted date: 2019-04-23
in scheme: BATAELValue

Manufacture of Glass - HF - BAT35-IV
type: Concept
notation: GLS-HF-BAT35-IV
definition: 3, Mineral industry: 3,3 Manufacture of glass including glass fibre with a melting capacity exceeding 20 tonnes per day; Techniques (i)-(iv) (see table); Reducing hydrogen fluoride emissions to air. The BAT-AEL emission level is < 0,02 - 0,07 kg/t.
status: valid
status modified: 2019-04-23
accepted date: 2019-04-23
in scheme: BATAELValue

Manufacture of Glass - HF - BAT42-II
type: Concept
notation: GLS-HF-BAT42-II
definition: 3, Mineral industry: 3,3 Manufacture of glass including glass fibre with a melting capacity exceeding 20 tonnes per day; Techniques (i)-(iv) (see table); Reducing hydrogen fluoride emissions to air. The BAT-AEL emission level is < 1 - 5 mg/Nm3.
status: valid
status modified: 2019-04-23
accepted date: 2019-04-23
in scheme: BATAELValue

Manufacture of Glass - HF - BAT42-IV
type: Concept
notation: GLS-HF-BAT42-IV
definition: 3, Mineral industry: 3,3 Manufacture of glass including glass fibre with a melting capacity exceeding 20 tonnes per day; Techniques (i)-(iv) (see table); Reducing hydrogen fluoride emissions to air. The BAT-AEL emission level is < 0,003 - 0,015 kg/t.
status: valid
status modified: 2019-04-23
accepted date: 2019-04-23
in scheme: BATAELValue

Manufacture of Glass - HF - BAT47
type: Concept
notation: GLS-HF-BAT47
definition: 3, Mineral industry: 3,3 Manufacture of glass including glass fibre with a melting capacity exceeding 20 tonnes per day; Techniques (i)-(ii) (see table); Reducing hydrogen fluoride emissions to air. The BAT-AEL emission level is < 5 mg/Nm3.
status: valid
status modified: 2019-04-23
accepted date: 2019-04-23
in scheme: BATAELValue

Manufacture of Glass - HF - BAT52-II
type: Concept
notation: GLS-HF-BAT52-II
definition: 3, Mineral industry: 3,3 Manufacture of glass including glass fibre with a melting capacity exceeding 20 tonnes per day; Techniques (i)-(iii) (see table); Reducing hydrogen fluoride emissions to air. The BAT-AEL emission level is < 1 - 5 mg/Nm3.
status: valid
status modified: 2019-04-23
accepted date: 2019-04-23
in scheme: BATAELValue

Manufacture of Glass - HF - BAT52-IV
type: Concept
notation: GLS-HF-BAT52-IV
definition: 3, Mineral industry: 3,3 Manufacture of glass including glass fibre with a melting capacity exceeding 20 tonnes per day; Techniques (i)-(iii) (see table); Reducing hydrogen fluoride emissions to air. The BAT-AEL emission level is < 0,003 - 0,04 kg/t.
status: valid
status modified: 2019-04-23
accepted date: 2019-04-23
in scheme: BATAELValue

Manufacture of Glass - HF - BAT55
type: Concept
notation: GLS-HF-BAT55
definition: 3, Mineral industry: 3,3 Manufacture of glass including glass fibre with a melting capacity exceeding 20 tonnes per day; Techniques (i)-(ii) (see table); Reducing hydrogen fluoride emissions to air. The BAT-AEL emission level is < 5 mg/Nm3.
status: valid
status modified: 2019-04-23
accepted date: 2019-04-23
in scheme: BATAELValue

Manufacture of Glass - HF - BAT60-III
type: Concept
notation: GLS-HF-BAT60-III
definition: 3, Mineral industry: 3,4 Melting mineral substances including the production of mineral fibres with a melting capacity exceeding 20�tonnes per day; Techniques (i)-(ii) (see table); for all products; Reducing hydrogen fluoride emissions to air. The BAT-AEL emission level is < 1 - 5 mg/Nm3.
status: valid
status modified: 2019-04-23
accepted date: 2019-04-23
in scheme: BATAELValue

Manufacture of Glass - HF - BAT60-VI
type: Concept
notation: GLS-HF-BAT60-VI
definition: 3, Mineral industry: 3,4 Melting mineral substances including the production of mineral fibres with a melting capacity exceeding 20�tonnes per day; Techniques (i)-(ii) (see table); for all products; Reducing hydrogen fluoride emissions to air. The BAT-AEL emission level is < 0,002 - 0,013 kg/t.
status: valid
status modified: 2019-04-23
accepted date: 2019-04-23
in scheme: BATAELValue

Manufacture of Glass - HF - BAT68-II
type: Concept
notation: GLS-HF-BAT68-II
definition: 3, Mineral industry: 3,4 Melting mineral substances including the production of mineral fibres with a melting capacity exceeding 20�tonnes per day; Raw materials selection for batch formulation with low content of chlorine and fluorine; Reducing hydrogen fluoride emissions to air. The BAT-AEL emission level is < 5 mg/Nm3.
status: valid
status modified: 2019-04-23
accepted date: 2019-04-23
in scheme: BATAELValue

Manufacture of Glass - HF - BAT74-II
type: Concept
notation: GLS-HF-BAT74-II
definition: 3, Mineral industry: 3,4 Melting mineral substances including the production of mineral fibres with a melting capacity exceeding 20�tonnes per day; Techniques (i)-(iii) (see table); Reducing hydrogen fluoride emissions to air. The BAT-AEL emission level is < 5 mg/Nm3.
status: valid
status modified: 2019-04-23
accepted date: 2019-04-23
in scheme: BATAELValue

Manufacture of Glass - HF - BAT74-IV
type: Concept
notation: GLS-HF-BAT74-IV
definition: 3, Mineral industry: 3,4 Melting mineral substances including the production of mineral fibres with a melting capacity exceeding 20�tonnes per day; Techniques (i)-(iii) (see table); Reducing hydrogen fluoride emissions to air. The BAT-AEL emission level is < 0,03 kg/t.
status: valid
status modified: 2019-04-23
accepted date: 2019-04-23
in scheme: BATAELValue

Manufacture of Glass - Metals - BAT21-I
type: Concept
notation: GLS-Metals-BAT21-I
definition: 3, Mineral industry: 3,3 Manufacture of glass including glass fibre with a melting capacity exceeding 20 tonnes per day; Techniques (i)-(iv) (see table); Reducing metals emissions to air. The BAT-AEL emission level is < 0,2 - 1 mg/Nm3.
status: valid
status modified: 2019-04-23
accepted date: 2019-04-23
in scheme: BATAELValue

Manufacture of Glass - Metals - BAT21-II
type: Concept
notation: GLS-Metals-BAT21-II
definition: 3, Mineral industry: 3,3 Manufacture of glass including glass fibre with a melting capacity exceeding 20 tonnes per day; Techniques (i)-(iv) (see table); Reducing metals emissions to air. The BAT-AEL emission level is < 1 - 5 mg/Nm3.
status: valid
status modified: 2019-04-23
accepted date: 2019-04-23
in scheme: BATAELValue

Manufacture of Glass - Metals - BAT21-III
type: Concept
notation: GLS-Metals-BAT21-III
definition: 3, Mineral industry: 3,3 Manufacture of glass including glass fibre with a melting capacity exceeding 20 tonnes per day; Techniques (i)-(iv) (see table); Reducing metals emissions to air. The BAT-AEL emission level is < 0,0003 - 0,0015 kg/t.
status: valid
status modified: 2019-04-23
accepted date: 2019-04-23
in scheme: BATAELValue

Manufacture of Glass - Metals - BAT21-IV
type: Concept
notation: GLS-Metals-BAT21-IV
definition: 3, Mineral industry: 3,3 Manufacture of glass including glass fibre with a melting capacity exceeding 20 tonnes per day; Techniques (i)-(iv) (see table); Reducing metals emissions to air. The BAT-AEL emission level is < 0,0015 - 0,0075 kg/t.
status: valid
status modified: 2019-04-23
accepted date: 2019-04-23
in scheme: BATAELValue

Manufacture of Glass - Metals - BAT29-I
type: Concept
notation: GLS-Metals-BAT29-I
definition: 3, Mineral industry: 3,3 Manufacture of glass including glass fibre with a melting capacity exceeding 20 tonnes per day; Techniques (i)-(iii) (see table); Reducing metals emissions to air. The BAT-AEL emission level is < 0,2 - 1 mg/Nm3.
status: valid
status modified: 2019-04-23
accepted date: 2019-04-23
in scheme: BATAELValue

Manufacture of Glass - Metals - BAT29-II
type: Concept
notation: GLS-Metals-BAT29-II
definition: 3, Mineral industry: 3,3 Manufacture of glass including glass fibre with a melting capacity exceeding 20 tonnes per day; Techniques (i)-(iii) (see table); Reducing metals emissions to air. The BAT-AEL emission level is < 1 - 5 mg/Nm3.
status: valid
status modified: 2019-04-23
accepted date: 2019-04-23
in scheme: BATAELValue

Manufacture of Glass - Metals - BAT29-III
type: Concept
notation: GLS-Metals-BAT29-III
definition: 3, Mineral industry: 3,3 Manufacture of glass including glass fibre with a melting capacity exceeding 20 tonnes per day; Techniques (i)-(iii) (see table); Reducing metals emissions to air. The BAT-AEL emission level is < 0,0005 - 0,0025 kg/t.
status: valid
status modified: 2019-04-23
accepted date: 2019-04-23
in scheme: BATAELValue

Manufacture of Glass - Metals - BAT29-IV
type: Concept
notation: GLS-Metals-BAT29-IV
definition: 3, Mineral industry: 3,3 Manufacture of glass including glass fibre with a melting capacity exceeding 20 tonnes per day; Techniques (i)-(iii) (see table); Reducing metals emissions to air. The BAT-AEL emission level is < 0,0025 - 0,0125 kg/t.
status: valid
status modified: 2019-04-23
accepted date: 2019-04-23
in scheme: BATAELValue

Manufacture of Glass - Metals - BAT31-V
type: Concept
notation: GLS-Metals-BAT31-V
definition: 3, Mineral industry: 3,3 Manufacture of glass including glass fibre with a melting capacity exceeding 20 tonnes per day; Techniques (i)-(iv) (see table); Reducing metals emissions to air. The BAT-AEL emission level is < 1 mg/Nm3.
status: valid
status modified: 2019-04-23
accepted date: 2019-04-23
in scheme: BATAELValue

Manufacture of Glass - Metals - BAT31-VI
type: Concept
notation: GLS-Metals-BAT31-VI
definition: 3, Mineral industry: 3,3 Manufacture of glass including glass fibre with a melting capacity exceeding 20 tonnes per day; Techniques (i)-(iv) (see table); Reducing metals emissions to air. The BAT-AEL emission level is < 5 mg/Nm3.
status: valid
status modified: 2019-04-23
accepted date: 2019-04-23
in scheme: BATAELValue

Manufacture of Glass - Metals - BAT36-I
type: Concept
notation: GLS-Metals-BAT36-I
definition: 3, Mineral industry: 3,3 Manufacture of glass including glass fibre with a melting capacity exceeding 20 tonnes per day; Techniques (i)-(iii) (see table); Reducing metals emissions to air. The BAT-AEL emission level is < 0,2 - 1 mg/Nm3.
status: valid
status modified: 2019-04-23
accepted date: 2019-04-23
in scheme: BATAELValue

Manufacture of Glass - Metals - BAT36-II
type: Concept
notation: GLS-Metals-BAT36-II
definition: 3, Mineral industry: 3,3 Manufacture of glass including glass fibre with a melting capacity exceeding 20 tonnes per day; Techniques (i)-(iii) (see table); Reducing metals emissions to air. The BAT-AEL emission level is < 1 - 3 mg/Nm3.
status: valid
status modified: 2019-04-23
accepted date: 2019-04-23
in scheme: BATAELValue

Manufacture of Glass - Metals - BAT36-III
type: Concept
notation: GLS-Metals-BAT36-III
definition: 3, Mineral industry: 3,3 Manufacture of glass including glass fibre with a melting capacity exceeding 20 tonnes per day; Techniques (i)-(iii) (see table); Reducing metals emissions to air. The BAT-AEL emission level is < 0,0009 - 0,0045 kg/t.
status: valid
status modified: 2019-04-23
accepted date: 2019-04-23
in scheme: BATAELValue

Manufacture of Glass - Metals - BAT36-IV
type: Concept
notation: GLS-Metals-BAT36-IV
definition: 3, Mineral industry: 3,3 Manufacture of glass including glass fibre with a melting capacity exceeding 20 tonnes per day; Techniques (i)-(iii) (see table); Reducing metals emissions to air. The BAT-AEL emission level is < 0,0045 - 0,0135 kg/t.
status: valid
status modified: 2019-04-23
accepted date: 2019-04-23
in scheme: BATAELValue

Manufacture of Glass - Metals - BAT43-I
type: Concept
notation: GLS-Metals-BAT43-I
definition: 3, Mineral industry: 3,3 Manufacture of glass including glass fibre with a melting capacity exceeding 20 tonnes per day; Techniques (i)-(iii) (see table); Reducing metals emissions to air. The BAT-AEL emission level is < 0,2 - 1 mg/Nm3.
status: valid
status modified: 2019-04-23
accepted date: 2019-04-23
in scheme: BATAELValue

Manufacture of Glass - Metals - BAT43-II
type: Concept
notation: GLS-Metals-BAT43-II
definition: 3, Mineral industry: 3,3 Manufacture of glass including glass fibre with a melting capacity exceeding 20 tonnes per day; Techniques (i)-(iii) (see table); Reducing metals emissions to air. The BAT-AEL emission level is < 1 - 5 mg/Nm3.
status: valid
status modified: 2019-04-23
accepted date: 2019-04-23
in scheme: BATAELValue

Manufacture of Glass - Metals - BAT43-III
type: Concept
notation: GLS-Metals-BAT43-III
definition: 3, Mineral industry: 3,3 Manufacture of glass including glass fibre with a melting capacity exceeding 20 tonnes per day; Techniques (i)-(iii) (see table); Reducing metals emissions to air. The BAT-AEL emission level is < 0,0006 - 0,003 kg/t.
status: valid
status modified: 2019-04-23
accepted date: 2019-04-23
in scheme: BATAELValue

Manufacture of Glass - Metals - BAT43-IV
type: Concept
notation: GLS-Metals-BAT43-IV
definition: 3, Mineral industry: 3,3 Manufacture of glass including glass fibre with a melting capacity exceeding 20 tonnes per day; Techniques (i)-(iii) (see table); Reducing metals emissions to air. The BAT-AEL emission level is < 0,003 - 0,015 kg/t.
status: valid
status modified: 2019-04-23
accepted date: 2019-04-23
in scheme: BATAELValue

Manufacture of Glass - Metals - BAT46-II
type: Concept
notation: GLS-Metals-BAT46-II
definition: 3, Mineral industry: 3,3 Manufacture of glass including glass fibre with a melting capacity exceeding 20 tonnes per day; Techniques (i)-(ii) (see table); Reducing metals emissions to air. The BAT-AEL emission level is < 1 mg/Nm3.
status: valid
status modified: 2019-04-23
accepted date: 2019-04-23
in scheme: BATAELValue

Manufacture of Glass - Metals - BAT46-III
type: Concept
notation: GLS-Metals-BAT46-III
definition: 3, Mineral industry: 3,3 Manufacture of glass including glass fibre with a melting capacity exceeding 20 tonnes per day; Techniques (i)-(ii) (see table); Reducing metals emissions to air. The BAT-AEL emission level is < 1 - 5 mg/Nm3.
status: valid
status modified: 2019-04-23
accepted date: 2019-04-23
in scheme: BATAELValue

Manufacture of Glass - Metals - BAT53-I
type: Concept
notation: GLS-Metals-BAT53-I
definition: 3, Mineral industry: 3,3 Manufacture of glass including glass fibre with a melting capacity exceeding 20 tonnes per day; Techniques (i)-(iii) (see table); Reducing metals emissions to air. The BAT-AEL emission level is < 0,1 - 1 mg/Nm3.
status: valid
status modified: 2019-04-23
accepted date: 2019-04-23
in scheme: BATAELValue

Manufacture of Glass - Metals - BAT53-II
type: Concept
notation: GLS-Metals-BAT53-II
definition: 3, Mineral industry: 3,3 Manufacture of glass including glass fibre with a melting capacity exceeding 20 tonnes per day; Techniques (i)-(iii) (see table); Reducing metals emissions to air. The BAT-AEL emission level is < 1 - 5 mg/Nm3.
status: valid
status modified: 2019-04-23
accepted date: 2019-04-23
in scheme: BATAELValue

Manufacture of Glass - Metals - BAT53-III
type: Concept
notation: GLS-Metals-BAT53-III
definition: 3, Mineral industry: 3,3 Manufacture of glass including glass fibre with a melting capacity exceeding 20 tonnes per day; Techniques (i)-(iii) (see table); Reducing metals emissions to air. The BAT-AEL emission level is < 0,0003 - 0,003 kg/t.
status: valid
status modified: 2019-04-23
accepted date: 2019-04-23
in scheme: BATAELValue

Manufacture of Glass - Metals - BAT53-IV
type: Concept
notation: GLS-Metals-BAT53-IV
definition: 3, Mineral industry: 3,3 Manufacture of glass including glass fibre with a melting capacity exceeding 20 tonnes per day; Techniques (i)-(iii) (see table); Reducing metals emissions to air. The BAT-AEL emission level is < 0,003 - 0,015 kg/t.
status: valid
status modified: 2019-04-23
accepted date: 2019-04-23
in scheme: BATAELValue

Manufacture of Glass - Metals - BAT54-II
type: Concept
notation: GLS-Metals-BAT54-II
definition: 3, Mineral industry: 3,3 Manufacture of glass including glass fibre with a melting capacity exceeding 20 tonnes per day; Techniques (i)-(ii) (see table); Reducing metals emissions to air. The BAT-AEL emission level is < 1 mg/Nm3.
status: valid
status modified: 2019-04-23
accepted date: 2019-04-23
in scheme: BATAELValue

Manufacture of Glass - Metals - BAT54-III
type: Concept
notation: GLS-Metals-BAT54-III
definition: 3, Mineral industry: 3,3 Manufacture of glass including glass fibre with a melting capacity exceeding 20 tonnes per day; Techniques (i)-(ii) (see table); Reducing metals emissions to air. The BAT-AEL emission level is < 1 - 5 mg/Nm3.
status: valid
status modified: 2019-04-23
accepted date: 2019-04-23
in scheme: BATAELValue

Manufacture of Glass - Metals - BAT62-I
type: Concept
notation: GLS-Metals-BAT62-I
definition: 3, Mineral industry: 3,4 Melting mineral substances including the production of mineral fibres with a melting capacity exceeding 20�tonnes per day; Techniques (i)-(ii) (see table); Reducing metals emissions to air. The BAT-AEL emission level is < 0,2 - 1 mg/Nm3.
status: valid
status modified: 2019-04-23
accepted date: 2019-04-23
in scheme: BATAELValue

Manufacture of Glass - Metals - BAT62-II
type: Concept
notation: GLS-Metals-BAT62-II
definition: 3, Mineral industry: 3,4 Melting mineral substances including the production of mineral fibres with a melting capacity exceeding 20�tonnes per day; Techniques (i)-(ii) (see table); Reducing metals emissions to air. The BAT-AEL emission level is < 1 - 2 mg/Nm3.
status: valid
status modified: 2019-04-23
accepted date: 2019-04-23
in scheme: BATAELValue

Manufacture of Glass - Metals - BAT62-III
type: Concept
notation: GLS-Metals-BAT62-III
definition: 3, Mineral industry: 3,4 Melting mineral substances including the production of mineral fibres with a melting capacity exceeding 20�tonnes per day; Techniques (i)-(ii) (see table); Reducing metals emissions to air. The BAT-AEL emission level is < 0,0004 - 0,0025 kg/t.
status: valid
status modified: 2019-04-23
accepted date: 2019-04-23
in scheme: BATAELValue

Manufacture of Glass - Metals - BAT62-IV
type: Concept
notation: GLS-Metals-BAT62-IV
definition: 3, Mineral industry: 3,4 Melting mineral substances including the production of mineral fibres with a melting capacity exceeding 20�tonnes per day; Techniques (i)-(ii) (see table); Reducing metals emissions to air. The BAT-AEL emission level is < 0,002 - 0,005 kg/t.
status: valid
status modified: 2019-04-23
accepted date: 2019-04-23
in scheme: BATAELValue

Manufacture of Glass - Metals - BAT69-I
type: Concept
notation: GLS-Metals-BAT69-I
definition: 3, Mineral industry: 3,4 Melting mineral substances including the production of mineral fibres with a melting capacity exceeding 20�tonnes per day; Techniques (i)-(ii) (see table); Reducing metals emissions to air. The BAT-AEL emission level is < 1 mg/Nm3.
status: valid
status modified: 2019-04-23
accepted date: 2019-04-23
in scheme: BATAELValue

Manufacture of Glass - Metals - BAT69-II
type: Concept
notation: GLS-Metals-BAT69-II
definition: 3, Mineral industry: 3,4 Melting mineral substances including the production of mineral fibres with a melting capacity exceeding 20�tonnes per day; Techniques (i)-(ii) (see table); Reducing metals emissions to air. The BAT-AEL emission level is < 5 mg/Nm3.
status: valid
status modified: 2019-04-23
accepted date: 2019-04-23
in scheme: BATAELValue

Manufacture of Glass - Metals - BAT75-I
type: Concept
notation: GLS-Metals-BAT75-I
definition: 3, Mineral industry: 3,4 Melting mineral substances including the production of mineral fibres with a melting capacity exceeding 20�tonnes per day; Techniques (i)-(iii) (see table); Reducing metals emissions to air. The BAT-AEL emission level is < 1 mg/Nm3.
status: valid
status modified: 2019-04-23
accepted date: 2019-04-23
in scheme: BATAELValue

Manufacture of Glass - Metals - BAT75-II
type: Concept
notation: GLS-Metals-BAT75-II
definition: 3, Mineral industry: 3,4 Melting mineral substances including the production of mineral fibres with a melting capacity exceeding 20�tonnes per day; Techniques (i)-(iii) (see table); Reducing metals emissions to air. The BAT-AEL emission level is < 5 mg/Nm3.
status: valid
status modified: 2019-04-23
accepted date: 2019-04-23
in scheme: BATAELValue

Manufacture of Glass - Metals - BAT75-III
type: Concept
notation: GLS-Metals-BAT75-III
definition: 3, Mineral industry: 3,4 Melting mineral substances including the production of mineral fibres with a melting capacity exceeding 20�tonnes per day; Techniques (i)-(iii) (see table); Reducing metals emissions to air. The BAT-AEL emission level is < 0,0075 kg/t.
status: valid
status modified: 2019-04-23
accepted date: 2019-04-23
in scheme: BATAELValue

Manufacture of Glass - Metals - BAT75-IV
type: Concept
notation: GLS-Metals-BAT75-IV
definition: 3, Mineral industry: 3,4 Melting mineral substances including the production of mineral fibres with a melting capacity exceeding 20�tonnes per day; Techniques (i)-(iii) (see table); Reducing metals emissions to air. The BAT-AEL emission level is < 0,037 kg/t.
status: valid
status modified: 2019-04-23
accepted date: 2019-04-23
in scheme: BATAELValue

Manufacture of Glass - Metals - BAT76-II
type: Concept
notation: GLS-Metals-BAT76-II
definition: 3, Mineral industry: 3,4 Melting mineral substances including the production of mineral fibres with a melting capacity exceeding 20�tonnes per day; Techniques (i)-(iii) (see table); Reducing metals emissions to air. The BAT-AEL emission level is < 1 mg/Nm3.
status: valid
status modified: 2019-04-23
accepted date: 2019-04-23
in scheme: BATAELValue

Manufacture of Glass - Metals - BAT76-III
type: Concept
notation: GLS-Metals-BAT76-III
definition: 3, Mineral industry: 3,4 Melting mineral substances including the production of mineral fibres with a melting capacity exceeding 20�tonnes per day; Techniques (i)-(iii) (see table); Reducing metals emissions to air. The BAT-AEL emission level is < 5 mg/Nm3.
status: valid
status modified: 2019-04-23
accepted date: 2019-04-23
in scheme: BATAELValue

Manufacture of Glass - NH3 - BAT10
type: Concept
notation: GLS-NH3-BAT10
definition: 3, Mineral industry: 3,3 Manufacture of glass including glass fibre with a melting capacity exceeding 20 tonnes per day; SCR or SNCR; Reducing ammonia (NH3) emissions to air. The BAT-AEL emission level is < 5 - 30 mg/Nm3.
status: valid
status modified: 2019-04-23
accepted date: 2019-04-23
in scheme: BATAELValue

Manufacture of Glass - NH3 - BAT37-III
type: Concept
notation: GLS-NH3-BAT37-III
definition: 3, Mineral industry: 3,3 Manufacture of glass including glass fibre with a melting capacity exceeding 20 tonnes per day; Techniques (i)-(iii) (see table); Reducing ammonia emissions to air. The BAT-AEL emission level is < 30 mg/Nm3.
status: valid
status modified: 2019-04-23
accepted date: 2019-04-23
in scheme: BATAELValue

Manufacture of Glass - NH3 - BAT63-IV
type: Concept
notation: GLS-NH3-BAT63-IV
definition: 3, Mineral industry: 3,4 Melting mineral substances including the production of mineral fibres with a melting capacity exceeding 20�tonnes per day; Techniques (i)-(v) (see table); Reducing ammonia emissions to air. The BAT-AEL emission level is 30 - 60 mg/Nm3.
status: valid
status modified: 2019-04-23
accepted date: 2019-04-23
in scheme: BATAELValue

Manufacture of Glass - NH3 - BAT63-X
type: Concept
notation: GLS-NH3-BAT63-X
definition: 3, Mineral industry: 3,4 Melting mineral substances including the production of mineral fibres with a melting capacity exceeding 20�tonnes per day; Techniques (i)-(v) (see table); Reducing ammonia emissions to air. The BAT-AEL emission level is < 20 - 60 mg/Nm3.
status: valid
status modified: 2019-04-23
accepted date: 2019-04-23
in scheme: BATAELValue

Manufacture of Glass - NH3 - BAT63-XVII
type: Concept
notation: GLS-NH3-BAT63-XVII
definition: 3, Mineral industry: 3,4 Melting mineral substances including the production of mineral fibres with a melting capacity exceeding 20�tonnes per day; Techniques (i)-(v) (see table); Reducing ammonia emissions to air. The BAT-AEL emission level is < 0,4 kg/t.
status: valid
status modified: 2019-04-23
accepted date: 2019-04-23
in scheme: BATAELValue

Manufacture of Glass - NH4 - BAT13-XVII
type: Concept
notation: GLS-NH4-BAT13-XVII
definition: 3, Mineral industry: 3,3 Manufacture of glass including glass fibre with a melting capacity exceeding 20 tonnes per day Reducing ammonia to water. The BAT-AEL emission level is < 10 mg/l.
status: valid
status modified: 2019-04-23
accepted date: 2019-04-23
in scheme: BATAELValue

Manufacture of Glass - NO2 - BAT17-I
type: Concept
notation: GLS-NO2-BAT17-I
definition: 3, Mineral industry: 3,3 Manufacture of glass including glass fibre with a melting capacity exceeding 20 tonnes per day; I. Primary techniques: Combustion modifications (i), special furnace design (ii); Reducing nitrogen oxides (NOx) emissions to air. The BAT-AEL emission level is 500 - 800 mg/Nm3.
status: valid
status modified: 2019-04-23
accepted date: 2019-04-23
in scheme: BATAELValue

Manufacture of Glass - NO2 - BAT17-II
type: Concept
notation: GLS-NO2-BAT17-II
definition: 3, Mineral industry: 3,3 Manufacture of glass including glass fibre with a melting capacity exceeding 20 tonnes per day; I. Primary techniques: Electric melting (iii); Reducing nitrogen oxides (NOx) emissions to air. The BAT-AEL emission level is < 100 mg/Nm3.
status: valid
status modified: 2019-04-23
accepted date: 2019-04-23
in scheme: BATAELValue

Manufacture of Glass - NO2 - BAT17-III
type: Concept
notation: GLS-NO2-BAT17-III
definition: 3, Mineral industry: 3,3 Manufacture of glass including glass fibre with a melting capacity exceeding 20 tonnes per day; II. Secondary techniques; Reducing nitrogen oxides (NOx) emissions to air. The BAT-AEL emission level is < 500 mg/Nm3.
status: valid
status modified: 2019-04-23
accepted date: 2019-04-23
in scheme: BATAELValue

Manufacture of Glass - NO2 - BAT17-IV
type: Concept
notation: GLS-NO2-BAT17-IV
definition: 3, Mineral industry: 3,3 Manufacture of glass including glass fibre with a melting capacity exceeding 20 tonnes per day; I. Primary techniques: Combustion modifications (i), special furnace design (ii); Reducing nitrogen oxides (NOx) emissions to air. The BAT-AEL emission level is 0,75 - 1,2 kg/t.
status: valid
status modified: 2019-04-23
accepted date: 2019-04-23
in scheme: BATAELValue

Manufacture of Glass - NO2 - BAT17-V
type: Concept
notation: GLS-NO2-BAT17-V
definition: 3, Mineral industry: 3,3 Manufacture of glass including glass fibre with a melting capacity exceeding 20 tonnes per day; I. Primary techniques: Electric melting (iii); Reducing nitrogen oxides (NOx) emissions to air. The BAT-AEL emission level is < 0,3 kg/t.
status: valid
status modified: 2019-04-23
accepted date: 2019-04-23
in scheme: BATAELValue

Manufacture of Glass - NO2 - BAT17-VI
type: Concept
notation: GLS-NO2-BAT17-VI
definition: 3, Mineral industry: 3,3 Manufacture of glass including glass fibre with a melting capacity exceeding 20 tonnes per day; I. Primary techniques: Oxy-fuel melting (iv); Reducing nitrogen oxides (NOx) emissions to air. The BAT-AEL emission level is < 0,5 - 0,8 kg/t.
status: valid
status modified: 2019-04-23
accepted date: 2019-04-23
in scheme: BATAELValue

Manufacture of Glass - NO2 - BAT17-VII
type: Concept
notation: GLS-NO2-BAT17-VII
definition: 3, Mineral industry: 3,3 Manufacture of glass including glass fibre with a melting capacity exceeding 20 tonnes per day; II. Secondary techniques; Reducing nitrogen oxides (NOx) emissions to air. The BAT-AEL emission level is < 0,75 kg/t.
status: valid
status modified: 2019-04-23
accepted date: 2019-04-23
in scheme: BATAELValue

Manufacture of Glass - NO2 - BAT18-I
type: Concept
notation: GLS-NO2-BAT18-I
definition: 3, Mineral industry: 3,3 Manufacture of glass including glass fibre with a melting capacity exceeding 20 tonnes per day; I. Primary techniques (see table BAT 17): Combustion modifications (i), special furnace designs (ii) combined with minimisation of these (nitrates) raw materials; Reducing nitrogen oxides (NOx) emissions to air. The BAT-AEL emission level is 500 - 800 mg/Nm3.
status: valid
status modified: 2019-04-23
accepted date: 2019-04-23
in scheme: BATAELValue

Manufacture of Glass - NO2 - BAT18-II
type: Concept
notation: GLS-NO2-BAT18-II
definition: 3, Mineral industry: 3,3 Manufacture of glass including glass fibre with a melting capacity exceeding 20 tonnes per day; I. Primary techniques (see table BAT 17): Electric melting (iii) combined with minimisation of these (nitrates) raw materials; Reducing nitrogen oxides (NOx) emissions to air. The BAT-AEL emission level is < 100 mg/Nm3.
status: valid
status modified: 2019-04-23
accepted date: 2019-04-23
in scheme: BATAELValue

Manufacture of Glass - NO2 - BAT18-III
type: Concept
notation: GLS-NO2-BAT18-III
definition: 3, Mineral industry: 3,3 Manufacture of glass including glass fibre with a melting capacity exceeding 20 tonnes per day; II. Secondary techniques (see table BAT 17) combined with minimisation of these (nitrates) raw materials; Reducing nitrogen oxides (NOx) emissions to air. The BAT-AEL emission level is < 500 mg/Nm3.
status: valid
status modified: 2019-04-23
accepted date: 2019-04-23
in scheme: BATAELValue

Manufacture of Glass - NO2 - BAT18-IV
type: Concept
notation: GLS-NO2-BAT18-IV
definition: 3, Mineral industry: 3,3 Manufacture of glass including glass fibre with a melting capacity exceeding 20 tonnes per day; I. Primary techniques (see table BAT 17): Combustion modifications (i), special furnace designs (ii) combined with minimisation of these (nitrates) raw materials; Reducing nitrogen oxides (NOx) emissions to air. The BAT-AEL emission level is 0,75 - 1,2 kg/t.
status: valid
status modified: 2019-04-23
accepted date: 2019-04-23
in scheme: BATAELValue

Manufacture of Glass - NO2 - BAT18-IX
type: Concept
notation: GLS-NO2-BAT18-IX
definition: 3, Mineral industry: 3,3 Manufacture of glass including glass fibre with a melting capacity exceeding 20 tonnes per day; Primary techniques (see table) in cases of short campaigns or melting furnaces with a capacity < 100 t/d; Reducing nitrogen oxides (NOx) emissions to air. The BAT-AEL emission level is < 3 kg/t.
status: valid
status modified: 2019-04-23
accepted date: 2019-04-23
in scheme: BATAELValue

Manufacture of Glass - NO2 - BAT18-V
type: Concept
notation: GLS-NO2-BAT18-V
definition: 3, Mineral industry: 3,3 Manufacture of glass including glass fibre with a melting capacity exceeding 20 tonnes per day; I. Primary techniques (see table BAT 17): Electric melting (iii) combined with minimisation of these (nitrates) raw materials; Reducing nitrogen oxides (NOx) emissions to air. The BAT-AEL emission level is < 0,3 kg/t.
status: valid
status modified: 2019-04-23
accepted date: 2019-04-23
in scheme: BATAELValue

Manufacture of Glass - NO2 - BAT18-VI
type: Concept
notation: GLS-NO2-BAT18-VI
definition: 3, Mineral industry: 3,3 Manufacture of glass including glass fibre with a melting capacity exceeding 20 tonnes per day; I. Primary techniques (see table BAT 17): Oxy-fuel melting (iv) combined with minimisation of these (nitrates) raw materials; Reducing nitrogen oxides (NOx) emissions to air. The BAT-AEL emission level is < 0,5 - 0,8 kg/t.
status: valid
status modified: 2019-04-23
accepted date: 2019-04-23
in scheme: BATAELValue

Manufacture of Glass - NO2 - BAT18-VII
type: Concept
notation: GLS-NO2-BAT18-VII
definition: 3, Mineral industry: 3,3 Manufacture of glass including glass fibre with a melting capacity exceeding 20 tonnes per day; II. Secondary techniques (see table BAT 17) combined with minimisation of these (nitrates) raw materials; Reducing nitrogen oxides (NOx) emissions to air. The BAT-AEL emission level is < 0,75 kg/t.
status: valid
status modified: 2019-04-23
accepted date: 2019-04-23
in scheme: BATAELValue

Manufacture of Glass - NO2 - BAT18-VIII
type: Concept
notation: GLS-NO2-BAT18-VIII
definition: 3, Mineral industry: 3,3 Manufacture of glass including glass fibre with a melting capacity exceeding 20 tonnes per day; Primary techniques (see table) in cases of short campaigns or melting furnaces with a capacity < 100 t/d; Reducing nitrogen oxides (NOx) emissions to air. The BAT-AEL emission level is < 1000 mg/Nm3.
status: valid
status modified: 2019-04-23
accepted date: 2019-04-23
in scheme: BATAELValue

Manufacture of Glass - NO2 - BAT25-I
type: Concept
notation: GLS-NO2-BAT25-I
definition: 3, Mineral industry: 3,3 Manufacture of glass including glass fibre with a melting capacity exceeding 20 tonnes per day; I. Primary techniques: Combustion modifications (i), Fenix process (ii); Reducing nitrogen oxides (NOx) emissions to air. The BAT-AEL emission level is 700 - 800 mg/Nm3.
status: valid
status modified: 2019-04-23
accepted date: 2019-04-23
in scheme: BATAELValue

Manufacture of Glass - NO2 - BAT25-II
type: Concept
notation: GLS-NO2-BAT25-II
definition: 3, Mineral industry: 3,3 Manufacture of glass including glass fibre with a melting capacity exceeding 20 tonnes per day; II. Secondary techniques; Reducing nitrogen oxides (NOx) emissions to air. The BAT-AEL emission level is 400 - 700 mg/Nm3.
status: valid
status modified: 2019-04-23
accepted date: 2019-04-23
in scheme: BATAELValue

Manufacture of Glass - NO2 - BAT25-III
type: Concept
notation: GLS-NO2-BAT25-III
definition: 3, Mineral industry: 3,3 Manufacture of glass including glass fibre with a melting capacity exceeding 20 tonnes per day; I. Primary techniques: Combustion modifications (i), Fenix process (ii); Reducing nitrogen oxides (NOx) emissions to air. The BAT-AEL emission level is 1,75 - 2 kg/t.
status: valid
status modified: 2019-04-23
accepted date: 2019-04-23
in scheme: BATAELValue

Manufacture of Glass - NO2 - BAT25-IV
type: Concept
notation: GLS-NO2-BAT25-IV
definition: 3, Mineral industry: 3,3 Manufacture of glass including glass fibre with a melting capacity exceeding 20 tonnes per day; I. Primary techniques: Oxy-fuel melting (iii); Reducing nitrogen oxides (NOx) emissions to air. The BAT-AEL emission level is < 1,25 - 2 kg/t.
status: valid
status modified: 2019-04-23
accepted date: 2019-04-23
in scheme: BATAELValue

Manufacture of Glass - NO2 - BAT25-V
type: Concept
notation: GLS-NO2-BAT25-V
definition: 3, Mineral industry: 3,3 Manufacture of glass including glass fibre with a melting capacity exceeding 20 tonnes per day; II. Secondary techniques; Reducing nitrogen oxides (NOx) emissions to air. The BAT-AEL emission level is 1 - 1,75 kg/t.
status: valid
status modified: 2019-04-23
accepted date: 2019-04-23
in scheme: BATAELValue

Manufacture of Glass - NO2 - BAT26-I
type: Concept
notation: GLS-NO2-BAT26-I
definition: 3, Mineral industry: 3,3 Manufacture of glass including glass fibre with a melting capacity exceeding 20 tonnes per day; II. Secondary techniques (see table BAT 25) and minimisation of these (nitrates) raw materials; Reducing nitrogen oxides (NOx) emissions to air. The BAT-AEL emission level is 400 - 700 mg/Nm3.
status: valid
status modified: 2019-04-23
accepted date: 2019-04-23
in scheme: BATAELValue

Manufacture of Glass - NO2 - BAT26-II
type: Concept
notation: GLS-NO2-BAT26-II
definition: 3, Mineral industry: 3,3 Manufacture of glass including glass fibre with a melting capacity exceeding 20 tonnes per day; II. Secondary techniques (see table BAT 25) and minimisation of these (nitrates) raw materials; Reducing nitrogen oxides (NOx) emissions to air. The BAT-AEL emission level is 1 - 1,75 kg/t.
status: valid
status modified: 2019-04-23
accepted date: 2019-04-23
in scheme: BATAELValue

Manufacture of Glass - NO2 - BAT26-III
type: Concept
notation: GLS-NO2-BAT26-III
definition: 3, Mineral industry: 3,3 Manufacture of glass including glass fibre with a melting capacity exceeding 20 tonnes per day; Primary techniques (see table) and production of special glasses in a limited number of short campaigns; Reducing nitrogen oxides (NOx) emissions to air. The BAT-AEL emission level is < 1200 mg/Nm3.
status: valid
status modified: 2019-04-23
accepted date: 2019-04-23
in scheme: BATAELValue

Manufacture of Glass - NO2 - BAT26-IV
type: Concept
notation: GLS-NO2-BAT26-IV
definition: 3, Mineral industry: 3,3 Manufacture of glass including glass fibre with a melting capacity exceeding 20 tonnes per day; Primary techniques (see table) and production of special glasses in a limited number of short campaigns; Reducing nitrogen oxides (NOx) emissions to air. The BAT-AEL emission level is < 3 kg/t.
status: valid
status modified: 2019-04-23
accepted date: 2019-04-23
in scheme: BATAELValue

Manufacture of Glass - NO2 - BAT33-I
type: Concept
notation: GLS-NO2-BAT33-I
definition: 3, Mineral industry: 3,3 Manufacture of glass including glass fibre with a melting capacity exceeding 20 tonnes per day; Combustion modifications (i); Reducing nitrogen oxides (NOx) emissions to air. The BAT-AEL emission level is < 600 - 1000 mg/Nm3.
status: valid
status modified: 2019-04-23
accepted date: 2019-04-23
in scheme: BATAELValue

Manufacture of Glass - NO2 - BAT33-II
type: Concept
notation: GLS-NO2-BAT33-II
definition: 3, Mineral industry: 3,3 Manufacture of glass including glass fibre with a melting capacity exceeding 20 tonnes per day; Combustion modifications (i); Reducing nitrogen oxides (NOx) emissions to air. The BAT-AEL emission level is < 2,7 - 4,5 kg/t.
status: valid
status modified: 2019-04-23
accepted date: 2019-04-23
in scheme: BATAELValue

Manufacture of Glass - NO2 - BAT33-III
type: Concept
notation: GLS-NO2-BAT33-III
definition: 3, Mineral industry: 3,3 Manufacture of glass including glass fibre with a melting capacity exceeding 20 tonnes per day; Oxy-fuel melting (ii); Reducing nitrogen oxides (NOx) emissions to air. The BAT-AEL emission level is < 0,5 - 1,5 kg/t.
status: valid
status modified: 2019-04-23
accepted date: 2019-04-23
in scheme: BATAELValue

Manufacture of Glass - NO2 - BAT39-I
type: Concept
notation: GLS-NO2-BAT39-I
definition: 3, Mineral industry: 3,3 Manufacture of glass including glass fibre with a melting capacity exceeding 20 tonnes per day; Combustion modifications (i), special furnace design (ii); Reducing nitrogen oxides (NOx) emissions to air. The BAT-AEL emission level is < 500 - 1000 mg/Nm3.
status: valid
status modified: 2019-04-23
accepted date: 2019-04-23
in scheme: BATAELValue

Manufacture of Glass - NO2 - BAT39-II
type: Concept
notation: GLS-NO2-BAT39-II
definition: 3, Mineral industry: 3,3 Manufacture of glass including glass fibre with a melting capacity exceeding 20 tonnes per day; Electric melting (iii); Reducing nitrogen oxides (NOx) emissions to air. The BAT-AEL emission level is < 100 mg/Nm3.
status: valid
status modified: 2019-04-23
accepted date: 2019-04-23
in scheme: BATAELValue

Manufacture of Glass - NO2 - BAT39-III
type: Concept
notation: GLS-NO2-BAT39-III
definition: 3, Mineral industry: 3,3 Manufacture of glass including glass fibre with a melting capacity exceeding 20 tonnes per day; Combustion modifications (i), special furnace design (ii); Reducing nitrogen oxides (NOx) emissions to air. The BAT-AEL emission level is < 1,25 - 2,5 kg/t.
status: valid
status modified: 2019-04-23
accepted date: 2019-04-23
in scheme: BATAELValue

Manufacture of Glass - NO2 - BAT39-IV
type: Concept
notation: GLS-NO2-BAT39-IV
definition: 3, Mineral industry: 3,3 Manufacture of glass including glass fibre with a melting capacity exceeding 20 tonnes per day; Electric melting (iii); Reducing nitrogen oxides (NOx) emissions to air. The BAT-AEL emission level is < 0,3 kg/t.
status: valid
status modified: 2019-04-23
accepted date: 2019-04-23
in scheme: BATAELValue

Manufacture of Glass - NO2 - BAT39-V
type: Concept
notation: GLS-NO2-BAT39-V
definition: 3, Mineral industry: 3,3 Manufacture of glass including glass fibre with a melting capacity exceeding 20 tonnes per day; Oxy-fuel melting (iv); Reducing nitrogen oxides (NOx) emissions to air. The BAT-AEL emission level is < 0,5 - 1,5 kg/t.
status: valid
status modified: 2019-04-23
accepted date: 2019-04-23
in scheme: BATAELValue

Manufacture of Glass - NO2 - BAT40-I
type: Concept
notation: GLS-NO2-BAT40-I
definition: 3, Mineral industry: 3,3 Manufacture of glass including glass fibre with a melting capacity exceeding 20 tonnes per day; Combustion modifications (i), special furnace designs (ii) (see table BAT 39) combined with minimisation of these (nitrates) raw materials; Reducing nitrogen oxides (NOx) emissions to air. The BAT-AEL emission level is < 500 - 1500 mg/Nm3.
status: valid
status modified: 2019-04-23
accepted date: 2019-04-23
in scheme: BATAELValue

Manufacture of Glass - NO2 - BAT40-II
type: Concept
notation: GLS-NO2-BAT40-II
definition: 3, Mineral industry: 3,3 Manufacture of glass including glass fibre with a melting capacity exceeding 20 tonnes per day; Electric melting (iii) (see table BAT 39) combined with minimisation of these (nitrates) raw materials; Reducing nitrogen oxides (NOx) emissions to air. The BAT-AEL emission level is < 100 mg/Nm3.
status: valid
status modified: 2019-04-23
accepted date: 2019-04-23
in scheme: BATAELValue

Manufacture of Glass - NO2 - BAT40-III
type: Concept
notation: GLS-NO2-BAT40-III
definition: 3, Mineral industry: 3,3 Manufacture of glass including glass fibre with a melting capacity exceeding 20 tonnes per day; Combustion modifications (i), special furnace designs (ii) (see table BAT 39) combined with minimisation of these (nitrates) raw materials; Reducing nitrogen oxides (NOx) emissions to air. The BAT-AEL emission level is < 1,25 - 2,5 kg/t.
status: valid
status modified: 2019-04-23
accepted date: 2019-04-23
in scheme: BATAELValue

Manufacture of Glass - NO2 - BAT40-IV
type: Concept
notation: GLS-NO2-BAT40-IV
definition: 3, Mineral industry: 3,3 Manufacture of glass including glass fibre with a melting capacity exceeding 20 tonnes per day; Electric melting (iii) (see table BAT 39) combined with minimisation of these (nitrates) raw materials; Reducing nitrogen oxides (NOx) emissions to air. The BAT-AEL emission level is < 0,3 kg/t.
status: valid
status modified: 2019-04-23
accepted date: 2019-04-23
in scheme: BATAELValue

Manufacture of Glass - NO2 - BAT40-IX
type: Concept
notation: GLS-NO2-BAT40-IX
definition: 3, Mineral industry: 3,3 Manufacture of glass including glass fibre with a melting capacity exceeding 20 tonnes per day; Electric melting in production of special types of soda-lime glasses and other special glasses and for a limited number of short campaigns or for melting furnaces with a capacity < 100 t/d; Reducing nitrogen oxides (NOx) emissions to air. The BAT-AEL emission level is < 8 - 10 kg/t.
status: valid
status modified: 2019-04-23
accepted date: 2019-04-23
in scheme: BATAELValue

Manufacture of Glass - NO2 - BAT40-V
type: Concept
notation: GLS-NO2-BAT40-V
definition: 3, Mineral industry: 3,3 Manufacture of glass including glass fibre with a melting capacity exceeding 20 tonnes per day; Oxy-fuel melting (iv) (see table BAT 39) combined with minimisation of these (nitrates) raw materials; Reducing nitrogen oxides (NOx) emissions to air. The BAT-AEL emission level is < 0,5 - 1,5 kg/t.
status: valid
status modified: 2019-04-23
accepted date: 2019-04-23
in scheme: BATAELValue

Manufacture of Glass - NO2 - BAT40-VI
type: Concept
notation: GLS-NO2-BAT40-VI
definition: 3, Mineral industry: 3,3 Manufacture of glass including glass fibre with a melting capacity exceeding 20 tonnes per day; Fuel/air conventional furnaces in production of special types of soda-lime glasses and other special glasses and for a limited number of short campaigns or for melting furnaces with a capacity < 100 t/d; Reducing nitrogen oxides (NOx) emissions to air. The BAT-AEL emission level is < 500 - 1500 mg/Nm3.
status: valid
status modified: 2019-04-23
accepted date: 2019-04-23
in scheme: BATAELValue

Manufacture of Glass - NO2 - BAT40-VII
type: Concept
notation: GLS-NO2-BAT40-VII
definition: 3, Mineral industry: 3,3 Manufacture of glass including glass fibre with a melting capacity exceeding 20 tonnes per day; Electric melting in production of special types of soda-lime glasses and other special glasses and for a limited number of short campaigns or for melting furnaces with a capacity < 100 t/d; Reducing nitrogen oxides (NOx) emissions to air. The BAT-AEL emission level is < 300 - 500 mg/Nm3.
status: valid
status modified: 2019-04-23
accepted date: 2019-04-23
in scheme: BATAELValue

Manufacture of Glass - NO2 - BAT40-VIII
type: Concept
notation: GLS-NO2-BAT40-VIII
definition: 3, Mineral industry: 3,3 Manufacture of glass including glass fibre with a melting capacity exceeding 20 tonnes per day; Fuel/air conventional furnaces in production of special types of soda-lime glasses and other special glasses and for a limited number of short campaigns or for melting furnaces with a capacity < 100 t/d; Reducing nitrogen oxides (NOx) emissions to air. The BAT-AEL emission level is < 1,25 - 3,75 kg/t.
status: valid
status modified: 2019-04-23
accepted date: 2019-04-23
in scheme: BATAELValue

Manufacture of Glass - NO2 - BAT49-I
type: Concept
notation: GLS-NO2-BAT49-I
definition: 3, Mineral industry: 3,3 Manufacture of glass including glass fibre with a melting capacity exceeding 20 tonnes per day; I. Primary techniques: Combustion modifications (i); Reducing nitrogen oxides (NOx) emissions to air. The BAT-AEL emission level is 600 - 800 mg/Nm3.
status: valid
status modified: 2019-04-23
accepted date: 2019-04-23
in scheme: BATAELValue

Manufacture of Glass - NO2 - BAT49-II
type: Concept
notation: GLS-NO2-BAT49-II
definition: 3, Mineral industry: 3,3 Manufacture of glass including glass fibre with a melting capacity exceeding 20 tonnes per day; I. Primary techniques: Electric melting (ii); Reducing nitrogen oxides (NOx) emissions to air. The BAT-AEL emission level is < 100 mg/Nm3.
status: valid
status modified: 2019-04-23
accepted date: 2019-04-23
in scheme: BATAELValue

Manufacture of Glass - NO2 - BAT49-III
type: Concept
notation: GLS-NO2-BAT49-III
definition: 3, Mineral industry: 3,3 Manufacture of glass including glass fibre with a melting capacity exceeding 20 tonnes per day; II. Secondary techniques; Reducing nitrogen oxides (NOx) emissions to air. The BAT-AEL emission level is < 500 mg/Nm3.
status: valid
status modified: 2019-04-23
accepted date: 2019-04-23
in scheme: BATAELValue

Manufacture of Glass - NO2 - BAT49-IV
type: Concept
notation: GLS-NO2-BAT49-IV
definition: 3, Mineral industry: 3,3 Manufacture of glass including glass fibre with a melting capacity exceeding 20 tonnes per day; I. Primary techniques: Combustion modifications (i); Reducing nitrogen oxides (NOx) emissions to air. The BAT-AEL emission level is 1,5 - 3,2 kg/t.
status: valid
status modified: 2019-04-23
accepted date: 2019-04-23
in scheme: BATAELValue

Manufacture of Glass - NO2 - BAT49-V
type: Concept
notation: GLS-NO2-BAT49-V
definition: 3, Mineral industry: 3,3 Manufacture of glass including glass fibre with a melting capacity exceeding 20 tonnes per day; I. Primary techniques: Electric melting (ii); Reducing nitrogen oxides (NOx) emissions to air. The BAT-AEL emission level is < 0,25 - 0,4 kg/t.
status: valid
status modified: 2019-04-23
accepted date: 2019-04-23
in scheme: BATAELValue

Manufacture of Glass - NO2 - BAT49-VI
type: Concept
notation: GLS-NO2-BAT49-VI
definition: 3, Mineral industry: 3,3 Manufacture of glass including glass fibre with a melting capacity exceeding 20 tonnes per day; I. Primary techniques: Oxy-fuel melting (iii); Reducing nitrogen oxides (NOx) emissions to air. The BAT-AEL emission level is < 1 - 3 kg/t.
status: valid
status modified: 2019-04-23
accepted date: 2019-04-23
in scheme: BATAELValue

Manufacture of Glass - NO2 - BAT49-VII
type: Concept
notation: GLS-NO2-BAT49-VII
definition: 3, Mineral industry: 3,3 Manufacture of glass including glass fibre with a melting capacity exceeding 20 tonnes per day; II. Secondary techniques; Reducing nitrogen oxides (NOx) emissions to air. The BAT-AEL emission level is < 1 - 3 kg/t.
status: valid
status modified: 2019-04-23
accepted date: 2019-04-23
in scheme: BATAELValue

Manufacture of Glass - NO2 - BAT50-I
type: Concept
notation: GLS-NO2-BAT50-I
definition: 3, Mineral industry: 3,3 Manufacture of glass including glass fibre with a melting capacity exceeding 20 tonnes per day; Primary or secondary techniques (see table) combined with minimisation of nitrate input; Reducing nitrogen oxides (NOx) emissions to air. The BAT-AEL emission level is < 500 - 1000 mg/Nm3.
status: valid
status modified: 2019-04-23
accepted date: 2019-04-23
in scheme: BATAELValue

Manufacture of Glass - NO2 - BAT50-II
type: Concept
notation: GLS-NO2-BAT50-II
definition: 3, Mineral industry: 3,3 Manufacture of glass including glass fibre with a melting capacity exceeding 20 tonnes per day; Primary or secondary techniques (see table) combined with minimisation of nitrate input; Reducing nitrogen oxides (NOx) emissions to air. The BAT-AEL emission level is < 1 - 6 kg/t.
status: valid
status modified: 2019-04-23
accepted date: 2019-04-23
in scheme: BATAELValue

Manufacture of Glass - NO2 - BAT57-I
type: Concept
notation: GLS-NO2-BAT57-I
definition: 3, Mineral industry: 3,4 Melting mineral substances including the production of mineral fibres with a melting capacity exceeding 20�tonnes per day; For glass wool: Fuel/air (i) and electric furnaces (ii); Reducing nitrogen oxides (NOx) emissions to air. The BAT-AEL emission level is < 200 - 500 mg/Nm3.
status: valid
status modified: 2019-04-23
accepted date: 2019-04-23
in scheme: BATAELValue

Manufacture of Glass - NO2 - BAT57-II
type: Concept
notation: GLS-NO2-BAT57-II
definition: 3, Mineral industry: 3,4 Melting mineral substances including the production of mineral fibres with a melting capacity exceeding 20�tonnes per day; For stone wool: All types of furnaces; Reducing nitrogen oxides (NOx) emissions to air. The BAT-AEL emission level is < 400 - 500 mg/Nm3.
status: valid
status modified: 2019-04-23
accepted date: 2019-04-23
in scheme: BATAELValue

Manufacture of Glass - NO2 - BAT57-III
type: Concept
notation: GLS-NO2-BAT57-III
definition: 3, Mineral industry: 3,4 Melting mineral substances including the production of mineral fibres with a melting capacity exceeding 20�tonnes per day; For glass wool: Fuel/air (i) and electric furnaces (ii); Reducing nitrogen oxides (NOx) emissions to air. The BAT-AEL emission level is < 0,4 - 1 kg/t.
status: valid
status modified: 2019-04-23
accepted date: 2019-04-23
in scheme: BATAELValue

Manufacture of Glass - NO2 - BAT57-IV
type: Concept
notation: GLS-NO2-BAT57-IV
definition: 3, Mineral industry: 3,4 Melting mineral substances including the production of mineral fibres with a melting capacity exceeding 20�tonnes per day; For glass wool: Oxy-fuel melting (iii); Reducing nitrogen oxides (NOx) emissions to air. The BAT-AEL emission level is < 0,5 kg/t.
status: valid
status modified: 2019-04-23
accepted date: 2019-04-23
in scheme: BATAELValue

Manufacture of Glass - NO2 - BAT57-V
type: Concept
notation: GLS-NO2-BAT57-V
definition: 3, Mineral industry: 3,4 Melting mineral substances including the production of mineral fibres with a melting capacity exceeding 20�tonnes per day; For stone wool: All types of furnaces; Reducing nitrogen oxides (NOx) emissions to air. The BAT-AEL emission level is < 1 - 1,25 kg/t.
status: valid
status modified: 2019-04-23
accepted date: 2019-04-23
in scheme: BATAELValue

Manufacture of Glass - NO2 - BAT58-I
type: Concept
notation: GLS-NO2-BAT58-I
definition: 3, Mineral industry: 3,4 Melting mineral substances including the production of mineral fibres with a melting capacity exceeding 20�tonnes per day; Primary techniques (i)-(iii) combined with minimisation of nitrate input; Reducing nitrogen oxides (NOx) emissions to air. The BAT-AEL emission level is < 500 - 700 mg/Nm3.
status: valid
status modified: 2019-04-23
accepted date: 2019-04-23
in scheme: BATAELValue

Manufacture of Glass - NO2 - BAT58-II
type: Concept
notation: GLS-NO2-BAT58-II
definition: 3, Mineral industry: 3,4 Melting mineral substances including the production of mineral fibres with a melting capacity exceeding 20�tonnes per day; Primary techniques (i)-(iii) combined with minimisation of nitrate input; Reducing nitrogen oxides (NOx) emissions to air. The BAT-AEL emission level is < 1 - 1,4 kg/t.
status: valid
status modified: 2019-04-23
accepted date: 2019-04-23
in scheme: BATAELValue

Manufacture of Glass - NO2 - BAT63-XIII
type: Concept
notation: GLS-NO2-BAT63-XIII
definition: 3, Mineral industry: 3,4 Melting mineral substances including the production of mineral fibres with a melting capacity exceeding 20�tonnes per day; Techniques (i)-(v) (see table); Reducing nitrogen oxides (NOx) emissions to air. The BAT-AEL emission level is < 100 - 200 mg/Nm3.
status: valid
status modified: 2019-04-23
accepted date: 2019-04-23
in scheme: BATAELValue

Manufacture of Glass - NO2 - BAT63-XX
type: Concept
notation: GLS-NO2-BAT63-XX
definition: 3, Mineral industry: 3,4 Melting mineral substances including the production of mineral fibres with a melting capacity exceeding 20�tonnes per day; Techniques (i)-(v) (see table); Reducing nitrogen oxides (NOx) emissions to air. The BAT-AEL emission level is < 1 kg/t.
status: valid
status modified: 2019-04-23
accepted date: 2019-04-23
in scheme: BATAELValue

Manufacture of Glass - NO2 - BAT66
type: Concept
notation: GLS-NO2-BAT66
definition: 3, Mineral industry: 3,4 Melting mineral substances including the production of mineral fibres with a melting capacity exceeding 20�tonnes per day; Lubricant burn-off oven with combustion control and/or modifications (see table); Reducing nitrogen oxides (NOx) emissions to air. The BAT-AEL emission level is 100 - 200 mg/Nm3.
status: valid
status modified: 2019-04-23
accepted date: 2019-04-23
in scheme: BATAELValue

Manufacture of Glass - NO2 - BAT72-I
type: Concept
notation: GLS-NO2-BAT72-I
definition: 3, Mineral industry: 3,4 Melting mineral substances including the production of mineral fibres with a melting capacity exceeding 20�tonnes per day; Primary techniques: Fuel/air, fuel/oxygen- enriched air combustion, without nitrates; Reducing nitrogen oxides (NOx) emissions to air. The BAT-AEL emission level is 500 - 1000 mg/Nm3.
status: valid
status modified: 2019-04-23
accepted date: 2019-04-23
in scheme: BATAELValue

Manufacture of Glass - NO2 - BAT72-II
type: Concept
notation: GLS-NO2-BAT72-II
definition: 3, Mineral industry: 3,4 Melting mineral substances including the production of mineral fibres with a melting capacity exceeding 20�tonnes per day; Primary techniques: Fuel/air, fuel/oxygen- enriched air combustion, with use of nitrates; Reducing nitrogen oxides (NOx) emissions to air. The BAT-AEL emission level is < 1600 mg/Nm3.
status: valid
status modified: 2019-04-23
accepted date: 2019-04-23
in scheme: BATAELValue

Manufacture of Glass - NO2 - BAT72-III
type: Concept
notation: GLS-NO2-BAT72-III
definition: 3, Mineral industry: 3,4 Melting mineral substances including the production of mineral fibres with a melting capacity exceeding 20�tonnes per day; Primary techniques: Oxy-fuel firing, without nitrates; Reducing nitrogen oxides (NOx) emissions to air. The BAT-AEL emission level is < 2,5 - 5 kg/t.
status: valid
status modified: 2019-04-23
accepted date: 2019-04-23
in scheme: BATAELValue

Manufacture of Glass - NO2 - BAT72-IV
type: Concept
notation: GLS-NO2-BAT72-IV
definition: 3, Mineral industry: 3,4 Melting mineral substances including the production of mineral fibres with a melting capacity exceeding 20�tonnes per day; Primary techniques: Oxy-fuel firing, with use of nitrates; Reducing nitrogen oxides (NOx) emissions to air. The BAT-AEL emission level is 5 - 10 kg/t.
status: valid
status modified: 2019-04-23
accepted date: 2019-04-23
in scheme: BATAELValue

Manufacture of Glass - NO2 - BAT72-V
type: Concept
notation: GLS-NO2-BAT72-V
definition: 3, Mineral industry: 3,4 Melting mineral substances including the production of mineral fibres with a melting capacity exceeding 20�tonnes per day; Primary techniques: Fuel/air, fuel/oxygen- enriched air combustion, without nitrates; Reducing nitrogen oxides (NOx) emissions to air. The BAT-AEL emission level is 2,5 - 7,5 kg/t.
status: valid
status modified: 2019-04-23
accepted date: 2019-04-23
in scheme: BATAELValue

Manufacture of Glass - NO2 - BAT72-VI
type: Concept
notation: GLS-NO2-BAT72-VI
definition: 3, Mineral industry: 3,4 Melting mineral substances including the production of mineral fibres with a melting capacity exceeding 20�tonnes per day; Primary techniques: Fuel/air, fuel/oxygen- enriched air combustion, with use of nitrates; Reducing nitrogen oxides (NOx) emissions to air. The BAT-AEL emission level is < 12 kg/t.
status: valid
status modified: 2019-04-23
accepted date: 2019-04-23
in scheme: BATAELValue

Manufacture of Glass - Ni - BAT13-XVI
type: Concept
notation: GLS-Ni-BAT13-XVI
definition: 3, Mineral industry: 3,3 Manufacture of glass including glass fibre with a melting capacity exceeding 20 tonnes per day Reducing nickel to water. The BAT-AEL emission level is < 0,5 mg/l.
status: valid
status modified: 2019-04-23
accepted date: 2019-04-23
in scheme: BATAELValue

Manufacture of Glass - Pb - BAT13-VII
type: Concept
notation: GLS-Pb-BAT13-VII
definition: 3, Mineral industry: 3,3 Manufacture of glass including glass fibre with a melting capacity exceeding 20 tonnes per day Reducing lead to water. The BAT-AEL emission level is < 0,05 - 0,3 mg/l.
status: valid
status modified: 2019-04-23
accepted date: 2019-04-23
in scheme: BATAELValue

Manufacture of Glass - Pb - BAT45-I
type: Concept
notation: GLS-Pb-BAT45-I
definition: 3, Mineral industry: 3,3 Manufacture of glass including glass fibre with a melting capacity exceeding 20 tonnes per day; Techniques (i)-(iv) (see table); Reducing lead compounds emissions to air. The BAT-AEL emission level is < 0,5 - 1 mg/Nm3.
status: valid
status modified: 2019-04-23
accepted date: 2019-04-23
in scheme: BATAELValue

Manufacture of Glass - Pb - BAT45-II
type: Concept
notation: GLS-Pb-BAT45-II
definition: 3, Mineral industry: 3,3 Manufacture of glass including glass fibre with a melting capacity exceeding 20 tonnes per day; Techniques (i)-(iv) (see table); Reducing lead compounds emissions to air. The BAT-AEL emission level is < 0,001 - 0,003 kg/t.
status: valid
status modified: 2019-04-23
accepted date: 2019-04-23
in scheme: BATAELValue

Manufacture of Glass - Pb - BAT46-IV
type: Concept
notation: GLS-Pb-BAT46-IV
definition: 3, Mineral industry: 3,3 Manufacture of glass including glass fibre with a melting capacity exceeding 20 tonnes per day; Techniques (i)-(ii) (see table); Reducing lead emissions to air. The BAT-AEL emission level is < 1 - 1,5 mg/Nm3.
status: valid
status modified: 2019-04-23
accepted date: 2019-04-23
in scheme: BATAELValue

Manufacture of Glass - SO2 - BAT19-I
type: Concept
notation: GLS-SO2-BAT19-I
definition: 3, Mineral industry: 3,3 Manufacture of glass including glass fibre with a melting capacity exceeding 20 tonnes per day; Techniques (i)-(iii) (see table), and natural gas; Reducing sulphur oxides (SOx) emissions to air. The BAT-AEL emission level is < 200 - 500 mg/Nm3.
status: valid
status modified: 2019-04-23
accepted date: 2019-04-23
in scheme: BATAELValue

Manufacture of Glass - SO2 - BAT19-II
type: Concept
notation: GLS-SO2-BAT19-II
definition: 3, Mineral industry: 3,3 Manufacture of glass including glass fibre with a melting capacity exceeding 20 tonnes per day; Techniques (i)-(iii) (see table), and fuel oil; Reducing sulphur oxides (SOx) emissions to air. The BAT-AEL emission level is < 500 - 1200 mg/Nm3.
status: valid
status modified: 2019-04-23
accepted date: 2019-04-23
in scheme: BATAELValue

Manufacture of Glass - SO2 - BAT19-III
type: Concept
notation: GLS-SO2-BAT19-III
definition: 3, Mineral industry: 3,3 Manufacture of glass including glass fibre with a melting capacity exceeding 20 tonnes per day; Techniques (i)-(iii) (see table), and natural gas; Reducing sulphur oxides (SOx) emissions to air. The BAT-AEL emission level is < 0,3 - 0,75 kg/t.
status: valid
status modified: 2019-04-23
accepted date: 2019-04-23
in scheme: BATAELValue

Manufacture of Glass - SO2 - BAT19-IV
type: Concept
notation: GLS-SO2-BAT19-IV
definition: 3, Mineral industry: 3,3 Manufacture of glass including glass fibre with a melting capacity exceeding 20 tonnes per day; Techniques (i)-(iii) (see table), and fuel oil; Reducing sulphur oxides (SOx) emissions to air. The BAT-AEL emission level is < 0,75 - 1,8 kg/t.
status: valid
status modified: 2019-04-23
accepted date: 2019-04-23
in scheme: BATAELValue

Manufacture of Glass - SO2 - BAT23
type: Concept
notation: GLS-SO2-BAT23
definition: 3, Mineral industry: 3,3 Manufacture of glass including glass fibre with a melting capacity exceeding 20 tonnes per day; Techniques (i)-(ii) (see table); Reducing sulphur oxides (SOx) emissions to air. The BAT-AEL emission level is < 100 - 200 mg/Nm3.
status: valid
status modified: 2019-04-23
accepted date: 2019-04-23
in scheme: BATAELValue

Manufacture of Glass - SO2 - BAT27-I
type: Concept
notation: GLS-SO2-BAT27-I
definition: 3, Mineral industry: 3,3 Manufacture of glass including glass fibre with a melting capacity exceeding 20 tonnes per day; Techniques (i)-(iii) (see table), and natural gas; Reducing sulphur oxides (SOx) emissions to air. The BAT-AEL emission level is < 300 - 500 mg/Nm3.
status: valid
status modified: 2019-04-23
accepted date: 2019-04-23
in scheme: BATAELValue

Manufacture of Glass - SO2 - BAT27-II
type: Concept
notation: GLS-SO2-BAT27-II
definition: 3, Mineral industry: 3,3 Manufacture of glass including glass fibre with a melting capacity exceeding 20 tonnes per day; Techniques (i)-(iii) (see table), and fuel oil; Reducing sulphur oxides (SOx) emissions to air. The BAT-AEL emission level is 500 - 1300 mg/Nm3.
status: valid
status modified: 2019-04-23
accepted date: 2019-04-23
in scheme: BATAELValue

Manufacture of Glass - SO2 - BAT27-III
type: Concept
notation: GLS-SO2-BAT27-III
definition: 3, Mineral industry: 3,3 Manufacture of glass including glass fibre with a melting capacity exceeding 20 tonnes per day; Techniques (i)-(iii) (see table), and natural gas; Reducing sulphur oxides (SOx) emissions to air. The BAT-AEL emission level is < 0,75 - 1,25 kg/t.
status: valid
status modified: 2019-04-23
accepted date: 2019-04-23
in scheme: BATAELValue

Manufacture of Glass - SO2 - BAT27-IV
type: Concept
notation: GLS-SO2-BAT27-IV
definition: 3, Mineral industry: 3,3 Manufacture of glass including glass fibre with a melting capacity exceeding 20 tonnes per day; Techniques (i)-(iii) (see table), and fuel oil; Reducing sulphur oxides (SOx) emissions to air. The BAT-AEL emission level is 1,25 - 3,25 kg/t.
status: valid
status modified: 2019-04-23
accepted date: 2019-04-23
in scheme: BATAELValue

Manufacture of Glass - SO2 - BAT31-IV
type: Concept
notation: GLS-SO2-BAT31-IV
definition: 3, Mineral industry: 3,3 Manufacture of glass including glass fibre with a melting capacity exceeding 20 tonnes per day; Techniques (i)-(iv) (see table); Reducing sulphur oxides (SOx) emissions to air. The BAT-AEL emission level is < 200 mg/Nm3.
status: valid
status modified: 2019-04-23
accepted date: 2019-04-23
in scheme: BATAELValue

Manufacture of Glass - SO2 - BAT34-I
type: Concept
notation: GLS-SO2-BAT34-I
definition: 3, Mineral industry: 3,3 Manufacture of glass including glass fibre with a melting capacity exceeding 20 tonnes per day; Techniques (i)-(iv) (see table), and natural gas; Reducing sulphur oxides (SOx) emissions to air. The BAT-AEL emission level is < 200 - 800 mg/Nm3.
status: valid
status modified: 2019-04-23
accepted date: 2019-04-23
in scheme: BATAELValue

Manufacture of Glass - SO2 - BAT34-II
type: Concept
notation: GLS-SO2-BAT34-II
definition: 3, Mineral industry: 3,3 Manufacture of glass including glass fibre with a melting capacity exceeding 20 tonnes per day; Techniques (i)-(iv) (see table), and fuel oil; Reducing sulphur oxides (SOx) emissions to air. The BAT-AEL emission level is < 500 - 1000 mg/Nm3.
status: valid
status modified: 2019-04-23
accepted date: 2019-04-23
in scheme: BATAELValue

Manufacture of Glass - SO2 - BAT34-III
type: Concept
notation: GLS-SO2-BAT34-III
definition: 3, Mineral industry: 3,3 Manufacture of glass including glass fibre with a melting capacity exceeding 20 tonnes per day; Techniques (i)-(iv) (see table), and natural gas; Reducing sulphur oxides (SOx) emissions to air. The BAT-AEL emission level is < 0,9 - 3,6 kg/t.
status: valid
status modified: 2019-04-23
accepted date: 2019-04-23
in scheme: BATAELValue

Manufacture of Glass - SO2 - BAT34-IV
type: Concept
notation: GLS-SO2-BAT34-IV
definition: 3, Mineral industry: 3,3 Manufacture of glass including glass fibre with a melting capacity exceeding 20 tonnes per day; Techniques (i)-(iv) (see table), and fuel oil; Reducing sulphur oxides (SOx) emissions to air. The BAT-AEL emission level is < 2,25 - 4,5 kg/t.
status: valid
status modified: 2019-04-23
accepted date: 2019-04-23
in scheme: BATAELValue

Manufacture of Glass - SO2 - BAT41-I
type: Concept
notation: GLS-SO2-BAT41-I
definition: 3, Mineral industry: 3,3 Manufacture of glass including glass fibre with a melting capacity exceeding 20 tonnes per day; Techniques (i)-(iii) (see table), and natural gas; Reducing sulphur oxides (SOx) emissions to air. The BAT-AEL emission level is < 200 - 300 mg/Nm3.
status: valid
status modified: 2019-04-23
accepted date: 2019-04-23
in scheme: BATAELValue

Manufacture of Glass - SO2 - BAT41-II
type: Concept
notation: GLS-SO2-BAT41-II
definition: 3, Mineral industry: 3,3 Manufacture of glass including glass fibre with a melting capacity exceeding 20 tonnes per day; Techniques (i)-(iii) (see table), and fuel oil; Reducing sulphur oxides (SOx) emissions to air. The BAT-AEL emission level is < 1000 mg/Nm3.
status: valid
status modified: 2019-04-23
accepted date: 2019-04-23
in scheme: BATAELValue

Manufacture of Glass - SO2 - BAT41-III
type: Concept
notation: GLS-SO2-BAT41-III
definition: 3, Mineral industry: 3,3 Manufacture of glass including glass fibre with a melting capacity exceeding 20 tonnes per day; Techniques (i)-(iii) (see table), and electric melting; Reducing sulphur oxides (SOx) emissions to air. The BAT-AEL emission level is < 100 mg/Nm3.
status: valid
status modified: 2019-04-23
accepted date: 2019-04-23
in scheme: BATAELValue

Manufacture of Glass - SO2 - BAT41-IV
type: Concept
notation: GLS-SO2-BAT41-IV
definition: 3, Mineral industry: 3,3 Manufacture of glass including glass fibre with a melting capacity exceeding 20 tonnes per day; Techniques (i)-(iii) (see table), and natural gas; Reducing sulphur oxides (SOx) emissions to air. The BAT-AEL emission level is < 0,5 - 0,75 kg/t.
status: valid
status modified: 2019-04-23
accepted date: 2019-04-23
in scheme: BATAELValue

Manufacture of Glass - SO2 - BAT41-V
type: Concept
notation: GLS-SO2-BAT41-V
definition: 3, Mineral industry: 3,3 Manufacture of glass including glass fibre with a melting capacity exceeding 20 tonnes per day; Techniques (i)-(iii) (see table), and fuel oil; Reducing sulphur oxides (SOx) emissions to air. The BAT-AEL emission level is < 2,5 kg/t.
status: valid
status modified: 2019-04-23
accepted date: 2019-04-23
in scheme: BATAELValue

Manufacture of Glass - SO2 - BAT41-VI
type: Concept
notation: GLS-SO2-BAT41-VI
definition: 3, Mineral industry: 3,3 Manufacture of glass including glass fibre with a melting capacity exceeding 20 tonnes per day; Techniques (i)-(iii) (see table), and electric melting; Reducing sulphur oxides (SOx) emissions to air. The BAT-AEL emission level is < 0,25 kg/t.
status: valid
status modified: 2019-04-23
accepted date: 2019-04-23
in scheme: BATAELValue

Manufacture of Glass - SO2 - BAT51-I
type: Concept
notation: GLS-SO2-BAT51-I
definition: 3, Mineral industry: 3,3 Manufacture of glass including glass fibre with a melting capacity exceeding 20 tonnes per day; Techniques (i)-(iii) (see table), and natural gas and/or electric melting; Reducing sulphur oxides (SOx) emissions to air. The BAT-AEL emission level is < 30 - 200 mg/Nm3.
status: valid
status modified: 2019-04-23
accepted date: 2019-04-23
in scheme: BATAELValue

Manufacture of Glass - SO2 - BAT51-II
type: Concept
notation: GLS-SO2-BAT51-II
definition: 3, Mineral industry: 3,3 Manufacture of glass including glass fibre with a melting capacity exceeding 20 tonnes per day; Techniques (i)-(iii) (see table), and fuel oil; Reducing sulphur oxides (SOx) emissions to air. The BAT-AEL emission level is 500 - 800 mg/Nm3.
status: valid
status modified: 2019-04-23
accepted date: 2019-04-23
in scheme: BATAELValue

Manufacture of Glass - SO2 - BAT51-III
type: Concept
notation: GLS-SO2-BAT51-III
definition: 3, Mineral industry: 3,3 Manufacture of glass including glass fibre with a melting capacity exceeding 20 tonnes per day; Techniques (i)-(iii) (see table), and natural gas and/or electric melting; Reducing sulphur oxides (SOx) emissions to air. The BAT-AEL emission level is < 0,08 - 0,5 kg/t.
status: valid
status modified: 2019-04-23
accepted date: 2019-04-23
in scheme: BATAELValue

Manufacture of Glass - SO2 - BAT51-IV
type: Concept
notation: GLS-SO2-BAT51-IV
definition: 3, Mineral industry: 3,3 Manufacture of glass including glass fibre with a melting capacity exceeding 20 tonnes per day; Techniques (i)-(iii) (see table), and fuel oil; Reducing sulphur oxides (SOx) emissions to air. The BAT-AEL emission level is 1,25 - 2 kg/t.
status: valid
status modified: 2019-04-23
accepted date: 2019-04-23
in scheme: BATAELValue

Manufacture of Glass - SO2 - BAT59-I
type: Concept
notation: GLS-SO2-BAT59-I
definition: 3, Mineral industry: 3,4 Melting mineral substances including the production of mineral fibres with a melting capacity exceeding 20�tonnes per day; Techniques (i)-(iv) (see table); for glass wool: Gas-fired and electric furnaces; Reducing sulphur oxides (SOx) emissions to air. The BAT-AEL emission level is < 50 - 150 mg/Nm3.
status: valid
status modified: 2019-04-23
accepted date: 2019-04-23
in scheme: BATAELValue

Manufacture of Glass - SO2 - BAT59-II
type: Concept
notation: GLS-SO2-BAT59-II
definition: 3, Mineral industry: 3,4 Melting mineral substances including the production of mineral fibres with a melting capacity exceeding 20�tonnes per day; Techniques (i)-(iv) (see table); for stone wool: Gas-fired and electric furnaces; Reducing sulphur oxides (SOx) emissions to air. The BAT-AEL emission level is < 350 mg/Nm3.
status: valid
status modified: 2019-04-23
accepted date: 2019-04-23
in scheme: BATAELValue

Manufacture of Glass - SO2 - BAT59-III
type: Concept
notation: GLS-SO2-BAT59-III
definition: 3, Mineral industry: 3,4 Melting mineral substances including the production of mineral fibres with a melting capacity exceeding 20�tonnes per day; Techniques (i)-(iv) (see table); for stone wool: Cupola furnaces, no briquettes or slag recycling; Reducing sulphur oxides (SOx) emissions to air. The BAT-AEL emission level is < 400 mg/Nm3.
status: valid
status modified: 2019-04-23
accepted date: 2019-04-23
in scheme: BATAELValue

Manufacture of Glass - SO2 - BAT59-IV
type: Concept
notation: GLS-SO2-BAT59-IV
definition: 3, Mineral industry: 3,4 Melting mineral substances including the production of mineral fibres with a melting capacity exceeding 20�tonnes per day; Techniques (i)-(iv) (see table); for stone wool: Cupola furnaces, with cement briquettes or slag recycling; Reducing sulphur oxides (SOx) emissions to air. The BAT-AEL emission level is < 1400 mg/Nm3.
status: valid
status modified: 2019-04-23
accepted date: 2019-04-23
in scheme: BATAELValue

Manufacture of Glass - SO2 - BAT59-V
type: Concept
notation: GLS-SO2-BAT59-V
definition: 3, Mineral industry: 3,4 Melting mineral substances including the production of mineral fibres with a melting capacity exceeding 20�tonnes per day; Techniques (i)-(iv) (see table); for glass wool: Gas-fired and electric furnaces; Reducing sulphur oxides (SOx) emissions to air. The BAT-AEL emission level is < 0,1 - 0,3 kg/t.
status: valid
status modified: 2019-04-23
accepted date: 2019-04-23
in scheme: BATAELValue

Manufacture of Glass - SO2 - BAT59-VI
type: Concept
notation: GLS-SO2-BAT59-VI
definition: 3, Mineral industry: 3,4 Melting mineral substances including the production of mineral fibres with a melting capacity exceeding 20�tonnes per day; Techniques (i)-(iv) (see table); for stone wool: Gas-fired and electric furnaces; Reducing sulphur oxides (SOx) emissions to air. The BAT-AEL emission level is < 0,9 kg/t.
status: valid
status modified: 2019-04-23
accepted date: 2019-04-23
in scheme: BATAELValue

Manufacture of Glass - SO2 - BAT59-VII
type: Concept
notation: GLS-SO2-BAT59-VII
definition: 3, Mineral industry: 3,4 Melting mineral substances including the production of mineral fibres with a melting capacity exceeding 20�tonnes per day; Techniques (i)-(iv) (see table); for stone wool: Cupola furnaces, no briquettes or slag recycling; Reducing sulphur oxides (SOx) emissions to air. The BAT-AEL emission level is < 1 kg/t.
status: valid
status modified: 2019-04-23
accepted date: 2019-04-23
in scheme: BATAELValue

Manufacture of Glass - SO2 - BAT59-VIII
type: Concept
notation: GLS-SO2-BAT59-VIII
definition: 3, Mineral industry: 3,4 Melting mineral substances including the production of mineral fibres with a melting capacity exceeding 20�tonnes per day; Techniques (i)-(iv) (see table); for stone wool: Cupola furnaces, with cement briquettes or slag recycling; Reducing sulphur oxides (SOx) emissions to air. The BAT-AEL emission level is < 3,5 kg/t.
status: valid
status modified: 2019-04-23
accepted date: 2019-04-23
in scheme: BATAELValue

Manufacture of Glass - SO2 - BAT67
type: Concept
notation: GLS-SO2-BAT67
definition: 3, Mineral industry: 3,4 Melting mineral substances including the production of mineral fibres with a melting capacity exceeding 20�tonnes per day; Primary techniques (i)-(ii) (see table); Reducing sulphur oxides (SOx) emissions to air. The BAT-AEL emission level is < 50 mg/Nm3.
status: valid
status modified: 2019-04-23
accepted date: 2019-04-23
in scheme: BATAELValue

Manufacture of Glass - SO2 - BAT73-I
type: Concept
notation: GLS-SO2-BAT73-I
definition: 3, Mineral industry: 3,4 Melting mineral substances including the production of mineral fibres with a melting capacity exceeding 20�tonnes per day; Techniques (i)-(iii) (see table); Reducing sulphur oxides (SOx) emissions to air. The BAT-AEL emission level is < 50 - 200 mg/Nm3.
status: valid
status modified: 2019-04-23
accepted date: 2019-04-23
in scheme: BATAELValue

Manufacture of Glass - SO2 - BAT73-II
type: Concept
notation: GLS-SO2-BAT73-II
definition: 3, Mineral industry: 3,4 Melting mineral substances including the production of mineral fibres with a melting capacity exceeding 20�tonnes per day; Techniques (i)-(iii) (see table); Reducing sulphur oxides (SOx) emissions to air. The BAT-AEL emission level is < 0,25 - 1,5 kg/t.
status: valid
status modified: 2019-04-23
accepted date: 2019-04-23
in scheme: BATAELValue

Manufacture of Glass - SO4 - BAT13-IV
type: Concept
notation: GLS-SO4-BAT13-IV
definition: 3, Mineral industry: 3,3 Manufacture of glass including glass fibre with a melting capacity exceeding 20 tonnes per day Reducing sulphates to water. The BAT-AEL emission level is < 1000 mg/l.
status: valid
status modified: 2019-04-23
accepted date: 2019-04-23
in scheme: BATAELValue

Manufacture of Glass - Sb - BAT13-VIII
type: Concept
notation: GLS-Sb-BAT13-VIII
definition: 3, Mineral industry: 3,3 Manufacture of glass including glass fibre with a melting capacity exceeding 20 tonnes per day Reducing antimony to water. The BAT-AEL emission level is < 0,5 mg/l.
status: valid
status modified: 2019-04-23
accepted date: 2019-04-23
in scheme: BATAELValue

Manufacture of Glass - Se - BAT30-I
type: Concept
notation: GLS-Se-BAT30-I
definition: 3, Mineral industry: 3,3 Manufacture of glass including glass fibre with a melting capacity exceeding 20 tonnes per day; Techniques (i)-(iii) (see table); Reducing selenium compounds emissions to air. The BAT-AEL emission level is 1 - 3 mg/Nm3.
status: valid
status modified: 2019-04-23
accepted date: 2019-04-23
in scheme: BATAELValue

Manufacture of Glass - Se - BAT30-II
type: Concept
notation: GLS-Se-BAT30-II
definition: 3, Mineral industry: 3,3 Manufacture of glass including glass fibre with a melting capacity exceeding 20 tonnes per day; Techniques (i)-(iii) (see table); Reducing selenium compounds emissions to air. The BAT-AEL emission level is 0,0025 - 0,0075 kg/t.
status: valid
status modified: 2019-04-23
accepted date: 2019-04-23
in scheme: BATAELValue

Manufacture of Glass - Se - BAT44-I
type: Concept
notation: GLS-Se-BAT44-I
definition: 3, Mineral industry: 3,3 Manufacture of glass including glass fibre with a melting capacity exceeding 20 tonnes per day; Techniques (i)-(ii) (see table); Reducing selenium compounds emissions to air. The BAT-AEL emission level is < 1 mg/Nm3.
status: valid
status modified: 2019-04-23
accepted date: 2019-04-23
in scheme: BATAELValue

Manufacture of Glass - Se - BAT44-II
type: Concept
notation: GLS-Se-BAT44-II
definition: 3, Mineral industry: 3,3 Manufacture of glass including glass fibre with a melting capacity exceeding 20 tonnes per day; Techniques (i)-(ii) (see table); Reducing selenium compounds emissions to air. The BAT-AEL emission level is < 0,003 kg/t.
status: valid
status modified: 2019-04-23
accepted date: 2019-04-23
in scheme: BATAELValue

Manufacture of Glass - Sn - BAT13-XV
type: Concept
notation: GLS-Sn-BAT13-XV
definition: 3, Mineral industry: 3,3 Manufacture of glass including glass fibre with a melting capacity exceeding 20 tonnes per day Reducing tin to water. The BAT-AEL emission level is < 0,5 mg/l.
status: valid
status modified: 2019-04-23
accepted date: 2019-04-23
in scheme: BATAELValue

Manufacture of Glass - Sn - BAT22-III
type: Concept
notation: GLS-Sn-BAT22-III
definition: 3, Mineral industry: 3,3 Manufacture of glass including glass fibre with a melting capacity exceeding 20 tonnes per day; Techniques (i)-(iii) (see table); Reducing tin compounds emissions to air. The BAT-AEL emission level is < 5 mg/Nm3.
status: valid
status modified: 2019-04-23
accepted date: 2019-04-23
in scheme: BATAELValue

Manufacture of Glass - THC - BAT13-VI
type: Concept
notation: GLS-THC-BAT13-VI
definition: 3, Mineral industry: 3,3 Manufacture of glass including glass fibre with a melting capacity exceeding 20 tonnes per day Reducing total hydrocarbons to water. The BAT-AEL emission level is < 15 mg/l.
status: valid
status modified: 2019-04-23
accepted date: 2019-04-23
in scheme: BATAELValue

Manufacture of Glass - TPM - BAT63-I
type: Concept
notation: GLS-TPM-BAT63-I
definition: 3, Mineral industry: 3,4 Melting mineral substances including the production of mineral fibres with a melting capacity exceeding 20�tonnes per day; Techniques (i)-(v) (see table); Reducing total particulate matter emissions to air. The BAT-AEL emission level is < 20 - 50 mg/Nm3.
status: valid
status modified: 2019-04-23
accepted date: 2019-04-23
in scheme: BATAELValue

Manufacture of Glass - TPM - BAT63-VII
type: Concept
notation: GLS-TPM-BAT63-VII
definition: 3, Mineral industry: 3,4 Melting mineral substances including the production of mineral fibres with a melting capacity exceeding 20�tonnes per day; Techniques (i)-(v) (see table); Reducing total particulate matter emissions to air. The BAT-AEL emission level is < 5 - 30 mg/Nm3.
status: valid
status modified: 2019-04-23
accepted date: 2019-04-23
in scheme: BATAELValue

Manufacture of Glass - TPM - BAT63-XIV
type: Concept
notation: GLS-TPM-BAT63-XIV
definition: 3, Mineral industry: 3,4 Melting mineral substances including the production of mineral fibres with a melting capacity exceeding 20�tonnes per day; Techniques (i)-(v) (see table); Reducing total particulate matter emissions to air. The BAT-AEL emission level is < 0,2 kg/t.
status: valid
status modified: 2019-04-23
accepted date: 2019-04-23
in scheme: BATAELValue

Manufacture of Glass - TSS - BAT13-II
type: Concept
notation: GLS-TSS-BAT13-II
definition: 3, Mineral industry: 3,3 Manufacture of glass including glass fibre with a melting capacity exceeding 20 tonnes per day Reducing total suspended solids to water. The BAT-AEL emission level is < 30 mg/l.
status: valid
status modified: 2019-04-23
accepted date: 2019-04-23
in scheme: BATAELValue

Manufacture of Glass - Ti - BAT22-II
type: Concept
notation: GLS-Ti-BAT22-II
definition: 3, Mineral industry: 3,3 Manufacture of glass including glass fibre with a melting capacity exceeding 20 tonnes per day; Techniques (i)-(iii) (see table); Reducing titanium compounds emissions to air. The BAT-AEL emission level is < 5 mg/Nm3.
status: valid
status modified: 2019-04-23
accepted date: 2019-04-23
in scheme: BATAELValue

Manufacture of Glass - Zn - BAT13-XI
type: Concept
notation: GLS-Zn-BAT13-XI
definition: 3, Mineral industry: 3,3 Manufacture of glass including glass fibre with a melting capacity exceeding 20 tonnes per day Reducing zinc to water. The BAT-AEL emission level is < 0,5 mg/l.
status: valid
status modified: 2019-04-23
accepted date: 2019-04-23
in scheme: BATAELValue

Manufacture of Glass - pH - BAT13-I
type: Concept
notation: GLS-pH-BAT13-I
definition: 3, Mineral industry: 3,3 Manufacture of glass including glass fibre with a melting capacity exceeding 20 tonnes per day Reducing pH to water. The BAT-AEL emission level is 6,5 � 9.
status: valid
status modified: 2019-04-23
accepted date: 2019-04-23
in scheme: BATAELValue

Intensive rearing of poultry or pigs - NH3 - BAT30-I
type: Concept
notation: IRPP-NH3-BAT30-I
definition: 6.� Other activities: 6.6 (c): Intensive rearing of poultry or pigs with more than 750 places for sows - mating and gestating sows; Techniques (a)-(e) (see table incl. footnote) for mating and gestating sows; Reducing ammonia emissions to air. The BAT-AEL emission level is 0,2-2,7 kg NH3/animal place/year.
status: valid
status modified: 2019-04-23
accepted date: 2019-04-23
in scheme: BATAELValue

Intensive rearing of poultry or pigs - NH3 - BAT30-II
type: Concept
notation: IRPP-NH3-BAT30-II
definition: 6.� Other activities: 6.6 (c): Intensive rearing of poultry or pigs with more than 750 places for sows - farrowing sows (including piglets) in crates; Techniques (a)-(e) (see table incl. footnote) for farrowing sows (including piglets) in crates; Reducing ammonia emissions to air. The BAT-AEL emission level is 0,4-5,6 kg NH3/animal place/year.
status: valid
status modified: 2019-04-23
accepted date: 2019-04-23
in scheme: BATAELValue

Intensive rearing of poultry or pigs - NH3 - BAT30-III
type: Concept
notation: IRPP-NH3-BAT30-III
definition: 6.� Other activities: 6.6 (c): Intensive rearing of poultry or pigs with more than 750 places for sows - weaners; Techniques (a)-(e) (see table incl. footnote) for weaners; Reducing ammonia emissions to air. The BAT-AEL emission level is 0,03-0,53 kg NH3/animal place/year.
status: valid
status modified: 2019-04-23
accepted date: 2019-04-23
in scheme: BATAELValue

Intensive rearing of poultry or pigs - NH3 - BAT30-IV
type: Concept
notation: IRPP-NH3-BAT30-IV
definition: 6.� Other activities: 6.6 (b): Intensive rearing of poultry or pigs with more than 2 000 places for production pigs (over 30 kg) - fattening pigs; Techniques (a)-(e) (see table incl. footnote) for fattening pigs; Reducing ammonia emissions to air. The BAT-AEL emission level is 0,1-2,6 kg NH3/animal place/year.
status: valid
status modified: 2019-04-23
accepted date: 2019-04-23
in scheme: BATAELValue

Intensive rearing of poultry or pigs - NH3 - BAT31-I
type: Concept
notation: IRPP-NH3-BAT31-I
definition: 6.� Other activities: 6.6 (a): Intensive rearing of poultry or pigs with more than 40 000 places for poultry; Techniques (a)-(c) (see table incl. footnote) for fattening pigs for cage systems; Reducing ammonia emissions to air. The BAT-AEL emission level is 0,02-0,08 kg NH3/animal place/year.
status: valid
status modified: 2019-04-23
accepted date: 2019-04-23
in scheme: BATAELValue

Intensive rearing of poultry or pigs - NH3 - BAT31-II
type: Concept
notation: IRPP-NH3-BAT31-II
definition: 6.� Other activities: 6.6 (a): Intensive rearing of poultry or pigs with more than 40 000 places for poultry; Techniques (a)-(c) (see table incl. footnote) for fattening pigs for non-cage systems; Reducing ammonia emissions to air. The BAT-AEL emission level is 0,02-0,13 kg NH3/animal place/year.
status: valid
status modified: 2019-04-23
accepted date: 2019-04-23
in scheme: BATAELValue

Intensive rearing of poultry or pigs - NH3 - BAT32
type: Concept
notation: IRPP-NH3-BAT32
definition: 6.� Other activities: 6.6 (a): Intensive rearing of poultry or pigs with more than 40 000 places for poultry; Techniques (a)-(f) (see table incl. footnote); Reducing ammonia emissions to air. The BAT-AEL emission level is 0,01-0,08 kg NH3/animal place/year.
status: valid
status modified: 2019-04-23
accepted date: 2019-04-23
in scheme: BATAELValue

Iron and Steel Production - BOD5 - BAT56-II
type: Concept
notation: IS-BOD5-BAT56-II
definition: 1, Energy industries undertaking activities related to 2.2: 1,3 Production of coke Reducing biological oxygen demand for 5 days (BOD5) to water. The BAT-AEL emission level is < 20 mg/l.
status: valid
status modified: 2019-04-23
accepted date: 2019-04-23
in scheme: BATAELValue

Iron and Steel Production - CN - BAT56-V
type: Concept
notation: IS-CN-BAT56-V
definition: 1, Energy industries undertaking activities related to 2.2: 1,3 Production of coke Reducing cyanide (CN-) to water. The BAT-AEL emission level is < 0,1 mg/l.
status: valid
status modified: 2019-04-23
accepted date: 2019-04-23
in scheme: BATAELValue

Iron and Steel Production - CN - BAT67-V
type: Concept
notation: IS-CN-BAT67-V
definition: 2, Production and processing of metals: 2,2 Production of pig iron or steel (primary or secondary fusion) including continuous casting, with a capacity exceeding 2,5�tonnes per hour Reducing cyanide (CN-) to water. The BAT-AEL emission level is < 0,4 mg/l.
status: valid
status modified: 2019-04-23
accepted date: 2019-04-23
in scheme: BATAELValue

Iron and Steel Production - COD - BAT28-II
type: Concept
notation: IS-COD-BAT28-II
definition: 2, Production and processing of metals: 2,1 Metal ore (including sulphide ore) roasting or sintering Reducing chemical oxygen demand (COD) to water. The BAT-AEL emission level is < 100 mg/l.
status: valid
status modified: 2019-04-23
accepted date: 2019-04-23
in scheme: BATAELValue

Iron and Steel Production - COD - BAT39-II
type: Concept
notation: IS-COD-BAT39-II
definition: 2, Production and processing of metals: 2,1 Metal ore (including sulphide ore) roasting or sintering Reducing chemical oxygen demand (COD) to water. The BAT-AEL emission level is < 160 mg/l.
status: valid
status modified: 2019-04-23
accepted date: 2019-04-23
in scheme: BATAELValue

Iron and Steel Production - COD - BAT56-I
type: Concept
notation: IS-COD-BAT56-I
definition: 1, Energy industries undertaking activities related to 2.2: 1,3 Production of coke Reducing chemical oxygen demand (COD) to water. The BAT-AEL emission level is < 220 mg/l.
status: valid
status modified: 2019-04-23
accepted date: 2019-04-23
in scheme: BATAELValue

Iron and Steel Production - Cr - BAT81-V
type: Concept
notation: IS-Cr-BAT81-V
definition: 2, Production and processing of metals: 2,2 Production of pig iron or steel (primary or secondary fusion) including continuous casting, with a capacity exceeding 2,5�tonnes per hour Reducing total chromium to water. The BAT-AEL emission level is < 0,5 mg/l.
status: valid
status modified: 2019-04-23
accepted date: 2019-04-23
in scheme: BATAELValue

Iron and Steel Production - Cr - BAT92-V
type: Concept
notation: IS-Cr-BAT92-V
definition: 2, Production and processing of metals: 2,2 Production of pig iron or steel (primary or secondary fusion) including continuous casting, with a capacity exceeding 2,5�tonnes per hour Reducing total chromium to water. The BAT-AEL emission level is < 0,5 mg/l.
status: valid
status modified: 2019-04-23
accepted date: 2019-04-23
in scheme: BATAELValue

Iron and Steel Production - Dust - BAT20-I
type: Concept
notation: IS-Dust-BAT20-I
definition: 2, Production and processing of metals: 2,1 Metal ore (including sulphide ore) roasting or sintering; Bag filter for new and existing plants; Reducing dust emissions to air. The BAT-AEL emission level is < 1 - 15 mg/Nm3.
status: valid
status modified: 2019-04-23
accepted date: 2019-04-23
in scheme: BATAELValue

Iron and Steel Production - Dust - BAT20-II
type: Concept
notation: IS-Dust-BAT20-II
definition: 2, Production and processing of metals: 2,1 Metal ore (including sulphide ore) roasting or sintering; Advanced electrostatic precipitators for existing plants, when bag filters are not applicable; Reducing dust emissions to air. The BAT-AEL emission level is < 20 - 40 mg/Nm3.
status: valid
status modified: 2019-04-23
accepted date: 2019-04-23
in scheme: BATAELValue

Iron and Steel Production - Dust - BAT26-I
type: Concept
notation: IS-Dust-BAT26-I
definition: 2, Production and processing of metals: 2,1 Metal ore (including sulphide ore) roasting or sintering; Bag filter; Reducing dust emissions to air. The BAT-AEL emission level is < 10 mg/Nm3.
status: valid
status modified: 2019-04-23
accepted date: 2019-04-23
in scheme: BATAELValue

Iron and Steel Production - Dust - BAT26-II
type: Concept
notation: IS-Dust-BAT26-II
definition: 2, Production and processing of metals: 2,1 Metal ore (including sulphide ore) roasting or sintering; Electrostatic precipitator; Reducing dust emissions to air. The BAT-AEL emission level is < 30 mg/Nm3.
status: valid
status modified: 2019-04-23
accepted date: 2019-04-23
in scheme: BATAELValue

Iron and Steel Production - Dust - BAT33-I
type: Concept
notation: IS-Dust-BAT33-I
definition: 2, Production and processing of metals: 2,1 Metal ore (including sulphide ore) roasting or sintering; Crushing, grinding and drying; Reducing dust emissions to air. The BAT-AEL emission level is < 20 mg/Nm3.
status: valid
status modified: 2019-04-23
accepted date: 2019-04-23
in scheme: BATAELValue

Iron and Steel Production - Dust - BAT33-II
type: Concept
notation: IS-Dust-BAT33-II
definition: 2, Production and processing of metals: 2,1 Metal ore (including sulphide ore) roasting or sintering; All other process steps or where all waste gases are treated together; Reducing dust emissions to air. The BAT-AEL emission level is < 10 - 15 mg/Nm3.
status: valid
status modified: 2019-04-23
accepted date: 2019-04-23
in scheme: BATAELValue

Iron and Steel Production - Dust - BAT42
type: Concept
notation: IS-Dust-BAT42
definition: 1, Energy industries undertaking activities related to 2.2: 1,3 Production of coke; Coal grinding plants, techniques (I.)-(II.) (see list); Reducing dust emissions to air. The BAT-AEL emission level is < 10 - 20 mg/Nm3.
status: valid
status modified: 2019-04-23
accepted date: 2019-04-23
in scheme: BATAELValue

Iron and Steel Production - Dust - BAT43
type: Concept
notation: IS-Dust-BAT43
definition: 1, Energy industries undertaking activities related to 2.2: 1,3 Production of coke; Using efficient extraction and subsequent dedusting (technique (V.); Reducing dust emissions to air. The BAT-AEL emission level is < 10 - 20 mg/Nm3.
status: valid
status modified: 2019-04-23
accepted date: 2019-04-23
in scheme: BATAELValue

Iron and Steel Production - Dust - BAT44-I
type: Concept
notation: IS-Dust-BAT44-I
definition: 1, Energy industries undertaking activities related to 2.2: 1,3 Production of coke; Coal charging systems with land-based treatment of extracted gases; Reducing dust emissions to air. The BAT-AEL emission level is < 5 g/t.
status: valid
status modified: 2019-04-23
accepted date: 2019-04-23
in scheme: BATAELValue

Iron and Steel Production - Dust - BAT44-II
type: Concept
notation: IS-Dust-BAT44-II
definition: 1, Energy industries undertaking activities related to 2.2: 1,3 Production of coke; Coal charging systems with land-based treatment of extracted gases; Reducing dust emissions to air. The BAT-AEL emission level is < 50 mg/Nm3.
status: valid
status modified: 2019-04-23
accepted date: 2019-04-23
in scheme: BATAELValue

Iron and Steel Production - Dust - BAT49-II
type: Concept
notation: IS-Dust-BAT49-II
definition: 1, Energy industries undertaking activities related to 2.2: 1,3 Production of coke; Techniques (I.)-(IV.) (see list); Reducing dust emissions to air. The BAT-AEL emission level is < 1 - 20 mg/Nm3.
status: valid
status modified: 2019-04-23
accepted date: 2019-04-23
in scheme: BATAELValue

Iron and Steel Production - Dust - BAT50-I
type: Concept
notation: IS-Dust-BAT50-I
definition: 1, Energy industries undertaking activities related to 2.2: 1,3 Production of coke; Bag filters; Reducing dust emissions to air. The BAT-AEL emission level is < 10 mg/Nm3.
status: valid
status modified: 2019-04-23
accepted date: 2019-04-23
in scheme: BATAELValue

Iron and Steel Production - Dust - BAT50-II
type: Concept
notation: IS-Dust-BAT50-II
definition: 1, Energy industries undertaking activities related to 2.2: 1,3 Production of coke; Other cases; Reducing dust emissions to air. The BAT-AEL emission level is < 20 mg/Nm3.
status: valid
status modified: 2019-04-23
accepted date: 2019-04-23
in scheme: BATAELValue

Iron and Steel Production - Dust - BAT51-I
type: Concept
notation: IS-Dust-BAT51-I
definition: 1, Energy industries undertaking activities related to 2.2: 1,3 Production of coke; Coke dry quenching (CDQ); Reducing dust emissions to air. The BAT-AEL emission level is < 20 mg/Nm3.
status: valid
status modified: 2019-04-23
accepted date: 2019-04-23
in scheme: BATAELValue

Iron and Steel Production - Dust - BAT51-II
type: Concept
notation: IS-Dust-BAT51-II
definition: 1, Energy industries undertaking activities related to 2.2: 1,3 Production of coke; Emission-minimised conventional wet quenching; Reducing dust emissions to air. The BAT-AEL emission level is < 25 g/t.
status: valid
status modified: 2019-04-23
accepted date: 2019-04-23
in scheme: BATAELValue

Iron and Steel Production - Dust - BAT51-III
type: Concept
notation: IS-Dust-BAT51-III
definition: 1, Energy industries undertaking activities related to 2.2: 1,3 Production of coke; Coke stabilisation quenching (CSQ); Reducing dust emissions to air. The BAT-AEL emission level is < 10 g/t.
status: valid
status modified: 2019-04-23
accepted date: 2019-04-23
in scheme: BATAELValue

Iron and Steel Production - Dust - BAT52
type: Concept
notation: IS-Dust-BAT52
definition: 1, Energy industries undertaking activities related to 2.2: 1,3 Production of coke; Techniques (I.)-(II.) (see list); Reducing dust emissions to air. The BAT-AEL emission level is < 10 mg/Nm3.
status: valid
status modified: 2019-04-23
accepted date: 2019-04-23
in scheme: BATAELValue

Iron and Steel Production - Dust - BAT59
type: Concept
notation: IS-Dust-BAT59
definition: 2, Production and processing of metals: 2,2 Production of pig iron or steel (primary or secondary fusion) including continuous casting, with a capacity exceeding 2,5�tonnes per hour; Dust capture and dry dedusting; Reducing dust emissions to air. The BAT-AEL emission level is < 20 mg/Nm3.
status: valid
status modified: 2019-04-23
accepted date: 2019-04-23
in scheme: BATAELValue

Iron and Steel Production - Dust - BAT61
type: Concept
notation: IS-Dust-BAT61
definition: 2, Production and processing of metals: 2,2 Production of pig iron or steel (primary or secondary fusion) including continuous casting, with a capacity exceeding 2,5�tonnes per hour; BAT II (see list); Reducing dust emissions to air. The BAT-AEL emission level is < 1 - 15 mg/Nm3.
status: valid
status modified: 2019-04-23
accepted date: 2019-04-23
in scheme: BATAELValue

Iron and Steel Production - Dust - BAT64
type: Concept
notation: IS-Dust-BAT64
definition: 2, Production and processing of metals: 2,2 Production of pig iron or steel (primary or secondary fusion) including continuous casting, with a capacity exceeding 2,5�tonnes per hour; Techniques (I)-(II) (see list); Reducing dust emissions to air. The BAT-AEL emission level is < 10 mg/Nm3 .
status: valid
status modified: 2019-04-23
accepted date: 2019-04-23
in scheme: BATAELValue

Iron and Steel Production - Dust - BAT65-II
type: Concept
notation: IS-Dust-BAT65-II
definition: 2, Production and processing of metals: 2,2 Production of pig iron or steel (primary or secondary fusion) including continuous casting, with a capacity exceeding 2,5�tonnes per hour; Desulphurised and dedusted surplus coke oven gas, dedusted blast furnace gas, dedusted basic oxygen furnace gas and natural gas; Reducing dust emissions to air. The BAT-AEL emission level is < 10 mg/Nm3.
status: valid
status modified: 2019-04-23
accepted date: 2019-04-23
in scheme: BATAELValue

Iron and Steel Production - Dust - BAT75-I
type: Concept
notation: IS-Dust-BAT75-I
definition: 2, Production and processing of metals: 2,2 Production of pig iron or steel (primary or secondary fusion) including continuous casting, with a capacity exceeding 2,5�tonnes per hour; BAT III.i (see list); Reducing dust emissions to air. The BAT-AEL emission level is 10 � 30 mg/Nm3 .
status: valid
status modified: 2019-04-23
accepted date: 2019-04-23
in scheme: BATAELValue

Iron and Steel Production - Dust - BAT75-II
type: Concept
notation: IS-Dust-BAT75-II
definition: 2, Production and processing of metals: 2,2 Production of pig iron or steel (primary or secondary fusion) including continuous casting, with a capacity exceeding 2,5�tonnes per hour; BAT III.ii (see list); Reducing dust emissions to air. The BAT-AEL emission level is < 50 mg/Nm3 .
status: valid
status modified: 2019-04-23
accepted date: 2019-04-23
in scheme: BATAELValue

Iron and Steel Production - Dust - BAT76-I
type: Concept
notation: IS-Dust-BAT76-I
definition: 2, Production and processing of metals: 2,2 Production of pig iron or steel (primary or secondary fusion) including continuous casting, with a capacity exceeding 2,5�tonnes per hour; BAT I (see list) for new and existing plants; Reducing dust emissions to air. The BAT-AEL emission level is 10 - 30 mg/Nm3.
status: valid
status modified: 2019-04-23
accepted date: 2019-04-23
in scheme: BATAELValue

Iron and Steel Production - Dust - BAT76-II
type: Concept
notation: IS-Dust-BAT76-II
definition: 2, Production and processing of metals: 2,2 Production of pig iron or steel (primary or secondary fusion) including continuous casting, with a capacity exceeding 2,5�tonnes per hour; BAT II (see list) for existing plants; Reducing dust emissions to air. The BAT-AEL emission level is < 50 mg/Nm3.
status: valid
status modified: 2019-04-23
accepted date: 2019-04-23
in scheme: BATAELValue

Iron and Steel Production - Dust - BAT78-I
type: Concept
notation: IS-Dust-BAT78-I
definition: 2, Production and processing of metals: 2,2 Production of pig iron or steel (primary or secondary fusion) including continuous casting, with a capacity exceeding 2,5�tonnes per hour; Bag filter; Reducing dust emissions to air. The BAT-AEL emission level is < 1 - 15 mg/Nm3.
status: valid
status modified: 2019-04-23
accepted date: 2019-04-23
in scheme: BATAELValue

Iron and Steel Production - Dust - BAT78-II
type: Concept
notation: IS-Dust-BAT78-II
definition: 2, Production and processing of metals: 2,2 Production of pig iron or steel (primary or secondary fusion) including continuous casting, with a capacity exceeding 2,5�tonnes per hour; ESP; Reducing dust emissions to air. The BAT-AEL emission level is < 20 mg/Nm3.
status: valid
status modified: 2019-04-23
accepted date: 2019-04-23
in scheme: BATAELValue

Iron and Steel Production - Dust - BAT78-III
type: Concept
notation: IS-Dust-BAT78-III
definition: 2, Production and processing of metals: 2,2 Production of pig iron or steel (primary or secondary fusion) including continuous casting, with a capacity exceeding 2,5�tonnes per hour; Bag filter; Reducing dust emissions to air. The BAT-AEL emission level is < 1 - 10 mg/Nm3.
status: valid
status modified: 2019-04-23
accepted date: 2019-04-23
in scheme: BATAELValue

Iron and Steel Production - Dust - BAT78-IV
type: Concept
notation: IS-Dust-BAT78-IV
definition: 2, Production and processing of metals: 2,2 Production of pig iron or steel (primary or secondary fusion) including continuous casting, with a capacity exceeding 2,5�tonnes per hour; ESP; Reducing dust emissions to air. The BAT-AEL emission level is < 20 mg/Nm3.
status: valid
status modified: 2019-04-23
accepted date: 2019-04-23
in scheme: BATAELValue

Iron and Steel Production - Dust - BAT79
type: Concept
notation: IS-Dust-BAT79
definition: 2, Production and processing of metals: 2,2 Production of pig iron or steel (primary or secondary fusion) including continuous casting, with a capacity exceeding 2,5�tonnes per hour; BAT I (see list); Reducing dust emissions to air. The BAT-AEL emission level is < 10 - 20 mg/Nm3.
status: valid
status modified: 2019-04-23
accepted date: 2019-04-23
in scheme: BATAELValue

Iron and Steel Production - Dust - BAT88-I
type: Concept
notation: IS-Dust-BAT88-I
definition: 2, Production and processing of metals: 2,2 Production of pig iron or steel (primary or secondary fusion) including continuous casting, with a capacity exceeding 2,5�tonnes per hour; Techniques (I.)-(III.) (see list) and dedusting by bag filter; Reducing dust emissions to air. The BAT-AEL emission level is < 5 mg/Nm3.
status: valid
status modified: 2019-04-23
accepted date: 2019-04-23
in scheme: BATAELValue

Iron and Steel Production - Dust - BAT90
type: Concept
notation: IS-Dust-BAT90
definition: 2, Production and processing of metals: 2,2 Production of pig iron or steel (primary or secondary fusion) including continuous casting, with a capacity exceeding 2,5�tonnes per hour; BAT I; Reducing dust emissions to air. The BAT-AEL emission level is < 10 - 20 mg/Nm3.
status: valid
status modified: 2019-04-23
accepted date: 2019-04-23
in scheme: BATAELValue

Iron and Steel Production - Fe - BAT67-II
type: Concept
notation: IS-Fe-BAT67-II
definition: 2, Production and processing of metals: 2,2 Production of pig iron or steel (primary or secondary fusion) including continuous casting, with a capacity exceeding 2,5�tonnes per hour Reducing iron to water. The BAT-AEL emission level is < 5 mg/l.
status: valid
status modified: 2019-04-23
accepted date: 2019-04-23
in scheme: BATAELValue

Iron and Steel Production - Fe - BAT81-II
type: Concept
notation: IS-Fe-BAT81-II
definition: 2, Production and processing of metals: 2,2 Production of pig iron or steel (primary or secondary fusion) including continuous casting, with a capacity exceeding 2,5�tonnes per hour Reducing iron to water. The BAT-AEL emission level is < 5 mg/l.
status: valid
status modified: 2019-04-23
accepted date: 2019-04-23
in scheme: BATAELValue

Iron and Steel Production - Fe - BAT92-II
type: Concept
notation: IS-Fe-BAT92-II
definition: 2, Production and processing of metals: 2,2 Production of pig iron or steel (primary or secondary fusion) including continuous casting, with a capacity exceeding 2,5�tonnes per hour Reducing iron to water. The BAT-AEL emission level is < 5 mg/l.
status: valid
status modified: 2019-04-23
accepted date: 2019-04-23
in scheme: BATAELValue

Iron and Steel Production - H2S - BAT48-I
type: Concept
notation: IS-H2S-BAT48-I
definition: 1, Energy industries undertaking activities related to 2.2: 1,3 Production of coke; Technique (I.) (see list); Reducing hydrogen sulphide emissions to air. The BAT-AEL emission level is < 300 � 1 000 mg/Nm3.
status: valid
status modified: 2019-04-23
accepted date: 2019-04-23
in scheme: BATAELValue

Iron and Steel Production - H2S - BAT48-II
type: Concept
notation: IS-H2S-BAT48-II
definition: 1, Energy industries undertaking activities related to 2.2: 1,3 Production of coke; Technique (II.) (see list); Reducing hydrogen sulphide emissions to air. The BAT-AEL emission level is < 10 mg/Nm3 .
status: valid
status modified: 2019-04-23
accepted date: 2019-04-23
in scheme: BATAELValue

Iron and Steel Production - HCl - BAT34-III
type: Concept
notation: IS-HCl-BAT34-III
definition: 2, Production and processing of metals: 2,1 Metal ore (including sulphide ore) roasting or sintering; Wet scrubber, semi-dry absorption with a subsequent dedusting system; Reducing hydrogen chloride (HCl) emissions to air. The BAT-AEL emission level is < 1 - 3 mg/Nm3.
status: valid
status modified: 2019-04-23
accepted date: 2019-04-23
in scheme: BATAELValue

Iron and Steel Production - HF - BAT34-II
type: Concept
notation: IS-HF-BAT34-II
definition: 2, Production and processing of metals: 2,1 Metal ore (including sulphide ore) roasting or sintering; Wet scrubber, semi-dry absorption with a subsequent dedusting system; Reducing hydrogen fluoride (HF) emissions to air. The BAT-AEL emission level is < 1 - 3 mg/Nm3.
status: valid
status modified: 2019-04-23
accepted date: 2019-04-23
in scheme: BATAELValue

Iron and Steel Production - Hg - BAT21
type: Concept
notation: IS-Hg-BAT21
definition: 2, Production and processing of metals: 2,1 Metal ore (including sulphide ore) roasting or sintering; Waste gas treatment with activated carbon or lignite coke injection; Reducing mercury emissions to air. The BAT-AEL emission level is < 0,03 - 0,05 mg/Nm3.
status: valid
status modified: 2019-04-23
accepted date: 2019-04-23
in scheme: BATAELValue

Iron and Steel Production - Hg - BAT88-II
type: Concept
notation: IS-Hg-BAT88-II
definition: 2, Production and processing of metals: 2,2 Production of pig iron or steel (primary or secondary fusion) including continuous casting, with a capacity exceeding 2,5�tonnes per hour; Techniques (I.)-(III.) (see list) and dedusting by bag filter; Reducing mercury emissions to air. The BAT-AEL emission level is < 0,05 mg/Nm3.
status: valid
status modified: 2019-04-23
accepted date: 2019-04-23
in scheme: BATAELValue

Iron and Steel Production - Metals - BAT28-III
type: Concept
notation: IS-Metals-BAT28-III
definition: 2, Production and processing of metals: 2,1 Metal ore (including sulphide ore) roasting or sintering Reducing heavy metals to water. The BAT-AEL emission level is < 0,1 mg/l.
status: valid
status modified: 2019-04-23
accepted date: 2019-04-23
in scheme: BATAELValue

Iron and Steel Production - Metals - BAT39-IV
type: Concept
notation: IS-Metals-BAT39-IV
definition: 2, Production and processing of metals: 2,1 Metal ore (including sulphide ore) roasting or sintering Reducing heavy metals to water. The BAT-AEL emission level is < 0,55 mg/l.
status: valid
status modified: 2019-04-23
accepted date: 2019-04-23
in scheme: BATAELValue

Iron and Steel Production - NO2 - BAT23-I
type: Concept
notation: IS-NO2-BAT23-I
definition: 2, Production and processing of metals: 2,1 Metal ore (including sulphide ore) roasting or sintering; Process integrated measures (I.); Reducing nitrogen oxides (NOx) emissions to air. The BAT-AEL emission level is < 500 mg/Nm3.
status: valid
status modified: 2019-04-23
accepted date: 2019-04-23
in scheme: BATAELValue

Iron and Steel Production - NO2 - BAT23-II
type: Concept
notation: IS-NO2-BAT23-II
definition: 2, Production and processing of metals: 2,1 Metal ore (including sulphide ore) roasting or sintering; RAC (II.i); Reducing nitrogen oxides (NOx) emissions to air. The BAT-AEL emission level is < 250 mg/Nm3.
status: valid
status modified: 2019-04-23
accepted date: 2019-04-23
in scheme: BATAELValue

Iron and Steel Production - NO2 - BAT23-III
type: Concept
notation: IS-NO2-BAT23-III
definition: 2, Production and processing of metals: 2,1 Metal ore (including sulphide ore) roasting or sintering; SCR (II.ii); Reducing nitrogen oxides (NOx) emissions to air. The BAT-AEL emission level is < 120 mg/Nm3.
status: valid
status modified: 2019-04-23
accepted date: 2019-04-23
in scheme: BATAELValue

Iron and Steel Production - NO2 - BAT49-III
type: Concept
notation: IS-NO2-BAT49-III
definition: 1, Energy industries undertaking activities related to 2.2: 1,3 Production of coke; Techniques (I.)-(IV.) (see list) for New or substantially revamped plants (< 10 years old); Reducing nitrogen oxides (NOx) emissions to air. The BAT-AEL emission level is < 350 - 500 mg/Nm3.
status: valid
status modified: 2019-04-23
accepted date: 2019-04-23
in scheme: BATAELValue

Iron and Steel Production - NO2 - BAT49-IV
type: Concept
notation: IS-NO2-BAT49-IV
definition: 1, Energy industries undertaking activities related to 2.2: 1,3 Production of coke; Techniques (I.)-(IV.) (see list) for Older plants (> 10 years old); Reducing nitrogen oxides (NOx) emissions to air. The BAT-AEL emission level is 500 - 650 mg/Nm3.
status: valid
status modified: 2019-04-23
accepted date: 2019-04-23
in scheme: BATAELValue

Iron and Steel Production - NO2 - BAT65-III
type: Concept
notation: IS-NO2-BAT65-III
definition: 2, Production and processing of metals: 2,2 Production of pig iron or steel (primary or secondary fusion) including continuous casting, with a capacity exceeding 2,5�tonnes per hour; Desulphurised and dedusted surplus coke oven gas, dedusted blast furnace gas, dedusted basic oxygen furnace gas and natural gas; Reducing nitrogen oxides (NOx) emissions to air. The BAT-AEL emission level is < 100 mg/Nm3.
status: valid
status modified: 2019-04-23
accepted date: 2019-04-23
in scheme: BATAELValue

Iron and Steel Production - Ni - BAT81-IV
type: Concept
notation: IS-Ni-BAT81-IV
definition: 2, Production and processing of metals: 2,2 Production of pig iron or steel (primary or secondary fusion) including continuous casting, with a capacity exceeding 2,5�tonnes per hour Reducing nickel to water. The BAT-AEL emission level is < 0,5 mg/l.
status: valid
status modified: 2019-04-23
accepted date: 2019-04-23
in scheme: BATAELValue

Iron and Steel Production - Ni - BAT92-IV
type: Concept
notation: IS-Ni-BAT92-IV
definition: 2, Production and processing of metals: 2,2 Production of pig iron or steel (primary or secondary fusion) including continuous casting, with a capacity exceeding 2,5�tonnes per hour Reducing nickel to water. The BAT-AEL emission level is < 0,5 mg/l.
status: valid
status modified: 2019-04-23
accepted date: 2019-04-23
in scheme: BATAELValue

Iron and Steel Production - PAH - BAT56-VI
type: Concept
notation: IS-PAH-BAT56-VI
definition: 1, Energy industries undertaking activities related to 2.2: 1,3 Production of coke Reducing polycyclic aromatic hydrocarbons (PAH) to water. The BAT-AEL emission level is < 0,05 mg/l.
status: valid
status modified: 2019-04-23
accepted date: 2019-04-23
in scheme: BATAELValue

Iron and Steel Production - PCDD.F - BAT25-I
type: Concept
notation: IS-PCDD.F-BAT25-I
definition: 2, Production and processing of metals: 2,1 Metal ore (including sulphide ore) roasting or sintering; Bag filter; Reducing polychlorinated dibenzodioxins/ furans (PCDD/F) emissions to air. The BAT-AEL emission level is < 0,05 - 0,2 ng/Nm3.
status: valid
status modified: 2019-04-23
accepted date: 2019-04-23
in scheme: BATAELValue

Iron and Steel Production - PCDD.F - BAT25-II
type: Concept
notation: IS-PCDD.F-BAT25-II
definition: 2, Production and processing of metals: 2,1 Metal ore (including sulphide ore) roasting or sintering; Advanced electrostatic precipitator; Reducing polychlorinated dibenzodioxins/ furans (PCDD/F) emissions to air. The BAT-AEL emission level is < 0,2 - 0,4 ng/Nm3.
status: valid
status modified: 2019-04-23
accepted date: 2019-04-23
in scheme: BATAELValue

Iron and Steel Production - PCDD.F - BAT89
type: Concept
notation: IS-PCDD.F-BAT89
definition: 2, Production and processing of metals: 2,2 Production of pig iron or steel (primary or secondary fusion) including continuous casting, with a capacity exceeding 2,5�tonnes per hour; Techniques (I.)-(III.) (see list); Reducing polychlorinated dibenzodioxins/ furans (PCDD/F) emissions to air. The BAT-AEL emission level is < 0,1 ng/Nm3.
status: valid
status modified: 2019-04-23
accepted date: 2019-04-23
in scheme: BATAELValue

Iron and Steel Production - Pb - BAT67-III
type: Concept
notation: IS-Pb-BAT67-III
definition: 2, Production and processing of metals: 2,2 Production of pig iron or steel (primary or secondary fusion) including continuous casting, with a capacity exceeding 2,5�tonnes per hour Reducing lead to water. The BAT-AEL emission level is < 0,5 mg/l.
status: valid
status modified: 2019-04-23
accepted date: 2019-04-23
in scheme: BATAELValue

Iron and Steel Production - Phenols - BAT56-VII
type: Concept
notation: IS-Phenols-BAT56-VII
definition: 1, Energy industries undertaking activities related to 2.2: 1,3 Production of coke Reducing phenols to water. The BAT-AEL emission level is < 0,5 mg/l.
status: valid
status modified: 2019-04-23
accepted date: 2019-04-23
in scheme: BATAELValue

Iron and Steel Production - S - BAT56-III
type: Concept
notation: IS-S-BAT56-III
definition: 1, Energy industries undertaking activities related to 2.2: 1,3 Production of coke Reducing sulphides to water. The BAT-AEL emission level is < 0,1 mg/l.
status: valid
status modified: 2019-04-23
accepted date: 2019-04-23
in scheme: BATAELValue

Iron and Steel Production - SCN - BAT56-IV
type: Concept
notation: IS-SCN-BAT56-IV
definition: 1, Energy industries undertaking activities related to 2.2: 1,3 Production of coke Reducing thiocyanate (SCN-) to water. The BAT-AEL emission level is < 4 mg/l.
status: valid
status modified: 2019-04-23
accepted date: 2019-04-23
in scheme: BATAELValue

Iron and Steel Production - SO2 - BAT22-I
type: Concept
notation: IS-SO2-BAT22-I
definition: 2, Production and processing of metals: 2,1 Metal ore (including sulphide ore) roasting or sintering; BAT I - IV (see list); Reducing sulphur oxides (SOx) emissions to air. The BAT-AEL emission level is < 350 - 500 mg/Nm3.
status: valid
status modified: 2019-04-23
accepted date: 2019-04-23
in scheme: BATAELValue

Iron and Steel Production - SO2 - BAT22-II
type: Concept
notation: IS-SO2-BAT22-II
definition: 2, Production and processing of metals: 2,1 Metal ore (including sulphide ore) roasting or sintering; BAT V (see list); Reducing sulphur oxides (SOx) emissions to air. The BAT-AEL emission level is < 100 mg/Nm3.
status: valid
status modified: 2019-04-23
accepted date: 2019-04-23
in scheme: BATAELValue

Iron and Steel Production - SO2 - BAT34-I
type: Concept
notation: IS-SO2-BAT34-I
definition: 2, Production and processing of metals: 2,1 Metal ore (including sulphide ore) roasting or sintering; Wet scrubber, semi-dry absorption with a subsequent dedusting system; Reducing sulphur oxides (SOx) emissions to air. The BAT-AEL emission level is < 30 - 50 mg/Nm3.
status: valid
status modified: 2019-04-23
accepted date: 2019-04-23
in scheme: BATAELValue

Iron and Steel Production - SO2 - BAT49-I
type: Concept
notation: IS-SO2-BAT49-I
definition: 1, Energy industries undertaking activities related to 2.2: 1,3 Production of coke; Techniques (I.)-(IV.) (see list); Reducing sulphur oxides (SOx) emissions to air. The BAT-AEL emission level is < 200 - 500 mg/Nm3.
status: valid
status modified: 2019-04-23
accepted date: 2019-04-23
in scheme: BATAELValue

Iron and Steel Production - SO2 - BAT65-I
type: Concept
notation: IS-SO2-BAT65-I
definition: 2, Production and processing of metals: 2,2 Production of pig iron or steel (primary or secondary fusion) including continuous casting, with a capacity exceeding 2,5�tonnes per hour; Desulphurised and dedusted surplus coke oven gas, dedusted blast furnace gas, dedusted basic oxygen furnace gas and natural gas; Reducing sulphur oxides (SOx) emissions to air. The BAT-AEL emission level is < 200 mg/Nm3.
status: valid
status modified: 2019-04-23
accepted date: 2019-04-23
in scheme: BATAELValue

Iron and Steel Production - SS - BAT28-I
type: Concept
notation: IS-SS-BAT28-I
definition: 2, Production and processing of metals: 2,1 Metal ore (including sulphide ore) roasting or sintering Reducing suspended solids to water. The BAT-AEL emission level is < 30 mg/l.
status: valid
status modified: 2019-04-23
accepted date: 2019-04-23
in scheme: BATAELValue

Iron and Steel Production - SS - BAT39-I
type: Concept
notation: IS-SS-BAT39-I
definition: 2, Production and processing of metals: 2,1 Metal ore (including sulphide ore) roasting or sintering Reducing suspended solids to water. The BAT-AEL emission level is < 50 mg/l.
status: valid
status modified: 2019-04-23
accepted date: 2019-04-23
in scheme: BATAELValue

Iron and Steel Production - SS - BAT67-I
type: Concept
notation: IS-SS-BAT67-I
definition: 2, Production and processing of metals: 2,2 Production of pig iron or steel (primary or secondary fusion) including continuous casting, with a capacity exceeding 2,5�tonnes per hour Reducing suspended solids to water. The BAT-AEL emission level is < 30 mg/l.
status: valid
status modified: 2019-04-23
accepted date: 2019-04-23
in scheme: BATAELValue

Iron and Steel Production - SS - BAT81-I
type: Concept
notation: IS-SS-BAT81-I
definition: 2, Production and processing of metals: 2,2 Production of pig iron or steel (primary or secondary fusion) including continuous casting, with a capacity exceeding 2,5�tonnes per hour Reducing suspended solids to water. The BAT-AEL emission level is < 20 mg/l.
status: valid
status modified: 2019-04-23
accepted date: 2019-04-23
in scheme: BATAELValue

Iron and Steel Production - SS - BAT92-I
type: Concept
notation: IS-SS-BAT92-I
definition: 2, Production and processing of metals: 2,2 Production of pig iron or steel (primary or secondary fusion) including continuous casting, with a capacity exceeding 2,5�tonnes per hour Reducing suspended solids to water. The BAT-AEL emission level is < 20 mg/l.
status: valid
status modified: 2019-04-23
accepted date: 2019-04-23
in scheme: BATAELValue

Iron and Steel Production - THC - BAT81-VI
type: Concept
notation: IS-THC-BAT81-VI
definition: 2, Production and processing of metals: 2,2 Production of pig iron or steel (primary or secondary fusion) including continuous casting, with a capacity exceeding 2,5�tonnes per hour Reducing total hydrocarbons to water. The BAT-AEL emission level is < 5 mg/l.
status: valid
status modified: 2019-04-23
accepted date: 2019-04-23
in scheme: BATAELValue

Iron and Steel Production - THC - BAT92-VI
type: Concept
notation: IS-THC-BAT92-VI
definition: 2, Production and processing of metals: 2,2 Production of pig iron or steel (primary or secondary fusion) including continuous casting, with a capacity exceeding 2,5�tonnes per hour Reducing total hydrocarbons to water. The BAT-AEL emission level is < 5 mg/l.
status: valid
status modified: 2019-04-23
accepted date: 2019-04-23
in scheme: BATAELValue

Iron and Steel Production - TKN - BAT39-III
type: Concept
notation: IS-TKN-BAT39-III
definition: 2, Production and processing of metals: 2,1 Metal ore (including sulphide ore) roasting or sintering Reducing kjeldahl nitrogen to water. The BAT-AEL emission level is < 45 mg/l.
status: valid
status modified: 2019-04-23
accepted date: 2019-04-23
in scheme: BATAELValue

Iron and Steel Production - TN - BAT56-VIII
type: Concept
notation: IS-TN-BAT56-VIII
definition: 1, Energy industries undertaking activities related to 2.2: 1,3 Production of coke Reducing sum of ammonia-nitrogen (NH4+ - N), nitrate-nitrogen (NO3- - N) and nitrite-nitrogen (NO2- - N) to water. The BAT-AEL emission level is < 15 - 50 mg/l.
status: valid
status modified: 2019-04-23
accepted date: 2019-04-23
in scheme: BATAELValue

Iron and Steel Production - Zn - BAT67-IV
type: Concept
notation: IS-Zn-BAT67-IV
definition: 2, Production and processing of metals: 2,2 Production of pig iron or steel (primary or secondary fusion) including continuous casting, with a capacity exceeding 2,5�tonnes per hour Reducing zinc to water. The BAT-AEL emission level is < 2 mg/l.
status: valid
status modified: 2019-04-23
accepted date: 2019-04-23
in scheme: BATAELValue

Iron and Steel Production - Zn - BAT81-III
type: Concept
notation: IS-Zn-BAT81-III
definition: 2, Production and processing of metals: 2,2 Production of pig iron or steel (primary or secondary fusion) including continuous casting, with a capacity exceeding 2,5�tonnes per hour Reducing zinc to water. The BAT-AEL emission level is < 2 mg/l.
status: valid
status modified: 2019-04-23
accepted date: 2019-04-23
in scheme: BATAELValue

Iron and Steel Production - Zn - BAT92-III
type: Concept
notation: IS-Zn-BAT92-III
definition: 2, Production and processing of metals: 2,2 Production of pig iron or steel (primary or secondary fusion) including continuous casting, with a capacity exceeding 2,5�tonnes per hour Reducing zinc to water. The BAT-AEL emission level is < 2 mg/l.
status: valid
status modified: 2019-04-23
accepted date: 2019-04-23
in scheme: BATAELValue

Large combustion plants - CH4 - BAT45-II
type: Concept
notation: LCP-CH4-BAT45-II
definition: 1. Energy industries: 1.1, Combustion of fuels in installations with a total rated thermal input of 50 MW or more, only when this activity takes place in combustion plants with a total rated thermal input of 50 MW or more; Ensure optimised combustion and/or to use oxidation catalysts for Existing plant; Reducing methane emissions to air. The BAT-AEL emission level is 215�560 mg/Nm3.
status: valid
status modified: 2019-04-23
accepted date: 2019-04-23
in scheme: BATAELValue

Large combustion plants - CH4 - BAT45-III
type: Concept
notation: LCP-CH4-BAT45-III
definition: #N/A
status: valid
status modified: 2019-04-23
accepted date: 2019-04-23
in scheme: BATAELValue

Large combustion plants - Dust - BAT22-I
type: Concept
notation: LCP-Dust-BAT22-I
definition: 1. Energy industries: 1.1, Combustion of fuels in installations with a total rated thermal input of 50 MW or more, only when this activity takes place in combustion plants with a total rated thermal input of 50 MW or more; Techniques (a)-(e) (see table) for New plant; Reducing dust emissions to air. The BAT-AEL emission level is 2�5 mg/Nm3.
status: valid
status modified: 2019-04-23
accepted date: 2019-04-23
in scheme: BATAELValue

Large combustion plants - As - BAT15-VIII
type: Concept
notation: LCP-As-BAT15-VIII
definition: 1.� Energy industries; 5.� Waste management: 1.1, Combustion of fuels in installations with a total rated thermal input of 50 MW or more, only when this activity takes place in combustion plants with a total rated thermal input of 50 MW or more; 1.4, Gasification of coal or other fuels in installations with a total rated thermal input of 20 MW or more, only when this activity is directly associated to a combustion plant; 5.2, Disposal or recovery of waste in waste co-incineration plants for non-hazardous waste with a capacity exceeding 3 tonnes per hour or for hazardous waste with a capacity exceeding 10 tonnes per day, only when this activity takes place in combustion plants covered under 1.1 above. Reducing arsenic to water. The BAT-AEL emission level is 10�50 �g/l .
status: valid
status modified: 2019-04-23
accepted date: 2019-04-23
in scheme: BATAELValue

Large combustion plants - COD - BAT15-II
type: Concept
notation: LCP-COD-BAT15-II
definition: 1.� Energy industries; 5.� Waste management: 1.1, Combustion of fuels in installations with a total rated thermal input of 50 MW or more, only when this activity takes place in combustion plants with a total rated thermal input of 50 MW or more; 1.4, Gasification of coal or other fuels in installations with a total rated thermal input of 20 MW or more, only when this activity is directly associated to a combustion plant; 5.2, Disposal or recovery of waste in waste co-incineration plants for non-hazardous waste with a capacity exceeding 3 tonnes per hour or for hazardous waste with a capacity exceeding 10 tonnes per day, only when this activity takes place in combustion plants covered under 1.1 above. Reducing chemical oxygen demand (COD) to water. The BAT-AEL emission level is 60�150 mg/l .
status: valid
status modified: 2019-04-23
accepted date: 2019-04-23
in scheme: BATAELValue

Large combustion plants - Cd - BAT15-IX
type: Concept
notation: LCP-Cd-BAT15-IX
definition: 1.� Energy industries; 5.� Waste management: 1.1, Combustion of fuels in installations with a total rated thermal input of 50 MW or more, only when this activity takes place in combustion plants with a total rated thermal input of 50 MW or more; 1.4, Gasification of coal or other fuels in installations with a total rated thermal input of 20 MW or more, only when this activity is directly associated to a combustion plant; 5.2, Disposal or recovery of waste in waste co-incineration plants for non-hazardous waste with a capacity exceeding 3 tonnes per hour or for hazardous waste with a capacity exceeding 10 tonnes per day, only when this activity takes place in combustion plants covered under 1.1 above. Reducing cadmium to water. The BAT-AEL emission level is 2�5 �g/l .
status: valid
status modified: 2019-04-23
accepted date: 2019-04-23
in scheme: BATAELValue

Large combustion plants - Cr - BAT15-X
type: Concept
notation: LCP-Cr-BAT15-X
definition: 1.� Energy industries; 5.� Waste management: 1.1, Combustion of fuels in installations with a total rated thermal input of 50 MW or more, only when this activity takes place in combustion plants with a total rated thermal input of 50 MW or more; 1.4, Gasification of coal or other fuels in installations with a total rated thermal input of 20 MW or more, only when this activity is directly associated to a combustion plant; 5.2, Disposal or recovery of waste in waste co-incineration plants for non-hazardous waste with a capacity exceeding 3 tonnes per hour or for hazardous waste with a capacity exceeding 10 tonnes per day, only when this activity takes place in combustion plants covered under 1.1 above. Reducing chromium to water. The BAT-AEL emission level is 10�50 �g/l .
status: valid
status modified: 2019-04-23
accepted date: 2019-04-23
in scheme: BATAELValue

Large combustion plants - Cu - BAT15-XI
type: Concept
notation: LCP-Cu-BAT15-XI
definition: 1.� Energy industries; 5.� Waste management: 1.1, Combustion of fuels in installations with a total rated thermal input of 50 MW or more, only when this activity takes place in combustion plants with a total rated thermal input of 50 MW or more; 1.4, Gasification of coal or other fuels in installations with a total rated thermal input of 20 MW or more, only when this activity is directly associated to a combustion plant; 5.2, Disposal or recovery of waste in waste co-incineration plants for non-hazardous waste with a capacity exceeding 3 tonnes per hour or for hazardous waste with a capacity exceeding 10 tonnes per day, only when this activity takes place in combustion plants covered under 1.1 above. Reducing copper to water. The BAT-AEL emission level is 10�50 �g/l .
status: valid
status modified: 2019-04-23
accepted date: 2019-04-23
in scheme: BATAELValue

Large combustion plants - Dust - BAT22-II
type: Concept
notation: LCP-Dust-BAT22-II
definition: 1. Energy industries: 1.1, Combustion of fuels in installations with a total rated thermal input of 50 MW or more, only when this activity takes place in combustion plants with a total rated thermal input of 50 MW or more; Techniques (a)-(e) (see table) for Existing plant; Reducing dust emissions to air. The BAT-AEL emission level is 2�18 mg/Nm3.
status: valid
status modified: 2019-04-23
accepted date: 2019-04-23
in scheme: BATAELValue

Large combustion plants - Dust - BAT22-III
type: Concept
notation: LCP-Dust-BAT22-III
definition: 1. Energy industries: 1.1, Combustion of fuels in installations with a total rated thermal input of 50 MW or more, only when this activity takes place in combustion plants with a total rated thermal input of 50 MW or more; Techniques (a)-(e) (see table) for New plant; Reducing dust emissions to air. The BAT-AEL emission level is 4�16 mg/Nm3.
status: valid
status modified: 2019-04-23
accepted date: 2019-04-23
in scheme: BATAELValue

Large combustion plants - Dust - BAT22-IV
type: Concept
notation: LCP-Dust-BAT22-IV
definition: 1. Energy industries: 1.1, Combustion of fuels in installations with a total rated thermal input of 50 MW or more, only when this activity takes place in combustion plants with a total rated thermal input of 50 MW or more; Techniques (a)-(e) (see table) for Existing plant; Reducing dust emissions to air. The BAT-AEL emission level is 4�22 mg/Nm3.
status: valid
status modified: 2019-04-23
accepted date: 2019-04-23
in scheme: BATAELValue

Large combustion plants - Dust - BAT22-IX
type: Concept
notation: LCP-Dust-BAT22-IX
definition: 1. Energy industries: 1.1, Combustion of fuels in installations with a total rated thermal input of 50 MW or more, only when this activity takes place in combustion plants with a total rated thermal input of 50 MW or more; Techniques (a)-(e) (see table) for New plant; Reducing dust emissions to air. The BAT-AEL emission level is 2�5 mg/Nm3.
status: valid
status modified: 2019-04-23
accepted date: 2019-04-23
in scheme: BATAELValue

Large combustion plants - Dust - BAT22-V
type: Concept
notation: LCP-Dust-BAT22-V
definition: 1. Energy industries: 1.1, Combustion of fuels in installations with a total rated thermal input of 50 MW or more, only when this activity takes place in combustion plants with a total rated thermal input of 50 MW or more; Techniques (a)-(e) (see table) for New plant; Reducing dust emissions to air. The BAT-AEL emission level is 2�5 mg/Nm3.
status: valid
status modified: 2019-04-23
accepted date: 2019-04-23
in scheme: BATAELValue

Large combustion plants - Dust - BAT22-VI
type: Concept
notation: LCP-Dust-BAT22-VI
definition: 1. Energy industries: 1.1, Combustion of fuels in installations with a total rated thermal input of 50 MW or more, only when this activity takes place in combustion plants with a total rated thermal input of 50 MW or more; Techniques (a)-(e) (see table) for Existing plant; Reducing dust emissions to air. The BAT-AEL emission level is 2�14 mg/Nm3.
status: valid
status modified: 2019-04-23
accepted date: 2019-04-23
in scheme: BATAELValue

Large combustion plants - Dust - BAT22-VII
type: Concept
notation: LCP-Dust-BAT22-VII
definition: 1. Energy industries: 1.1, Combustion of fuels in installations with a total rated thermal input of 50 MW or more, only when this activity takes place in combustion plants with a total rated thermal input of 50 MW or more; Techniques (a)-(e) (see table) for New plant; Reducing dust emissions to air. The BAT-AEL emission level is 3�15 mg/Nm3.
status: valid
status modified: 2019-04-23
accepted date: 2019-04-23
in scheme: BATAELValue

Large combustion plants - Dust - BAT22-VIII
type: Concept
notation: LCP-Dust-BAT22-VIII
definition: 1. Energy industries: 1.1, Combustion of fuels in installations with a total rated thermal input of 50 MW or more, only when this activity takes place in combustion plants with a total rated thermal input of 50 MW or more; Techniques (a)-(e) (see table) for Existing plant; Reducing dust emissions to air. The BAT-AEL emission level is 4�22 mg/Nm3.
status: valid
status modified: 2019-04-23
accepted date: 2019-04-23
in scheme: BATAELValue

Large combustion plants - Dust - BAT22-X
type: Concept
notation: LCP-Dust-BAT22-X
definition: 1. Energy industries: 1.1, Combustion of fuels in installations with a total rated thermal input of 50 MW or more, only when this activity takes place in combustion plants with a total rated thermal input of 50 MW or more; Techniques (a)-(e) (see table) for Existing plant; Reducing dust emissions to air. The BAT-AEL emission level is 2�10 mg/Nm3.
status: valid
status modified: 2019-04-23
accepted date: 2019-04-23
in scheme: BATAELValue

Large combustion plants - Dust - BAT22-XI
type: Concept
notation: LCP-Dust-BAT22-XI
definition: 1. Energy industries: 1.1, Combustion of fuels in installations with a total rated thermal input of 50 MW or more, only when this activity takes place in combustion plants with a total rated thermal input of 50 MW or more; Techniques (a)-(e) (see table) for New plant; Reducing dust emissions to air. The BAT-AEL emission level is 3�15 mg/Nm3.
status: valid
status modified: 2019-04-23
accepted date: 2019-04-23
in scheme: BATAELValue

Large combustion plants - Dust - BAT22-XII
type: Concept
notation: LCP-Dust-BAT22-XII
definition: 1. Energy industries: 1.1, Combustion of fuels in installations with a total rated thermal input of 50 MW or more, only when this activity takes place in combustion plants with a total rated thermal input of 50 MW or more; Techniques (a)-(e) (see table) for Existing plant; Reducing dust emissions to air. The BAT-AEL emission level is 4�22 mg/Nm3.
status: valid
status modified: 2019-04-23
accepted date: 2019-04-23
in scheme: BATAELValue

Large combustion plants - Dust - BAT22-XIII
type: Concept
notation: LCP-Dust-BAT22-XIII
definition: 1. Energy industries: 1.1, Combustion of fuels in installations with a total rated thermal input of 50 MW or more, only when this activity takes place in combustion plants with a total rated thermal input of 50 MW or more; Techniques (a)-(e) (see table) for New plant; Reducing dust emissions to air. The BAT-AEL emission level is 2�5 mg/Nm3.
status: valid
status modified: 2019-04-23
accepted date: 2019-04-23
in scheme: BATAELValue

Large combustion plants - Dust - BAT22-XIV
type: Concept
notation: LCP-Dust-BAT22-XIV
definition: 1. Energy industries: 1.1, Combustion of fuels in installations with a total rated thermal input of 50 MW or more, only when this activity takes place in combustion plants with a total rated thermal input of 50 MW or more; Techniques (a)-(e) (see table) for Existing plant; Reducing dust emissions to air. The BAT-AEL emission level is 2�8 mg/Nm3.
status: valid
status modified: 2019-04-23
accepted date: 2019-04-23
in scheme: BATAELValue

Large combustion plants - Dust - BAT22-XV
type: Concept
notation: LCP-Dust-BAT22-XV
definition: 1. Energy industries: 1.1, Combustion of fuels in installations with a total rated thermal input of 50 MW or more, only when this activity takes place in combustion plants with a total rated thermal input of 50 MW or more; Techniques (a)-(e) (see table) for New plant; Reducing dust emissions to air. The BAT-AEL emission level is 3�10 mg/Nm3.
status: valid
status modified: 2019-04-23
accepted date: 2019-04-23
in scheme: BATAELValue

Large combustion plants - Dust - BAT22-XVI
type: Concept
notation: LCP-Dust-BAT22-XVI
definition: 1. Energy industries: 1.1, Combustion of fuels in installations with a total rated thermal input of 50 MW or more, only when this activity takes place in combustion plants with a total rated thermal input of 50 MW or more; Techniques (a)-(e) (see table) for Existing plant; Reducing dust emissions to air. The BAT-AEL emission level is 3�11 mg/Nm3.
status: valid
status modified: 2019-04-23
accepted date: 2019-04-23
in scheme: BATAELValue

Large combustion plants - Dust - BAT26-I
type: Concept
notation: LCP-Dust-BAT26-I
definition: 1. Energy industries: 1.1, Combustion of fuels in installations with a total rated thermal input of 50 MW or more, only when this activity takes place in combustion plants with a total rated thermal input of 50 MW or more; Techniques (a)-(e) (see table) for New plant; Reducing dust emissions to air. The BAT-AEL emission level is 2�5 mg/Nm3.
status: valid
status modified: 2019-04-23
accepted date: 2019-04-23
in scheme: BATAELValue

Large combustion plants - Dust - BAT26-II
type: Concept
notation: LCP-Dust-BAT26-II
definition: 1. Energy industries: 1.1, Combustion of fuels in installations with a total rated thermal input of 50 MW or more, only when this activity takes place in combustion plants with a total rated thermal input of 50 MW or more; Techniques (a)-(e) (see table) for Existing plant; Reducing dust emissions to air. The BAT-AEL emission level is 2�15 mg/Nm3.
status: valid
status modified: 2019-04-23
accepted date: 2019-04-23
in scheme: BATAELValue

Large combustion plants - Dust - BAT26-III
type: Concept
notation: LCP-Dust-BAT26-III
definition: 1. Energy industries: 1.1, Combustion of fuels in installations with a total rated thermal input of 50 MW or more, only when this activity takes place in combustion plants with a total rated thermal input of 50 MW or more; Techniques (a)-(e) (see table) for New plant; Reducing dust emissions to air. The BAT-AEL emission level is 2�10 mg/Nm3.
status: valid
status modified: 2019-04-23
accepted date: 2019-04-23
in scheme: BATAELValue

Large combustion plants - Dust - BAT26-IV
type: Concept
notation: LCP-Dust-BAT26-IV
definition: 1. Energy industries: 1.1, Combustion of fuels in installations with a total rated thermal input of 50 MW or more, only when this activity takes place in combustion plants with a total rated thermal input of 50 MW or more; Techniques (a)-(e) (see table) for Existing plant; Reducing dust emissions to air. The BAT-AEL emission level is 2�22 mg/Nm3.
status: valid
status modified: 2019-04-23
accepted date: 2019-04-23
in scheme: BATAELValue

Large combustion plants - Dust - BAT26-IX
type: Concept
notation: LCP-Dust-BAT26-IX
definition: 1. Energy industries: 1.1, Combustion of fuels in installations with a total rated thermal input of 50 MW or more, only when this activity takes place in combustion plants with a total rated thermal input of 50 MW or more; Techniques (a)-(e) (see table) for New plant; Reducing dust emissions to air. The BAT-AEL emission level is 2�5 mg/Nm3.
status: valid
status modified: 2019-04-23
accepted date: 2019-04-23
in scheme: BATAELValue

Large combustion plants - Dust - BAT26-V
type: Concept
notation: LCP-Dust-BAT26-V
definition: 1. Energy industries: 1.1, Combustion of fuels in installations with a total rated thermal input of 50 MW or more, only when this activity takes place in combustion plants with a total rated thermal input of 50 MW or more; Techniques (a)-(e) (see table) for New plant; Reducing dust emissions to air. The BAT-AEL emission level is 2�5 mg/Nm3.
status: valid
status modified: 2019-04-23
accepted date: 2019-04-23
in scheme: BATAELValue

Large combustion plants - Dust - BAT26-VI
type: Concept
notation: LCP-Dust-BAT26-VI
definition: 1. Energy industries: 1.1, Combustion of fuels in installations with a total rated thermal input of 50 MW or more, only when this activity takes place in combustion plants with a total rated thermal input of 50 MW or more; Techniques (a)-(e) (see table) for Existing plant; Reducing dust emissions to air. The BAT-AEL emission level is 2�12 mg/Nm3.
status: valid
status modified: 2019-04-23
accepted date: 2019-04-23
in scheme: BATAELValue

Large combustion plants - Dust - BAT26-VII
type: Concept
notation: LCP-Dust-BAT26-VII
definition: 1. Energy industries: 1.1, Combustion of fuels in installations with a total rated thermal input of 50 MW or more, only when this activity takes place in combustion plants with a total rated thermal input of 50 MW or more; Techniques (a)-(e) (see table) for New plant; Reducing dust emissions to air. The BAT-AEL emission level is 2�10 mg/Nm3.
status: valid
status modified: 2019-04-23
accepted date: 2019-04-23
in scheme: BATAELValue

Large combustion plants - Dust - BAT26-VIII
type: Concept
notation: LCP-Dust-BAT26-VIII
definition: 1. Energy industries: 1.1, Combustion of fuels in installations with a total rated thermal input of 50 MW or more, only when this activity takes place in combustion plants with a total rated thermal input of 50 MW or more; Techniques (a)-(e) (see table) for Existing plant; Reducing dust emissions to air. The BAT-AEL emission level is 2�18 mg/Nm3.
status: valid
status modified: 2019-04-23
accepted date: 2019-04-23
in scheme: BATAELValue

Large combustion plants - Dust - BAT26-X
type: Concept
notation: LCP-Dust-BAT26-X
definition: 1. Energy industries: 1.1, Combustion of fuels in installations with a total rated thermal input of 50 MW or more, only when this activity takes place in combustion plants with a total rated thermal input of 50 MW or more; Techniques (a)-(e) (see table) for Existing plant; Reducing dust emissions to air. The BAT-AEL emission level is 2�10 mg/Nm3.
status: valid
status modified: 2019-04-23
accepted date: 2019-04-23
in scheme: BATAELValue

Large combustion plants - Dust - BAT26-XI
type: Concept
notation: LCP-Dust-BAT26-XI
definition: 1. Energy industries: 1.1, Combustion of fuels in installations with a total rated thermal input of 50 MW or more, only when this activity takes place in combustion plants with a total rated thermal input of 50 MW or more; Techniques (a)-(e) (see table) for New plant; Reducing dust emissions to air. The BAT-AEL emission level is 2�10 mg/Nm3.
status: valid
status modified: 2019-04-23
accepted date: 2019-04-23
in scheme: BATAELValue

Large combustion plants - Dust - BAT26-XII
type: Concept
notation: LCP-Dust-BAT26-XII
definition: 1. Energy industries: 1.1, Combustion of fuels in installations with a total rated thermal input of 50 MW or more, only when this activity takes place in combustion plants with a total rated thermal input of 50 MW or more; Techniques (a)-(e) (see table) for Existing plant; Reducing dust emissions to air. The BAT-AEL emission level is 2�16 mg/Nm3.
status: valid
status modified: 2019-04-23
accepted date: 2019-04-23
in scheme: BATAELValue

Large combustion plants - Dust - BAT30-I
type: Concept
notation: LCP-Dust-BAT30-I
definition: 1. Energy industries: 1.1, Combustion of fuels in installations with a total rated thermal input of 50 MW or more, only when this activity takes place in combustion plants with a total rated thermal input of 50 MW or more; Techniques (a)-(f) (see table) for New plant; Reducing dust emissions to air. The BAT-AEL emission level is 2�10 mg/Nm3.
status: valid
status modified: 2019-04-23
accepted date: 2019-04-23
in scheme: BATAELValue

Large combustion plants - Dust - BAT30-II
type: Concept
notation: LCP-Dust-BAT30-II
definition: 1. Energy industries: 1.1, Combustion of fuels in installations with a total rated thermal input of 50 MW or more, only when this activity takes place in combustion plants with a total rated thermal input of 50 MW or more; Techniques (a)-(f) (see table) for Existing plant; Reducing dust emissions to air. The BAT-AEL emission level is 2�20 mg/Nm3.
status: valid
status modified: 2019-04-23
accepted date: 2019-04-23
in scheme: BATAELValue

Large combustion plants - Dust - BAT30-III
type: Concept
notation: LCP-Dust-BAT30-III
definition: 1. Energy industries: 1.1, Combustion of fuels in installations with a total rated thermal input of 50 MW or more, only when this activity takes place in combustion plants with a total rated thermal input of 50 MW or more; Techniques (a)-(f) (see table) for New plant; Reducing dust emissions to air. The BAT-AEL emission level is 7�18 mg/Nm3.
status: valid
status modified: 2019-04-23
accepted date: 2019-04-23
in scheme: BATAELValue

Large combustion plants - Dust - BAT30-IV
type: Concept
notation: LCP-Dust-BAT30-IV
definition: 1. Energy industries: 1.1, Combustion of fuels in installations with a total rated thermal input of 50 MW or more, only when this activity takes place in combustion plants with a total rated thermal input of 50 MW or more; Techniques (a)-(f) (see table) for Existing plant; Reducing dust emissions to air. The BAT-AEL emission level is 7�22 mg/Nm3.
status: valid
status modified: 2019-04-23
accepted date: 2019-04-23
in scheme: BATAELValue

Large combustion plants - Dust - BAT30-V
type: Concept
notation: LCP-Dust-BAT30-V
definition: 1. Energy industries: 1.1, Combustion of fuels in installations with a total rated thermal input of 50 MW or more, only when this activity takes place in combustion plants with a total rated thermal input of 50 MW or more; Techniques (a)-(f) (see table) for New plant; Reducing dust emissions to air. The BAT-AEL emission level is 2�5 mg/Nm3.
status: valid
status modified: 2019-04-23
accepted date: 2019-04-23
in scheme: BATAELValue

Large combustion plants - Dust - BAT30-VI
type: Concept
notation: LCP-Dust-BAT30-VI
definition: 1. Energy industries: 1.1, Combustion of fuels in installations with a total rated thermal input of 50 MW or more, only when this activity takes place in combustion plants with a total rated thermal input of 50 MW or more; Techniques (a)-(f) (see table) for Existing plant; Reducing dust emissions to air. The BAT-AEL emission level is 2�10 mg/Nm3.
status: valid
status modified: 2019-04-23
accepted date: 2019-04-23
in scheme: BATAELValue

Large combustion plants - Dust - BAT30-VII
type: Concept
notation: LCP-Dust-BAT30-VII
definition: 1. Energy industries: 1.1, Combustion of fuels in installations with a total rated thermal input of 50 MW or more, only when this activity takes place in combustion plants with a total rated thermal input of 50 MW or more; Techniques (a)-(f) (see table) for New plant; Reducing dust emissions to air. The BAT-AEL emission level is 7�10 mg/Nm3.
status: valid
status modified: 2019-04-23
accepted date: 2019-04-23
in scheme: BATAELValue

Large combustion plants - Dust - BAT30-VIII
type: Concept
notation: LCP-Dust-BAT30-VIII
definition: 1. Energy industries: 1.1, Combustion of fuels in installations with a total rated thermal input of 50 MW or more, only when this activity takes place in combustion plants with a total rated thermal input of 50 MW or more; Techniques (a)-(f) (see table) for Existing plant; Reducing dust emissions to air. The BAT-AEL emission level is 7�11 mg/Nm3.
status: valid
status modified: 2019-04-23
accepted date: 2019-04-23
in scheme: BATAELValue

Large combustion plants - Dust - BAT35-I
type: Concept
notation: LCP-Dust-BAT35-I
definition: 1. Energy industries: 1.1, Combustion of fuels in installations with a total rated thermal input of 50 MW or more, only when this activity takes place in combustion plants with a total rated thermal input of 50 MW or more; Techniques (a)-(c) (see table) for New plant; Reducing dust emissions to air. The BAT-AEL emission level is 5�10 mg/Nm3.
status: valid
status modified: 2019-04-23
accepted date: 2019-04-23
in scheme: BATAELValue

Large combustion plants - Dust - BAT35-II
type: Concept
notation: LCP-Dust-BAT35-II
definition: 1. Energy industries: 1.1, Combustion of fuels in installations with a total rated thermal input of 50 MW or more, only when this activity takes place in combustion plants with a total rated thermal input of 50 MW or more; Techniques (a)-(c) (see table) for Existing plant; Reducing dust emissions to air. The BAT-AEL emission level is 5�35 mg/Nm3.
status: valid
status modified: 2019-04-23
accepted date: 2019-04-23
in scheme: BATAELValue

Large combustion plants - Dust - BAT35-III
type: Concept
notation: LCP-Dust-BAT35-III
definition: 1. Energy industries: 1.1, Combustion of fuels in installations with a total rated thermal input of 50 MW or more, only when this activity takes place in combustion plants with a total rated thermal input of 50 MW or more; Techniques (a)-(c) (see table) for New plant; Reducing dust emissions to air. The BAT-AEL emission level is 10�20 mg/Nm3.
status: valid
status modified: 2019-04-23
accepted date: 2019-04-23
in scheme: BATAELValue

Large combustion plants - Dust - BAT35-IV
type: Concept
notation: LCP-Dust-BAT35-IV
definition: 1. Energy industries: 1.1, Combustion of fuels in installations with a total rated thermal input of 50 MW or more, only when this activity takes place in combustion plants with a total rated thermal input of 50 MW or more; Techniques (a)-(c) (see table) for Existing plant; Reducing dust emissions to air. The BAT-AEL emission level is 10�45 mg/Nm3.
status: valid
status modified: 2019-04-23
accepted date: 2019-04-23
in scheme: BATAELValue

Large combustion plants - Dust - BAT39-III
type: Concept
notation: LCP-Dust-BAT39-III
definition: 1. Energy industries: 1.1, Combustion of fuels in installations with a total rated thermal input of 50 MW or more, only when this activity takes place in combustion plants with a total rated thermal input of 50 MW or more; Technique (a) (see table) for new and existing plants; Reducing dust emissions to air. The BAT-AEL emission level is 2�5 mg/Nm3.
status: valid
status modified: 2019-04-23
accepted date: 2019-04-23
in scheme: BATAELValue

Large combustion plants - Dust - BAT39-IV
type: Concept
notation: LCP-Dust-BAT39-IV
definition: 1. Energy industries: 1.1, Combustion of fuels in installations with a total rated thermal input of 50 MW or more, only when this activity takes place in combustion plants with a total rated thermal input of 50 MW or more; Technique (a) (see table) for new and existing plants; Reducing dust emissions to air. The BAT-AEL emission level is 2�10 mg/Nm3.
status: valid
status modified: 2019-04-23
accepted date: 2019-04-23
in scheme: BATAELValue

Large combustion plants - Dust - BAT51-I
type: Concept
notation: LCP-Dust-BAT51-I
definition: 1. Energy industries: 1.1, Combustion of fuels in installations with a total rated thermal input of 50 MW or more, only when this activity takes place in combustion plants with a total rated thermal input of 50 MW or more; Techniques (a)-(e) (see table) in boilers; Reducing dust emissions to air. The BAT-AEL emission level is 2�7 mg/Nm3.
status: valid
status modified: 2019-04-23
accepted date: 2019-04-23
in scheme: BATAELValue

Large combustion plants - Dust - BAT51-II
type: Concept
notation: LCP-Dust-BAT51-II
definition: 1. Energy industries: 1.1, Combustion of fuels in installations with a total rated thermal input of 50 MW or more, only when this activity takes place in combustion plants with a total rated thermal input of 50 MW or more; Techniques (a)-(e) (see table) in boilers; Reducing dust emissions to air. The BAT-AEL emission level is 2�10 mg/Nm3.
status: valid
status modified: 2019-04-23
accepted date: 2019-04-23
in scheme: BATAELValue

Large combustion plants - Dust - BAT51-III
type: Concept
notation: LCP-Dust-BAT51-III
definition: 1. Energy industries: 1.1, Combustion of fuels in installations with a total rated thermal input of 50 MW or more, only when this activity takes place in combustion plants with a total rated thermal input of 50 MW or more; Techniques (a)-(e) (see table) in combined-cycle gas turbines (CCGTs); Reducing dust emissions to air. The BAT-AEL emission level is 2�5 mg/Nm3.
status: valid
status modified: 2019-04-23
accepted date: 2019-04-23
in scheme: BATAELValue

Large combustion plants - Dust - BAT51-IV
type: Concept
notation: LCP-Dust-BAT51-IV
definition: 1. Energy industries: 1.1, Combustion of fuels in installations with a total rated thermal input of 50 MW or more, only when this activity takes place in combustion plants with a total rated thermal input of 50 MW or more; Techniques (a)-(e) (see table) in combined-cycle gas turbines (CCGTs); Reducing dust emissions to air. The BAT-AEL emission level is 2�5 mg/Nm3.
status: valid
status modified: 2019-04-23
accepted date: 2019-04-23
in scheme: BATAELValue

Large combustion plants - Dust - BAT58-I
type: Concept
notation: LCP-Dust-BAT58-I
definition: 1. Energy industries: 1.1, Combustion of fuels in installations with a total rated thermal input of 50 MW or more, only when this activity takes place in combustion plants with a total rated thermal input of 50 MW or more; Techniques (a)-(e) (see table). for New plant; Reducing dust emissions to air. The BAT-AEL emission level is 2�5 mg/Nm3.
status: valid
status modified: 2019-04-23
accepted date: 2019-04-23
in scheme: BATAELValue

Large combustion plants - Dust - BAT58-II
type: Concept
notation: LCP-Dust-BAT58-II
definition: 1. Energy industries: 1.1, Combustion of fuels in installations with a total rated thermal input of 50 MW or more, only when this activity takes place in combustion plants with a total rated thermal input of 50 MW or more; Techniques (a)-(e) (see table). for Existing plant; Reducing dust emissions to air. The BAT-AEL emission level is 2�15 mg/Nm3.
status: valid
status modified: 2019-04-23
accepted date: 2019-04-23
in scheme: BATAELValue

Large combustion plants - Dust - BAT58-III
type: Concept
notation: LCP-Dust-BAT58-III
definition: 1. Energy industries: 1.1, Combustion of fuels in installations with a total rated thermal input of 50 MW or more, only when this activity takes place in combustion plants with a total rated thermal input of 50 MW or more; Techniques (a)-(e) (see table). for New plant; Reducing dust emissions to air. The BAT-AEL emission level is 2�10 mg/Nm3.
status: valid
status modified: 2019-04-23
accepted date: 2019-04-23
in scheme: BATAELValue

Large combustion plants - Dust - BAT58-IV
type: Concept
notation: LCP-Dust-BAT58-IV
definition: 1. Energy industries: 1.1, Combustion of fuels in installations with a total rated thermal input of 50 MW or more, only when this activity takes place in combustion plants with a total rated thermal input of 50 MW or more; Techniques (a)-(e) (see table). for Existing plant; Reducing dust emissions to air. The BAT-AEL emission level is 2�22 mg/Nm3.
status: valid
status modified: 2019-04-23
accepted date: 2019-04-23
in scheme: BATAELValue

Large combustion plants - Dust - BAT58-V
type: Concept
notation: LCP-Dust-BAT58-V
definition: 1. Energy industries: 1.1, Combustion of fuels in installations with a total rated thermal input of 50 MW or more, only when this activity takes place in combustion plants with a total rated thermal input of 50 MW or more; Techniques (a)-(e) (see table). for New plant; Reducing dust emissions to air. The BAT-AEL emission level is 2�5 mg/Nm3.
status: valid
status modified: 2019-04-23
accepted date: 2019-04-23
in scheme: BATAELValue

Large combustion plants - Dust - BAT58-VI
type: Concept
notation: LCP-Dust-BAT58-VI
definition: 1. Energy industries: 1.1, Combustion of fuels in installations with a total rated thermal input of 50 MW or more, only when this activity takes place in combustion plants with a total rated thermal input of 50 MW or more; Techniques (a)-(e) (see table). for Existing plant; Reducing dust emissions to air. The BAT-AEL emission level is 2�10 mg/Nm3.
status: valid
status modified: 2019-04-23
accepted date: 2019-04-23
in scheme: BATAELValue

Large combustion plants - Dust - BAT58-VII
type: Concept
notation: LCP-Dust-BAT58-VII
definition: 1. Energy industries: 1.1, Combustion of fuels in installations with a total rated thermal input of 50 MW or more, only when this activity takes place in combustion plants with a total rated thermal input of 50 MW or more; Techniques (a)-(e) (see table). for New plant; Reducing dust emissions to air. The BAT-AEL emission level is 2�10 mg/Nm3.
status: valid
status modified: 2019-04-23
accepted date: 2019-04-23
in scheme: BATAELValue

Large combustion plants - Dust - BAT58-VIII
type: Concept
notation: LCP-Dust-BAT58-VIII
definition: 1. Energy industries: 1.1, Combustion of fuels in installations with a total rated thermal input of 50 MW or more, only when this activity takes place in combustion plants with a total rated thermal input of 50 MW or more; Techniques (a)-(e) (see table). for Existing plant; Reducing dust emissions to air. The BAT-AEL emission level is 2�11 mg/Nm3.
status: valid
status modified: 2019-04-23
accepted date: 2019-04-23
in scheme: BATAELValue

Large combustion plants - Dust - BAT75-III
type: Concept
notation: LCP-Dust-BAT75-III
definition: 1. Energy industries: 1.4, Gasification of coal or other fuels in installations with a total rated thermal input of 20 MW or more, only when this activity is directly associated to a combustion plant; Techniques (a)-(c) (see table); Reducing dust emissions to air. The BAT-AEL emission level is < 2,5 mg/Nm3.
status: valid
status modified: 2019-04-23
accepted date: 2019-04-23
in scheme: BATAELValue

Large combustion plants - Formaldehyde - BAT45-I
type: Concept
notation: LCP-Formaldehyde-BAT45-I
definition: 1. Energy industries: 1.1, Combustion of fuels in installations with a total rated thermal input of 50 MW or more, only when this activity takes place in combustion plants with a total rated thermal input of 50 MW or more; Ensure optimised combustion and/or to use oxidation catalysts for New or existing plan; Reducing formaldehyde emissions to air. The BAT-AEL emission level is 5�15 mg/Nm3.
status: valid
status modified: 2019-04-23
accepted date: 2019-04-23
in scheme: BATAELValue

Large combustion plants - F - BAT15-IV
type: Concept
notation: LCP-F-BAT15-IV
definition: 1.� Energy industries; 5.� Waste management: 1.1, Combustion of fuels in installations with a total rated thermal input of 50 MW or more, only when this activity takes place in combustion plants with a total rated thermal input of 50 MW or more; 1.4, Gasification of coal or other fuels in installations with a total rated thermal input of 20 MW or more, only when this activity is directly associated to a combustion plant; 5.2, Disposal or recovery of waste in waste co-incineration plants for non-hazardous waste with a capacity exceeding 3 tonnes per hour or for hazardous waste with a capacity exceeding 10 tonnes per day, only when this activity takes place in combustion plants covered under 1.1 above. Reducing fluorides to water. The BAT-AEL emission level is 10�25 mg/l.
status: valid
status modified: 2019-04-23
accepted date: 2019-04-23
in scheme: BATAELValue

Large combustion plants - HCl - BAT21-XIX
type: Concept
notation: LCP-HCl-BAT21-XIX
definition: 1. Energy industries: 1.1, Combustion of fuels in installations with a total rated thermal input of 50 MW or more, only when this activity takes place in combustion plants with a total rated thermal input of 50 MW or more; Techniques (a)-(j) (see table) for New plant; Reducing hydrogen chloride emissions to air. The BAT-AEL emission level is 1�3 mg/Nm3.
status: valid
status modified: 2019-04-23
accepted date: 2019-04-23
in scheme: BATAELValue

Large combustion plants - HCl - BAT21-XVII
type: Concept
notation: LCP-HCl-BAT21-XVII
definition: 1. Energy industries: 1.1, Combustion of fuels in installations with a total rated thermal input of 50 MW or more, only when this activity takes place in combustion plants with a total rated thermal input of 50 MW or more; Techniques (a)-(j) (see table) for New plant; Reducing hydrogen chloride emissions to air. The BAT-AEL emission level is 1�6 mg/Nm3.
status: valid
status modified: 2019-04-23
accepted date: 2019-04-23
in scheme: BATAELValue

Large combustion plants - HCl - BAT21-XVIII
type: Concept
notation: LCP-HCl-BAT21-XVIII
definition: 1. Energy industries: 1.1, Combustion of fuels in installations with a total rated thermal input of 50 MW or more, only when this activity takes place in combustion plants with a total rated thermal input of 50 MW or more; Techniques (a)-(j) (see table) for Existing plant; Reducing hydrogen chloride emissions to air. The BAT-AEL emission level is 2�10 mg/Nm3.
status: valid
status modified: 2019-04-23
accepted date: 2019-04-23
in scheme: BATAELValue

Large combustion plants - HCl - BAT21-XX
type: Concept
notation: LCP-HCl-BAT21-XX
definition: 1. Energy industries: 1.1, Combustion of fuels in installations with a total rated thermal input of 50 MW or more, only when this activity takes place in combustion plants with a total rated thermal input of 50 MW or more; Techniques (a)-(j) (see table) for Existing plant; Reducing hydrogen chloride emissions to air. The BAT-AEL emission level is 1�5 mg/Nm3.
status: valid
status modified: 2019-04-23
accepted date: 2019-04-23
in scheme: BATAELValue

Large combustion plants - HCl - BAT25-XIII
type: Concept
notation: LCP-HCl-BAT25-XIII
definition: 1. Energy industries: 1.1, Combustion of fuels in installations with a total rated thermal input of 50 MW or more, only when this activity takes place in combustion plants with a total rated thermal input of 50 MW or more; Techniques (a)-(h) (see table) for New plant; Reducing hydrogen chloride emissions to air. The BAT-AEL emission level is 1�7 mg/Nm3.
status: valid
status modified: 2019-04-23
accepted date: 2019-04-23
in scheme: BATAELValue

Large combustion plants - HCl - BAT25-XIV
type: Concept
notation: LCP-HCl-BAT25-XIV
definition: 1. Energy industries: 1.1, Combustion of fuels in installations with a total rated thermal input of 50 MW or more, only when this activity takes place in combustion plants with a total rated thermal input of 50 MW or more; Techniques (a)-(h) (see table) for Existing plant; Reducing hydrogen chloride emissions to air. The BAT-AEL emission level is 1�15 mg/Nm3.
status: valid
status modified: 2019-04-23
accepted date: 2019-04-23
in scheme: BATAELValue

Large combustion plants - HCl - BAT25-XIX
type: Concept
notation: LCP-HCl-BAT25-XIX
definition: 1. Energy industries: 1.1, Combustion of fuels in installations with a total rated thermal input of 50 MW or more, only when this activity takes place in combustion plants with a total rated thermal input of 50 MW or more; Techniques (a)-(h) (see table) for New plant; Reducing hydrogen chloride emissions to air. The BAT-AEL emission level is 1�12 mg/Nm3.
status: valid
status modified: 2019-04-23
accepted date: 2019-04-23
in scheme: BATAELValue

Large combustion plants - HCl - BAT25-XV
type: Concept
notation: LCP-HCl-BAT25-XV
definition: 1. Energy industries: 1.1, Combustion of fuels in installations with a total rated thermal input of 50 MW or more, only when this activity takes place in combustion plants with a total rated thermal input of 50 MW or more; Techniques (a)-(h) (see table) for New plant; Reducing hydrogen chloride emissions to air. The BAT-AEL emission level is 1�12 mg/Nm3.
status: valid
status modified: 2019-04-23
accepted date: 2019-04-23
in scheme: BATAELValue

Large combustion plants - HCl - BAT25-XVI
type: Concept
notation: LCP-HCl-BAT25-XVI
definition: 1. Energy industries: 1.1, Combustion of fuels in installations with a total rated thermal input of 50 MW or more, only when this activity takes place in combustion plants with a total rated thermal input of 50 MW or more; Techniques (a)-(h) (see table) for Existing plant; Reducing hydrogen chloride emissions to air. The BAT-AEL emission level is 1�35 mg/Nm3.
status: valid
status modified: 2019-04-23
accepted date: 2019-04-23
in scheme: BATAELValue

Large combustion plants - HCl - BAT25-XVII
type: Concept
notation: LCP-HCl-BAT25-XVII
definition: 1. Energy industries: 1.1, Combustion of fuels in installations with a total rated thermal input of 50 MW or more, only when this activity takes place in combustion plants with a total rated thermal input of 50 MW or more; Techniques (a)-(h) (see table) for New plant; Reducing hydrogen chloride emissions to air. The BAT-AEL emission level is 1�5 mg/Nm3.
status: valid
status modified: 2019-04-23
accepted date: 2019-04-23
in scheme: BATAELValue

Large combustion plants - HCl - BAT25-XVIII
type: Concept
notation: LCP-HCl-BAT25-XVIII
definition: 1. Energy industries: 1.1, Combustion of fuels in installations with a total rated thermal input of 50 MW or more, only when this activity takes place in combustion plants with a total rated thermal input of 50 MW or more; Techniques (a)-(h) (see table) for Existing plant; Reducing hydrogen chloride emissions to air. The BAT-AEL emission level is 1�9 mg/Nm3.
status: valid
status modified: 2019-04-23
accepted date: 2019-04-23
in scheme: BATAELValue

Large combustion plants - HCl - BAT25-XX
type: Concept
notation: LCP-HCl-BAT25-XX
definition: 1. Energy industries: 1.1, Combustion of fuels in installations with a total rated thermal input of 50 MW or more, only when this activity takes place in combustion plants with a total rated thermal input of 50 MW or more; Techniques (a)-(h) (see table) for Existing plant; Reducing hydrogen chloride emissions to air. The BAT-AEL emission level is 1�12 mg/Nm3.
status: valid
status modified: 2019-04-23
accepted date: 2019-04-23
in scheme: BATAELValue

Large combustion plants - HCl - BAT25-XXI
type: Concept
notation: LCP-HCl-BAT25-XXI
definition: 1. Energy industries: 1.1, Combustion of fuels in installations with a total rated thermal input of 50 MW or more, only when this activity takes place in combustion plants with a total rated thermal input of 50 MW or more; Techniques (a)-(h) (see table) for New plant; Reducing hydrogen chloride emissions to air. The BAT-AEL emission level is 1�5 mg/Nm3.
status: valid
status modified: 2019-04-23
accepted date: 2019-04-23
in scheme: BATAELValue

Large combustion plants - HCl - BAT25-XXII
type: Concept
notation: LCP-HCl-BAT25-XXII
definition: 1. Energy industries: 1.1, Combustion of fuels in installations with a total rated thermal input of 50 MW or more, only when this activity takes place in combustion plants with a total rated thermal input of 50 MW or more; Techniques (a)-(h) (see table) for Existing plant; Reducing hydrogen chloride emissions to air. The BAT-AEL emission level is 1�5 mg/Nm3.
status: valid
status modified: 2019-04-23
accepted date: 2019-04-23
in scheme: BATAELValue

Large combustion plants - HCl - BAT25-XXIII
type: Concept
notation: LCP-HCl-BAT25-XXIII
definition: 1. Energy industries: 1.1, Combustion of fuels in installations with a total rated thermal input of 50 MW or more, only when this activity takes place in combustion plants with a total rated thermal input of 50 MW or more; Techniques (a)-(h) (see table) for New plant; Reducing hydrogen chloride emissions to air. The BAT-AEL emission level is 1�12 mg/Nm3.
status: valid
status modified: 2019-04-23
accepted date: 2019-04-23
in scheme: BATAELValue

Large combustion plants - HCl - BAT25-XXIV
type: Concept
notation: LCP-HCl-BAT25-XXIV
definition: 1. Energy industries: 1.1, Combustion of fuels in installations with a total rated thermal input of 50 MW or more, only when this activity takes place in combustion plants with a total rated thermal input of 50 MW or more; Techniques (a)-(h) (see table) for Existing plant; Reducing hydrogen chloride emissions to air. The BAT-AEL emission level is 1�12 mg/Nm3.
status: valid
status modified: 2019-04-23
accepted date: 2019-04-23
in scheme: BATAELValue

Large combustion plants - HCl - BAT57-III
type: Concept
notation: LCP-HCl-BAT57-III
definition: 1. Energy industries: 1.1, Combustion of fuels in installations with a total rated thermal input of 50 MW or more, only when this activity takes place in combustion plants with a total rated thermal input of 50 MW or more; Techniques (a)-(g) (see table). for New plant; Reducing hydrogen chloride emissions to air. The BAT-AEL emission level is 1�7 mg/Nm3.
status: valid
status modified: 2019-04-23
accepted date: 2019-04-23
in scheme: BATAELValue

Large combustion plants - HCl - BAT57-IV
type: Concept
notation: LCP-HCl-BAT57-IV
definition: 1. Energy industries: 1.1, Combustion of fuels in installations with a total rated thermal input of 50 MW or more, only when this activity takes place in combustion plants with a total rated thermal input of 50 MW or more; Techniques (a)-(g) (see table). for Existing plant; Reducing hydrogen chloride emissions to air. The BAT-AEL emission level is 2�15 mg/Nm3.
status: valid
status modified: 2019-04-23
accepted date: 2019-04-23
in scheme: BATAELValue

Large combustion plants - HCl - BAT57-VII
type: Concept
notation: LCP-HCl-BAT57-VII
definition: 1. Energy industries: 1.1, Combustion of fuels in installations with a total rated thermal input of 50 MW or more, only when this activity takes place in combustion plants with a total rated thermal input of 50 MW or more; Techniques (a)-(g) (see table). for New plant; Reducing hydrogen chloride emissions to air. The BAT-AEL emission level is 1�5 mg/Nm3.
status: valid
status modified: 2019-04-23
accepted date: 2019-04-23
in scheme: BATAELValue

Large combustion plants - HCl - BAT57-VIII
type: Concept
notation: LCP-HCl-BAT57-VIII
definition: 1. Energy industries: 1.1, Combustion of fuels in installations with a total rated thermal input of 50 MW or more, only when this activity takes place in combustion plants with a total rated thermal input of 50 MW or more; Techniques (a)-(g) (see table). for Existing plant; Reducing hydrogen chloride emissions to air. The BAT-AEL emission level is 1�9 mg/Nm3.
status: valid
status modified: 2019-04-23
accepted date: 2019-04-23
in scheme: BATAELValue

Large combustion plants - HF - BAT21-XXI
type: Concept
notation: LCP-HF-BAT21-XXI
definition: 1. Energy industries: 1.1, Combustion of fuels in installations with a total rated thermal input of 50 MW or more, only when this activity takes place in combustion plants with a total rated thermal input of 50 MW or more; Techniques (a)-(j) (see table) for New plant; Reducing hydrogen fluoride emissions to air. The BAT-AEL emission level is < 1�3 mg/Nm3.
status: valid
status modified: 2019-04-23
accepted date: 2019-04-23
in scheme: BATAELValue

Large combustion plants - HF - BAT21-XXII
type: Concept
notation: LCP-HF-BAT21-XXII
definition: 1. Energy industries: 1.1, Combustion of fuels in installations with a total rated thermal input of 50 MW or more, only when this activity takes place in combustion plants with a total rated thermal input of 50 MW or more; Techniques (a)-(j) (see table) for Existing plant; Reducing hydrogen fluoride emissions to air. The BAT-AEL emission level is < 1�6 mg/Nm3.
status: valid
status modified: 2019-04-23
accepted date: 2019-04-23
in scheme: BATAELValue

Large combustion plants - HF - BAT21-XXIII
type: Concept
notation: LCP-HF-BAT21-XXIII
definition: 1. Energy industries: 1.1, Combustion of fuels in installations with a total rated thermal input of 50 MW or more, only when this activity takes place in combustion plants with a total rated thermal input of 50 MW or more; Techniques (a)-(j) (see table) for New plant; Reducing hydrogen fluoride emissions to air. The BAT-AEL emission level is < 1�2 mg/Nm3.
status: valid
status modified: 2019-04-23
accepted date: 2019-04-23
in scheme: BATAELValue

Large combustion plants - HF - BAT21-XXIV
type: Concept
notation: LCP-HF-BAT21-XXIV
definition: 1. Energy industries: 1.1, Combustion of fuels in installations with a total rated thermal input of 50 MW or more, only when this activity takes place in combustion plants with a total rated thermal input of 50 MW or more; Techniques (a)-(j) (see table) for Existing plant; Reducing hydrogen fluoride emissions to air. The BAT-AEL emission level is < 1�3 mg/Nm3.
status: valid
status modified: 2019-04-23
accepted date: 2019-04-23
in scheme: BATAELValue

Large combustion plants - HF - BAT25-XXIX
type: Concept
notation: LCP-HF-BAT25-XXIX
definition: 1. Energy industries: 1.1, Combustion of fuels in installations with a total rated thermal input of 50 MW or more, only when this activity takes place in combustion plants with a total rated thermal input of 50 MW or more; Techniques (a)-(h) (see table) for New plant; Reducing hydrogen fluoride emissions to air. The BAT-AEL emission level is < 1 mg/Nm3.
status: valid
status modified: 2019-04-23
accepted date: 2019-04-23
in scheme: BATAELValue

Large combustion plants - HF - BAT25-XXV
type: Concept
notation: LCP-HF-BAT25-XXV
definition: 1. Energy industries: 1.1, Combustion of fuels in installations with a total rated thermal input of 50 MW or more, only when this activity takes place in combustion plants with a total rated thermal input of 50 MW or more; Techniques (a)-(h) (see table) for New plant; Reducing hydrogen fluoride emissions to air. The BAT-AEL emission level is < 1 mg/Nm3.
status: valid
status modified: 2019-04-23
accepted date: 2019-04-23
in scheme: BATAELValue

Large combustion plants - HF - BAT25-XXVI
type: Concept
notation: LCP-HF-BAT25-XXVI
definition: 1. Energy industries: 1.1, Combustion of fuels in installations with a total rated thermal input of 50 MW or more, only when this activity takes place in combustion plants with a total rated thermal input of 50 MW or more; Techniques (a)-(h) (see table) for Existing plant; Reducing hydrogen fluoride emissions to air. The BAT-AEL emission level is < 1,5 mg/Nm3.
status: valid
status modified: 2019-04-23
accepted date: 2019-04-23
in scheme: BATAELValue

Large combustion plants - HF - BAT25-XXVII
type: Concept
notation: LCP-HF-BAT25-XXVII
definition: 1. Energy industries: 1.1, Combustion of fuels in installations with a total rated thermal input of 50 MW or more, only when this activity takes place in combustion plants with a total rated thermal input of 50 MW or more; Techniques (a)-(h) (see table) for New plant; Reducing hydrogen fluoride emissions to air. The BAT-AEL emission level is < 1 mg/Nm3.
status: valid
status modified: 2019-04-23
accepted date: 2019-04-23
in scheme: BATAELValue

Large combustion plants - HF - BAT25-XXVIII
type: Concept
notation: LCP-HF-BAT25-XXVIII
definition: 1. Energy industries: 1.1, Combustion of fuels in installations with a total rated thermal input of 50 MW or more, only when this activity takes place in combustion plants with a total rated thermal input of 50 MW or more; Techniques (a)-(h) (see table) for Existing plant; Reducing hydrogen fluoride emissions to air. The BAT-AEL emission level is < 1 mg/Nm3.
status: valid
status modified: 2019-04-23
accepted date: 2019-04-23
in scheme: BATAELValue

Large combustion plants - HF - BAT25-XXX
type: Concept
notation: LCP-HF-BAT25-XXX
definition: 1. Energy industries: 1.1, Combustion of fuels in installations with a total rated thermal input of 50 MW or more, only when this activity takes place in combustion plants with a total rated thermal input of 50 MW or more; Techniques (a)-(h) (see table) for Existing plant; Reducing hydrogen fluoride emissions to air. The BAT-AEL emission level is < 1 mg/Nm3.
status: valid
status modified: 2019-04-23
accepted date: 2019-04-23
in scheme: BATAELValue

Large combustion plants - HF - BAT57-IX
type: Concept
notation: LCP-HF-BAT57-IX
definition: 1. Energy industries: 1.1, Combustion of fuels in installations with a total rated thermal input of 50 MW or more, only when this activity takes place in combustion plants with a total rated thermal input of 50 MW or more; Techniques (a)-(g) (see table). for New plant; Reducing hydrogen fluoride emissions to air. The BAT-AEL emission level is < 1�2 mg/Nm3.
status: valid
status modified: 2019-04-23
accepted date: 2019-04-23
in scheme: BATAELValue

Large combustion plants - HF - BAT57-V
type: Concept
notation: LCP-HF-BAT57-V
definition: 1. Energy industries: 1.1, Combustion of fuels in installations with a total rated thermal input of 50 MW or more, only when this activity takes place in combustion plants with a total rated thermal input of 50 MW or more; Techniques (a)-(g) (see table). for New plant; Reducing hydrogen fluoride emissions to air. The BAT-AEL emission level is < 1�3 mg/Nm3.
status: valid
status modified: 2019-04-23
accepted date: 2019-04-23
in scheme: BATAELValue

Large combustion plants - HF - BAT57-VI
type: Concept
notation: LCP-HF-BAT57-VI
definition: 1. Energy industries: 1.1, Combustion of fuels in installations with a total rated thermal input of 50 MW or more, only when this activity takes place in combustion plants with a total rated thermal input of 50 MW or more; Techniques (a)-(g) (see table). for Existing plant; Reducing hydrogen fluoride emissions to air. The BAT-AEL emission level is < 1�6 mg/Nm3.
status: valid
status modified: 2019-04-23
accepted date: 2019-04-23
in scheme: BATAELValue

Large combustion plants - HF - BAT57-X
type: Concept
notation: LCP-HF-BAT57-X
definition: 1. Energy industries: 1.1, Combustion of fuels in installations with a total rated thermal input of 50 MW or more, only when this activity takes place in combustion plants with a total rated thermal input of 50 MW or more; Techniques (a)-(g) (see table). for Existing plant; Reducing hydrogen fluoride emissions to air. The BAT-AEL emission level is < 1�3 mg/Nm3.
status: valid
status modified: 2019-04-23
accepted date: 2019-04-23
in scheme: BATAELValue

Large combustion plants - Hg - BAT15-XII
type: Concept
notation: LCP-Hg-BAT15-XII
definition: 1.� Energy industries; 5.� Waste management: 1.1, Combustion of fuels in installations with a total rated thermal input of 50 MW or more, only when this activity takes place in combustion plants with a total rated thermal input of 50 MW or more; 1.4, Gasification of coal or other fuels in installations with a total rated thermal input of 20 MW or more, only when this activity is directly associated to a combustion plant; 5.2, Disposal or recovery of waste in waste co-incineration plants for non-hazardous waste with a capacity exceeding 3 tonnes per hour or for hazardous waste with a capacity exceeding 10 tonnes per day, only when this activity takes place in combustion plants covered under 1.1 above. Reducing mercury to water. The BAT-AEL emission level is 0,2�3 �g/l .
status: valid
status modified: 2019-04-23
accepted date: 2019-04-23
in scheme: BATAELValue

Large combustion plants - Hg - BAT23-I
type: Concept
notation: LCP-Hg-BAT23-I
definition: 1. Energy industries: 1.1, Combustion of fuels in installations with a total rated thermal input of 50 MW or more, only when this activity takes place in combustion plants with a total rated thermal input of 50 MW or more; Techniques (a)-(i) (see table) for New plant; Reducing mercury emissions to air. The BAT-AEL emission level is < 1�3 �g/Nm3.
status: valid
status modified: 2019-04-23
accepted date: 2019-04-23
in scheme: BATAELValue

Large combustion plants - Hg - BAT23-II
type: Concept
notation: LCP-Hg-BAT23-II
definition: 1. Energy industries: 1.1, Combustion of fuels in installations with a total rated thermal input of 50 MW or more, only when this activity takes place in combustion plants with a total rated thermal input of 50 MW or more; Techniques (a)-(i) (see table) for New plant; Reducing mercury emissions to air. The BAT-AEL emission level is < 1�5 �g/Nm3.
status: valid
status modified: 2019-04-23
accepted date: 2019-04-23
in scheme: BATAELValue

Large combustion plants - Hg - BAT23-III
type: Concept
notation: LCP-Hg-BAT23-III
definition: 1. Energy industries: 1.1, Combustion of fuels in installations with a total rated thermal input of 50 MW or more, only when this activity takes place in combustion plants with a total rated thermal input of 50 MW or more; Techniques (a)-(i) (see table) for Existing plant; Reducing mercury emissions to air. The BAT-AEL emission level is < 1�9 �g/Nm3.
status: valid
status modified: 2019-04-23
accepted date: 2019-04-23
in scheme: BATAELValue

Large combustion plants - Hg - BAT23-IV
type: Concept
notation: LCP-Hg-BAT23-IV
definition: 1. Energy industries: 1.1, Combustion of fuels in installations with a total rated thermal input of 50 MW or more, only when this activity takes place in combustion plants with a total rated thermal input of 50 MW or more; Techniques (a)-(i) (see table) for Existing plant; Reducing mercury emissions to air. The BAT-AEL emission level is < 1�10 �g/Nm3.
status: valid
status modified: 2019-04-23
accepted date: 2019-04-23
in scheme: BATAELValue

Large combustion plants - Hg - BAT23-V
type: Concept
notation: LCP-Hg-BAT23-V
definition: 1. Energy industries: 1.1, Combustion of fuels in installations with a total rated thermal input of 50 MW or more, only when this activity takes place in combustion plants with a total rated thermal input of 50 MW or more; Techniques (a)-(i) (see table) for New plant; Reducing mercury emissions to air. The BAT-AEL emission level is < 1�2 �g/Nm3.
status: valid
status modified: 2019-04-23
accepted date: 2019-04-23
in scheme: BATAELValue

Large combustion plants - Hg - BAT23-VI
type: Concept
notation: LCP-Hg-BAT23-VI
definition: 1. Energy industries: 1.1, Combustion of fuels in installations with a total rated thermal input of 50 MW or more, only when this activity takes place in combustion plants with a total rated thermal input of 50 MW or more; Techniques (a)-(i) (see table) for New plant; Reducing mercury emissions to air. The BAT-AEL emission level is < 1�4 �g/Nm3.
status: valid
status modified: 2019-04-23
accepted date: 2019-04-23
in scheme: BATAELValue

Large combustion plants - Hg - BAT23-VII
type: Concept
notation: LCP-Hg-BAT23-VII
definition: 1. Energy industries: 1.1, Combustion of fuels in installations with a total rated thermal input of 50 MW or more, only when this activity takes place in combustion plants with a total rated thermal input of 50 MW or more; Techniques (a)-(i) (see table) for Existing plant; Reducing mercury emissions to air. The BAT-AEL emission level is < 1�4 �g/Nm3.
status: valid
status modified: 2019-04-23
accepted date: 2019-04-23
in scheme: BATAELValue

Large combustion plants - Hg - BAT23-VIII
type: Concept
notation: LCP-Hg-BAT23-VIII
definition: 1. Energy industries: 1.1, Combustion of fuels in installations with a total rated thermal input of 50 MW or more, only when this activity takes place in combustion plants with a total rated thermal input of 50 MW or more; Techniques (a)-(i) (see table) for Existing plant; Reducing mercury emissions to air. The BAT-AEL emission level is < 1�7 �g/Nm3.
status: valid
status modified: 2019-04-23
accepted date: 2019-04-23
in scheme: BATAELValue

Large combustion plants - Hg - BAT27
type: Concept
notation: LCP-Hg-BAT27
definition: 1. Energy industries: 1.1, Combustion of fuels in installations with a total rated thermal input of 50 MW or more, only when this activity takes place in combustion plants with a total rated thermal input of 50 MW or more; Techniques (a)-(g) (see table); Reducing mercury emissions to air. The BAT-AEL emission level is < 1�5 �g/Nm3 .
status: valid
status modified: 2019-04-23
accepted date: 2019-04-23
in scheme: BATAELValue

Large combustion plants - Hg - BAT75-II
type: Concept
notation: LCP-Hg-BAT75-II
definition: 1. Energy industries: 1.4, Gasification of coal or other fuels in installations with a total rated thermal input of 20 MW or more, only when this activity is directly associated to a combustion plant; Techniques (a)-(c) (see table); Reducing particulate-bound mercury emissions to air. The BAT-AEL emission level is < 1 �g/Nm3.
status: valid
status modified: 2019-04-23
accepted date: 2019-04-23
in scheme: BATAELValue

Large combustion plants - Metals - BAT68-I
type: Concept
notation: LCP-Metals-BAT68-I
definition: 1. Energy industries: 1.1, Combustion of fuels in installations with a total rated thermal input of 50 MW or more, only when this activity takes place in combustion plants with a total rated thermal input of 50 MW or more; Use one or a combination of the techniques given in BAT 22; Reducing metals emissions to air. The BAT-AEL emission level is 0,005�0,5 mg/Nm3 .
status: valid
status modified: 2019-04-23
accepted date: 2019-04-23
in scheme: BATAELValue

Large combustion plants - Metals - BAT68-II
type: Concept
notation: LCP-Metals-BAT68-II
definition: 1. Energy industries: 1.1, Combustion of fuels in installations with a total rated thermal input of 50 MW or more, only when this activity takes place in combustion plants with a total rated thermal input of 50 MW or more; Use one or a combination of the techniques given in BAT 22; Reducing metals emissions to air. The BAT-AEL emission level is 5�12 �g/Nm3.
status: valid
status modified: 2019-04-23
accepted date: 2019-04-23
in scheme: BATAELValue

Large combustion plants - Metals - BAT68-III
type: Concept
notation: LCP-Metals-BAT68-III
definition: 1. Energy industries: 1.1, Combustion of fuels in installations with a total rated thermal input of 50 MW or more, only when this activity takes place in combustion plants with a total rated thermal input of 50 MW or more; Use one or a combination of the techniques given in BAT 22; Reducing metals emissions to air. The BAT-AEL emission level is 0,005�0,2 mg/Nm3 .
status: valid
status modified: 2019-04-23
accepted date: 2019-04-23
in scheme: BATAELValue

Large combustion plants - Metals - BAT68-IV
type: Concept
notation: LCP-Metals-BAT68-IV
definition: 1. Energy industries: 1.1, Combustion of fuels in installations with a total rated thermal input of 50 MW or more, only when this activity takes place in combustion plants with a total rated thermal input of 50 MW or more; Use one or a combination of the techniques given in BAT 22; Reducing metals emissions to air. The BAT-AEL emission level is 5�6 �g/Nm3.
status: valid
status modified: 2019-04-23
accepted date: 2019-04-23
in scheme: BATAELValue

Large combustion plants - Metals - BAT69-I
type: Concept
notation: LCP-Metals-BAT69-I
definition: 1. Energy industries: 1.1, Combustion of fuels in installations with a total rated thermal input of 50 MW or more, only when this activity takes place in combustion plants with a total rated thermal input of 50 MW or more; Use one or a combination of the techniques given in BAT 26; Reducing metals emissions to air. The BAT-AEL emission level is 0,075�0,3 mg/Nm3.
status: valid
status modified: 2019-04-23
accepted date: 2019-04-23
in scheme: BATAELValue

Large combustion plants - Metals - BAT69-II
type: Concept
notation: LCP-Metals-BAT69-II
definition: 1. Energy industries: 1.1, Combustion of fuels in installations with a total rated thermal input of 50 MW or more, only when this activity takes place in combustion plants with a total rated thermal input of 50 MW or more; Use one or a combination of the techniques given in BAT 26; Reducing metals emissions to air. The BAT-AEL emission level is < 5 �g/Nm3.
status: valid
status modified: 2019-04-23
accepted date: 2019-04-23
in scheme: BATAELValue

Large combustion plants - Metals - BAT75-I
type: Concept
notation: LCP-Metals-BAT75-I
definition: 1. Energy industries: 1.4, Gasification of coal or other fuels in installations with a total rated thermal input of 20 MW or more, only when this activity is directly associated to a combustion plant; Techniques (a)-(c) (see table); Reducing particulate-bound metals emissions to air. The BAT-AEL emission level is < 0,025 mg/Nm3.
status: valid
status modified: 2019-04-23
accepted date: 2019-04-23
in scheme: BATAELValue

Large combustion plants - NH3 - BAT7
type: Concept
notation: LCP-NH3-BAT7
definition: 1.� Energy industries; 5.� Waste management: 1.1Combustion of fuels in installations with a total rated thermal input of 50 MW or more, only when this activity takes place in combustion plants with a total rated thermal input of 50 MW or more; 1.4, Gasification of coal or other fuels in installations with a total rated thermal input of 20 MW or more, only when this activity is directly associated to a combustion plant; 5.2, Disposal or recovery of waste in waste co-incineration plants for non-hazardous waste with a capacity exceeding 3 tonnes per hour or for hazardous waste with a capacity exceeding 10 tonnes per day, only when this activity takes place in combustion plants covered under 1.1 above; Optimise the design and/or operation of SCR and/or SNCR; Reducing ammonia emissions to air. The BAT-AEL emission level is < 3�10 mg/Nm3 .
status: valid
status modified: 2019-04-23
accepted date: 2019-04-23
in scheme: BATAELValue

Large combustion plants - NOx - BAT20-I
type: Concept
notation: LCP-NOx-BAT20-I
definition: 1. Energy industries: 1.1, Combustion of fuels in installations with a total rated thermal input of 50 MW or more, only when this activity takes place in combustion plants with a total rated thermal input of 50 MW or more; Techniques (a)-(e) (see table incl. footnote) for New plant; Reducing nitrogen oxides (NOx) emissions to air. The BAT-AEL emission level is 100�150 mg/Nm3.
status: valid
status modified: 2019-04-23
accepted date: 2019-04-23
in scheme: BATAELValue

Large combustion plants - NOx - BAT20-II
type: Concept
notation: LCP-NOx-BAT20-II
definition: 1. Energy industries: 1.1, Combustion of fuels in installations with a total rated thermal input of 50 MW or more, only when this activity takes place in combustion plants with a total rated thermal input of 50 MW or more; Techniques (a)-(e) (see table incl. footnote) for Existing plant; Reducing nitrogen oxides (NOx) emissions to air. The BAT-AEL emission level is 100�270 mg/Nm3.
status: valid
status modified: 2019-04-23
accepted date: 2019-04-23
in scheme: BATAELValue

Large combustion plants - NOx - BAT20-III
type: Concept
notation: LCP-NOx-BAT20-III
definition: 1. Energy industries: 1.1, Combustion of fuels in installations with a total rated thermal input of 50 MW or more, only when this activity takes place in combustion plants with a total rated thermal input of 50 MW or more; Techniques (a)-(e) (see table incl. footnote) for New plant; Reducing nitrogen oxides (NOx) emissions to air. The BAT-AEL emission level is 155�200 mg/Nm3.
status: valid
status modified: 2019-04-23
accepted date: 2019-04-23
in scheme: BATAELValue

Large combustion plants - NOx - BAT20-IV
type: Concept
notation: LCP-NOx-BAT20-IV
definition: 1. Energy industries: 1.1, Combustion of fuels in installations with a total rated thermal input of 50 MW or more, only when this activity takes place in combustion plants with a total rated thermal input of 50 MW or more; Techniques (a)-(e) (see table incl. footnote) for Existing plant; Reducing nitrogen oxides (NOx) emissions to air. The BAT-AEL emission level is 165�330 mg/Nm3 .
status: valid
status modified: 2019-04-23
accepted date: 2019-04-23
in scheme: BATAELValue

Large combustion plants - NOx - BAT20-IX
type: Concept
notation: LCP-NOx-BAT20-IX
definition: 1. Energy industries: 1.1, Combustion of fuels in installations with a total rated thermal input of 50 MW or more, only when this activity takes place in combustion plants with a total rated thermal input of 50 MW or more; Techniques (a)-(e) (see table incl. footnote) in FBC boiler combusting coal and/or lignite and lignite-fired PC boiler. for New plant; Reducing nitrogen oxides (NOx) emissions to air. The BAT-AEL emission level is 50-85 mg/Nm3.
status: valid
status modified: 2019-04-23
accepted date: 2019-04-23
in scheme: BATAELValue

Large combustion plants - NOx - BAT20-V
type: Concept
notation: LCP-NOx-BAT20-V
definition: 1. Energy industries: 1.1, Combustion of fuels in installations with a total rated thermal input of 50 MW or more, only when this activity takes place in combustion plants with a total rated thermal input of 50 MW or more; Techniques (a)-(e) (see table incl. footnote) for New plant; Reducing nitrogen oxides (NOx) emissions to air. The BAT-AEL emission level is 50�100 mg/Nm3.
status: valid
status modified: 2019-04-23
accepted date: 2019-04-23
in scheme: BATAELValue

Large combustion plants - NOx - BAT20-VI
type: Concept
notation: LCP-NOx-BAT20-VI
definition: 1. Energy industries: 1.1, Combustion of fuels in installations with a total rated thermal input of 50 MW or more, only when this activity takes place in combustion plants with a total rated thermal input of 50 MW or more; Techniques (a)-(e) (see table incl. footnote) for Existing plant; Reducing nitrogen oxides (NOx) emissions to air. The BAT-AEL emission level is 100�180 mg/Nm3 .
status: valid
status modified: 2019-04-23
accepted date: 2019-04-23
in scheme: BATAELValue

Large combustion plants - NOx - BAT20-VII
type: Concept
notation: LCP-NOx-BAT20-VII
definition: 1. Energy industries: 1.1, Combustion of fuels in installations with a total rated thermal input of 50 MW or more, only when this activity takes place in combustion plants with a total rated thermal input of 50 MW or more; Techniques (a)-(e) (see table incl. footnote) for New plant; Reducing nitrogen oxides (NOx) emissions to air. The BAT-AEL emission level is 80�130 mg/Nm3 .
status: valid
status modified: 2019-04-23
accepted date: 2019-04-23
in scheme: BATAELValue

Large combustion plants - NOx - BAT20-VIII
type: Concept
notation: LCP-NOx-BAT20-VIII
definition: 1. Energy industries: 1.1, Combustion of fuels in installations with a total rated thermal input of 50 MW or more, only when this activity takes place in combustion plants with a total rated thermal input of 50 MW or more; Techniques (a)-(e) (see table incl. footnote) for Existing plant; Reducing nitrogen oxides (NOx) emissions to air. The BAT-AEL emission level is 155�210 mg/Nm3 .
status: valid
status modified: 2019-04-23
accepted date: 2019-04-23
in scheme: BATAELValue

Large combustion plants - NOx - BAT20-X
type: Concept
notation: LCP-NOx-BAT20-X
definition: 1. Energy industries: 1.1, Combustion of fuels in installations with a total rated thermal input of 50 MW or more, only when this activity takes place in combustion plants with a total rated thermal input of 50 MW or more; Techniques (a)-(e) (see table incl. footnote) in FBC boiler combusting coal and/or lignite and lignite-fired PC boiler. for Existing plant; Reducing nitrogen oxides (NOx) emissions to air. The BAT-AEL emission level is < 85 - 150 mg/Nm3 .
status: valid
status modified: 2019-04-23
accepted date: 2019-04-23
in scheme: BATAELValue

Large combustion plants - NOx - BAT20-XI
type: Concept
notation: LCP-NOx-BAT20-XI
definition: 1. Energy industries: 1.1, Combustion of fuels in installations with a total rated thermal input of 50 MW or more, only when this activity takes place in combustion plants with a total rated thermal input of 50 MW or more; Techniques (a)-(e) (see table incl. footnote) in FBC boiler combusting coal and/or lignite and lignite-fired PC boiler. for New plant; Reducing nitrogen oxides (NOx) emissions to air. The BAT-AEL emission level is 80-125 mg/Nm3.
status: valid
status modified: 2019-04-23
accepted date: 2019-04-23
in scheme: BATAELValue

Large combustion plants - NOx - BAT20-XII
type: Concept
notation: LCP-NOx-BAT20-XII
definition: 1. Energy industries: 1.1, Combustion of fuels in installations with a total rated thermal input of 50 MW or more, only when this activity takes place in combustion plants with a total rated thermal input of 50 MW or more; Techniques (a)-(e) (see table incl. footnote) in FBC boiler combusting coal and/or lignite and lignite-fired PC boiler. for Existing plant; Reducing nitrogen oxides (NOx) emissions to air. The BAT-AEL emission level is 140-165 mg/Nm3 .
status: valid
status modified: 2019-04-23
accepted date: 2019-04-23
in scheme: BATAELValue

Large combustion plants - NOx - BAT20-XIII
type: Concept
notation: LCP-NOx-BAT20-XIII
definition: 1. Energy industries: 1.1, Combustion of fuels in installations with a total rated thermal input of 50 MW or more, only when this activity takes place in combustion plants with a total rated thermal input of 50 MW or more; Techniques (a)-(e) (see table incl. footnote) in coal-fired PC boiler. for New plant; Reducing nitrogen oxides (NOx) emissions to air. The BAT-AEL emission level is 65 � 85 mg/Nm3.
status: valid
status modified: 2019-04-23
accepted date: 2019-04-23
in scheme: BATAELValue

Large combustion plants - NOx - BAT20-XIV
type: Concept
notation: LCP-NOx-BAT20-XIV
definition: 1. Energy industries: 1.1, Combustion of fuels in installations with a total rated thermal input of 50 MW or more, only when this activity takes place in combustion plants with a total rated thermal input of 50 MW or more; Techniques (a)-(e) (see table incl. footnote) in coal-fired PC boiler. for Existing plant; Reducing nitrogen oxides (NOx) emissions to air. The BAT-AEL emission level is 65 � 150 mg/Nm3 .
status: valid
status modified: 2019-04-23
accepted date: 2019-04-23
in scheme: BATAELValue

Large combustion plants - NOx - BAT20-XV
type: Concept
notation: LCP-NOx-BAT20-XV
definition: 1. Energy industries: 1.1, Combustion of fuels in installations with a total rated thermal input of 50 MW or more, only when this activity takes place in combustion plants with a total rated thermal input of 50 MW or more; Techniques (a)-(e) (see table incl. footnote) in coal-fired PC boiler. for New plant; Reducing nitrogen oxides (NOx) emissions to air. The BAT-AEL emission level is 80 � 125 mg/Nm3 .
status: valid
status modified: 2019-04-23
accepted date: 2019-04-23
in scheme: BATAELValue

Large combustion plants - NOx - BAT20-XVI
type: Concept
notation: LCP-NOx-BAT20-XVI
definition: 1. Energy industries: 1.1, Combustion of fuels in installations with a total rated thermal input of 50 MW or more, only when this activity takes place in combustion plants with a total rated thermal input of 50 MW or more; Techniques (a)-(e) (see table incl. footnote) in coal-fired PC boiler. for Existing plant; Reducing nitrogen oxides (NOx) emissions to air. The BAT-AEL emission level is < 85 � 165 mg/Nm3 .
status: valid
status modified: 2019-04-23
accepted date: 2019-04-23
in scheme: BATAELValue

Large combustion plants - NOx - BAT24-I
type: Concept
notation: LCP-NOx-BAT24-I
definition: 1. Energy industries: 1.1, Combustion of fuels in installations with a total rated thermal input of 50 MW or more, only when this activity takes place in combustion plants with a total rated thermal input of 50 MW or more; Techniques (a)-(g) (see table) for New plant; Reducing nitrogen oxides (NOx) emissions to air. The BAT-AEL emission level is 70-150 mg/Nm3.
status: valid
status modified: 2019-04-23
accepted date: 2019-04-23
in scheme: BATAELValue

Large combustion plants - NOx - BAT24-II
type: Concept
notation: LCP-NOx-BAT24-II
definition: 1. Energy industries: 1.1, Combustion of fuels in installations with a total rated thermal input of 50 MW or more, only when this activity takes place in combustion plants with a total rated thermal input of 50 MW or more; Techniques (a)-(g) (see table) for Existing plant; Reducing nitrogen oxides (NOx) emissions to air. The BAT-AEL emission level is 70-225 mg/Nm3.
status: valid
status modified: 2019-04-23
accepted date: 2019-04-23
in scheme: BATAELValue

Large combustion plants - NOx - BAT24-III
type: Concept
notation: LCP-NOx-BAT24-III
definition: 1. Energy industries: 1.1, Combustion of fuels in installations with a total rated thermal input of 50 MW or more, only when this activity takes place in combustion plants with a total rated thermal input of 50 MW or more; Techniques (a)-(g) (see table) for New plant; Reducing nitrogen oxides (NOx) emissions to air. The BAT-AEL emission level is 120�200 mg/Nm3.
status: valid
status modified: 2019-04-23
accepted date: 2019-04-23
in scheme: BATAELValue

Large combustion plants - NOx - BAT24-IV
type: Concept
notation: LCP-NOx-BAT24-IV
definition: 1. Energy industries: 1.1, Combustion of fuels in installations with a total rated thermal input of 50 MW or more, only when this activity takes place in combustion plants with a total rated thermal input of 50 MW or more; Techniques (a)-(g) (see table) for Existing plant; Reducing nitrogen oxides (NOx) emissions to air. The BAT-AEL emission level is 120�275 mg/Nm3.
status: valid
status modified: 2019-04-23
accepted date: 2019-04-23
in scheme: BATAELValue

Large combustion plants - NOx - BAT24-IX
type: Concept
notation: LCP-NOx-BAT24-IX
definition: 1. Energy industries: 1.1, Combustion of fuels in installations with a total rated thermal input of 50 MW or more, only when this activity takes place in combustion plants with a total rated thermal input of 50 MW or more; Techniques (a)-(g) (see table) for New plant; Reducing nitrogen oxides (NOx) emissions to air. The BAT-AEL emission level is 40�140 mg/Nm3.
status: valid
status modified: 2019-04-23
accepted date: 2019-04-23
in scheme: BATAELValue

Large combustion plants - NOx - BAT24-V
type: Concept
notation: LCP-NOx-BAT24-V
definition: 1. Energy industries: 1.1, Combustion of fuels in installations with a total rated thermal input of 50 MW or more, only when this activity takes place in combustion plants with a total rated thermal input of 50 MW or more; Techniques (a)-(g) (see table) for New plant; Reducing nitrogen oxides (NOx) emissions to air. The BAT-AEL emission level is 50�140 mg/Nm3.
status: valid
status modified: 2019-04-23
accepted date: 2019-04-23
in scheme: BATAELValue

Large combustion plants - NOx - BAT24-VI
type: Concept
notation: LCP-NOx-BAT24-VI
definition: 1. Energy industries: 1.1, Combustion of fuels in installations with a total rated thermal input of 50 MW or more, only when this activity takes place in combustion plants with a total rated thermal input of 50 MW or more; Techniques (a)-(g) (see table) for Existing plant; Reducing nitrogen oxides (NOx) emissions to air. The BAT-AEL emission level is 50�180 mg/Nm3.
status: valid
status modified: 2019-04-23
accepted date: 2019-04-23
in scheme: BATAELValue

Large combustion plants - NOx - BAT24-VII
type: Concept
notation: LCP-NOx-BAT24-VII
definition: 1. Energy industries: 1.1, Combustion of fuels in installations with a total rated thermal input of 50 MW or more, only when this activity takes place in combustion plants with a total rated thermal input of 50 MW or more; Techniques (a)-(g) (see table) for New plant; Reducing nitrogen oxides (NOx) emissions to air. The BAT-AEL emission level is 100�200 mg/Nm3.
status: valid
status modified: 2019-04-23
accepted date: 2019-04-23
in scheme: BATAELValue

Large combustion plants - NOx - BAT24-VIII
type: Concept
notation: LCP-NOx-BAT24-VIII
definition: 1. Energy industries: 1.1, Combustion of fuels in installations with a total rated thermal input of 50 MW or more, only when this activity takes place in combustion plants with a total rated thermal input of 50 MW or more; Techniques (a)-(g) (see table) for Existing plant; Reducing nitrogen oxides (NOx) emissions to air. The BAT-AEL emission level is 100�220 mg/Nm3.
status: valid
status modified: 2019-04-23
accepted date: 2019-04-23
in scheme: BATAELValue

Large combustion plants - NOx - BAT24-X
type: Concept
notation: LCP-NOx-BAT24-X
definition: 1. Energy industries: 1.1, Combustion of fuels in installations with a total rated thermal input of 50 MW or more, only when this activity takes place in combustion plants with a total rated thermal input of 50 MW or more; Techniques (a)-(g) (see table) for Existing plant; Reducing nitrogen oxides (NOx) emissions to air. The BAT-AEL emission level is 40�150 mg/Nm3.
status: valid
status modified: 2019-04-23
accepted date: 2019-04-23
in scheme: BATAELValue

Large combustion plants - NOx - BAT24-XI
type: Concept
notation: LCP-NOx-BAT24-XI
definition: 1. Energy industries: 1.1, Combustion of fuels in installations with a total rated thermal input of 50 MW or more, only when this activity takes place in combustion plants with a total rated thermal input of 50 MW or more; Techniques (a)-(g) (see table) for New plant; Reducing nitrogen oxides (NOx) emissions to air. The BAT-AEL emission level is 65�150 mg/Nm3.
status: valid
status modified: 2019-04-23
accepted date: 2019-04-23
in scheme: BATAELValue

Large combustion plants - NOx - BAT24-XII
type: Concept
notation: LCP-NOx-BAT24-XII
definition: 1. Energy industries: 1.1, Combustion of fuels in installations with a total rated thermal input of 50 MW or more, only when this activity takes place in combustion plants with a total rated thermal input of 50 MW or more; Techniques (a)-(g) (see table) for Existing plant; Reducing nitrogen oxides (NOx) emissions to air. The BAT-AEL emission level is 95�165 mg/Nm3.
status: valid
status modified: 2019-04-23
accepted date: 2019-04-23
in scheme: BATAELValue

Large combustion plants - NOx - BAT28-I
type: Concept
notation: LCP-NOx-BAT28-I
definition: 1. Energy industries: 1.1, Combustion of fuels in installations with a total rated thermal input of 50 MW or more, only when this activity takes place in combustion plants with a total rated thermal input of 50 MW or more; Techniques (a)-(i) (see table) for New plant; Reducing nitrogen oxides (NOx) emissions to air. The BAT-AEL emission level is 75�200 mg/Nm3.
status: valid
status modified: 2019-04-23
accepted date: 2019-04-23
in scheme: BATAELValue

Large combustion plants - NOx - BAT28-II
type: Concept
notation: LCP-NOx-BAT28-II
definition: 1. Energy industries: 1.1, Combustion of fuels in installations with a total rated thermal input of 50 MW or more, only when this activity takes place in combustion plants with a total rated thermal input of 50 MW or more; Techniques (a)-(i) (see table) for Existing plant; Reducing nitrogen oxides (NOx) emissions to air. The BAT-AEL emission level is 150�270 mg/Nm3.
status: valid
status modified: 2019-04-23
accepted date: 2019-04-23
in scheme: BATAELValue

Large combustion plants - NOx - BAT28-III
type: Concept
notation: LCP-NOx-BAT28-III
definition: 1. Energy industries: 1.1, Combustion of fuels in installations with a total rated thermal input of 50 MW or more, only when this activity takes place in combustion plants with a total rated thermal input of 50 MW or more; Techniques (a)-(i) (see table) for New plant; Reducing nitrogen oxides (NOx) emissions to air. The BAT-AEL emission level is 100�215 mg/Nm3.
status: valid
status modified: 2019-04-23
accepted date: 2019-04-23
in scheme: BATAELValue

Large combustion plants - NOx - BAT28-IV
type: Concept
notation: LCP-NOx-BAT28-IV
definition: 1. Energy industries: 1.1, Combustion of fuels in installations with a total rated thermal input of 50 MW or more, only when this activity takes place in combustion plants with a total rated thermal input of 50 MW or more; Techniques (a)-(i) (see table) for Existing plant; Reducing nitrogen oxides (NOx) emissions to air. The BAT-AEL emission level is 210�330 mg/Nm3.
status: valid
status modified: 2019-04-23
accepted date: 2019-04-23
in scheme: BATAELValue

Large combustion plants - NOx - BAT28-V
type: Concept
notation: LCP-NOx-BAT28-V
definition: 1. Energy industries: 1.1, Combustion of fuels in installations with a total rated thermal input of 50 MW or more, only when this activity takes place in combustion plants with a total rated thermal input of 50 MW or more; Techniques (a)-(i) (see table) for New plant; Reducing nitrogen oxides (NOx) emissions to air. The BAT-AEL emission level is 45�75 mg/Nm3.
status: valid
status modified: 2019-04-23
accepted date: 2019-04-23
in scheme: BATAELValue

Large combustion plants - NOx - BAT28-VI
type: Concept
notation: LCP-NOx-BAT28-VI
definition: 1. Energy industries: 1.1, Combustion of fuels in installations with a total rated thermal input of 50 MW or more, only when this activity takes place in combustion plants with a total rated thermal input of 50 MW or more; Techniques (a)-(i) (see table) for Existing plant; Reducing nitrogen oxides (NOx) emissions to air. The BAT-AEL emission level is 45�100 mg/Nm3.
status: valid
status modified: 2019-04-23
accepted date: 2019-04-23
in scheme: BATAELValue

Large combustion plants - NOx - BAT28-VII
type: Concept
notation: LCP-NOx-BAT28-VII
definition: 1. Energy industries: 1.1, Combustion of fuels in installations with a total rated thermal input of 50 MW or more, only when this activity takes place in combustion plants with a total rated thermal input of 50 MW or more; Techniques (a)-(i) (see table) for New plant; Reducing nitrogen oxides (NOx) emissions to air. The BAT-AEL emission level is 85�100 mg/Nm3.
status: valid
status modified: 2019-04-23
accepted date: 2019-04-23
in scheme: BATAELValue

Large combustion plants - NOx - BAT28-VIII
type: Concept
notation: LCP-NOx-BAT28-VIII
definition: 1. Energy industries: 1.1, Combustion of fuels in installations with a total rated thermal input of 50 MW or more, only when this activity takes place in combustion plants with a total rated thermal input of 50 MW or more; Techniques (a)-(i) (see table) for Existing plant; Reducing nitrogen oxides (NOx) emissions to air. The BAT-AEL emission level is 85�110 mg/Nm3.
status: valid
status modified: 2019-04-23
accepted date: 2019-04-23
in scheme: BATAELValue

Large combustion plants - NOx - BAT33-I
type: Concept
notation: LCP-NOx-BAT33-I
definition: 1. Energy industries: 1.1, Combustion of fuels in installations with a total rated thermal input of 50 MW or more, only when this activity takes place in combustion plants with a total rated thermal input of 50 MW or more; Techniques (a)-(b) (see table) for New plant; Reducing nitrogen oxides (NOx) emissions to air. The BAT-AEL emission level is 115�190 mg/Nm3.
status: valid
status modified: 2019-04-23
accepted date: 2019-04-23
in scheme: BATAELValue

Large combustion plants - NOx - BAT33-II
type: Concept
notation: LCP-NOx-BAT33-II
definition: 1. Energy industries: 1.1, Combustion of fuels in installations with a total rated thermal input of 50 MW or more, only when this activity takes place in combustion plants with a total rated thermal input of 50 MW or more; Techniques (a)-(b) (see table) for Existing plant; Reducing nitrogen oxides (NOx) emissions to air. The BAT-AEL emission level is 125�625 mg/Nm3.
status: valid
status modified: 2019-04-23
accepted date: 2019-04-23
in scheme: BATAELValue

Large combustion plants - NOx - BAT33-III
type: Concept
notation: LCP-NOx-BAT33-III
definition: 1. Energy industries: 1.1, Combustion of fuels in installations with a total rated thermal input of 50 MW or more, only when this activity takes place in combustion plants with a total rated thermal input of 50 MW or more; Techniques (a)-(b) (see table) for New plant; Reducing nitrogen oxides (NOx) emissions to air. The BAT-AEL emission level is 145�300 mg/Nm3.
status: valid
status modified: 2019-04-23
accepted date: 2019-04-23
in scheme: BATAELValue

Large combustion plants - NOx - BAT33-IV
type: Concept
notation: LCP-NOx-BAT33-IV
definition: 1. Energy industries: 1.1, Combustion of fuels in installations with a total rated thermal input of 50 MW or more, only when this activity takes place in combustion plants with a total rated thermal input of 50 MW or more; Techniques (a)-(b) (see table) for Existing plant; Reducing nitrogen oxides (NOx) emissions to air. The BAT-AEL emission level is 150�750 mg/Nm3.
status: valid
status modified: 2019-04-23
accepted date: 2019-04-23
in scheme: BATAELValue

Large combustion plants - NOx - BAT44-I
type: Concept
notation: LCP-NOx-BAT44-I
definition: 1. Energy industries: 1.1, Combustion of fuels in installations with a total rated thermal input of 50 MW or more, only when this activity takes place in combustion plants with a total rated thermal input of 50 MW or more; Ensure optimised combustion and/or to use oxidation catalysts for new open-cycle gas turbines (OCGTs); Reducing nitrogen oxides (NOx) emissions to air. The BAT-AEL emission level is 15�35 mg/Nm3.
status: valid
status modified: 2019-04-23
accepted date: 2019-04-23
in scheme: BATAELValue

Large combustion plants - NOx - BAT44-II
type: Concept
notation: LCP-NOx-BAT44-II
definition: 1. Energy industries: 1.1, Combustion of fuels in installations with a total rated thermal input of 50 MW or more, only when this activity takes place in combustion plants with a total rated thermal input of 50 MW or more; Ensure optimised combustion and/or to use oxidation catalysts for new open-cycle gas turbines (OCGTs); Reducing nitrogen oxides (NOx) emissions to air. The BAT-AEL emission level is 25�50 mg/Nm3.
status: valid
status modified: 2019-04-23
accepted date: 2019-04-23
in scheme: BATAELValue

Large combustion plants - NOx - BAT44-III
type: Concept
notation: LCP-NOx-BAT44-III
definition: 1. Energy industries: 1.1, Combustion of fuels in installations with a total rated thermal input of 50 MW or more, only when this activity takes place in combustion plants with a total rated thermal input of 50 MW or more; Ensure optimised combustion and/or to use oxidation catalysts for Existing OCGT (excluding turbines for mechanical drive applications); Reducing nitrogen oxides (NOx) emissions to air. The BAT-AEL emission level is 15�50 mg/Nm3.
status: valid
status modified: 2019-04-23
accepted date: 2019-04-23
in scheme: BATAELValue

Large combustion plants - NOx - BAT44-IV
type: Concept
notation: LCP-NOx-BAT44-IV
definition: 1. Energy industries: 1.1, Combustion of fuels in installations with a total rated thermal input of 50 MW or more, only when this activity takes place in combustion plants with a total rated thermal input of 50 MW or more; Ensure optimised combustion and/or to use oxidation catalysts for Existing OCGT (excluding turbines for mechanical drive applications); Reducing nitrogen oxides (NOx) emissions to air. The BAT-AEL emission level is 25�55 mg/Nm3.
status: valid
status modified: 2019-04-23
accepted date: 2019-04-23
in scheme: BATAELValue

Large combustion plants - NOx - BAT44-IX
type: Concept
notation: LCP-NOx-BAT44-IX
definition: 1. Energy industries: 1.1, Combustion of fuels in installations with a total rated thermal input of 50 MW or more, only when this activity takes place in combustion plants with a total rated thermal input of 50 MW or more; Ensure optimised combustion and/or to use oxidation catalysts for existing combined-cycle gas turbines (CCGTs); Reducing nitrogen oxides (NOx) emissions to air. The BAT-AEL emission level is 10�50 mg/Nm3.
status: valid
status modified: 2019-04-23
accepted date: 2019-04-23
in scheme: BATAELValue

Large combustion plants - NOx - BAT44-V
type: Concept
notation: LCP-NOx-BAT44-V
definition: 1. Energy industries: 1.1, Combustion of fuels in installations with a total rated thermal input of 50 MW or more, only when this activity takes place in combustion plants with a total rated thermal input of 50 MW or more; Ensure optimised combustion and/or to use oxidation catalysts for new combined-cycle gas turbines (CCGTs); Reducing nitrogen oxides (NOx) emissions to air. The BAT-AEL emission level is 10�30 mg/Nm3.
status: valid
status modified: 2019-04-23
accepted date: 2019-04-23
in scheme: BATAELValue

Large combustion plants - NOx - BAT44-VI
type: Concept
notation: LCP-NOx-BAT44-VI
definition: 1. Energy industries: 1.1, Combustion of fuels in installations with a total rated thermal input of 50 MW or more, only when this activity takes place in combustion plants with a total rated thermal input of 50 MW or more; Ensure optimised combustion and/or to use oxidation catalysts for new combined-cycle gas turbines (CCGTs); Reducing nitrogen oxides (NOx) emissions to air. The BAT-AEL emission level is 15�40 mg/Nm3.
status: valid
status modified: 2019-04-23
accepted date: 2019-04-23
in scheme: BATAELValue

Large combustion plants - NOx - BAT44-VII
type: Concept
notation: LCP-NOx-BAT44-VII
definition: 1. Energy industries: 1.1, Combustion of fuels in installations with a total rated thermal input of 50 MW or more, only when this activity takes place in combustion plants with a total rated thermal input of 50 MW or more; Ensure optimised combustion and/or to use oxidation catalysts for existing combined-cycle gas turbines (CCGTs); Reducing nitrogen oxides (NOx) emissions to air. The BAT-AEL emission level is 10�40 mg/Nm3.
status: valid
status modified: 2019-04-23
accepted date: 2019-04-23
in scheme: BATAELValue

Large combustion plants - NOx - BAT44-VIII
type: Concept
notation: LCP-NOx-BAT44-VIII
definition: 1. Energy industries: 1.1, Combustion of fuels in installations with a total rated thermal input of 50 MW or more, only when this activity takes place in combustion plants with a total rated thermal input of 50 MW or more; Ensure optimised combustion and/or to use oxidation catalysts for existing combined-cycle gas turbines (CCGTs); Reducing nitrogen oxides (NOx) emissions to air. The BAT-AEL emission level is 18-50 mg/Nm3.
status: valid
status modified: 2019-04-23
accepted date: 2019-04-23
in scheme: BATAELValue

Large combustion plants - NOx - BAT44-X
type: Concept
notation: LCP-NOx-BAT44-X
definition: 1. Energy industries: 1.1, Combustion of fuels in installations with a total rated thermal input of 50 MW or more, only when this activity takes place in combustion plants with a total rated thermal input of 50 MW or more; Ensure optimised combustion and/or to use oxidation catalysts for existing combined-cycle gas turbines (CCGTs); Reducing nitrogen oxides (NOx) emissions to air. The BAT-AEL emission level is 18-55 mg/Nm3.
status: valid
status modified: 2019-04-23
accepted date: 2019-04-23
in scheme: BATAELValue

Large combustion plants - NOx - BAT44-XI
type: Concept
notation: LCP-NOx-BAT44-XI
definition: 1. Energy industries: 1.1, Combustion of fuels in installations with a total rated thermal input of 50 MW or more, only when this activity takes place in combustion plants with a total rated thermal input of 50 MW or more; Ensure optimised combustion and/or to use oxidation catalysts for existing combined-cycle gas turbines (CCGTs); Reducing nitrogen oxides (NOx) emissions to air. The BAT-AEL emission level is 10-45 mg/Nm3.
status: valid
status modified: 2019-04-23
accepted date: 2019-04-23
in scheme: BATAELValue

Large combustion plants - NOx - BAT44-XII
type: Concept
notation: LCP-NOx-BAT44-XII
definition: 1. Energy industries: 1.1, Combustion of fuels in installations with a total rated thermal input of 50 MW or more, only when this activity takes place in combustion plants with a total rated thermal input of 50 MW or more; Ensure optimised combustion and/or to use oxidation catalysts for existing combined-cycle gas turbines (CCGTs); Reducing nitrogen oxides (NOx) emissions to air. The BAT-AEL emission level is 35-55 mg/Nm3.
status: valid
status modified: 2019-04-23
accepted date: 2019-04-23
in scheme: BATAELValue

Large combustion plants - NOx - BAT44-XIII
type: Concept
notation: LCP-NOx-BAT44-XIII
definition: 1. Energy industries: 1.1, Combustion of fuels in installations with a total rated thermal input of 50 MW or more, only when this activity takes place in combustion plants with a total rated thermal input of 50 MW or more; Ensure optimised combustion and/or to use oxidation catalysts for existing combined-cycle gas turbines (CCGTs); Reducing nitrogen oxides (NOx) emissions to air. The BAT-AEL emission level is 25-50 mg/Nm3.
status: valid
status modified: 2019-04-23
accepted date: 2019-04-23
in scheme: BATAELValue

Large combustion plants - NOx - BAT44-XIV
type: Concept
notation: LCP-NOx-BAT44-XIV
definition: 1. Energy industries: 1.1, Combustion of fuels in installations with a total rated thermal input of 50 MW or more, only when this activity takes place in combustion plants with a total rated thermal input of 50 MW or more; Ensure optimised combustion and/or to use oxidation catalysts for existing combined-cycle gas turbines (CCGTs); Reducing nitrogen oxides (NOx) emissions to air. The BAT-AEL emission level is 35-55 mg/Nm3.
status: valid
status modified: 2019-04-23
accepted date: 2019-04-23
in scheme: BATAELValue

Large combustion plants - NOx - BAT44-XIX
type: Concept
notation: LCP-NOx-BAT44-XIX
definition: 1. Energy industries: 1.1, Combustion of fuels in installations with a total rated thermal input of 50 MW or more, only when this activity takes place in combustion plants with a total rated thermal input of 50 MW or more; Ensure optimised combustion and/or to use oxidation catalysts for Existing plant; Reducing nitrogen oxides (NOx) emissions to air. The BAT-AEL emission level is 50�100 mg/Nm3.
status: valid
status modified: 2019-04-23
accepted date: 2019-04-23
in scheme: BATAELValue

Large combustion plants - NOx - BAT44-XV
type: Concept
notation: LCP-NOx-BAT44-XV
definition: 1. Energy industries: 1.1, Combustion of fuels in installations with a total rated thermal input of 50 MW or more, only when this activity takes place in combustion plants with a total rated thermal input of 50 MW or more; Ensure optimised combustion and/or to use oxidation catalysts for open- and combined-cycle gas turbines put into operation no later than 27 November 2003, or existing gas turbine for emergency use and operated < 500 h/yr; Reducing nitrogen oxides (NOx) emissions to air. The BAT-AEL emission level is 60�140 mg/Nm3.
status: valid
status modified: 2019-04-23
accepted date: 2019-04-23
in scheme: BATAELValue

Large combustion plants - NOx - BAT44-XVI
type: Concept
notation: LCP-NOx-BAT44-XVI
definition: 1. Energy industries: 1.1, Combustion of fuels in installations with a total rated thermal input of 50 MW or more, only when this activity takes place in combustion plants with a total rated thermal input of 50 MW or more; Ensure optimised combustion and/or to use oxidation catalysts for Existing plant; Reducing nitrogen oxides (NOx) emissions to air. The BAT-AEL emission level is 15�50 mg/Nm3.
status: valid
status modified: 2019-04-23
accepted date: 2019-04-23
in scheme: BATAELValue

Large combustion plants - NOx - BAT44-XVII
type: Concept
notation: LCP-NOx-BAT44-XVII
definition: 1. Energy industries: 1.1, Combustion of fuels in installations with a total rated thermal input of 50 MW or more, only when this activity takes place in combustion plants with a total rated thermal input of 50 MW or more; Ensure optimised combustion and/or to use oxidation catalysts for New plant; Reducing nitrogen oxides (NOx) emissions to air. The BAT-AEL emission level is 25-55 mg/Nm3.
status: valid
status modified: 2019-04-23
accepted date: 2019-04-23
in scheme: BATAELValue

Large combustion plants - NOx - BAT44-XVIII
type: Concept
notation: LCP-NOx-BAT44-XVIII
definition: 1. Energy industries: 1.1, Combustion of fuels in installations with a total rated thermal input of 50 MW or more, only when this activity takes place in combustion plants with a total rated thermal input of 50 MW or more; Ensure optimised combustion and/or to use oxidation catalysts for New plant; Reducing nitrogen oxides (NOx) emissions to air. The BAT-AEL emission level is 10�60 mg/Nm3.
status: valid
status modified: 2019-04-23
accepted date: 2019-04-23
in scheme: BATAELValue

Large combustion plants - NOx - BAT44-XX
type: Concept
notation: LCP-NOx-BAT44-XX
definition: 1. Energy industries: 1.1, Combustion of fuels in installations with a total rated thermal input of 50 MW or more, only when this activity takes place in combustion plants with a total rated thermal input of 50 MW or more; Ensure optimised combustion and/or to use oxidation catalysts for New plant; Reducing nitrogen oxides (NOx) emissions to air. The BAT-AEL emission level is 30�85 mg/Nm3.
status: valid
status modified: 2019-04-23
accepted date: 2019-04-23
in scheme: BATAELValue

Large combustion plants - NOx - BAT44-XXI
type: Concept
notation: LCP-NOx-BAT44-XXI
definition: 1. Energy industries: 1.1, Combustion of fuels in installations with a total rated thermal input of 50 MW or more, only when this activity takes place in combustion plants with a total rated thermal input of 50 MW or more; Ensure optimised combustion and/or to use oxidation catalysts for Existing plant; Reducing nitrogen oxides (NOx) emissions to air. The BAT-AEL emission level is 85�110 mg/Nm3.
status: valid
status modified: 2019-04-23
accepted date: 2019-04-23
in scheme: BATAELValue

Large combustion plants - NOx - BAT44-XXII
type: Concept
notation: LCP-NOx-BAT44-XXII
definition: 1. Energy industries: 1.1, Combustion of fuels in installations with a total rated thermal input of 50 MW or more, only when this activity takes place in combustion plants with a total rated thermal input of 50 MW or more; Ensure optimised combustion and/or to use oxidation catalysts for New plant; Reducing nitrogen oxides (NOx) emissions to air. The BAT-AEL emission level is 20�75 mg/Nm3.
status: valid
status modified: 2019-04-23
accepted date: 2019-04-23
in scheme: BATAELValue

Large combustion plants - NOx - BAT44-XXIII
type: Concept
notation: LCP-NOx-BAT44-XXIII
definition: 1. Energy industries: 1.1, Combustion of fuels in installations with a total rated thermal input of 50 MW or more, only when this activity takes place in combustion plants with a total rated thermal input of 50 MW or more; Ensure optimised combustion and/or to use oxidation catalysts for Existing plant; Reducing nitrogen oxides (NOx) emissions to air. The BAT-AEL emission level is 20�100 mg/Nm3.
status: valid
status modified: 2019-04-23
accepted date: 2019-04-23
in scheme: BATAELValue

Large combustion plants - NOx - BAT44-XXIV
type: Concept
notation: LCP-NOx-BAT44-XXIV
definition: 1. Energy industries: 1.1, Combustion of fuels in installations with a total rated thermal input of 50 MW or more, only when this activity takes place in combustion plants with a total rated thermal input of 50 MW or more; Ensure optimised combustion and/or to use oxidation catalysts for New plant; Reducing nitrogen oxides (NOx) emissions to air. The BAT-AEL emission level is 55�85 mg/Nm3.
status: valid
status modified: 2019-04-23
accepted date: 2019-04-23
in scheme: BATAELValue

Large combustion plants - NOx - BAT44-XXV
type: Concept
notation: LCP-NOx-BAT44-XXV
definition: 1. Energy industries: 1.1, Combustion of fuels in installations with a total rated thermal input of 50 MW or more, only when this activity takes place in combustion plants with a total rated thermal input of 50 MW or more; Ensure optimised combustion and/or to use oxidation catalysts for Existing plant; Reducing nitrogen oxides (NOx) emissions to air. The BAT-AEL emission level is 55�110 mg/Nm3.
status: valid
status modified: 2019-04-23
accepted date: 2019-04-23
in scheme: BATAELValue

Large combustion plants - NOx - BAT49-I
type: Concept
notation: LCP-NOx-BAT49-I
definition: 1. Energy industries: 1.1, Combustion of fuels in installations with a total rated thermal input of 50 MW or more, only when this activity takes place in combustion plants with a total rated thermal input of 50 MW or more; Techniques (a)-(b) (see table) for New boilers; Reducing nitrogen oxides (NOx) emissions to air. The BAT-AEL emission level is 15�65 mg/Nm3.
status: valid
status modified: 2019-04-23
accepted date: 2019-04-23
in scheme: BATAELValue

Large combustion plants - NOx - BAT49-II
type: Concept
notation: LCP-NOx-BAT49-II
definition: 1. Energy industries: 1.1, Combustion of fuels in installations with a total rated thermal input of 50 MW or more, only when this activity takes place in combustion plants with a total rated thermal input of 50 MW or more; Techniques (a)-(b) (see table) for New boilers; Reducing nitrogen oxides (NOx) emissions to air. The BAT-AEL emission level is 22�100 mg/Nm3.
status: valid
status modified: 2019-04-23
accepted date: 2019-04-23
in scheme: BATAELValue

Large combustion plants - NOx - BAT49-III
type: Concept
notation: LCP-NOx-BAT49-III
definition: 1. Energy industries: 1.1, Combustion of fuels in installations with a total rated thermal input of 50 MW or more, only when this activity takes place in combustion plants with a total rated thermal input of 50 MW or more; Techniques (a)-(b) (see table) for Existing boilers; Reducing nitrogen oxides (NOx) emissions to air. The BAT-AEL emission level is 20�100 mg/Nm3.
status: valid
status modified: 2019-04-23
accepted date: 2019-04-23
in scheme: BATAELValue

Large combustion plants - NOx - BAT49-IV
type: Concept
notation: LCP-NOx-BAT49-IV
definition: 1. Energy industries: 1.1, Combustion of fuels in installations with a total rated thermal input of 50 MW or more, only when this activity takes place in combustion plants with a total rated thermal input of 50 MW or more; Techniques (a)-(b) (see table) for Existing boilers; Reducing nitrogen oxides (NOx) emissions to air. The BAT-AEL emission level is 22�110 mg/Nm3.
status: valid
status modified: 2019-04-23
accepted date: 2019-04-23
in scheme: BATAELValue

Large combustion plants - NOx - BAT49-V
type: Concept
notation: LCP-NOx-BAT49-V
definition: 1. Energy industries: 1.1, Combustion of fuels in installations with a total rated thermal input of 50 MW or more, only when this activity takes place in combustion plants with a total rated thermal input of 50 MW or more; Techniques (a)-(b) (see table) for new combined-cycle gas turbines (CCGTs); Reducing nitrogen oxides (NOx) emissions to air. The BAT-AEL emission level is 20�35 mg/Nm3.
status: valid
status modified: 2019-04-23
accepted date: 2019-04-23
in scheme: BATAELValue

Large combustion plants - NOx - BAT49-VI
type: Concept
notation: LCP-NOx-BAT49-VI
definition: 1. Energy industries: 1.1, Combustion of fuels in installations with a total rated thermal input of 50 MW or more, only when this activity takes place in combustion plants with a total rated thermal input of 50 MW or more; Techniques (a)-(b) (see table) for new combined-cycle gas turbines (CCGTs); Reducing nitrogen oxides (NOx) emissions to air. The BAT-AEL emission level is 30�50 mg/Nm3.
status: valid
status modified: 2019-04-23
accepted date: 2019-04-23
in scheme: BATAELValue

Large combustion plants - NOx - BAT49-VII
type: Concept
notation: LCP-NOx-BAT49-VII
definition: 1. Energy industries: 1.1, Combustion of fuels in installations with a total rated thermal input of 50 MW or more, only when this activity takes place in combustion plants with a total rated thermal input of 50 MW or more; Techniques (a)-(b) (see table) for existing combined-cycle gas turbines (CCGTs); Reducing nitrogen oxides (NOx) emissions to air. The BAT-AEL emission level is 20�50 mg/Nm3.
status: valid
status modified: 2019-04-23
accepted date: 2019-04-23
in scheme: BATAELValue

Large combustion plants - NOx - BAT49-VIII
type: Concept
notation: LCP-NOx-BAT49-VIII
definition: 1. Energy industries: 1.1, Combustion of fuels in installations with a total rated thermal input of 50 MW or more, only when this activity takes place in combustion plants with a total rated thermal input of 50 MW or more; Techniques (a)-(b) (see table) for existing combined-cycle gas turbines (CCGTs); Reducing nitrogen oxides (NOx) emissions to air. The BAT-AEL emission level is 30�55 mg/Nm3.
status: valid
status modified: 2019-04-23
accepted date: 2019-04-23
in scheme: BATAELValue

Large combustion plants - NOx - BAT53-I
type: Concept
notation: LCP-NOx-BAT53-I
definition: 1. Energy industries: 1.1, Combustion of fuels in installations with a total rated thermal input of 50 MW or more, only when this activity takes place in combustion plants with a total rated thermal input of 50 MW or more; Techniques (a)-(d) (see table). for new open-cycle gas turbines on offshore platforms; Reducing nitrogen oxides (NOx) emissions to air. The BAT-AEL emission level is 15�50 mg/Nm3.
status: valid
status modified: 2019-04-23
accepted date: 2019-04-23
in scheme: BATAELValue

Large combustion plants - NOx - BAT53-II
type: Concept
notation: LCP-NOx-BAT53-II
definition: 1. Energy industries: 1.1, Combustion of fuels in installations with a total rated thermal input of 50 MW or more, only when this activity takes place in combustion plants with a total rated thermal input of 50 MW or more; Techniques (a)-(d) (see table). for existing open-cycle gas turbines on offshore platforms; Reducing nitrogen oxides (NOx) emissions to air. The BAT-AEL emission level is < 50�350 mg/Nm3.
status: valid
status modified: 2019-04-23
accepted date: 2019-04-23
in scheme: BATAELValue

Large combustion plants - NOx - BAT56-I
type: Concept
notation: LCP-NOx-BAT56-I
definition: 1. Energy industries: 1.1, Combustion of fuels in installations with a total rated thermal input of 50 MW or more, only when this activity takes place in combustion plants with a total rated thermal input of 50 MW or more; Techniques (a)-(i) (see table). for New plant; Reducing nitrogen oxides (NOx) emissions to air. The BAT-AEL emission level is 30�85 mg/Nm3.
status: valid
status modified: 2019-04-23
accepted date: 2019-04-23
in scheme: BATAELValue

Large combustion plants - NOx - BAT56-II
type: Concept
notation: LCP-NOx-BAT56-II
definition: 1. Energy industries: 1.1, Combustion of fuels in installations with a total rated thermal input of 50 MW or more, only when this activity takes place in combustion plants with a total rated thermal input of 50 MW or more; Techniques (a)-(i) (see table). for Existing plant; Reducing nitrogen oxides (NOx) emissions to air. The BAT-AEL emission level is 80�290 mg/Nm3.
status: valid
status modified: 2019-04-23
accepted date: 2019-04-23
in scheme: BATAELValue

Large combustion plants - NOx - BAT56-III
type: Concept
notation: LCP-NOx-BAT56-III
definition: 1. Energy industries: 1.1, Combustion of fuels in installations with a total rated thermal input of 50 MW or more, only when this activity takes place in combustion plants with a total rated thermal input of 50 MW or more; Techniques (a)-(i) (see table). for New plant; Reducing nitrogen oxides (NOx) emissions to air. The BAT-AEL emission level is 50�110 mg/Nm3.
status: valid
status modified: 2019-04-23
accepted date: 2019-04-23
in scheme: BATAELValue

Large combustion plants - NOx - BAT56-IV
type: Concept
notation: LCP-NOx-BAT56-IV
definition: 1. Energy industries: 1.1, Combustion of fuels in installations with a total rated thermal input of 50 MW or more, only when this activity takes place in combustion plants with a total rated thermal input of 50 MW or more; Techniques (a)-(i) (see table). for Existing plant; Reducing nitrogen oxides (NOx) emissions to air. The BAT-AEL emission level is 100�330 mg/Nm3.
status: valid
status modified: 2019-04-23
accepted date: 2019-04-23
in scheme: BATAELValue

Large combustion plants - NOx - BAT56-V
type: Concept
notation: LCP-NOx-BAT56-V
definition: 1. Energy industries: 1.1, Combustion of fuels in installations with a total rated thermal input of 50 MW or more, only when this activity takes place in combustion plants with a total rated thermal input of 50 MW or more; Techniques (a)-(i) (see table). for New plant; Reducing nitrogen oxides (NOx) emissions to air. The BAT-AEL emission level is 20�80 mg/Nm3.
status: valid
status modified: 2019-04-23
accepted date: 2019-04-23
in scheme: BATAELValue

Large combustion plants - NOx - BAT56-VI
type: Concept
notation: LCP-NOx-BAT56-VI
definition: 1. Energy industries: 1.1, Combustion of fuels in installations with a total rated thermal input of 50 MW or more, only when this activity takes place in combustion plants with a total rated thermal input of 50 MW or more; Techniques (a)-(i) (see table). for Existing plant; Reducing nitrogen oxides (NOx) emissions to air. The BAT-AEL emission level is 70�100 mg/Nm3.
status: valid
status modified: 2019-04-23
accepted date: 2019-04-23
in scheme: BATAELValue

Large combustion plants - NOx - BAT56-VII
type: Concept
notation: LCP-NOx-BAT56-VII
definition: 1. Energy industries: 1.1, Combustion of fuels in installations with a total rated thermal input of 50 MW or more, only when this activity takes place in combustion plants with a total rated thermal input of 50 MW or more; Techniques (a)-(i) (see table). for New plant; Reducing nitrogen oxides (NOx) emissions to air. The BAT-AEL emission level is 30�100 mg/Nm3.
status: valid
status modified: 2019-04-23
accepted date: 2019-04-23
in scheme: BATAELValue

Large combustion plants - NOx - BAT56-VIII
type: Concept
notation: LCP-NOx-BAT56-VIII
definition: 1. Energy industries: 1.1, Combustion of fuels in installations with a total rated thermal input of 50 MW or more, only when this activity takes place in combustion plants with a total rated thermal input of 50 MW or more; Techniques (a)-(i) (see table). for Existing plant; Reducing nitrogen oxides (NOx) emissions to air. The BAT-AEL emission level is 85�110 mg/Nm3.
status: valid
status modified: 2019-04-23
accepted date: 2019-04-23
in scheme: BATAELValue

Large combustion plants - NOx - BAT73-I
type: Concept
notation: LCP-NOx-BAT73-I
definition: 1. Energy industries: 1.4, Gasification of coal or other fuels in installations with a total rated thermal input of 20 MW or more, only when this activity is directly associated to a combustion plant; Use one or a combination of the techniques given below: (a)-(e) (see table) for New plant; Reducing nitrogen oxides (NOx) emissions to air. The BAT-AEL emission level is 10�25 mg/Nm3 .
status: valid
status modified: 2019-04-23
accepted date: 2019-04-23
in scheme: BATAELValue

Large combustion plants - NOx - BAT73-II
type: Concept
notation: LCP-NOx-BAT73-II
definition: 1. Energy industries: 1.4, Gasification of coal or other fuels in installations with a total rated thermal input of 20 MW or more, only when this activity is directly associated to a combustion plant; Use one or a combination of the techniques given below: (a)-(e) (see table) for Existing plant; Reducing nitrogen oxides (NOx) emissions to air. The BAT-AEL emission level is 12�45 mg/Nm3 .
status: valid
status modified: 2019-04-23
accepted date: 2019-04-23
in scheme: BATAELValue

Large combustion plants - NOx - BAT73-III
type: Concept
notation: LCP-NOx-BAT73-III
definition: 1. Energy industries: 1.4, Gasification of coal or other fuels in installations with a total rated thermal input of 20 MW or more, only when this activity is directly associated to a combustion plant; Use one or a combination of the techniques given below: (a)-(e) (see table) for New plant; Reducing nitrogen oxides (NOx) emissions to air. The BAT-AEL emission level is 1�35 mg/Nm3 .
status: valid
status modified: 2019-04-23
accepted date: 2019-04-23
in scheme: BATAELValue

Large combustion plants - NOx - BAT73-IV
type: Concept
notation: LCP-NOx-BAT73-IV
definition: 1. Energy industries: 1.4, Gasification of coal or other fuels in installations with a total rated thermal input of 20 MW or more, only when this activity is directly associated to a combustion plant; Use one or a combination of the techniques given below: (a)-(e) (see table) for Existing plant; Reducing nitrogen oxides (NOx) emissions to air. The BAT-AEL emission level is 1�60 mg/Nm3 .
status: valid
status modified: 2019-04-23
accepted date: 2019-04-23
in scheme: BATAELValue

Large combustion plants - Ni - BAT15-XIII
type: Concept
notation: LCP-Ni-BAT15-XIII
definition: 1.� Energy industries; 5.� Waste management: 1.1, Combustion of fuels in installations with a total rated thermal input of 50 MW or more, only when this activity takes place in combustion plants with a total rated thermal input of 50 MW or more; 1.4, Gasification of coal or other fuels in installations with a total rated thermal input of 20 MW or more, only when this activity is directly associated to a combustion plant; 5.2, Disposal or recovery of waste in waste co-incineration plants for non-hazardous waste with a capacity exceeding 3 tonnes per hour or for hazardous waste with a capacity exceeding 10 tonnes per day, only when this activity takes place in combustion plants covered under 1.1 above. Reducing nickel to water. The BAT-AEL emission level is 10�50 �g/l .
status: valid
status modified: 2019-04-23
accepted date: 2019-04-23
in scheme: BATAELValue

Large combustion plants - PCDD.F - BAT59
type: Concept
notation: LCP-PCDD.F-BAT59
definition: 1. Energy industries: 1.1, Combustion of fuels in installations with a total rated thermal input of 50 MW or more, only when this activity takes place in combustion plants with a total rated thermal input of 50 MW or more; Techniques (a)-(c) (see table); Reducing PCDD/F emissions to air. The BAT-AEL emission level is < 0,012�0,036 ng I-TEQ/Nm3 .
status: valid
status modified: 2019-04-23
accepted date: 2019-04-23
in scheme: BATAELValue

Large combustion plants - PCDD.F - BAT71-I
type: Concept
notation: LCP-PCDD.F-BAT71-I
definition: 1. Energy industries: 1.1, Combustion of fuels in installations with a total rated thermal input of 50 MW or more, only when this activity takes place in combustion plants with a total rated thermal input of 50 MW or more; Use a combination of the techniques given in BAT 6, BAT 26 and techniques (a)-(c) (see table); Reducing PCDD/F emissions to air. The BAT-AEL emission level is ? 0,01-0,03 ng I-TEQ/Nm3 .
status: valid
status modified: 2019-04-23
accepted date: 2019-04-23
in scheme: BATAELValue

Large combustion plants - Pb - BAT15-XIV
type: Concept
notation: LCP-Pb-BAT15-XIV
definition: 1.� Energy industries; 5.� Waste management: 1.1, Combustion of fuels in installations with a total rated thermal input of 50 MW or more, only when this activity takes place in combustion plants with a total rated thermal input of 50 MW or more; 1.4, Gasification of coal or other fuels in installations with a total rated thermal input of 20 MW or more, only when this activity is directly associated to a combustion plant; 5.2, Disposal or recovery of waste in waste co-incineration plants for non-hazardous waste with a capacity exceeding 3 tonnes per hour or for hazardous waste with a capacity exceeding 10 tonnes per day, only when this activity takes place in combustion plants covered under 1.1 above. Reducing lead to water. The BAT-AEL emission level is 10�20 �g/l .
status: valid
status modified: 2019-04-23
accepted date: 2019-04-23
in scheme: BATAELValue

Large combustion plants - S - BAT15-VI
type: Concept
notation: LCP-S-BAT15-VI
definition: 1.� Energy industries; 5.� Waste management: 1.1, Combustion of fuels in installations with a total rated thermal input of 50 MW or more, only when this activity takes place in combustion plants with a total rated thermal input of 50 MW or more; 1.4, Gasification of coal or other fuels in installations with a total rated thermal input of 20 MW or more, only when this activity is directly associated to a combustion plant; 5.2, Disposal or recovery of waste in waste co-incineration plants for non-hazardous waste with a capacity exceeding 3 tonnes per hour or for hazardous waste with a capacity exceeding 10 tonnes per day, only when this activity takes place in combustion plants covered under 1.1 above. Reducing sulphide to water. The BAT-AEL emission level is 0,1�0,2 mg/l.
status: valid
status modified: 2019-04-23
accepted date: 2019-04-23
in scheme: BATAELValue

Large combustion plants - SO2 - BAT21-I
type: Concept
notation: LCP-SO2-BAT21-I
definition: 1. Energy industries: 1.1, Combustion of fuels in installations with a total rated thermal input of 50 MW or more, only when this activity takes place in combustion plants with a total rated thermal input of 50 MW or more; Techniques (a)-(j) (see table) for New plant; Reducing sulphur dioxide (SO2) emissions to air. The BAT-AEL emission level is 150�200 mg/Nm3.
status: valid
status modified: 2019-04-23
accepted date: 2019-04-23
in scheme: BATAELValue

Large combustion plants - SO2 - BAT21-II
type: Concept
notation: LCP-SO2-BAT21-II
definition: 1. Energy industries: 1.1, Combustion of fuels in installations with a total rated thermal input of 50 MW or more, only when this activity takes place in combustion plants with a total rated thermal input of 50 MW or more; Techniques (a)-(j) (see table) for Existing plant; Reducing sulphur dioxide (SO2) emissions to air. The BAT-AEL emission level is 150�360 mg/Nm3 .
status: valid
status modified: 2019-04-23
accepted date: 2019-04-23
in scheme: BATAELValue

Large combustion plants - SO2 - BAT21-III
type: Concept
notation: LCP-SO2-BAT21-III
definition: 1. Energy industries: 1.1, Combustion of fuels in installations with a total rated thermal input of 50 MW or more, only when this activity takes place in combustion plants with a total rated thermal input of 50 MW or more; Techniques (a)-(j) (see table) for New plant; Reducing sulphur dioxide (SO2) emissions to air. The BAT-AEL emission level is 170�220 mg/Nm3 .
status: valid
status modified: 2019-04-23
accepted date: 2019-04-23
in scheme: BATAELValue

Large combustion plants - SO2 - BAT21-IV
type: Concept
notation: LCP-SO2-BAT21-IV
definition: 1. Energy industries: 1.1, Combustion of fuels in installations with a total rated thermal input of 50 MW or more, only when this activity takes place in combustion plants with a total rated thermal input of 50 MW or more; Techniques (a)-(j) (see table) for Existing plant; Reducing sulphur dioxide (SO2) emissions to air. The BAT-AEL emission level is 170�400 mg/Nm3.
status: valid
status modified: 2019-04-23
accepted date: 2019-04-23
in scheme: BATAELValue

Large combustion plants - SO2 - BAT21-IX
type: Concept
notation: LCP-SO2-BAT21-IX
definition: 1. Energy industries: 1.1, Combustion of fuels in installations with a total rated thermal input of 50 MW or more, only when this activity takes place in combustion plants with a total rated thermal input of 50 MW or more; Techniques (a)-(j) (see table) in PC boilers for New plant; Reducing sulphur dioxide (SO2) emissions to air. The BAT-AEL emission level is 10�75 mg/Nm3 .
status: valid
status modified: 2019-04-23
accepted date: 2019-04-23
in scheme: BATAELValue

Large combustion plants - SO2 - BAT21-V
type: Concept
notation: LCP-SO2-BAT21-V
definition: 1. Energy industries: 1.1, Combustion of fuels in installations with a total rated thermal input of 50 MW or more, only when this activity takes place in combustion plants with a total rated thermal input of 50 MW or more; Techniques (a)-(j) (see table) for New plant; Reducing sulphur dioxide (SO2) emissions to air. The BAT-AEL emission level is 80�150 mg/Nm3 .
status: valid
status modified: 2019-04-23
accepted date: 2019-04-23
in scheme: BATAELValue

Large combustion plants - SO2 - BAT21-VI
type: Concept
notation: LCP-SO2-BAT21-VI
definition: 1. Energy industries: 1.1, Combustion of fuels in installations with a total rated thermal input of 50 MW or more, only when this activity takes place in combustion plants with a total rated thermal input of 50 MW or more; Techniques (a)-(j) (see table) for Existing plant; Reducing sulphur dioxide (SO2) emissions to air. The BAT-AEL emission level is 95�200 mg/Nm3 .
status: valid
status modified: 2019-04-23
accepted date: 2019-04-23
in scheme: BATAELValue

Large combustion plants - SO2 - BAT21-VII
type: Concept
notation: LCP-SO2-BAT21-VII
definition: 1. Energy industries: 1.1, Combustion of fuels in installations with a total rated thermal input of 50 MW or more, only when this activity takes place in combustion plants with a total rated thermal input of 50 MW or more; Techniques (a)-(j) (see table) for New plant; Reducing sulphur dioxide (SO2) emissions to air. The BAT-AEL emission level is 135�200 mg/Nm3 .
status: valid
status modified: 2019-04-23
accepted date: 2019-04-23
in scheme: BATAELValue

Large combustion plants - SO2 - BAT21-VIII
type: Concept
notation: LCP-SO2-BAT21-VIII
definition: 1. Energy industries: 1.1, Combustion of fuels in installations with a total rated thermal input of 50 MW or more, only when this activity takes place in combustion plants with a total rated thermal input of 50 MW or more; Techniques (a)-(j) (see table) for Existing plant; Reducing sulphur dioxide (SO2) emissions to air. The BAT-AEL emission level is 135�220 mg/Nm3 .
status: valid
status modified: 2019-04-23
accepted date: 2019-04-23
in scheme: BATAELValue

Large combustion plants - SO2 - BAT21-X
type: Concept
notation: LCP-SO2-BAT21-X
definition: 1. Energy industries: 1.1, Combustion of fuels in installations with a total rated thermal input of 50 MW or more, only when this activity takes place in combustion plants with a total rated thermal input of 50 MW or more; Techniques (a)-(j) (see table) in PC boilers for Existing plant; Reducing sulphur dioxide (SO2) emissions to air. The BAT-AEL emission level is 10�130 mg/Nm3.
status: valid
status modified: 2019-04-23
accepted date: 2019-04-23
in scheme: BATAELValue

Large combustion plants - SO2 - BAT21-XI
type: Concept
notation: LCP-SO2-BAT21-XI
definition: 1. Energy industries: 1.1, Combustion of fuels in installations with a total rated thermal input of 50 MW or more, only when this activity takes place in combustion plants with a total rated thermal input of 50 MW or more; Techniques (a)-(j) (see table) in PC boilers for New plant; Reducing sulphur dioxide (SO2) emissions to air. The BAT-AEL emission level is 25�110 mg/Nm3.
status: valid
status modified: 2019-04-23
accepted date: 2019-04-23
in scheme: BATAELValue

Large combustion plants - SO2 - BAT21-XII
type: Concept
notation: LCP-SO2-BAT21-XII
definition: 1. Energy industries: 1.1, Combustion of fuels in installations with a total rated thermal input of 50 MW or more, only when this activity takes place in combustion plants with a total rated thermal input of 50 MW or more; Techniques (a)-(j) (see table) in PC boilers for Existing plant; Reducing sulphur dioxide (SO2) emissions to air. The BAT-AEL emission level is 25�165 mg/Nm3 .
status: valid
status modified: 2019-04-23
accepted date: 2019-04-23
in scheme: BATAELValue

Large combustion plants - SO2 - BAT21-XIII
type: Concept
notation: LCP-SO2-BAT21-XIII
definition: 1. Energy industries: 1.1, Combustion of fuels in installations with a total rated thermal input of 50 MW or more, only when this activity takes place in combustion plants with a total rated thermal input of 50 MW or more; Techniques (a)-(j) (see table) in fluidised bed boilers for New plant; Reducing sulphur dioxide (SO2) emissions to air. The BAT-AEL emission level is 20�75 mg/Nm3 .
status: valid
status modified: 2019-04-23
accepted date: 2019-04-23
in scheme: BATAELValue

Large combustion plants - SO2 - BAT21-XIV
type: Concept
notation: LCP-SO2-BAT21-XIV
definition: 1. Energy industries: 1.1, Combustion of fuels in installations with a total rated thermal input of 50 MW or more, only when this activity takes place in combustion plants with a total rated thermal input of 50 MW or more; Techniques (a)-(j) (see table) in fluidised bed boilers for Existing plant; Reducing sulphur dioxide (SO2) emissions to air. The BAT-AEL emission level is 20�180 mg/Nm3 .
status: valid
status modified: 2019-04-23
accepted date: 2019-04-23
in scheme: BATAELValue

Large combustion plants - SO2 - BAT21-XV
type: Concept
notation: LCP-SO2-BAT21-XV
definition: 1. Energy industries: 1.1, Combustion of fuels in installations with a total rated thermal input of 50 MW or more, only when this activity takes place in combustion plants with a total rated thermal input of 50 MW or more; Techniques (a)-(j) (see table) in fluidised bed boilers for New plant; Reducing sulphur dioxide (SO2) emissions to air. The BAT-AEL emission level is 25�110 mg/Nm3.
status: valid
status modified: 2019-04-23
accepted date: 2019-04-23
in scheme: BATAELValue

Large combustion plants - SO2 - BAT21-XVI
type: Concept
notation: LCP-SO2-BAT21-XVI
definition: 1. Energy industries: 1.1, Combustion of fuels in installations with a total rated thermal input of 50 MW or more, only when this activity takes place in combustion plants with a total rated thermal input of 50 MW or more; Techniques (a)-(j) (see table) in fluidised bed boilers for Existing plant; Reducing sulphur dioxide (SO2) emissions to air. The BAT-AEL emission level is 50�220 mg/Nm3.
status: valid
status modified: 2019-04-23
accepted date: 2019-04-23
in scheme: BATAELValue

Large combustion plants - SO2 - BAT25-I
type: Concept
notation: LCP-SO2-BAT25-I
definition: 1. Energy industries: 1.1, Combustion of fuels in installations with a total rated thermal input of 50 MW or more, only when this activity takes place in combustion plants with a total rated thermal input of 50 MW or more; Techniques (a)-(h) (see table) for New plant; Reducing sulphur dioxide (SO2) emissions to air. The BAT-AEL emission level is 15�70 mg/Nm3.
status: valid
status modified: 2019-04-23
accepted date: 2019-04-23
in scheme: BATAELValue

Large combustion plants - SO2 - BAT25-II
type: Concept
notation: LCP-SO2-BAT25-II
definition: 1. Energy industries: 1.1, Combustion of fuels in installations with a total rated thermal input of 50 MW or more, only when this activity takes place in combustion plants with a total rated thermal input of 50 MW or more; Techniques (a)-(h) (see table) for Existing plant; Reducing sulphur dioxide (SO2) emissions to air. The BAT-AEL emission level is 15�100 mg/Nm3.
status: valid
status modified: 2019-04-23
accepted date: 2019-04-23
in scheme: BATAELValue

Large combustion plants - SO2 - BAT25-III
type: Concept
notation: LCP-SO2-BAT25-III
definition: 1. Energy industries: 1.1, Combustion of fuels in installations with a total rated thermal input of 50 MW or more, only when this activity takes place in combustion plants with a total rated thermal input of 50 MW or more; Techniques (a)-(h) (see table) for New plant; Reducing sulphur dioxide (SO2) emissions to air. The BAT-AEL emission level is 30�175 mg/Nm3.
status: valid
status modified: 2019-04-23
accepted date: 2019-04-23
in scheme: BATAELValue

Large combustion plants - SO2 - BAT25-IV
type: Concept
notation: LCP-SO2-BAT25-IV
definition: 1. Energy industries: 1.1, Combustion of fuels in installations with a total rated thermal input of 50 MW or more, only when this activity takes place in combustion plants with a total rated thermal input of 50 MW or more; Techniques (a)-(h) (see table) for Existing plant; Reducing sulphur dioxide (SO2) emissions to air. The BAT-AEL emission level is 30�215 mg/Nm3.
status: valid
status modified: 2019-04-23
accepted date: 2019-04-23
in scheme: BATAELValue

Large combustion plants - SO2 - BAT25-IX
type: Concept
notation: LCP-SO2-BAT25-IX
definition: 1. Energy industries: 1.1, Combustion of fuels in installations with a total rated thermal input of 50 MW or more, only when this activity takes place in combustion plants with a total rated thermal input of 50 MW or more; Techniques (a)-(h) (see table) for New plant; Reducing sulphur dioxide (SO2) emissions to air. The BAT-AEL emission level is < 10�35 mg/Nm3.
status: valid
status modified: 2019-04-23
accepted date: 2019-04-23
in scheme: BATAELValue

Large combustion plants - SO2 - BAT25-V
type: Concept
notation: LCP-SO2-BAT25-V
definition: 1. Energy industries: 1.1, Combustion of fuels in installations with a total rated thermal input of 50 MW or more, only when this activity takes place in combustion plants with a total rated thermal input of 50 MW or more; Techniques (a)-(h) (see table) for New plant; Reducing sulphur dioxide (SO2) emissions to air. The BAT-AEL emission level is < 10�50 mg/Nm3.
status: valid
status modified: 2019-04-23
accepted date: 2019-04-23
in scheme: BATAELValue

Large combustion plants - SO2 - BAT25-VI
type: Concept
notation: LCP-SO2-BAT25-VI
definition: 1. Energy industries: 1.1, Combustion of fuels in installations with a total rated thermal input of 50 MW or more, only when this activity takes place in combustion plants with a total rated thermal input of 50 MW or more; Techniques (a)-(h) (see table) for Existing plant; Reducing sulphur dioxide (SO2) emissions to air. The BAT-AEL emission level is < 10�70 mg/Nm3.
status: valid
status modified: 2019-04-23
accepted date: 2019-04-23
in scheme: BATAELValue

Large combustion plants - SO2 - BAT25-VII
type: Concept
notation: LCP-SO2-BAT25-VII
definition: 1. Energy industries: 1.1, Combustion of fuels in installations with a total rated thermal input of 50 MW or more, only when this activity takes place in combustion plants with a total rated thermal input of 50 MW or more; Techniques (a)-(h) (see table) for New plant; Reducing sulphur dioxide (SO2) emissions to air. The BAT-AEL emission level is < 20�85 mg/Nm3.
status: valid
status modified: 2019-04-23
accepted date: 2019-04-23
in scheme: BATAELValue

Large combustion plants - SO2 - BAT25-VIII
type: Concept
notation: LCP-SO2-BAT25-VIII
definition: 1. Energy industries: 1.1, Combustion of fuels in installations with a total rated thermal input of 50 MW or more, only when this activity takes place in combustion plants with a total rated thermal input of 50 MW or more; Techniques (a)-(h) (see table) for Existing plant; Reducing sulphur dioxide (SO2) emissions to air. The BAT-AEL emission level is < 20�175 mg/Nm3.
status: valid
status modified: 2019-04-23
accepted date: 2019-04-23
in scheme: BATAELValue

Large combustion plants - SO2 - BAT25-X
type: Concept
notation: LCP-SO2-BAT25-X
definition: 1. Energy industries: 1.1, Combustion of fuels in installations with a total rated thermal input of 50 MW or more, only when this activity takes place in combustion plants with a total rated thermal input of 50 MW or more; Techniques (a)-(h) (see table) for Existing plant; Reducing sulphur dioxide (SO2) emissions to air. The BAT-AEL emission level is < 10�50 mg/Nm3.
status: valid
status modified: 2019-04-23
accepted date: 2019-04-23
in scheme: BATAELValue

Large combustion plants - SO2 - BAT25-XI
type: Concept
notation: LCP-SO2-BAT25-XI
definition: 1. Energy industries: 1.1, Combustion of fuels in installations with a total rated thermal input of 50 MW or more, only when this activity takes place in combustion plants with a total rated thermal input of 50 MW or more; Techniques (a)-(h) (see table); Reducing sulphur dioxide (SO2) emissions to air. The BAT-AEL emission level is < 20�70 mg/Nm3.
status: valid
status modified: 2019-04-23
accepted date: 2019-04-23
in scheme: BATAELValue

Large combustion plants - SO2 - BAT25-XII
type: Concept
notation: LCP-SO2-BAT25-XII
definition: 1. Energy industries: 1.1, Combustion of fuels in installations with a total rated thermal input of 50 MW or more, only when this activity takes place in combustion plants with a total rated thermal input of 50 MW or more; Techniques (a)-(h) (see table) for Existing plant; Reducing sulphur dioxide (SO2) emissions to air. The BAT-AEL emission level is < 20�85 mg/Nm3.
status: valid
status modified: 2019-04-23
accepted date: 2019-04-23
in scheme: BATAELValue

Large combustion plants - SO2 - BAT29-I
type: Concept
notation: LCP-SO2-BAT29-I
definition: 1. Energy industries: 1.1, Combustion of fuels in installations with a total rated thermal input of 50 MW or more, only when this activity takes place in combustion plants with a total rated thermal input of 50 MW or more; Techniques (a)-(f) (see table) for New plant; Reducing sulphur dioxide (SO2) emissions to air. The BAT-AEL emission level is 50�175 mg/Nm3.
status: valid
status modified: 2019-04-23
accepted date: 2019-04-23
in scheme: BATAELValue

Large combustion plants - SO2 - BAT29-II
type: Concept
notation: LCP-SO2-BAT29-II
definition: 1. Energy industries: 1.1, Combustion of fuels in installations with a total rated thermal input of 50 MW or more, only when this activity takes place in combustion plants with a total rated thermal input of 50 MW or more; Techniques (a)-(f) (see table) for Existing plant; Reducing sulphur dioxide (SO2) emissions to air. The BAT-AEL emission level is 50�175 mg/Nm3.
status: valid
status modified: 2019-04-23
accepted date: 2019-04-23
in scheme: BATAELValue

Large combustion plants - SO2 - BAT29-III
type: Concept
notation: LCP-SO2-BAT29-III
definition: 1. Energy industries: 1.1, Combustion of fuels in installations with a total rated thermal input of 50 MW or more, only when this activity takes place in combustion plants with a total rated thermal input of 50 MW or more; Techniques (a)-(f) (see table) for New plant; Reducing sulphur dioxide (SO2) emissions to air. The BAT-AEL emission level is 150�200 mg/Nm3.
status: valid
status modified: 2019-04-23
accepted date: 2019-04-23
in scheme: BATAELValue

Large combustion plants - SO2 - BAT29-IV
type: Concept
notation: LCP-SO2-BAT29-IV
definition: 1. Energy industries: 1.1, Combustion of fuels in installations with a total rated thermal input of 50 MW or more, only when this activity takes place in combustion plants with a total rated thermal input of 50 MW or more; Techniques (a)-(f) (see table) for Existing plant; Reducing sulphur dioxide (SO2) emissions to air. The BAT-AEL emission level is 150�200 mg/Nm3.
status: valid
status modified: 2019-04-23
accepted date: 2019-04-23
in scheme: BATAELValue

Large combustion plants - SO2 - BAT29-V
type: Concept
notation: LCP-SO2-BAT29-V
definition: 1. Energy industries: 1.1, Combustion of fuels in installations with a total rated thermal input of 50 MW or more, only when this activity takes place in combustion plants with a total rated thermal input of 50 MW or more; Techniques (a)-(f) (see table) for New plant; Reducing sulphur dioxide (SO2) emissions to air. The BAT-AEL emission level is 35�50 mg/Nm3.
status: valid
status modified: 2019-04-23
accepted date: 2019-04-23
in scheme: BATAELValue

Large combustion plants - SO2 - BAT29-VI
type: Concept
notation: LCP-SO2-BAT29-VI
definition: 1. Energy industries: 1.1, Combustion of fuels in installations with a total rated thermal input of 50 MW or more, only when this activity takes place in combustion plants with a total rated thermal input of 50 MW or more; Techniques (a)-(f) (see table) for Existing plant; Reducing sulphur dioxide (SO2) emissions to air. The BAT-AEL emission level is 50�110 mg/Nm3.
status: valid
status modified: 2019-04-23
accepted date: 2019-04-23
in scheme: BATAELValue

Large combustion plants - SO2 - BAT29-VII
type: Concept
notation: LCP-SO2-BAT29-VII
definition: 1. Energy industries: 1.1, Combustion of fuels in installations with a total rated thermal input of 50 MW or more, only when this activity takes place in combustion plants with a total rated thermal input of 50 MW or more; Techniques (a)-(f) (see table) for New plant; Reducing sulphur dioxide (SO2) emissions to air. The BAT-AEL emission level is 50�120 mg/Nm3.
status: valid
status modified: 2019-04-23
accepted date: 2019-04-23
in scheme: BATAELValue

Large combustion plants - SO2 - BAT29-VIII
type: Concept
notation: LCP-SO2-BAT29-VIII
definition: 1. Energy industries: 1.1, Combustion of fuels in installations with a total rated thermal input of 50 MW or more, only when this activity takes place in combustion plants with a total rated thermal input of 50 MW or more; Techniques (a)-(f) (see table) for Existing plant; Reducing sulphur dioxide (SO2) emissions to air. The BAT-AEL emission level is 150�165 mg/Nm3.
status: valid
status modified: 2019-04-23
accepted date: 2019-04-23
in scheme: BATAELValue

Large combustion plants - SO2 - BAT34-I
type: Concept
notation: LCP-SO2-BAT34-I
definition: 1. Energy industries: 1.1, Combustion of fuels in installations with a total rated thermal input of 50 MW or more, only when this activity takes place in combustion plants with a total rated thermal input of 50 MW or more; Techniques (a)-(c) (see table) for New combustion plant (all sizes); Reducing sulphur dioxide (SO2) emissions to air. The BAT-AEL emission level is 45�100 mg/Nm3.
status: valid
status modified: 2019-04-23
accepted date: 2019-04-23
in scheme: BATAELValue

Large combustion plants - SO2 - BAT34-II
type: Concept
notation: LCP-SO2-BAT34-II
definition: 1. Energy industries: 1.1, Combustion of fuels in installations with a total rated thermal input of 50 MW or more, only when this activity takes place in combustion plants with a total rated thermal input of 50 MW or more; Techniques (a)-(c) (see table) for Existing combustion plant (all sizes); Reducing sulphur dioxide (SO2) emissions to air. The BAT-AEL emission level is 100�200 mg/Nm3.
status: valid
status modified: 2019-04-23
accepted date: 2019-04-23
in scheme: BATAELValue

Large combustion plants - SO2 - BAT34-III
type: Concept
notation: LCP-SO2-BAT34-III
definition: 1. Energy industries: 1.1, Combustion of fuels in installations with a total rated thermal input of 50 MW or more, only when this activity takes place in combustion plants with a total rated thermal input of 50 MW or more; Techniques (a)-(c) (see table) for New combustion plant (all sizes); Reducing sulphur dioxide (SO2) emissions to air. The BAT-AEL emission level is 60�110 mg/Nm3.
status: valid
status modified: 2019-04-23
accepted date: 2019-04-23
in scheme: BATAELValue

Large combustion plants - SO2 - BAT34-IV
type: Concept
notation: LCP-SO2-BAT34-IV
definition: 1. Energy industries: 1.1, Combustion of fuels in installations with a total rated thermal input of 50 MW or more, only when this activity takes place in combustion plants with a total rated thermal input of 50 MW or more; Techniques (a)-(c) (see table) for Existing combustion plant (all sizes); Reducing sulphur dioxide (SO2) emissions to air. The BAT-AEL emission level is 105�235 mg/Nm3.
status: valid
status modified: 2019-04-23
accepted date: 2019-04-23
in scheme: BATAELValue

Large combustion plants - SO2 - BAT39-I
type: Concept
notation: LCP-SO2-BAT39-I
definition: 1. Energy industries: 1.1, Combustion of fuels in installations with a total rated thermal input of 50 MW or more, only when this activity takes place in combustion plants with a total rated thermal input of 50 MW or more; Technique (a) (see table) for new and existing plants; Reducing sulphur dioxide (SO2) emissions to air. The BAT-AEL emission level is 35�60 mg/Nm3.
status: valid
status modified: 2019-04-23
accepted date: 2019-04-23
in scheme: BATAELValue

Large combustion plants - SO2 - BAT39-II
type: Concept
notation: LCP-SO2-BAT39-II
definition: 1. Energy industries: 1.1, Combustion of fuels in installations with a total rated thermal input of 50 MW or more, only when this activity takes place in combustion plants with a total rated thermal input of 50 MW or more; Technique (a) (see table) for new and existing plants; Reducing sulphur dioxide (SO2) emissions to air. The BAT-AEL emission level is 50�66 mg/Nm3.
status: valid
status modified: 2019-04-23
accepted date: 2019-04-23
in scheme: BATAELValue

Large combustion plants - SO2 - BAT50-I
type: Concept
notation: LCP-SO2-BAT50-I
definition: 1. Energy industries: 1.1, Combustion of fuels in installations with a total rated thermal input of 50 MW or more, only when this activity takes place in combustion plants with a total rated thermal input of 50 MW or more; Techniques (a)-(b) (see table) in boilers; Reducing sulphur dioxide (SO2) emissions to air. The BAT-AEL emission level is 25�150 mg/Nm3.
status: valid
status modified: 2019-04-23
accepted date: 2019-04-23
in scheme: BATAELValue

Large combustion plants - SO2 - BAT50-II
type: Concept
notation: LCP-SO2-BAT50-II
definition: 1. Energy industries: 1.1, Combustion of fuels in installations with a total rated thermal input of 50 MW or more, only when this activity takes place in combustion plants with a total rated thermal input of 50 MW or more; Techniques (a)-(b) (see table) in boilers; Reducing sulphur dioxide (SO2) emissions to air. The BAT-AEL emission level is 50�200 mg/Nm3.
status: valid
status modified: 2019-04-23
accepted date: 2019-04-23
in scheme: BATAELValue

Large combustion plants - SO2 - BAT50-III
type: Concept
notation: LCP-SO2-BAT50-III
definition: 1. Energy industries: 1.1, Combustion of fuels in installations with a total rated thermal input of 50 MW or more, only when this activity takes place in combustion plants with a total rated thermal input of 50 MW or more; Techniques (a)-(b) (see table) in combined-cycle gas turbines (CCGTs); Reducing sulphur dioxide (SO2) emissions to air. The BAT-AEL emission level is 10�45 mg/Nm3.
status: valid
status modified: 2019-04-23
accepted date: 2019-04-23
in scheme: BATAELValue

Large combustion plants - SO2 - BAT50-IV
type: Concept
notation: LCP-SO2-BAT50-IV
definition: 1. Energy industries: 1.1, Combustion of fuels in installations with a total rated thermal input of 50 MW or more, only when this activity takes place in combustion plants with a total rated thermal input of 50 MW or more; Techniques (a)-(b) (see table) in combined-cycle gas turbines (CCGTs); Reducing sulphur dioxide (SO2) emissions to air. The BAT-AEL emission level is 20�70 mg/Nm3.
status: valid
status modified: 2019-04-23
accepted date: 2019-04-23
in scheme: BATAELValue

Large combustion plants - SO2 - BAT57-I
type: Concept
notation: LCP-SO2-BAT57-I
definition: 1. Energy industries: 1.1, Combustion of fuels in installations with a total rated thermal input of 50 MW or more, only when this activity takes place in combustion plants with a total rated thermal input of 50 MW or more; Techniques (a)-(g) (see table). for New and existing boilers; Reducing sulphur dioxide (SO2) emissions to air. The BAT-AEL emission level is 10�110 mg/Nm3.
status: valid
status modified: 2019-04-23
accepted date: 2019-04-23
in scheme: BATAELValue

Large combustion plants - SO2 - BAT57-II
type: Concept
notation: LCP-SO2-BAT57-II
definition: 1. Energy industries: 1.1, Combustion of fuels in installations with a total rated thermal input of 50 MW or more, only when this activity takes place in combustion plants with a total rated thermal input of 50 MW or more; Techniques (a)-(g) (see table). for New and existing boilers; Reducing sulphur dioxide (SO2) emissions to air. The BAT-AEL emission level is 90�200 mg/Nm3.
status: valid
status modified: 2019-04-23
accepted date: 2019-04-23
in scheme: BATAELValue

Large combustion plants - SO2 - BAT74
type: Concept
notation: LCP-SO2-BAT74
definition: 1. Energy industries: 1.4, Gasification of coal or other fuels in installations with a total rated thermal input of 20 MW or more, only when this activity is directly associated to a combustion plant; Acid gas removal (see table); Reducing sulphur dioxide (SO2) emissions to air. The BAT-AEL emission level is 3�16 mg/Nm3.
status: valid
status modified: 2019-04-23
accepted date: 2019-04-23
in scheme: BATAELValue

Large combustion plants - TVOC - BAT15-XVI
type: Concept
notation: LCP-TVOC-BAT15-XVI
definition: 1. Energy industries: 1.1, Combustion of fuels in installations with a total rated thermal input of 50 MW or more, only when this activity takes place in combustion plants with a total rated thermal input of 50 MW or more; Techniques (a)-(c) (see table); Reducing TVOC emissions to air. The BAT-AEL emission level is 0,6�12 mg/Nm3 .
status: valid
status modified: 2019-04-23
accepted date: 2019-04-23
in scheme: BATAELValue

Large combustion plants - TVOC - BAT71-II
type: Concept
notation: LCP-TVOC-BAT71-II
definition: 1. Energy industries: 1.1, Combustion of fuels in installations with a total rated thermal input of 50 MW or more, only when this activity takes place in combustion plants with a total rated thermal input of 50 MW or more; Use a combination of the techniques given in BAT 6, BAT 26 and techniques (a)-(c) (see table); Reducing TVOC emissions to air. The BAT-AEL emission level is <0,1-5 mg/Nm3.
status: valid
status modified: 2019-04-23
accepted date: 2019-04-23
in scheme: BATAELValue

Large combustion plants - TVOC - BAT71-III
type: Concept
notation: LCP-TVOC-BAT71-III
definition: 1. Energy industries: 1.1, Combustion of fuels in installations with a total rated thermal input of 50 MW or more, only when this activity takes place in combustion plants with a total rated thermal input of 50 MW or more; Use a combination of the techniques given in BAT 6, BAT 26 and techniques (a)-(c) (see table); Reducing TVOC emissions to air. The BAT-AEL emission level is 0,5-10 mg/Nm3.
status: valid
status modified: 2019-04-23
accepted date: 2019-04-23
in scheme: BATAELValue

Large combustion plants - SO3 - BAT15-VII
type: Concept
notation: LCP-SO3-BAT15-VII
definition: 1.� Energy industries; 5.� Waste management: 1.1, Combustion of fuels in installations with a total rated thermal input of 50 MW or more, only when this activity takes place in combustion plants with a total rated thermal input of 50 MW or more; 1.4, Gasification of coal or other fuels in installations with a total rated thermal input of 20 MW or more, only when this activity is directly associated to a combustion plant; 5.2, Disposal or recovery of waste in waste co-incineration plants for non-hazardous waste with a capacity exceeding 3 tonnes per hour or for hazardous waste with a capacity exceeding 10 tonnes per day, only when this activity takes place in combustion plants covered under 1.1 above. Reducing sulphite to water. The BAT-AEL emission level is 1�20 mg/l .
status: valid
status modified: 2019-04-23
accepted date: 2019-04-23
in scheme: BATAELValue

Large combustion plants - SO4 - BAT15-V
type: Concept
notation: LCP-SO4-BAT15-V
definition: 1.� Energy industries; 5.� Waste management: 1.1, Combustion of fuels in installations with a total rated thermal input of 50 MW or more, only when this activity takes place in combustion plants with a total rated thermal input of 50 MW or more; 1.4, Gasification of coal or other fuels in installations with a total rated thermal input of 20 MW or more, only when this activity is directly associated to a combustion plant; 5.2, Disposal or recovery of waste in waste co-incineration plants for non-hazardous waste with a capacity exceeding 3 tonnes per hour or for hazardous waste with a capacity exceeding 10 tonnes per day, only when this activity takes place in combustion plants covered under 1.1 above. Reducing sulphates to water. The BAT-AEL emission level is 1,3�2,0 g/l .
status: valid
status modified: 2019-04-23
accepted date: 2019-04-23
in scheme: BATAELValue

Large combustion plants - TOC - BAT15-I
type: Concept
notation: LCP-TOC-BAT15-I
definition: 1.� Energy industries; 5.� Waste management: 1.1, Combustion of fuels in installations with a total rated thermal input of 50 MW or more, only when this activity takes place in combustion plants with a total rated thermal input of 50 MW or more; 1.4, Gasification of coal or other fuels in installations with a total rated thermal input of 20 MW or more, only when this activity is directly associated to a combustion plant; 5.2, Disposal or recovery of waste in waste co-incineration plants for non-hazardous waste with a capacity exceeding 3 tonnes per hour or for hazardous waste with a capacity exceeding 10 tonnes per day, only when this activity takes place in combustion plants covered under 1.1 above. Reducing total organic carbon (TOC) to water. The BAT-AEL emission level is 20�50 mg/l .
status: valid
status modified: 2019-04-23
accepted date: 2019-04-23
in scheme: BATAELValue

Large combustion plants - TSS - BAT15-III
type: Concept
notation: LCP-TSS-BAT15-III
definition: 1.� Energy industries; 5.� Waste management: 1.1, Combustion of fuels in installations with a total rated thermal input of 50 MW or more, only when this activity takes place in combustion plants with a total rated thermal input of 50 MW or more; 1.4, Gasification of coal or other fuels in installations with a total rated thermal input of 20 MW or more, only when this activity is directly associated to a combustion plant; 5.2, Disposal or recovery of waste in waste co-incineration plants for non-hazardous waste with a capacity exceeding 3 tonnes per hour or for hazardous waste with a capacity exceeding 10 tonnes per day, only when this activity takes place in combustion plants covered under 1.1 above. Reducing total suspended solids to water. The BAT-AEL emission level is 10�30 mg/l .
status: valid
status modified: 2019-04-23
accepted date: 2019-04-23
in scheme: BATAELValue

Large combustion plants - Zn - BAT15-XV
type: Concept
notation: LCP-Zn-BAT15-XV
definition: 1.� Energy industries; 5.� Waste management: 1.1, Combustion of fuels in installations with a total rated thermal input of 50 MW or more, only when this activity takes place in combustion plants with a total rated thermal input of 50 MW or more; 1.4, Gasification of coal or other fuels in installations with a total rated thermal input of 20 MW or more, only when this activity is directly associated to a combustion plant; 5.2, Disposal or recovery of waste in waste co-incineration plants for non-hazardous waste with a capacity exceeding 3 tonnes per hour or for hazardous waste with a capacity exceeding 10 tonnes per day, only when this activity takes place in combustion plants covered under 1.1 above. Reducing zinc to water. The BAT-AEL emission level is 50�200 �g/l .
status: valid
status modified: 2019-04-23
accepted date: 2019-04-23
in scheme: BATAELValue

Production of Large Volume Organic Chemicals - Benzene - BAT57-I
type: Concept
notation: LVOC-Benzene-BAT57-I
definition: 4. Chemical industry: 4.1, Production of organic chemicals, such as: (b) oxygen-containing hydrocarbons such as alcohols, aldehydes, ketones, carboxylic acids, esters and mixtures of esters, acetates, ethers, peroxides and epoxy resins; Techniques (a)-(d) (see table); Reducing benzene emissions to air. The BAT-AEL emission level is < 1 mg/Nm3.
status: valid
status modified: 2019-04-23
accepted date: 2019-04-23
in scheme: BATAELValue

Production of Large Volume Organic Chemicals - Cl2 - BAT66-IV
type: Concept
notation: LVOC-Cl2-BAT66-IV
definition: 4. Chemical industry: 4.1, Production of organic chemicals, such as: (d) nitrogenous hydrocarbons such as amines, amides, nitrous compounds, nitro compounds or nitrate compounds, nitriles, cyanates, isocyanates; Treat combined waste gas streams using a thermal oxidiser followed by caustic scrubbing; Reducing chlorides emissions to air. The BAT-AEL emission level is < 1 mg/Nm3.
status: valid
status modified: 2019-04-23
accepted date: 2019-04-23
in scheme: BATAELValue

Production of Large Volume Organic Chemicals - Cl2 - BAT67-IV
type: Concept
notation: LVOC-Cl2-BAT67-IV
definition: 4. Chemical industry: 4.1, Production of organic chemicals, such as: (d) nitrogenous hydrocarbons such as amines, amides, nitrous compounds, nitro compounds or nitrate compounds, nitriles, cyanates, isocyanates; Treat combined waste gas streams using a thermal oxidiser followed by caustic scrubbing; Reducing chlorides emissions to air. The BAT-AEL emission level is < 1 mg/Nm3.
status: valid
status modified: 2019-04-23
accepted date: 2019-04-23
in scheme: BATAELValue

Production of Large Volume Organic Chemicals - Cl2 - BAT76-III
type: Concept
notation: LVOC-Cl2-BAT76-III
definition: 4. Chemical industry: 4.1, Production of organic chemicals, such as: (f) halogenic hydrocarbons; treat the combined waste gas streams from EDC and/or VCM production by using a thermal oxidiser followed by two-stage wet scrubbing; Reducing chlorides emissions to air. The BAT-AEL emission level is < 1�4 mg/Nm3, at 11 vol-% O2.
status: valid
status modified: 2019-04-23
accepted date: 2019-04-23
in scheme: BATAELValue

Production of Large Volume Organic Chemicals - Cl2 - BAT77-III
type: Concept
notation: LVOC-Cl2-BAT77-III
definition: 4. Chemical industry: 4.1, Production of organic chemicals, such as: (f) halogenic hydrocarbons; treat the combined waste gas streams from EDC and/or VCM production by using a thermal oxidiser followed by two-stage wet scrubbing; Reducing chlorides emissions to air. The BAT-AEL emission level is < 1�4 mg/Nm3, at 11 vol-% O2.
status: valid
status modified: 2019-04-23
accepted date: 2019-04-23
in scheme: BATAELValue

Production of Large Volume Organic Chemicals - Cu - BAT80-I
type: Concept
notation: LVOC-Cu-BAT80-I
definition: 4. Chemical industry: 4.1, Production of organic chemicals, such as: (f) halogenic hydrocarbons Reducing copper to water. The BAT-AEL emission level is 0,04�0,2 g/t EDC produced by oxychlorination .
status: valid
status modified: 2019-04-23
accepted date: 2019-04-23
in scheme: BATAELValue

Production of Large Volume Organic Chemicals - EDC - BAT80-II
type: Concept
notation: LVOC-EDC-BAT80-II
definition: 4. Chemical industry: 4.1, Production of organic chemicals, such as: (f) halogenic hydrocarbons Reducing EDC to water. The BAT-AEL emission level is 0,01�0,05 g/t EDC purified .
status: valid
status modified: 2019-04-23
accepted date: 2019-04-23
in scheme: BATAELValue

Production of Large Volume Organic Chemicals - EDCVCM - BAT76-II
type: Concept
notation: LVOC-EDCVCM-BAT76-II
definition: 4. Chemical industry: 4.1, Production of organic chemicals, such as: (f) halogenic hydrocarbons; treat the combined waste gas streams from EDC and/or VCM production by using a thermal oxidiser followed by two-stage wet scrubbing; Reducing EDC and VCM emissions to air. The BAT-AEL emission level is < 1 mg/Nm3, at 11 vol-% O2.
status: valid
status modified: 2019-04-23
accepted date: 2019-04-23
in scheme: BATAELValue

Production of Large Volume Organic Chemicals - EDCVCM - BAT77-II
type: Concept
notation: LVOC-EDCVCM-BAT77-II
definition: 4. Chemical industry: 4.1, Production of organic chemicals, such as: (f) halogenic hydrocarbons; treat the combined waste gas streams from EDC and/or VCM production by using a thermal oxidiser followed by two-stage wet scrubbing; Reducing EDC and VCM emissions to air. The BAT-AEL emission level is < 1 mg/Nm3, at 11 vol-% O2.
status: valid
status modified: 2019-04-23
accepted date: 2019-04-23
in scheme: BATAELValue

Production of Large Volume Organic Chemicals - Formaldehyde - BAT45-II
type: Concept
notation: LVOC-Formaldehyde-BAT45-II
definition: 4. Chemical industry: 4.1, Production of organic chemicals, such as: (b) oxygen-containing hydrocarbons such as alcohols, aldehydes, ketones, carboxylic acids, esters and mixtures of esters, acetates, ethers, peroxides and epoxy resins; Techniques (a)-(c) (see table); Reducing formaldehyde emissions to air. The BAT-AEL emission level is 2�5 mg/Nm3.
status: valid
status modified: 2019-04-23
accepted date: 2019-04-23
in scheme: BATAELValue

Production of Large Volume Organic Chemicals - HCl - BAT66-V
type: Concept
notation: LVOC-HCl-BAT66-V
definition: 4. Chemical industry: 4.1, Production of organic chemicals, such as: (d) nitrogenous hydrocarbons such as amines, amides, nitrous compounds, nitro compounds or nitrate compounds, nitriles, cyanates, isocyanates; Treat combined waste gas streams using a thermal oxidiser followed by caustic scrubbing; Reducing hydrogen chloride emissions to air. The BAT-AEL emission level is 2�10 mg/Nm3.
status: valid
status modified: 2019-04-23
accepted date: 2019-04-23
in scheme: BATAELValue

Production of Large Volume Organic Chemicals - HCl - BAT67-V
type: Concept
notation: LVOC-HCl-BAT67-V
definition: 4. Chemical industry: 4.1, Production of organic chemicals, such as: (d) nitrogenous hydrocarbons such as amines, amides, nitrous compounds, nitro compounds or nitrate compounds, nitriles, cyanates, isocyanates; Treat combined waste gas streams using a thermal oxidiser followed by caustic scrubbing; Reducing hydrogen chloride emissions to air. The BAT-AEL emission level is 2�10 mg/Nm3.
status: valid
status modified: 2019-04-23
accepted date: 2019-04-23
in scheme: BATAELValue

Production of Large Volume Organic Chemicals - HCl - BAT76-IV
type: Concept
notation: LVOC-HCl-BAT76-IV
definition: 4. Chemical industry: 4.1, Production of organic chemicals, such as: (f) halogenic hydrocarbons; treat the combined waste gas streams from EDC and/or VCM production by using a thermal oxidiser followed by two-stage wet scrubbing; Reducing hydrogen chloride emissions to air. The BAT-AEL emission level is 2�10 mg/Nm3, at 11 vol-% O2.
status: valid
status modified: 2019-04-23
accepted date: 2019-04-23
in scheme: BATAELValue

Production of Large Volume Organic Chemicals - HCl - BAT77-IV
type: Concept
notation: LVOC-HCl-BAT77-IV
definition: 4. Chemical industry: 4.1, Production of organic chemicals, such as: (f) halogenic hydrocarbons; treat the combined waste gas streams from EDC and/or VCM production by using a thermal oxidiser followed by two-stage wet scrubbing; Reducing hydrogen chloride emissions to air. The BAT-AEL emission level is 2�10 mg/Nm3, at 11 vol-% O2.
status: valid
status modified: 2019-04-23
accepted date: 2019-04-23
in scheme: BATAELValue

Production of Large Volume Organic Chemicals - NH3 - BAT4-III
type: Concept
notation: LVOC-NH3-BAT4-III
definition: 4. Chemical industry: 4.1, Production of organic chemicals, such as: (a) simple hydrocarbons (linear or cyclic, saturated or unsaturated, aliphatic or�aromatic); Techniques (a)-(h) (see table) and optimise the design and/or operation of SCR or SNCR; Reducing ammonia (NH3) emissions to air. The BAT-AEL emission level is < 5�15 mg/Nm�, at 3 vol-% O2.
status: valid
status modified: 2019-04-23
accepted date: 2019-04-23
in scheme: BATAELValue

Production of Large Volume Organic Chemicals - NOx - BAT4-I
type: Concept
notation: LVOC-NOx-BAT4-I
definition: 4. Chemical industry: 4.1, Production of organic chemicals, such as: (a) simple hydrocarbons (linear or cyclic, saturated or unsaturated, aliphatic or�aromatic); Techniques (a)-(h) (see table) and optimise the design and/or operation of SCR or SNCR for New furnace; Reducing nitrogen oxides (NOx) emissions to air. The BAT-AEL emission level is 60�100 mg/Nm�, at 3 vol-% O2.
status: valid
status modified: 2019-04-23
accepted date: 2019-04-23
in scheme: BATAELValue

Production of Large Volume Organic Chemicals - NOx - BAT4-II
type: Concept
notation: LVOC-NOx-BAT4-II
definition: 4. Chemical industry: 4.1, Production of organic chemicals, such as: (a) simple hydrocarbons (linear or cyclic, saturated or unsaturated, aliphatic or�aromatic); Techniques (a)-(h) (see table) and optimise the design and/or operation of SCR or SNCR for Existing furnace; Reducing nitrogen oxides (NOx) emissions to air. The BAT-AEL emission level is 70�200 mg/Nm�, at 3 vol-% O2.
status: valid
status modified: 2019-04-23
accepted date: 2019-04-23
in scheme: BATAELValue

Production of Large Volume Organic Chemicals - PCDD.F - BAT66-VI
type: Concept
notation: LVOC-PCDD.F-BAT66-VI
definition: 4. Chemical industry: 4.1, Production of organic chemicals, such as: (d) nitrogenous hydrocarbons such as amines, amides, nitrous compounds, nitro compounds or nitrate compounds, nitriles, cyanates, isocyanates; Treat combined waste gas streams using a thermal oxidiser followed by caustic scrubbing; Reducing PCDD/F emissions to air. The BAT-AEL emission level is 0,025�0,08 ng I-TEQ/Nm3 .
status: valid
status modified: 2019-04-23
accepted date: 2019-04-23
in scheme: BATAELValue

Production of Large Volume Organic Chemicals - PCDD.F - BAT67-VI
type: Concept
notation: LVOC-PCDD.F-BAT67-VI
definition: 4. Chemical industry: 4.1, Production of organic chemicals, such as: (d) nitrogenous hydrocarbons such as amines, amides, nitrous compounds, nitro compounds or nitrate compounds, nitriles, cyanates, isocyanates; Treat combined waste gas streams using a thermal oxidiser followed by caustic scrubbing; Reducing PCDD/F emissions to air. The BAT-AEL emission level is 0,025�0,08 ng I-TEQ/Nm3 .
status: valid
status modified: 2019-04-23
accepted date: 2019-04-23
in scheme: BATAELValue

Production of Large Volume Organic Chemicals - PCDD.F - BAT76-V
type: Concept
notation: LVOC-PCDD.F-BAT76-V
definition: 4. Chemical industry: 4.1, Production of organic chemicals, such as: (f) halogenic hydrocarbons; treat the combined waste gas streams from EDC and/or VCM production by using a thermal oxidiser followed by two-stage wet scrubbing; Reducing PCDD/F emissions to air. The BAT-AEL emission level is 0,025�0,08 ng I-TEQ/Nm3.
status: valid
status modified: 2019-04-23
accepted date: 2019-04-23
in scheme: BATAELValue

Production of Large Volume Organic Chemicals - PCDD.F - BAT77-V
type: Concept
notation: LVOC-PCDD.F-BAT77-V
definition: 4. Chemical industry: 4.1, Production of organic chemicals, such as: (f) halogenic hydrocarbons; treat the combined waste gas streams from EDC and/or VCM production by using a thermal oxidiser followed by two-stage wet scrubbing; Reducing PCDD/F emissions to air. The BAT-AEL emission level is 0,025�0,08 ng I-TEQ/Nm3.
status: valid
status modified: 2019-04-23
accepted date: 2019-04-23
in scheme: BATAELValue

Production of Large Volume Organic Chemicals - PCDD.F - BAT80-III
type: Concept
notation: LVOC-PCDD.F-BAT80-III
definition: 4. Chemical industry: 4.1, Production of organic chemicals, such as: (f) halogenic hydrocarbons Reducing PCDD/F to water. The BAT-AEL emission level is 0,1� 0,3 �g I-TEQ/t EDC produced by oxychlorination .
status: valid
status modified: 2019-04-23
accepted date: 2019-04-23
in scheme: BATAELValue

Production of Large Volume Organic Chemicals - TVOC - BAT45-I
type: Concept
notation: LVOC-TVOC-BAT45-I
definition: 4. Chemical industry: 4.1, Production of organic chemicals, such as: (b) oxygen-containing hydrocarbons such as alcohols, aldehydes, ketones, carboxylic acids, esters and mixtures of esters, acetates, ethers, peroxides and epoxy resins; Techniques (a)-(c) (see table); Reducing TVOC emissions to air. The BAT-AEL emission level is < 5�30 mg/Nm3.
status: valid
status modified: 2019-04-23
accepted date: 2019-04-23
in scheme: BATAELValue

Production of Large Volume Organic Chemicals - TVOC - BAT51
type: Concept
notation: LVOC-TVOC-BAT51
definition: 4. Chemical industry: 4.1, Production of organic chemicals, such as: (b) oxygen-containing hydrocarbons such as alcohols, aldehydes, ketones, carboxylic acids, esters and mixtures of esters, acetates, ethers, peroxides and epoxy resins; Techniques (a)-(c) (see table); Reducing TVOC emissions to air. The BAT-AEL emission level is 1�10 g/t of EO produced .
status: valid
status modified: 2019-04-23
accepted date: 2019-04-23
in scheme: BATAELValue

Production of Large Volume Organic Chemicals - TVOC - BAT57-II
type: Concept
notation: LVOC-TVOC-BAT57-II
definition: 4. Chemical industry: 4.1, Production of organic chemicals, such as: (b) oxygen-containing hydrocarbons such as alcohols, aldehydes, ketones, carboxylic acids, esters and mixtures of esters, acetates, ethers, peroxides and epoxy resins; Techniques (a)-(d) (see table); Reducing TVOC emissions to air. The BAT-AEL emission level is 5�30 mg/Nm3.
status: valid
status modified: 2019-04-23
accepted date: 2019-04-23
in scheme: BATAELValue

Production of Large Volume Organic Chemicals - TVOC - BAT66-I
type: Concept
notation: LVOC-TVOC-BAT66-I
definition: 4. Chemical industry: 4.1, Production of organic chemicals, such as: (d) nitrogenous hydrocarbons such as amines, amides, nitrous compounds, nitro compounds or nitrate compounds, nitriles, cyanates, isocyanates; Treat combined waste gas streams using a thermal oxidiser followed by caustic scrubbing; Reducing TVOC emissions to air. The BAT-AEL emission level is 1�5 mg/Nm3.
status: valid
status modified: 2019-04-23
accepted date: 2019-04-23
in scheme: BATAELValue

Production of Large Volume Organic Chemicals - TVOC - BAT67-I
type: Concept
notation: LVOC-TVOC-BAT67-I
definition: 4. Chemical industry: 4.1, Production of organic chemicals, such as: (d) nitrogenous hydrocarbons such as amines, amides, nitrous compounds, nitro compounds or nitrate compounds, nitriles, cyanates, isocyanates; Treat combined waste gas streams using a thermal oxidiser followed by caustic scrubbing; Reducing TVOC emissions to air. The BAT-AEL emission level is 1�5 mg/Nm3.
status: valid
status modified: 2019-04-23
accepted date: 2019-04-23
in scheme: BATAELValue

Production of Large Volume Organic Chemicals - TVOC - BAT76-I
type: Concept
notation: LVOC-TVOC-BAT76-I
definition: 4. Chemical industry: 4.1, Production of organic chemicals, such as: (f) halogenic hydrocarbons; treat the combined waste gas streams from EDC and/or VCM production by using a thermal oxidiser followed by two-stage wet scrubbing; Reducing TVOC emissions to air. The BAT-AEL emission level is 0,5�5 mg/Nm3, at 11 vol-% O2.
status: valid
status modified: 2019-04-23
accepted date: 2019-04-23
in scheme: BATAELValue

Production of Large Volume Organic Chemicals - TVOC - BAT77-I
type: Concept
notation: LVOC-TVOC-BAT77-I
definition: 4. Chemical industry: 4.1, Production of organic chemicals, such as: (f) halogenic hydrocarbons; treat the combined waste gas streams from EDC and/or VCM production by using a thermal oxidiser followed by two-stage wet scrubbing; Reducing TVOC emissions to air. The BAT-AEL emission level is 0,5�5 mg/Nm3, at 11 vol-% O2.
status: valid
status modified: 2019-04-23
accepted date: 2019-04-23
in scheme: BATAELValue

Production of Large Volume Organic Chemicals - TVOC - BAT86
type: Concept
notation: LVOC-TVOC-BAT86
definition: 4. Chemical industry: 4.2. Production of inorganic chemicals, such as: (e) non-metals, metal oxides or other inorganic compounds such as calcium carbide, silicon, silicon carbide; Techniques (a)-(d) (see table); Reducing TVOC emissions to air. The BAT-AEL emission level is 5�25 mg/Nm3 .
status: valid
status modified: 2019-04-23
accepted date: 2019-04-23
in scheme: BATAELValue

Production of Large Volume Organic Chemicals - Tetrachloromethane - BAT66-II
type: Concept
notation: LVOC-Tetrachloromethane-BAT66-II
definition: 4. Chemical industry: 4.1, Production of organic chemicals, such as: (d) nitrogenous hydrocarbons such as amines, amides, nitrous compounds, nitro compounds or nitrate compounds, nitriles, cyanates, isocyanates; Treat combined waste gas streams using a thermal oxidiser followed by caustic scrubbing; Reducing tertachloromethane emissions to air. The BAT-AEL emission level is ? 0,5 g/t MDI produced .
status: valid
status modified: 2019-04-23
accepted date: 2019-04-23
in scheme: BATAELValue

Production of Large Volume Organic Chemicals - Tetrachloromethane - BAT66-III
type: Concept
notation: LVOC-Tetrachloromethane-BAT66-III
definition: 4. Chemical industry: 4.1, Production of organic chemicals, such as: (d) nitrogenous hydrocarbons such as amines, amides, nitrous compounds, nitro compounds or nitrate compounds, nitriles, cyanates, isocyanates; Treat combined waste gas streams using a thermal oxidiser followed by caustic scrubbing; Reducing tertachloromethane emissions to air. The BAT-AEL emission level is ? 0,7 g/t TDI produced .
status: valid
status modified: 2019-04-23
accepted date: 2019-04-23
in scheme: BATAELValue

Production of Large Volume Organic Chemicals - Tetrachloromethane - BAT67-II
type: Concept
notation: LVOC-Tetrachloromethane-BAT67-II
definition: 4. Chemical industry: 4.1, Production of organic chemicals, such as: (d) nitrogenous hydrocarbons such as amines, amides, nitrous compounds, nitro compounds or nitrate compounds, nitriles, cyanates, isocyanates; Treat combined waste gas streams using a thermal oxidiser followed by caustic scrubbing; Reducing tertachloromethane emissions to air. The BAT-AEL emission level is ? 0,5 g/t MDI produced .
status: valid
status modified: 2019-04-23
accepted date: 2019-04-23
in scheme: BATAELValue

Production of Large Volume Organic Chemicals - Tetrachloromethane - BAT67-III
type: Concept
notation: LVOC-Tetrachloromethane-BAT67-III
definition: 4. Chemical industry: 4.1, Production of organic chemicals, such as: (d) nitrogenous hydrocarbons such as amines, amides, nitrous compounds, nitro compounds or nitrate compounds, nitriles, cyanates, isocyanates; Treat combined waste gas streams using a thermal oxidiser followed by caustic scrubbing; Reducing tertachloromethane emissions to air. The BAT-AEL emission level is ? 0,7 g/t TDI produced .
status: valid
status modified: 2019-04-23
accepted date: 2019-04-23
in scheme: BATAELValue

Non-Ferrous Metals industries - Ag - BAT17-I
type: Concept
notation: NFM-Ag-BAT17-I
definition: 2, Production and processing of metals: 2.5, Processing of non-ferrous metals Reducing mercury to water. The BAT-AEL emission level is ? 0,6 mg/l.
status: valid
status modified: 2019-04-23
accepted date: 2019-04-23
in scheme: BATAELValue

Non-Ferrous Metals industries - As - BAT17-II
type: Concept
notation: NFM-As-BAT17-II
definition: 2, Production and processing of metals: 2.5, Processing of non-ferrous metals Reducing arsenic to water. The BAT-AEL emission level is ? 0,1 mg/l.
status: valid
status modified: 2019-04-23
accepted date: 2019-04-23
in scheme: BATAELValue

Non-Ferrous Metals industries - As - BAT17-III
type: Concept
notation: NFM-As-BAT17-III
definition: 2, Production and processing of metals: 2.5, Processing of non-ferrous metals Reducing arsenic to water. The BAT-AEL emission level is ? 0,3 mg/l.
status: valid
status modified: 2019-04-23
accepted date: 2019-04-23
in scheme: BATAELValue

Non-Ferrous Metals industries - AsH3SbH3 - BAT114-III
type: Concept
notation: NFM-AsH3SbH3-BAT114-III
definition: 2, Production and processing of metals: 2.5: Processing of non-ferrous metals: (a) production of non-ferrous crude metals from ore, concentrates or secondary raw materials by metallurgical, chemical or electrolytic processes; Techniques (a)-(c) (see table incl. footnote); Reducing arsenic and antimony emissions to air. The BAT-AEL emission level is ? 0,5 mg/Nm3.
status: valid
status modified: 2019-04-23
accepted date: 2019-04-23
in scheme: BATAELValue

Non-Ferrous Metals industries - BaP - BAT178-II
type: Concept
notation: NFM-BaP-BAT178-II
definition: 6.� Other activities: 6.8: Production of carbon (hard-burnt coal) or electrographite by means of incineration or graphitisation; Bag filter; Reducing benzo[a]pyrene emissions to air. The BAT-AEL emission level is ? 0,01 mg/Nm3.
status: valid
status modified: 2019-04-23
accepted date: 2019-04-23
in scheme: BATAELValue

Non-Ferrous Metals industries - BaP - BAT179-II
type: Concept
notation: NFM-BaP-BAT179-II
definition: 6.� Other activities: 6.8: Production of carbon (hard-burnt coal) or electrographite by means of incineration or graphitisation; Techniques (a)-(d) (see table incl. footnote); Reducing benzo[a]pyrene emissions to air. The BAT-AEL emission level is 0,001-0,01 mg/Nm3.
status: valid
status modified: 2019-04-23
accepted date: 2019-04-23
in scheme: BATAELValue

Non-Ferrous Metals industries - BaP - BAT180-II
type: Concept
notation: NFM-BaP-BAT180-II
definition: 6.� Other activities: 6.8: Production of carbon (hard-burnt coal) or electrographite by means of incineration or graphitisation; Techniques (a)-(c) (see table incl. footnote); Reducing benzo[a]pyrene emissions to air. The BAT-AEL emission level is 0,005-0,015 mg/Nm3.
status: valid
status modified: 2019-04-23
accepted date: 2019-04-23
in scheme: BATAELValue

Non-Ferrous Metals industries - BaP - BAT181-II
type: Concept
notation: NFM-BaP-BAT181-II
definition: 6.� Other activities: 6.8: Production of carbon (hard-burnt coal) or electrographite by means of incineration or graphitisation; Techniques (a)-(c) (see table incl. footnote); Reducing benzo[a]pyrene emissions to air. The BAT-AEL emission level is 0,001-0,01 mg/Nm3.
status: valid
status modified: 2019-04-23
accepted date: 2019-04-23
in scheme: BATAELValue

Non-Ferrous Metals industries - BaP - BAT59-II
type: Concept
notation: NFM-BaP-BAT59-II
definition: 2, Production and processing of metals: 2.5, Processing of non-ferrous metals: (a) production of non-ferrous crude metals from ore, concentrates or secondary raw materials by metallurgical, chemical or electrolytic processes; Techniques (a)-(c) (see table incl. footnote) in a paste plant (hot pitch storage, paste mixing, cooling and forming); Reducing benzo[a]pyrene emissions to air. The BAT-AEL emission level is 0,001 - 0,01 mg/Nm3.
status: valid
status modified: 2019-04-23
accepted date: 2019-04-23
in scheme: BATAELValue

Non-Ferrous Metals industries - BaP - BAT60-II
type: Concept
notation: NFM-BaP-BAT60-II
definition: 2, Production and processing of metals: 2.5, Processing of non-ferrous metals: (a) production of non-ferrous crude metals from ore, concentrates or secondary raw materials by metallurgical, chemical or electrolytic processes; Techniques (a)-(d) (see table incl. footnote); Reducing benzo[a]pyrene emissions to air. The BAT-AEL emission level is 0,001-0,01 mg/Nm3.
status: valid
status modified: 2019-04-23
accepted date: 2019-04-23
in scheme: BATAELValue

Non-Ferrous Metals industries - BaP - BAT61-II
type: Concept
notation: NFM-BaP-BAT61-II
definition: 2, Production and processing of metals: 2.5, Processing of non-ferrous metals: (a) production of non-ferrous crude metals from ore, concentrates or secondary raw materials by metallurgical, chemical or electrolytic processes; Use a pre-filtration unit and a regenerative thermal oxidiser followed by a dry scrubber (e.g. lime bed); Reducing benzo[a]pyrene emissions to air. The BAT-AEL emission level is 0,001-0,01 mg/Nm3.
status: valid
status modified: 2019-04-23
accepted date: 2019-04-23
in scheme: BATAELValue

Non-Ferrous Metals industries - CO - BAT17-VII
type: Concept
notation: NFM-CO-BAT17-VII
definition: 2, Production and processing of metals: 2.5, Processing of non-ferrous metals Reducing silver to water. The BAT-AEL emission level is ? 0,1 mg/l.
status: valid
status modified: 2019-04-23
accepted date: 2019-04-23
in scheme: BATAELValue

Non-Ferrous Metals industries - CO - BAT17-VIII
type: Concept
notation: NFM-CO-BAT17-VIII
definition: 2, Production and processing of metals: 2.5, Processing of non-ferrous metals Reducing silver to water. The BAT-AEL emission level is 0,1-0,5 mg/l.
status: valid
status modified: 2019-04-23
accepted date: 2019-04-23
in scheme: BATAELValue

Non-Ferrous Metals industries - Cd - BAT132-II
type: Concept
notation: NFM-Cd-BAT132-II
definition: 2, Production and processing of metals: 2.5, Processing of non-ferrous metals: (b) melting, including the alloyage, of non-ferrous metals, including recovered products and operation of non-ferrous metal foundries, with a melting capacity exceeding 4 tonnes per day for lead and cadmium or 20 tonnes per day for all other metals; Techniques (a)-(c) (see table incl. footnote); Reducing cadmium emissions to air. The BAT-AEL emission level is ? 0,1 mg/Nm3.
status: valid
status modified: 2019-04-23
accepted date: 2019-04-23
in scheme: BATAELValue

Non-Ferrous Metals industries - Cd - BAT17-IV
type: Concept
notation: NFM-Cd-BAT17-IV
definition: 2, Production and processing of metals: 2.5, Processing of non-ferrous metals Reducing cadmium to water. The BAT-AEL emission level is 0,02�0,1 mg/l.
status: valid
status modified: 2019-04-23
accepted date: 2019-04-23
in scheme: BATAELValue

Non-Ferrous Metals industries - Cd - BAT17-V
type: Concept
notation: NFM-Cd-BAT17-V
definition: 2, Production and processing of metals: 2.5, Processing of non-ferrous metals Reducing cadmium to water. The BAT-AEL emission level is ? 0,1 mg/l.
status: valid
status modified: 2019-04-23
accepted date: 2019-04-23
in scheme: BATAELValue

Non-Ferrous Metals industries - Cd - BAT17-VI
type: Concept
notation: NFM-Cd-BAT17-VI
definition: 2, Production and processing of metals: 2.5, Processing of non-ferrous metals Reducing cadmium to water. The BAT-AEL emission level is ? 0,05 mg/l.
status: valid
status modified: 2019-04-23
accepted date: 2019-04-23
in scheme: BATAELValue

Non-Ferrous Metals industries - Cl2 - BAT144-II
type: Concept
notation: NFM-Cl2-BAT144-II
definition: 2, Production and processing of metals: 2.5, Processing of non-ferrous metals: (a) production of non-ferrous crude metals from ore, concentrates or secondary raw materials by metallurgical, chemical or electrolytic processes; Alkaline scrubber; Reducing chlorides emissions to air. The BAT-AEL emission level is 0,5-2 mg/Nm3.
status: valid
status modified: 2019-04-23
accepted date: 2019-04-23
in scheme: BATAELValue

Non-Ferrous Metals industries - Cl2 - BAT172-II
type: Concept
notation: NFM-Cl2-BAT172-II
definition: 2, Production and processing of metals: 2.5, Processing of non-ferrous metals: (a) production of non-ferrous crude metals from ore, concentrates or secondary raw materials by metallurgical, chemical or electrolytic processes; Wet scrubber; Reducing chlorides emissions to air. The BAT-AEL emission level is ? 1 mg/Nm3.
status: valid
status modified: 2019-04-23
accepted date: 2019-04-23
in scheme: BATAELValue

Non-Ferrous Metals industries - Cl2 - BAT84-II
type: Concept
notation: NFM-Cl2-BAT84-II
definition: 2, Production and processing of metals: 2.5, Processing of non-ferrous metals: (b) melting, including the alloyage, of non-ferrous metals, including recovered products and operation of non-ferrous metal foundries, with a melting capacity exceeding 4 tonnes per day for lead and cadmium or 20 tonnes per day for all other metals; Techniques (a)-(d) (see table); Reducing chlorides emissions to air. The BAT-AEL emission level is ? 1 mg/Nm3.
status: valid
status modified: 2019-04-23
accepted date: 2019-04-23
in scheme: BATAELValue

Non-Ferrous Metals industries - Cr - BAT17-IX
type: Concept
notation: NFM-Cr-BAT17-IX
definition: 2, Production and processing of metals: 2.5, Processing of non-ferrous metals Reducing cobalt to water. The BAT-AEL emission level is ? 0,2 mg/l.
status: valid
status modified: 2019-04-23
accepted date: 2019-04-23
in scheme: BATAELValue

Non-Ferrous Metals industries - Cr - BAT17-X
type: Concept
notation: NFM-Cr-BAT17-X
definition: 2, Production and processing of metals: 2.5, Processing of non-ferrous metals Reducing chromium to water. The BAT-AEL emission level is ? 0,05 mg/l.
status: valid
status modified: 2019-04-23
accepted date: 2019-04-23
in scheme: BATAELValue

Non-Ferrous Metals industries - Cu - BAT17-XI
type: Concept
notation: NFM-Cu-BAT17-XI
definition: 2, Production and processing of metals: 2.5, Processing of non-ferrous metals Reducing copper to water. The BAT-AEL emission level is 0,05-0,5 mg/l.
status: valid
status modified: 2019-04-23
accepted date: 2019-04-23
in scheme: BATAELValue

Non-Ferrous Metals industries - Cu - BAT17-XII
type: Concept
notation: NFM-Cu-BAT17-XII
definition: 2, Production and processing of metals: 2.5, Processing of non-ferrous metals Reducing copper to water. The BAT-AEL emission level is ? 0,2 mg/l.
status: valid
status modified: 2019-04-23
accepted date: 2019-04-23
in scheme: BATAELValue

Non-Ferrous Metals industries - Cu - BAT17-XIII
type: Concept
notation: NFM-Cu-BAT17-XIII
definition: 2, Production and processing of metals: 2.5, Processing of non-ferrous metals Reducing copper to water. The BAT-AEL emission level is ? 0,1 mg/l.
status: valid
status modified: 2019-04-23
accepted date: 2019-04-23
in scheme: BATAELValue

Non-Ferrous Metals industries - Cu - BAT17-XIV
type: Concept
notation: NFM-Cu-BAT17-XIV
definition: 2, Production and processing of metals: 2.5, Processing of non-ferrous metals Reducing copper to water. The BAT-AEL emission level is ? 0,3 mg/l.
status: valid
status modified: 2019-04-23
accepted date: 2019-04-23
in scheme: BATAELValue

Non-Ferrous Metals industries - Cu - BAT17-XV
type: Concept
notation: NFM-Cu-BAT17-XV
definition: 2, Production and processing of metals: 2.5, Processing of non-ferrous metals Reducing copper to water. The BAT-AEL emission level is ? 0,5 mg/l.
status: valid
status modified: 2019-04-23
accepted date: 2019-04-23
in scheme: BATAELValue

Non-Ferrous Metals industries - Dust - BAT113
type: Concept
notation: NFM-Dust-BAT113
definition: 2, Production and processing of metals: 2.5: Processing of non-ferrous metals; Bag filter; Reducing dust emissions to air. The BAT-AEL emission level is ? 5 mg/Nm3.
status: valid
status modified: 2019-04-23
accepted date: 2019-04-23
in scheme: BATAELValue

Non-Ferrous Metals industries - Dust - BAT119
type: Concept
notation: NFM-Dust-BAT119
definition: 2, Production and processing of metals: 2.5, Processing of non-ferrous metals: (a) production of non-ferrous crude metals from ore, concentrates or secondary raw materials by metallurgical, chemical or electrolytic processes; Bag filter; Reducing dust emissions to air. The BAT-AEL emission level is 2 - 5 mg/Nm3.
status: valid
status modified: 2019-04-23
accepted date: 2019-04-23
in scheme: BATAELValue

Non-Ferrous Metals industries - Dust - BAT121
type: Concept
notation: NFM-Dust-BAT121
definition: 2, Production and processing of metals: 2.5, Processing of non-ferrous metals; Bag filter; Reducing dust emissions to air. The BAT-AEL emission level is ? 5 mg/Nm3.
status: valid
status modified: 2019-04-23
accepted date: 2019-04-23
in scheme: BATAELValue

Non-Ferrous Metals industries - Dust - BAT122
type: Concept
notation: NFM-Dust-BAT122
definition: 2, Production and processing of metals: 2.5, Processing of non-ferrous metals: (b) melting, including the alloyage, of non-ferrous metals, including recovered products and operation of non-ferrous metal foundries, with a melting capacity exceeding 4 tonnes per day for lead and cadmium or 20 tonnes per day for all other metals; Bag filter; Reducing dust emissions to air. The BAT-AEL emission level is 2 - 5 mg/Nm3.
status: valid
status modified: 2019-04-23
accepted date: 2019-04-23
in scheme: BATAELValue

Non-Ferrous Metals industries - Dust - BAT128
type: Concept
notation: NFM-Dust-BAT128
definition: 2, Production and processing of metals: 2.5, Processing of non-ferrous metals: (b) melting, including the alloyage, of non-ferrous metals, including recovered products and operation of non-ferrous metal foundries, with a melting capacity exceeding 4 tonnes per day for lead and cadmium or 20 tonnes per day for all other metals; Bag filter; Reducing dust emissions to air. The BAT-AEL emission level is ? 5 mg/Nm3.
status: valid
status modified: 2019-04-23
accepted date: 2019-04-23
in scheme: BATAELValue

Non-Ferrous Metals industries - Dust - BAT132-I
type: Concept
notation: NFM-Dust-BAT132-I
definition: 2, Production and processing of metals: 2.5, Processing of non-ferrous metals: (b) melting, including the alloyage, of non-ferrous metals, including recovered products and operation of non-ferrous metal foundries, with a melting capacity exceeding 4 tonnes per day for lead and cadmium or 20 tonnes per day for all other metals; Techniques (a)-(c) (see table incl. footnote); Reducing dust emissions to air. The BAT-AEL emission level is 2 - 3 mg/Nm3.
status: valid
status modified: 2019-04-23
accepted date: 2019-04-23
in scheme: BATAELValue

Non-Ferrous Metals industries - Dust - BAT140
type: Concept
notation: NFM-Dust-BAT140
definition: 2, Production and processing of metals: 2.5, Processing of non-ferrous metals: (a) production of non-ferrous crude metals from ore, concentrates or secondary raw materials by metallurgical, chemical or electrolytic processes; Techniques (a)-(b) (see table incl. footnote); Reducing dust emissions to air. The BAT-AEL emission level is 2 - 5 mg/Nm3.
status: valid
status modified: 2019-04-23
accepted date: 2019-04-23
in scheme: BATAELValue

Non-Ferrous Metals industries - Dust - BAT158-I
type: Concept
notation: NFM-Dust-BAT158-I
definition: 2, Production and processing of metals: 2.5, Processing of non-ferrous metals: (a) production of non-ferrous crude metals from ore, concentrates or secondary raw materials by metallurgical, chemical or electrolytic processes; Bag filter; Reducing dust emissions to air. The BAT-AEL emission level is 2 - 5 mg/Nm3.
status: valid
status modified: 2019-04-23
accepted date: 2019-04-23
in scheme: BATAELValue

Non-Ferrous Metals industries - Dust - BAT158-II
type: Concept
notation: NFM-Dust-BAT158-II
definition: 2, Production and processing of metals: 2.5, Processing of non-ferrous metals: (a) production of non-ferrous crude metals from ore, concentrates or secondary raw materials by metallurgical, chemical or electrolytic processes; Bag filter; Reducing dust emissions to air. The BAT-AEL emission level is 2 - 5 mg/Nm3.
status: valid
status modified: 2019-04-23
accepted date: 2019-04-23
in scheme: BATAELValue

Non-Ferrous Metals industries - Dust - BAT158-III
type: Concept
notation: NFM-Dust-BAT158-III
definition: 2, Production and processing of metals: 2.5, Processing of non-ferrous metals: (a) production of non-ferrous crude metals from ore, concentrates or secondary raw materials by metallurgical, chemical or electrolytic processes; Bag filter; Reducing dust emissions to air. The BAT-AEL emission level is 2 - 5 mg/Nm3.
status: valid
status modified: 2019-04-23
accepted date: 2019-04-23
in scheme: BATAELValue

Non-Ferrous Metals industries - Dust - BAT158-IV
type: Concept
notation: NFM-Dust-BAT158-IV
definition: 2, Production and processing of metals: 2.5, Processing of non-ferrous metals: (a) production of non-ferrous crude metals from ore, concentrates or secondary raw materials by metallurgical, chemical or electrolytic processes; Bag filter; Reducing dust emissions to air. The BAT-AEL emission level is 2 - 5 mg/Nm3.
status: valid
status modified: 2019-04-23
accepted date: 2019-04-23
in scheme: BATAELValue

Non-Ferrous Metals industries - Dust - BAT171
type: Concept
notation: NFM-Dust-BAT171
definition: 2, Production and processing of metals: 2.5, Processing of non-ferrous metals: (a) production of non-ferrous crude metals from ore, concentrates or secondary raw materials by metallurgical, chemical or electrolytic processes; Bag filter or a combination of an ESP and a bag filter; Reducing dust emissions to air. The BAT-AEL emission level is 2 - 5 mg/Nm3.
status: valid
status modified: 2019-04-23
accepted date: 2019-04-23
in scheme: BATAELValue

Non-Ferrous Metals industries - Dust - BAT178-I
type: Concept
notation: NFM-Dust-BAT178-I
definition: 6.� Other activities: 6.8: Production of carbon (hard-burnt coal) or electrographite by means of incineration or graphitisation; Bag filter; Reducing dust emissions to air. The BAT-AEL emission level is 2 - 5 mg/Nm3.
status: valid
status modified: 2019-04-23
accepted date: 2019-04-23
in scheme: BATAELValue

Non-Ferrous Metals industries - Dust - BAT179-I
type: Concept
notation: NFM-Dust-BAT179-I
definition: 6.� Other activities: 6.8: Production of carbon (hard-burnt coal) or electrographite by means of incineration or graphitisation; Techniques (a)-(d) (see table incl. footnote); Reducing dust emissions to air. The BAT-AEL emission level is 2 - 10 mg/Nm3.
status: valid
status modified: 2019-04-23
accepted date: 2019-04-23
in scheme: BATAELValue

Non-Ferrous Metals industries - Dust - BAT180-I
type: Concept
notation: NFM-Dust-BAT180-I
definition: 6.� Other activities: 6.8: Production of carbon (hard-burnt coal) or electrographite by means of incineration or graphitisation; Techniques (a)-(c) (see table incl. footnote); Reducing dust emissions to air. The BAT-AEL emission level is 2 - 10 mg/Nm3.
status: valid
status modified: 2019-04-23
accepted date: 2019-04-23
in scheme: BATAELValue

Non-Ferrous Metals industries - Dust - BAT181-I
type: Concept
notation: NFM-Dust-BAT181-I
definition: 6.� Other activities: 6.8: Production of carbon (hard-burnt coal) or electrographite by means of incineration or graphitisation; Techniques (a)-(c) (see table incl. footnote); Reducing dust emissions to air. The BAT-AEL emission level is 2 - 10 mg/Nm3.
status: valid
status modified: 2019-04-23
accepted date: 2019-04-23
in scheme: BATAELValue

Non-Ferrous Metals industries - Dust - BAT37
type: Concept
notation: NFM-Dust-BAT37
definition: 2, Production and processing of metals: 2.5, Processing of non-ferrous metals: (b) melting, including the alloyage, of non-ferrous metals, including recovered products and operation of non-ferrous metal foundries, with a melting capacity exceeding 4 tonnes per day for lead and cadmium or 20 tonnes per day for all other metals; Bag filter for reception, storage, handling, transport, metering, mixing, blending, crushing, drying, cutting and screening of raw materials, and the pyrolytic treatment of copper turnings in primary and secondary copper production; Reducing dust emissions to air. The BAT-AEL emission level is 2 - 5 mg/Nm3.
status: valid
status modified: 2019-04-23
accepted date: 2019-04-23
in scheme: BATAELValue

Non-Ferrous Metals industries - Dust - BAT38
type: Concept
notation: NFM-Dust-BAT38
definition: 2, Production and processing of metals: 2.5, Processing of non-ferrous metals: (b) melting, including the alloyage, of non-ferrous metals, including recovered products and operation of non-ferrous metal foundries, with a melting capacity exceeding 4 tonnes per day for lead and cadmium or 20 tonnes per day for all other metals; Bag filter for concentrate drying in primary copper production; Reducing dust emissions to air. The BAT-AEL emission level is 3 - 5 mg/Nm3.
status: valid
status modified: 2019-04-23
accepted date: 2019-04-23
in scheme: BATAELValue

Non-Ferrous Metals industries - Dust - BAT39
type: Concept
notation: NFM-Dust-BAT39
definition: 2, Production and processing of metals: 2.5, Processing of non-ferrous metals: (b) melting, including the alloyage, of non-ferrous metals, including recovered products and operation of non-ferrous metal foundries, with a melting capacity exceeding 4 tonnes per day for lead and cadmium or 20 tonnes per day for all other metals; Bag filter and/or a wet scrubber for primary copper smelter and converter (emissions other than those that are routed to the sulphuric acid or liquid SO 2 plant or power plant); Reducing dust emissions to air. The BAT-AEL emission level is 2 - 5 mg/Nm3.
status: valid
status modified: 2019-04-23
accepted date: 2019-04-23
in scheme: BATAELValue

Non-Ferrous Metals industries - Dust - BAT40
type: Concept
notation: NFM-Dust-BAT40
definition: 2, Production and processing of metals: 2.5, Processing of non-ferrous metals: (b) melting, including the alloyage, of non-ferrous metals, including recovered products and operation of non-ferrous metal foundries, with a melting capacity exceeding 4 tonnes per day for lead and cadmium or 20 tonnes per day for all other metals; Bag filter for secondary copper smelter and converter and processing of secondary copper intermediates (emissions other than those that are routed to the sulphuric acid plant); Reducing dust emissions to air. The BAT-AEL emission level is 2 - 4 mg/Nm3.
status: valid
status modified: 2019-04-23
accepted date: 2019-04-23
in scheme: BATAELValue

Non-Ferrous Metals industries - Dust - BAT41
type: Concept
notation: NFM-Dust-BAT41
definition: 2, Production and processing of metals: 2.5, Processing of non-ferrous metals: (b) melting, including the alloyage, of non-ferrous metals, including recovered products and operation of non-ferrous metal foundries, with a melting capacity exceeding 4 tonnes per day for lead and cadmium or 20 tonnes per day for all other metals; Bag filter for secondary copper holding furnace; Reducing dust emissions to air. The BAT-AEL emission level is ? 5 mg/Nm3.
status: valid
status modified: 2019-04-23
accepted date: 2019-04-23
in scheme: BATAELValue

Non-Ferrous Metals industries - Dust - BAT42
type: Concept
notation: NFM-Dust-BAT42
definition: 2, Production and processing of metals: 2.5, Processing of non-ferrous metals: (b) melting, including the alloyage, of non-ferrous metals, including recovered products and operation of non-ferrous metal foundries, with a melting capacity exceeding 4 tonnes per day for lead and cadmium or 20 tonnes per day for all other metals; Bag filter or a scrubber in combination with an ESP for copper-rich slag furnace processing; Reducing dust emissions to air. The BAT-AEL emission level is 2 - 5 mg/Nm3.
status: valid
status modified: 2019-04-23
accepted date: 2019-04-23
in scheme: BATAELValue

Non-Ferrous Metals industries - Dust - BAT43
type: Concept
notation: NFM-Dust-BAT43
definition: 2, Production and processing of metals: 2.5, Processing of non-ferrous metals: (b) melting, including the alloyage, of non-ferrous metals, including recovered products and operation of non-ferrous metal foundries, with a melting capacity exceeding 4 tonnes per day for lead and cadmium or 20 tonnes per day for all other metals; Bag filter or a scrubber in combination with an ESP for anode furnace (in primary and secondary copper production); Reducing dust emissions to air. The BAT-AEL emission level is 2 - 5 mg/Nm3.
status: valid
status modified: 2019-04-23
accepted date: 2019-04-23
in scheme: BATAELValue

Non-Ferrous Metals industries - Dust - BAT44
type: Concept
notation: NFM-Dust-BAT44
definition: 2, Production and processing of metals: 2.5, Processing of non-ferrous metals: (b) melting, including the alloyage, of non-ferrous metals, including recovered products and operation of non-ferrous metal foundries, with a melting capacity exceeding 4 tonnes per day for lead and cadmium or 20 tonnes per day for all other metals; Bag filter or, in the case of off-gases with a water content close to the dew point, a wet scrubber or a demister for anode casting (in primary and secondary copper production); Reducing dust emissions to air. The BAT-AEL emission level is ? 5-15 mg/Nm3.
status: valid
status modified: 2019-04-23
accepted date: 2019-04-23
in scheme: BATAELValue

Non-Ferrous Metals industries - Dust - BAT45
type: Concept
notation: NFM-Dust-BAT45
definition: 2, Production and processing of metals: 2.5, Processing of non-ferrous metals: (b) melting, including the alloyage, of non-ferrous metals, including recovered products and operation of non-ferrous metal foundries, with a melting capacity exceeding 4 tonnes per day for lead and cadmium or 20 tonnes per day for all other metals; Bag filter for copper melting furnace; Reducing dust emissions to air. The BAT-AEL emission level is 2 - 5 mg/Nm3.
status: valid
status modified: 2019-04-23
accepted date: 2019-04-23
in scheme: BATAELValue

Non-Ferrous Metals industries - Dust - BAT59-I
type: Concept
notation: NFM-Dust-BAT59-I
definition: 2, Production and processing of metals: 2.5, Processing of non-ferrous metals: (a) production of non-ferrous crude metals from ore, concentrates or secondary raw materials by metallurgical, chemical or electrolytic processes; Techniques (a)-(c) (see table incl. footnote) in a a paste plant (hot pitch storage, paste mixing, cooling and forming, removing coke dust from operations such as coke storage and grindin); Reducing dust emissions to air. The BAT-AEL emission level is 2 - 5 mg/Nm3.
status: valid
status modified: 2019-04-23
accepted date: 2019-04-23
in scheme: BATAELValue

Non-Ferrous Metals industries - Dust - BAT60-I
type: Concept
notation: NFM-Dust-BAT60-I
definition: 2, Production and processing of metals: 2.5, Processing of non-ferrous metals: (a) production of non-ferrous crude metals from ore, concentrates or secondary raw materials by metallurgical, chemical or electrolytic processes; Techniques (a)-(d) (see table incl. footnote); Reducing dust emissions to air. The BAT-AEL emission level is 2 - 5 mg/Nm3.
status: valid
status modified: 2019-04-23
accepted date: 2019-04-23
in scheme: BATAELValue

Non-Ferrous Metals industries - Dust - BAT61-I
type: Concept
notation: NFM-Dust-BAT61-I
definition: 2, Production and processing of metals: 2.5, Processing of non-ferrous metals: (a) production of non-ferrous crude metals from ore, concentrates or secondary raw materials by metallurgical, chemical or electrolytic processes; Use a pre-filtration unit and a regenerative thermal oxidiser followed by a dry scrubber (e.g. lime bed); Reducing dust emissions to air. The BAT-AEL emission level is 2 - 5 mg/Nm3.
status: valid
status modified: 2019-04-23
accepted date: 2019-04-23
in scheme: BATAELValue

Non-Ferrous Metals industries - Dust - BAT64-I
type: Concept
notation: NFM-Dust-BAT64-I
definition: 2, Production and processing of metals: 2.5, Processing of non-ferrous metals: (a) production of non-ferrous crude metals from ore, concentrates or secondary raw materials by metallurgical, chemical or electrolytic processes; See three tables; Reducing dust emissions to air. The BAT-AEL emission level is ? 1,2 kg/t Al.
status: valid
status modified: 2019-04-23
accepted date: 2019-04-23
in scheme: BATAELValue

Non-Ferrous Metals industries - Dust - BAT64-II
type: Concept
notation: NFM-Dust-BAT64-II
definition: 2, Production and processing of metals: 2.5, Processing of non-ferrous metals: (a) production of non-ferrous crude metals from ore, concentrates or secondary raw materials by metallurgical, chemical or electrolytic processes; See three tables; Reducing dust emissions to air. The BAT-AEL emission level is ? 0,6 kg/t Al.
status: valid
status modified: 2019-04-23
accepted date: 2019-04-23
in scheme: BATAELValue

Non-Ferrous Metals industries - Dust - BAT66
type: Concept
notation: NFM-Dust-BAT66
definition: 2, Production and processing of metals: 2.5, Processing of non-ferrous metals: (a) production of non-ferrous crude metals from ore, concentrates or secondary raw materials by metallurgical, chemical or electrolytic processes; Bag filter; Reducing dust emissions to air. The BAT-AEL emission level is ? 5-10 mg/Nm3.
status: valid
status modified: 2019-04-23
accepted date: 2019-04-23
in scheme: BATAELValue

Non-Ferrous Metals industries - Dust - BAT67-I
type: Concept
notation: NFM-Dust-BAT67-I
definition: 2, Production and processing of metals: 2.5, Processing of non-ferrous metals: (a) production of non-ferrous crude metals from ore, concentrates or secondary raw materials by metallurgical, chemical or electrolytic processes; Techniques (a)-(b) (see table incl. footnote); Reducing dust emissions to air. The BAT-AEL emission level is 2 - 5 mg/Nm3.
status: valid
status modified: 2019-04-23
accepted date: 2019-04-23
in scheme: BATAELValue

Non-Ferrous Metals industries - Dust - BAT68
type: Concept
notation: NFM-Dust-BAT68
definition: 2, Production and processing of metals: 2.5, Processing of non-ferrous metals: (a) production of non-ferrous crude metals from ore, concentrates or secondary raw materials by metallurgical, chemical or electrolytic processes; Techniques (a)-(b) (see table incl. footnote); Reducing dust emissions to air. The BAT-AEL emission level is 2 - 25 mg/Nm3.
status: valid
status modified: 2019-04-23
accepted date: 2019-04-23
in scheme: BATAELValue

Non-Ferrous Metals industries - Dust - BAT80
type: Concept
notation: NFM-Dust-BAT80
definition: 2, Production and processing of metals: 2.5, Processing of non-ferrous metals: (a) production of non-ferrous crude metals from ore, concentrates or secondary raw materials by metallurgical, chemical or electrolytic processes; Bag filter; Reducing dust emissions to air. The BAT-AEL emission level is ? 5 mg/Nm3.
status: valid
status modified: 2019-04-23
accepted date: 2019-04-23
in scheme: BATAELValue

Non-Ferrous Metals industries - Dust - BAT81
type: Concept
notation: NFM-Dust-BAT81
definition: 2, Production and processing of metals: 2.5, Processing of non-ferrous metals: (b) melting, including the alloyage, of non-ferrous metals, including recovered products and operation of non-ferrous metal foundries, with a melting capacity exceeding 4 tonnes per day for lead and cadmium or 20 tonnes per day for all other metals; Bag filter; Reducing dust emissions to air. The BAT-AEL emission level is 2 - 5 mg/Nm3.
status: valid
status modified: 2019-04-23
accepted date: 2019-04-23
in scheme: BATAELValue

Non-Ferrous Metals industries - Dust - BAT82
type: Concept
notation: NFM-Dust-BAT82
definition: 2, Production and processing of metals: 2.5, Processing of non-ferrous metals: (b) melting, including the alloyage, of non-ferrous metals, including recovered products and operation of non-ferrous metal foundries, with a melting capacity exceeding 4 tonnes per day for lead and cadmium or 20 tonnes per day for all other metals; Techniques (a)-(c) (see table); Reducing dust emissions to air. The BAT-AEL emission level is 2 - 5 mg/Nm3.
status: valid
status modified: 2019-04-23
accepted date: 2019-04-23
in scheme: BATAELValue

Non-Ferrous Metals industries - Dust - BAT88
type: Concept
notation: NFM-Dust-BAT88
definition: 2, Production and processing of metals: 2.5, Processing of non-ferrous metals; Bag filter; Reducing dust emissions to air. The BAT-AEL emission level is 2 - 5 mg/Nm3.
status: valid
status modified: 2019-04-23
accepted date: 2019-04-23
in scheme: BATAELValue

Non-Ferrous Metals industries - Dust - BAT94
type: Concept
notation: NFM-Dust-BAT94
definition: 2, Production and processing of metals: 2.5, Processing of non-ferrous metals: (a) production of non-ferrous crude metals from ore, concentrates or secondary raw materials by metallurgical, chemical or electrolytic processes; Bag filter; Reducing dust emissions to air. The BAT-AEL emission level is ? 5 mg/Nm3.
status: valid
status modified: 2019-04-23
accepted date: 2019-04-23
in scheme: BATAELValue

Non-Ferrous Metals industries - Dust - BAT95
type: Concept
notation: NFM-Dust-BAT95
definition: 2, Production and processing of metals: 2.5, Processing of non-ferrous metals: (a) production of non-ferrous crude metals from ore, concentrates or secondary raw materials by metallurgical, chemical or electrolytic processes; Bag filter or a wet scrubber; Reducing dust emissions to air. The BAT-AEL emission level is ? 5 mg/Nm3.
status: valid
status modified: 2019-04-23
accepted date: 2019-04-23
in scheme: BATAELValue

Non-Ferrous Metals industries - Dust - BAT96-I
type: Concept
notation: NFM-Dust-BAT96-I
definition: 2, Production and processing of metals: 2.5: Processing of non-ferrous metals; Bag filter; Reducing dust emissions to air. The BAT-AEL emission level is 2 - 4 mg/Nm3.
status: valid
status modified: 2019-04-23
accepted date: 2019-04-23
in scheme: BATAELValue

Non-Ferrous Metals industries - Dust - BAT97-I
type: Concept
notation: NFM-Dust-BAT97-I
definition: 2, Production and processing of metals: 2.5, Processing of non-ferrous metals: (b) melting, including the alloyage, of non-ferrous metals, including recovered products and operation of non-ferrous metal foundries, with a melting capacity exceeding 4 tonnes per day for lead and cadmium or 20 tonnes per day for all other metals; Techniques (a)-(b) (see table); Reducing dust emissions to air. The BAT-AEL emission level is 2 - 4 mg/Nm3.
status: valid
status modified: 2019-04-23
accepted date: 2019-04-23
in scheme: BATAELValue

Non-Ferrous Metals industries - F - BAT60-IV
type: Concept
notation: NFM-F-BAT60-IV
definition: 2, Production and processing of metals: 2.5, Processing of non-ferrous metals: (a) production of non-ferrous crude metals from ore, concentrates or secondary raw materials by metallurgical, chemical or electrolytic processes; Techniques (a)-(d) (see table incl. footnote); Reducing total fluorides emissions to air. The BAT-AEL emission level is ? 0,8 mg/Nm3.
status: valid
status modified: 2019-04-23
accepted date: 2019-04-23
in scheme: BATAELValue

Non-Ferrous Metals industries - F - BAT64-III
type: Concept
notation: NFM-F-BAT64-III
definition: 2, Production and processing of metals: 2.5, Processing of non-ferrous metals: (a) production of non-ferrous crude metals from ore, concentrates or secondary raw materials by metallurgical, chemical or electrolytic processes; See three tables; Reducing total fluorides emissions to air. The BAT-AEL emission level is ? 0,6 kg/t Al.
status: valid
status modified: 2019-04-23
accepted date: 2019-04-23
in scheme: BATAELValue

Non-Ferrous Metals industries - F - BAT64-IV
type: Concept
notation: NFM-F-BAT64-IV
definition: 2, Production and processing of metals: 2.5, Processing of non-ferrous metals: (a) production of non-ferrous crude metals from ore, concentrates or secondary raw materials by metallurgical, chemical or electrolytic processes; See three tables; Reducing total fluorides emissions to air. The BAT-AEL emission level is ? 0,35 kg/t Al.
status: valid
status modified: 2019-04-23
accepted date: 2019-04-23
in scheme: BATAELValue

Non-Ferrous Metals industries - F - BAT67-III
type: Concept
notation: NFM-F-BAT67-III
definition: 2, Production and processing of metals: 2.5, Processing of non-ferrous metals: (a) production of non-ferrous crude metals from ore, concentrates or secondary raw materials by metallurgical, chemical or electrolytic processes; Techniques (a)-(b) (see table incl. footnote); Reducing total fluorides emissions to air. The BAT-AEL emission level is ? 1,5 mg/Nm3.
status: valid
status modified: 2019-04-23
accepted date: 2019-04-23
in scheme: BATAELValue

Non-Ferrous Metals industries - H2S - BAT89-III
type: Concept
notation: NFM-H2S-BAT89-III
definition: 2, Production and processing of metals: 2.5, Processing of non-ferrous metals; Techniques (a)-(c) (see table incl. footnote); Reducing hydrogen sulphide emissions to air. The BAT-AEL emission level is ? 2 mg/Nm3.
status: valid
status modified: 2019-04-23
accepted date: 2019-04-23
in scheme: BATAELValue

Non-Ferrous Metals industries - H2SO4 - BAT114-II
type: Concept
notation: NFM-H2SO4-BAT114-II
definition: 2, Production and processing of metals: 2.5: Processing of non-ferrous metals: (a) production of non-ferrous crude metals from ore, concentrates or secondary raw materials by metallurgical, chemical or electrolytic processes; Techniques (a)-(c) (see table incl. footnote); Reducing sulphuric acid emissions to air. The BAT-AEL emission level is < 10 mg/Nm3.
status: valid
status modified: 2019-04-23
accepted date: 2019-04-23
in scheme: BATAELValue

Non-Ferrous Metals industries - HCl - BAT124-I
type: Concept
notation: NFM-HCl-BAT124-I
definition: 2, Production and processing of metals: 2.5, Processing of non-ferrous metals: (b) melting, including the alloyage, of non-ferrous metals, including recovered products and operation of non-ferrous metal foundries, with a melting capacity exceeding 4 tonnes per day for lead and cadmium or 20 tonnes per day for all other metals; Techniques (a)-(b) (see table incl. footnote); Reducing hydrogen chloride emissions to air. The BAT-AEL emission level is ? 1,5 mg/Nm3.
status: valid
status modified: 2019-04-23
accepted date: 2019-04-23
in scheme: BATAELValue

Non-Ferrous Metals industries - HCl - BAT144-I
type: Concept
notation: NFM-HCl-BAT144-I
definition: 2, Production and processing of metals: 2.5, Processing of non-ferrous metals: (a) production of non-ferrous crude metals from ore, concentrates or secondary raw materials by metallurgical, chemical or electrolytic processes; Alkaline scrubber; Reducing hydrogen chloride emissions to air. The BAT-AEL emission level is ? 5-10 mg/Nm3.
status: valid
status modified: 2019-04-23
accepted date: 2019-04-23
in scheme: BATAELValue

Non-Ferrous Metals industries - HCl - BAT84-I
type: Concept
notation: NFM-HCl-BAT84-I
definition: 2, Production and processing of metals: 2.5, Processing of non-ferrous metals: (b) melting, including the alloyage, of non-ferrous metals, including recovered products and operation of non-ferrous metal foundries, with a melting capacity exceeding 4 tonnes per day for lead and cadmium or 20 tonnes per day for all other metals; Techniques (a)-(d) (see table); Reducing hydrogen chloride emissions to air. The BAT-AEL emission level is ? 5-10 mg/Nm3.
status: valid
status modified: 2019-04-23
accepted date: 2019-04-23
in scheme: BATAELValue

Non-Ferrous Metals industries - HF - BAT124-II
type: Concept
notation: NFM-HF-BAT124-II
definition: 2, Production and processing of metals: 2.5, Processing of non-ferrous metals: (b) melting, including the alloyage, of non-ferrous metals, including recovered products and operation of non-ferrous metal foundries, with a melting capacity exceeding 4 tonnes per day for lead and cadmium or 20 tonnes per day for all other metals; Techniques (a)-(b) (see table incl. footnote); Reducing hydrogen fluoride emissions to air. The BAT-AEL emission level is ? 0,3 mg/Nm3.
status: valid
status modified: 2019-04-23
accepted date: 2019-04-23
in scheme: BATAELValue

Non-Ferrous Metals industries - HF - BAT60-III
type: Concept
notation: NFM-HF-BAT60-III
definition: 2, Production and processing of metals: 2.5, Processing of non-ferrous metals: (a) production of non-ferrous crude metals from ore, concentrates or secondary raw materials by metallurgical, chemical or electrolytic processes; Techniques (a)-(d) (see table incl. footnote); Reducing hydrogen fluoride emissions to air. The BAT-AEL emission level is 0,3-0,5 mg/Nm3.
status: valid
status modified: 2019-04-23
accepted date: 2019-04-23
in scheme: BATAELValue

Non-Ferrous Metals industries - HF - BAT61-III
type: Concept
notation: NFM-HF-BAT61-III
definition: 2, Production and processing of metals: 2.5, Processing of non-ferrous metals: (a) production of non-ferrous crude metals from ore, concentrates or secondary raw materials by metallurgical, chemical or electrolytic processes; Use a pre-filtration unit and a regenerative thermal oxidiser followed by a dry scrubber (e.g. lime bed); Reducing hydrogen fluoride emissions to air. The BAT-AEL emission level is ? 3 mg/Nm3.
status: valid
status modified: 2019-04-23
accepted date: 2019-04-23
in scheme: BATAELValue

Non-Ferrous Metals industries - HF - BAT67-II
type: Concept
notation: NFM-HF-BAT67-II
definition: 2, Production and processing of metals: 2.5, Processing of non-ferrous metals: (a) production of non-ferrous crude metals from ore, concentrates or secondary raw materials by metallurgical, chemical or electrolytic processes; Techniques (a)-(b) (see table incl. footnote); Reducing hydrogen fluoride emissions to air. The BAT-AEL emission level is ? 1,0 mg/Nm3.
status: valid
status modified: 2019-04-23
accepted date: 2019-04-23
in scheme: BATAELValue

Non-Ferrous Metals industries - HF - BAT84-III
type: Concept
notation: NFM-HF-BAT84-III
definition: 2, Production and processing of metals: 2.5, Processing of non-ferrous metals: (b) melting, including the alloyage, of non-ferrous metals, including recovered products and operation of non-ferrous metal foundries, with a melting capacity exceeding 4 tonnes per day for lead and cadmium or 20 tonnes per day for all other metals; Techniques (a)-(d) (see table incl. footnote); Reducing hydrogen fluoride emissions to air. The BAT-AEL emission level is ? 1 mg/Nm3.
status: valid
status modified: 2019-04-23
accepted date: 2019-04-23
in scheme: BATAELValue

Non-Ferrous Metals industries - Hg - BAT11
type: Concept
notation: NFM-Hg-BAT11
definition: 2, Production and processing of metals: 2.1, Metal ore (including sulphide ore) roasting or sintering; 2.5, Processing of non-ferrous metals; Techniques: (a)-(b) (see table); Reducing sulphur dioxide (SO2) emissions to air. The BAT-AEL emission level is 0,01 - 0,05 mg/Nm3.
status: valid
status modified: 2019-04-23
accepted date: 2019-04-23
in scheme: BATAELValue

Non-Ferrous Metals industries - Hg - BAT17-XVI
type: Concept
notation: NFM-Hg-BAT17-XVI
definition: 2, Production and processing of metals: 2.5, Processing of non-ferrous metals Reducing mercury to water. The BAT-AEL emission level is 0,005�0,02 mg/l.
status: valid
status modified: 2019-04-23
accepted date: 2019-04-23
in scheme: BATAELValue

Non-Ferrous Metals industries - Hg - BAT17-XVII
type: Concept
notation: NFM-Hg-BAT17-XVII
definition: 2, Production and processing of metals: 2.5, Processing of non-ferrous metals Reducing mercury to water. The BAT-AEL emission level is ? 0,05 mg/l.
status: valid
status modified: 2019-04-23
accepted date: 2019-04-23
in scheme: BATAELValue

Non-Ferrous Metals industries - NH3 - BAT145
type: Concept
notation: NFM-NH3-BAT145
definition: 2, Production and processing of metals: 2.5, Processing of non-ferrous metals: (a) production of non-ferrous crude metals from ore, concentrates or secondary raw materials by metallurgical, chemical or electrolytic processes; Wet scrubber with sulphuric acid; Reducing ammonia (NH3) emissions to air. The BAT-AEL emission level is 1 - 3 mg/Nm3.
status: valid
status modified: 2019-04-23
accepted date: 2019-04-23
in scheme: BATAELValue

Non-Ferrous Metals industries - NH3 - BAT89-I
type: Concept
notation: NFM-NH3-BAT89-I
definition: 2, Production and processing of metals: 2.5, Processing of non-ferrous metals; Techniques (a)-(c) (see table incl. footnote); Reducing ammonia (NH3) emissions to air. The BAT-AEL emission level is ? 10 mg/Nm3.
status: valid
status modified: 2019-04-23
accepted date: 2019-04-23
in scheme: BATAELValue

Non-Ferrous Metals industries - NOx - BAT141
type: Concept
notation: NFM-NOx-BAT141
definition: 2, Production and processing of metals: 2.5, Processing of non-ferrous metals: (a) production of non-ferrous crude metals from ore, concentrates or secondary raw materials by metallurgical, chemical or electrolytic processes; Techniques (a)-(b) (see table incl. footnote); Reducing nitrogen oxides (NOx) emissions to air. The BAT-AEL emission level is 70 - 150 mg/Nm3.
status: valid
status modified: 2019-04-23
accepted date: 2019-04-23
in scheme: BATAELValue

Non-Ferrous Metals industries - Ni - BAT17-XIX
type: Concept
notation: NFM-Ni-BAT17-XIX
definition: 2, Production and processing of metals: 2.5, Processing of non-ferrous metals Reducing nickel to water. The BAT-AEL emission level is ? 0,1 mg/l.
status: valid
status modified: 2019-04-23
accepted date: 2019-04-23
in scheme: BATAELValue

Non-Ferrous Metals industries - Ni - BAT17-XVIII
type: Concept
notation: NFM-Ni-BAT17-XVIII
definition: 2, Production and processing of metals: 2.5, Processing of non-ferrous metals Reducing nickel to water. The BAT-AEL emission level is ? 0,5 mg/l.
status: valid
status modified: 2019-04-23
accepted date: 2019-04-23
in scheme: BATAELValue

Non-Ferrous Metals industries - Ni - BAT17-XX
type: Concept
notation: NFM-Ni-BAT17-XX
definition: 2, Production and processing of metals: 2.5, Processing of non-ferrous metals Reducing nickel to water. The BAT-AEL emission level is ? 2 mg/l.
status: valid
status modified: 2019-04-23
accepted date: 2019-04-23
in scheme: BATAELValue

Non-Ferrous Metals industries - Ni - BAT172-I
type: Concept
notation: NFM-Ni-BAT172-I
definition: 2, Production and processing of metals: 2.5, Processing of non-ferrous metals: (a) production of non-ferrous crude metals from ore, concentrates or secondary raw materials by metallurgical, chemical or electrolytic processes; Wet scrubber; Reducing nickel emissions to air. The BAT-AEL emission level is ? 1 mg/Nm3.
status: valid
status modified: 2019-04-23
accepted date: 2019-04-23
in scheme: BATAELValue

Non-Ferrous Metals industries - Ni - BAT173
type: Concept
notation: NFM-Ni-BAT173
definition: 2, Production and processing of metals: 2.5, Processing of non-ferrous metals: (a) production of non-ferrous crude metals from ore, concentrates or secondary raw materials by metallurgical, chemical or electrolytic processes; Bag filter; Reducing nickel emissions to air. The BAT-AEL emission level is ? 1 mg/Nm3.
status: valid
status modified: 2019-04-23
accepted date: 2019-04-23
in scheme: BATAELValue

Non-Ferrous Metals industries - PCDD.F - BAT123-II
type: Concept
notation: NFM-PCDD.F-BAT123-II
definition: 2, Production and processing of metals: 2.5, Processing of non-ferrous metals: (b) melting, including the alloyage, of non-ferrous metals, including recovered products and operation of non-ferrous metal foundries, with a melting capacity exceeding 4 tonnes per day for lead and cadmium or 20 tonnes per day for all other metals; Techniques (a)-(c) (see table incl. footnote); Reducing PCDD/F emissions to air. The BAT-AEL emission level is ? 0,1 ng I-TEQ/Nm3 .
status: valid
status modified: 2019-04-23
accepted date: 2019-04-23
in scheme: BATAELValue

Non-Ferrous Metals industries - PCDD.F - BAT146
type: Concept
notation: NFM-PCDD.F-BAT146
definition: 2, Production and processing of metals: 2.5, Processing of non-ferrous metals: (a) production of non-ferrous crude metals from ore, concentrates or secondary raw materials by metallurgical, chemical or electrolytic processes; Techniques (a)-(h) (see table incl. footnote); Reducing PCDD/F emissions to air. The BAT-AEL emission level is ? 0,1 ng I-TEQ/Nm3 .
status: valid
status modified: 2019-04-23
accepted date: 2019-04-23
in scheme: BATAELValue

Non-Ferrous Metals industries - PCDD.F - BAT159
type: Concept
notation: NFM-PCDD.F-BAT159
definition: 2, Production and processing of metals: 2.5, Processing of non-ferrous metals: (a) production of non-ferrous crude metals from ore, concentrates or secondary raw materials by metallurgical, chemical or electrolytic processes; Inject adsorbents and to use an ESP and/or a bag filter; Reducing PCDD/F emissions to air. The BAT-AEL emission level is ? 0,05 ng I-TEQ/Nm3.
status: valid
status modified: 2019-04-23
accepted date: 2019-04-23
in scheme: BATAELValue

Non-Ferrous Metals industries - PCDD.F - BAT48
type: Concept
notation: NFM-PCDD.F-BAT48
definition: 2, Production and processing of metals: 2.5, Processing of non-ferrous metals; Techniques (a)-(j) (see table incl. footnote); Reducing PCDD/F emissions to air. The BAT-AEL emission level is ? 0,1 ng I-TEQ/Nm3 .
status: valid
status modified: 2019-04-23
accepted date: 2019-04-23
in scheme: BATAELValue

Non-Ferrous Metals industries - PCDD.F - BAT83-II
type: Concept
notation: NFM-PCDD.F-BAT83-II
definition: 2, Production and processing of metals: 2.5, Processing of non-ferrous metals: (b) melting, including the alloyage, of non-ferrous metals, including recovered products and operation of non-ferrous metal foundries, with a melting capacity exceeding 4 tonnes per day for lead and cadmium or 20 tonnes per day for all other metals; Techniques (a)-(e) (see table); Reducing PCDD/F emissions to air. The BAT-AEL emission level is ? 0,1 ng I-TEQ/Nm3 .
status: valid
status modified: 2019-04-23
accepted date: 2019-04-23
in scheme: BATAELValue

Non-Ferrous Metals industries - PCDD.F - BAT99
type: Concept
notation: NFM-PCDD.F-BAT99
definition: 2, Production and processing of metals: 2.5, Processing of non-ferrous metals: (b) melting, including the alloyage, of non-ferrous metals, including recovered products and operation of non-ferrous metal foundries, with a melting capacity exceeding 4 tonnes per day for lead and cadmium or 20 tonnes per day for all other metals; Techniques (a)-(j) (see table incl. footnote); Reducing PCDD/F emissions to air. The BAT-AEL emission level is ? 0,1 ng I-TEQ/Nm3 .
status: valid
status modified: 2019-04-23
accepted date: 2019-04-23
in scheme: BATAELValue

Non-Ferrous Metals industries - PH3 - BAT89-II
type: Concept
notation: NFM-PH3-BAT89-II
definition: 2, Production and processing of metals: 2.5, Processing of non-ferrous metals; Techniques (a)-(c) (see table incl. footnote); Reducing phosphene emissions to air. The BAT-AEL emission level is ? 0,5 mg/Nm3.
status: valid
status modified: 2019-04-23
accepted date: 2019-04-23
in scheme: BATAELValue

Non-Ferrous Metals industries - Pb - BAT17-XXI
type: Concept
notation: NFM-Pb-BAT17-XXI
definition: 2, Production and processing of metals: 2.5, Processing of non-ferrous metals Reducing lead to water. The BAT-AEL emission level is ? 0,5 mg/l.
status: valid
status modified: 2019-04-23
accepted date: 2019-04-23
in scheme: BATAELValue

Non-Ferrous Metals industries - Pb - BAT17-XXII
type: Concept
notation: NFM-Pb-BAT17-XXII
definition: 2, Production and processing of metals: 2.5, Processing of non-ferrous metals Reducing lead to water. The BAT-AEL emission level is ? 0,2 mg/l.
status: valid
status modified: 2019-04-23
accepted date: 2019-04-23
in scheme: BATAELValue

Non-Ferrous Metals industries - Pb - BAT96-II
type: Concept
notation: NFM-Pb-BAT96-II
definition: 2, Production and processing of metals: 2.5: Processing of non-ferrous metals; Bag filter; Reducing lead emissions to air. The BAT-AEL emission level is ? 1 mg/Nm3.
status: valid
status modified: 2019-04-23
accepted date: 2019-04-23
in scheme: BATAELValue

Non-Ferrous Metals industries - Pb - BAT97-II
type: Concept
notation: NFM-Pb-BAT97-II
definition: 2, Production and processing of metals: 2.5, Processing of non-ferrous metals: (b) melting, including the alloyage, of non-ferrous metals, including recovered products and operation of non-ferrous metal foundries, with a melting capacity exceeding 4 tonnes per day for lead and cadmium or 20 tonnes per day for all other metals; Techniques (a)-(b) (see table); Reducing lead emissions to air. The BAT-AEL emission level is ? 1 mg/Nm3.
status: valid
status modified: 2019-04-23
accepted date: 2019-04-23
in scheme: BATAELValue

Non-Ferrous Metals industries - SO2 - BAT100
type: Concept
notation: NFM-SO2-BAT100
definition: 2, Production and processing of metals: 2.5, Processing of non-ferrous metals: (b) melting, including the alloyage, of non-ferrous metals, including recovered products and operation of non-ferrous metal foundries, with a melting capacity exceeding 4 tonnes per day for lead and cadmium or 20 tonnes per day for all other metals; Techniques (a)-(d) (see table incl. footnotes); Reducing sulphur dioxide (SO2) emissions to air. The BAT-AEL emission level is 50-350 mg/Nm3.
status: valid
status modified: 2019-04-23
accepted date: 2019-04-23
in scheme: BATAELValue

Non-Ferrous Metals industries - SO2 - BAT120
type: Concept
notation: NFM-SO2-BAT120
definition: 2, Production and processing of metals: 2.5, Processing of non-ferrous metals: (a) production of non-ferrous crude metals from ore, concentrates or secondary raw materials by metallurgical, chemical or electrolytic processes; Wet desulphurisation technique; Reducing sulphur dioxide (SO2) emissions to air. The BAT-AEL emission level is ? 500 mg/Nm3.
status: valid
status modified: 2019-04-23
accepted date: 2019-04-23
in scheme: BATAELValue

Non-Ferrous Metals industries - SO2 - BAT142
type: Concept
notation: NFM-SO2-BAT142
definition: 2, Production and processing of metals: 2.5, Processing of non-ferrous metals: (a) production of non-ferrous crude metals from ore, concentrates or secondary raw materials by metallurgical, chemical or electrolytic processes; Techniques (a)-(b) (see table incl. footnote); Reducing sulphur dioxide (SO2) emissions to air. The BAT-AEL emission level is 50 - 480 mg/Nm3.
status: valid
status modified: 2019-04-23
accepted date: 2019-04-23
in scheme: BATAELValue

Non-Ferrous Metals industries - SO2 - BAT143
type: Concept
notation: NFM-SO2-BAT143
definition: 2, Production and processing of metals: 2.5, Processing of non-ferrous metals: (a) production of non-ferrous crude metals from ore, concentrates or secondary raw materials by metallurgical, chemical or electrolytic processes; Wet scrubber; Reducing sulphur dioxide (SO2) emissions to air. The BAT-AEL emission level is 50 - 100 mg/Nm3.
status: valid
status modified: 2019-04-23
accepted date: 2019-04-23
in scheme: BATAELValue

Non-Ferrous Metals industries - SO2 - BAT49-I
type: Concept
notation: NFM-SO2-BAT49-I
definition: 2, Production and processing of metals: 2.5, Processing of non-ferrous metals: (a) production of non-ferrous crude metals from ore, concentrates or secondary raw materials by metallurgical, chemical or electrolytic processes; Techniques (a)-(c) (see table incl. footnote) in primary copper production; Reducing sulphur dioxide (SO2) emissions to air. The BAT-AEL emission level is 50-500 mg/Nm3.
status: valid
status modified: 2019-04-23
accepted date: 2019-04-23
in scheme: BATAELValue

Non-Ferrous Metals industries - SO2 - BAT49-II
type: Concept
notation: NFM-SO2-BAT49-II
definition: 2, Production and processing of metals: 2.5, Processing of non-ferrous metals: (a) production of non-ferrous crude metals from ore, concentrates or secondary raw materials by metallurgical, chemical or electrolytic processes; Techniques (a)-(c) (see table incl. footnote) in secondary copper production; Reducing sulphur dioxide (SO2) emissions to air. The BAT-AEL emission level is 50-300 mg/Nm3.
status: valid
status modified: 2019-04-23
accepted date: 2019-04-23
in scheme: BATAELValue

Non-Ferrous Metals industries - SO2 - BAT69
type: Concept
notation: NFM-SO2-BAT69
definition: 2, Production and processing of metals: 2.5, Processing of non-ferrous metals: (a) production of non-ferrous crude metals from ore, concentrates or secondary raw materials by metallurgical, chemical or electrolytic processes; Techniques (a)-(b) (see table incl. footnote); Reducing sulphur dioxide (SO2) emissions to air. The BAT-AEL emission level is ? 2,5-15 kg/ t Al.
status: valid
status modified: 2019-04-23
accepted date: 2019-04-23
in scheme: BATAELValue

Non-Ferrous Metals industries - TVOC - BAT123-I
type: Concept
notation: NFM-TVOC-BAT123-I
definition: 2, Production and processing of metals: 2.5, Processing of non-ferrous metals: (b) melting, including the alloyage, of non-ferrous metals, including recovered products and operation of non-ferrous metal foundries, with a melting capacity exceeding 4 tonnes per day for lead and cadmium or 20 tonnes per day for all other metals; Techniques (a)-(c) (see table incl. footnote); Reducing TVOC emissions to air. The BAT-AEL emission level is 2 - 20 mg/Nm3.
status: valid
status modified: 2019-04-23
accepted date: 2019-04-23
in scheme: BATAELValue

Non-Ferrous Metals industries - TVOC - BAT183
type: Concept
notation: NFM-TVOC-BAT183
definition: 6.� Other activities: 6.8: Production of carbon (hard-burnt coal) or electrographite by means of incineration or graphitisation; Techniques (a)-(b) (see table incl. footnote); Reducing TVOC emissions to air. The BAT-AEL emission level is ? 10-40 mg/Nm3.
status: valid
status modified: 2019-04-23
accepted date: 2019-04-23
in scheme: BATAELValue

Non-Ferrous Metals industries - TVOC - BAT46
type: Concept
notation: NFM-TVOC-BAT46
definition: 2, Production and processing of metals: 2.5, Processing of non-ferrous metals; Techniques (a)-(e) (see table incl. footnote); Reducing TVOC emissions to air. The BAT-AEL emission level is 3 - 30 mg/Nm3.
status: valid
status modified: 2019-04-23
accepted date: 2019-04-23
in scheme: BATAELValue

Non-Ferrous Metals industries - TVOC - BAT83-I
type: Concept
notation: NFM-TVOC-BAT83-I
definition: 2, Production and processing of metals: 2.5, Processing of non-ferrous metals: (b) melting, including the alloyage, of non-ferrous metals, including recovered products and operation of non-ferrous metal foundries, with a melting capacity exceeding 4 tonnes per day for lead and cadmium or 20 tonnes per day for all other metals; Techniques (a)-(e) (see table); Reducing TVOC emissions to air. The BAT-AEL emission level is ? 10-30 mg/Nm3.
status: valid
status modified: 2019-04-23
accepted date: 2019-04-23
in scheme: BATAELValue

Non-Ferrous Metals industries - TVOC - BAT98
type: Concept
notation: NFM-TVOC-BAT98
definition: 2, Production and processing of metals: 2.5, Processing of non-ferrous metals: (b) melting, including the alloyage, of non-ferrous metals, including recovered products and operation of non-ferrous metal foundries, with a melting capacity exceeding 4 tonnes per day for lead and cadmium or 20 tonnes per day for all other metals; Techniques (a)-(c) (see table incl. footnotes); Reducing TVOC emissions to air. The BAT-AEL emission level is 10 - 40 mg/Nm3.
status: valid
status modified: 2019-04-23
accepted date: 2019-04-23
in scheme: BATAELValue

Non-Ferrous Metals industries - Zn - BAT114-I
type: Concept
notation: NFM-Zn-BAT114-I
definition: 2, Production and processing of metals: 2.5: Processing of non-ferrous metals: (a) production of non-ferrous crude metals from ore, concentrates or secondary raw materials by metallurgical, chemical or electrolytic processes; Techniques (a)-(c) (see table incl. footnote); Reducing zinc emissions to air. The BAT-AEL emission level is ? 1 mg/Nm3.
status: valid
status modified: 2019-04-23
accepted date: 2019-04-23
in scheme: BATAELValue

Non-Ferrous Metals industries - Zn - BAT17-XXIII
type: Concept
notation: NFM-Zn-BAT17-XXIII
definition: 2, Production and processing of metals: 2.5, Processing of non-ferrous metals Reducing zinc to water. The BAT-AEL emission level is ? 1 mg/l.
status: valid
status modified: 2019-04-23
accepted date: 2019-04-23
in scheme: BATAELValue

Non-Ferrous Metals industries - Zn - BAT17-XXIV
type: Concept
notation: NFM-Zn-BAT17-XXIV
definition: 2, Production and processing of metals: 2.5, Processing of non-ferrous metals Reducing zinc to water. The BAT-AEL emission level is ? 0,4 mg/l.
status: valid
status modified: 2019-04-23
accepted date: 2019-04-23
in scheme: BATAELValue

Production of pulp, paper and board - AOX - BAT19-VI
type: Concept
notation: PP-AOX-BAT19-VI
definition: 6. Other activities: 6.1 Production in industrial installations of: (a) pulp from timber or other fibrous materials; (b) paper or card board; Reducing adsorbable organically bound halogens (AOX) to water. The BAT-AEL emission level is 0 - 0,2 kg/ADt.
status: valid
status modified: 2019-04-23
accepted date: 2019-04-23
in scheme: BATAELValue

Production of pulp, paper and board - AOX - BAT33-IX
type: Concept
notation: PP-AOX-BAT33-IX
definition: 6. Other activities: 6.1 Production in industrial installations of: (a) pulp from timber or other fibrous materials; (b) paper or card board; Reducing Adsorbable Organically Bound Halogens (AOX) to water. The BAT-AEL emission level is 0,5 � 1,5 mg/l.
status: valid
status modified: 2019-04-23
accepted date: 2019-04-23
in scheme: BATAELValue

Production of pulp, paper and board - AOX - BAT45-V
type: Concept
notation: PP-AOX-BAT45-V
definition: 6. Other activities: 6.1 Production in industrial installations of: (a) pulp from timber or other fibrous materials; (b) paper or card board; Reducing adsorbable organically bound halogens (AOX) to water. The BAT-AEL emission level is < 0,05 kg/t.
status: valid
status modified: 2019-04-23
accepted date: 2019-04-23
in scheme: BATAELValue

Production of pulp, paper and board - AOX - BAT45-XIV
type: Concept
notation: PP-AOX-BAT45-XIV
definition: 6. Other activities: 6.1 Production in industrial installations of: (a) pulp from timber or other fibrous materials; (b) paper or card board; Reducing adsorbable organically bound halogens (AOX) to water. The BAT-AEL emission level is < 0,05 kg/t.
status: valid
status modified: 2019-04-23
accepted date: 2019-04-23
in scheme: BATAELValue

Production of pulp, paper and board - AOX - BAT50-VI
type: Concept
notation: PP-AOX-BAT50-VI
definition: 6. Other activities: 6.1 Production in industrial installations of: (a) pulp from timber or other fibrous materials; (b) paper or card board; Reducing Adsorbable Organically Bound Halogens (AOX) to water. The BAT-AEL emission level is 0,05 kg/t.
status: valid
status modified: 2019-04-23
accepted date: 2019-04-23
in scheme: BATAELValue

Production of pulp, paper and board - AOX - BAT50-XI
type: Concept
notation: PP-AOX-BAT50-XI
definition: 6. Other activities: 6.1 Production in industrial installations of: (a) pulp from timber or other fibrous materials; (b) paper or card board; Reducing Adsorbable Organically Bound Halogens (AOX) to water. The BAT-AEL emission level is 0,05 kg/t .
status: valid
status modified: 2019-04-23
accepted date: 2019-04-23
in scheme: BATAELValue

Production of pulp, paper and board - COD - BAT19-I
type: Concept
notation: PP-COD-BAT19-I
definition: 6. Other activities: 6.1 Production in industrial installations of: (a) pulp from timber or other fibrous materials; (b) paper or card board; Reducing chemical oxygen demand (COD) to water. The BAT-AEL emission level is 7 - 20 kg/ADt.
status: valid
status modified: 2019-04-23
accepted date: 2019-04-23
in scheme: BATAELValue

Production of pulp, paper and board - COD - BAT19-VII
type: Concept
notation: PP-COD-BAT19-VII
definition: 6. Other activities: 6.1 Production in industrial installations of: (a) pulp from timber or other fibrous materials; (b) paper or card board; Reducing chemical oxygen demand (COD) to water. The BAT-AEL emission level is 2,5 - 8 kg/ADt.
status: valid
status modified: 2019-04-23
accepted date: 2019-04-23
in scheme: BATAELValue

Production of pulp, paper and board - COD - BAT33-I
type: Concept
notation: PP-COD-BAT33-I
definition: 6. Other activities: 6.1 Production in industrial installations of: (a) pulp from timber or other fibrous materials; (b) paper or card board; Reducing chemical oxygen demand (COD) to water. The BAT-AEL emission level is 10 � 30 kg/ADt.
status: valid
status modified: 2019-04-23
accepted date: 2019-04-23
in scheme: BATAELValue

Production of pulp, paper and board - COD - BAT33-II
type: Concept
notation: PP-COD-BAT33-II
definition: 6. Other activities: 6.1 Production in industrial installations of: (a) pulp from timber or other fibrous materials; (b) paper or card board; Reducing chemical oxygen demand (COD) to water. The BAT-AEL emission level is 20 � 35 kg/ADt.
status: valid
status modified: 2019-04-23
accepted date: 2019-04-23
in scheme: BATAELValue

Production of pulp, paper and board - COD - BAT33-X
type: Concept
notation: PP-COD-BAT33-X
definition: 6. Other activities: 6.1 Production in industrial installations of: (a) pulp from timber or other fibrous materials; (b) paper or card board; Reducing chemical oxygen demand (COD) to water. The BAT-AEL emission level is 3,2 � 11 kg/ADt.
status: valid
status modified: 2019-04-23
accepted date: 2019-04-23
in scheme: BATAELValue

Production of pulp, paper and board - COD - BAT40-I
type: Concept
notation: PP-COD-BAT40-I
definition: 6. Other activities: 6.1 Production in industrial installations of: (a) pulp from timber or other fibrous materials; (b) paper or card board; Reducing chemical oxygen demand (COD) to water. The BAT-AEL emission level is 0,9 � 4,5 kg/t.
status: valid
status modified: 2019-04-23
accepted date: 2019-04-23
in scheme: BATAELValue

Production of pulp, paper and board - COD - BAT40-V
type: Concept
notation: PP-COD-BAT40-V
definition: 6. Other activities: 6.1 Production in industrial installations of: (a) pulp from timber or other fibrous materials; (b) paper or card board; Reducing chemical oxygen demand (COD) to water. The BAT-AEL emission level is 12 � 20 kg/ADt.
status: valid
status modified: 2019-04-23
accepted date: 2019-04-23
in scheme: BATAELValue

Production of pulp, paper and board - COD - BAT45-I
type: Concept
notation: PP-COD-BAT45-I
definition: 6. Other activities: 6.1 Production in industrial installations of: (a) pulp from timber or other fibrous materials; (b) paper or card board; Reducing chemical oxygen demand (COD) to water. The BAT-AEL emission level is 0,4 - 1,4 kg/t.
status: valid
status modified: 2019-04-23
accepted date: 2019-04-23
in scheme: BATAELValue

Production of pulp, paper and board - COD - BAT45-VI
type: Concept
notation: PP-COD-BAT45-VI
definition: 6. Other activities: 6.1 Production in industrial installations of: (a) pulp from timber or other fibrous materials; (b) paper or card board; Reducing chemical oxygen demand (COD) to water. The BAT-AEL emission level is 0,9 - 3 kg/t.
status: valid
status modified: 2019-04-23
accepted date: 2019-04-23
in scheme: BATAELValue

Production of pulp, paper and board - COD - BAT45-VII
type: Concept
notation: PP-COD-BAT45-VII
definition: 6. Other activities: 6.1 Production in industrial installations of: (a) pulp from timber or other fibrous materials; (b) paper or card board; Reducing chemical oxygen demand (COD) to water. The BAT-AEL emission level is 0,9 - 4 kg/t.
status: valid
status modified: 2019-04-23
accepted date: 2019-04-23
in scheme: BATAELValue

Production of pulp, paper and board - COD - BAT50-I
type: Concept
notation: PP-COD-BAT50-I
definition: 6. Other activities: 6.1 Production in industrial installations of: (a) pulp from timber or other fibrous materials; (b) paper or card board; Reducing chemical oxygen demand (COD) to water. The BAT-AEL emission level is 0,15 � 1,5 kg/t.
status: valid
status modified: 2019-04-23
accepted date: 2019-04-23
in scheme: BATAELValue

Production of pulp, paper and board - COD - BAT50-VII
type: Concept
notation: PP-COD-BAT50-VII
definition: 6. Other activities: 6.1 Production in industrial installations of: (a) pulp from timber or other fibrous materials; (b) paper or card board; Reducing chemical oxygen demand (COD) to water. The BAT-AEL emission level is 0,3 � 5 kg/t .
status: valid
status modified: 2019-04-23
accepted date: 2019-04-23
in scheme: BATAELValue

Production of pulp, paper and board - Dust - BAT23-I
type: Concept
notation: PP-Dust-BAT23-I
definition: 6. Other activities: 6.1 Production in industrial installations of: (a) pulp from timber or other fibrous materials; (b) paper or card board; Use an electrostatic precipitator (ESP) or a combination of ESP and wet scrubber: see description (Section 1.7.1.1) for New or major refurbishment; Reducing dust emissions to air. The BAT-AEL emission level is 10 � 25 mg/Nm3 at 6 % O2 .
status: valid
status modified: 2019-04-23
accepted date: 2019-04-23
in scheme: BATAELValue

Production of pulp, paper and board - Dust - BAT23-II
type: Concept
notation: PP-Dust-BAT23-II
definition: 6. Other activities: 6.1 Production in industrial installations of: (a) pulp from timber or other fibrous materials; (b) paper or card board; Use an electrostatic precipitator (ESP) or a combination of ESP and wet scrubber: see description (Section 1.7.1.1) for Existing; Reducing dust emissions to air. The BAT-AEL emission level is 0,02 � 0,20 kg dust/ADt.
status: valid
status modified: 2019-04-23
accepted date: 2019-04-23
in scheme: BATAELValue

Production of pulp, paper and board - Dust - BAT23-III
type: Concept
notation: PP-Dust-BAT23-III
definition: 6. Other activities: 6.1 Production in industrial installations of: (a) pulp from timber or other fibrous materials; (b) paper or card board; Use an electrostatic precipitator (ESP) or a combination of ESP and wet scrubber: see description (Section 1.7.1.1) for New or major refurbishment; Reducing dust emissions to air. The BAT-AEL emission level is 10 � 40 mg/Nm3 at 6 % O2 .
status: valid
status modified: 2019-04-23
accepted date: 2019-04-23
in scheme: BATAELValue

Production of pulp, paper and board - Dust - BAT23-IV
type: Concept
notation: PP-Dust-BAT23-IV
definition: 6. Other activities: 6.1 Production in industrial installations of: (a) pulp from timber or other fibrous materials; (b) paper or card board; Use an electrostatic precipitator (ESP) or a combination of ESP and wet scrubber: see description (Section 1.7.1.1) for Existing; Reducing dust emissions to air. The BAT-AEL emission level is 0,02 � 0,3 kg dust/ADt.
status: valid
status modified: 2019-04-23
accepted date: 2019-04-23
in scheme: BATAELValue

Production of pulp, paper and board - Dust - BAT27-I
type: Concept
notation: PP-Dust-BAT27-I
definition: 6. Other activities: 6.1 Production in industrial installations of: (a) pulp from timber or other fibrous materials; (b) paper or card board; Use an electrostatic precipitator (ESP) or a combination of ESP and wet scrubber: see description (Section 1.7.1.1.) for New or major refurbishments; Reducing dust emissions to air. The BAT-AEL emission level is 10 � 25 mg/Nm3 at 6 % O2.
status: valid
status modified: 2019-04-23
accepted date: 2019-04-23
in scheme: BATAELValue

Production of pulp, paper and board - Dust - BAT27-II
type: Concept
notation: PP-Dust-BAT27-II
definition: 6. Other activities: 6.1 Production in industrial installations of: (a) pulp from timber or other fibrous materials; (b) paper or card board; Use an electrostatic precipitator (ESP) or a combination of ESP and wet scrubber: see description (Section 1.7.1.1.) for New or major refurbishments; Reducing dust emissions to air. The BAT-AEL emission level is 0,005 � 0,02 kg dust/ADt .
status: valid
status modified: 2019-04-23
accepted date: 2019-04-23
in scheme: BATAELValue

Production of pulp, paper and board - Dust - BAT27-III
type: Concept
notation: PP-Dust-BAT27-III
definition: 6. Other activities: 6.1 Production in industrial installations of: (a) pulp from timber or other fibrous materials; (b) paper or card board; Use an electrostatic precipitator (ESP) or a combination of ESP and wet scrubber: see description (Section 1.7.1.1.) for Existing; Reducing dust emissions to air. The BAT-AEL emission level is 10 � 30 mg/Nm3 at 6 % O2.
status: valid
status modified: 2019-04-23
accepted date: 2019-04-23
in scheme: BATAELValue

Production of pulp, paper and board - Dust - BAT27-IV
type: Concept
notation: PP-Dust-BAT27-IV
definition: 6. Other activities: 6.1 Production in industrial installations of: (a) pulp from timber or other fibrous materials; (b) paper or card board; Use an electrostatic precipitator (ESP) or a combination of ESP and wet scrubber: see description (Section 1.7.1.1.) for Existing; Reducing dust emissions to air. The BAT-AEL emission level is 0,005 � 0,03 kg dust/ADt .
status: valid
status modified: 2019-04-23
accepted date: 2019-04-23
in scheme: BATAELValue

Production of pulp, paper and board - Dust - BAT37-I
type: Concept
notation: PP-Dust-BAT37-I
definition: 6. Other activities: 6.1 Production in industrial installations of: (a) pulp from timber or other fibrous materials; (b) paper or card board; Techniques (a)-(b) (see table) and limit �acid operation� of the scrubbers to the minimum required to ensure their proper functioning; Reducing dust emissions to air. The BAT-AEL emission level is 5 � 20 mg/Nm3 at 5 % O2.
status: valid
status modified: 2019-04-23
accepted date: 2019-04-23
in scheme: BATAELValue

Production of pulp, paper and board - N - BAT33-V
type: Concept
notation: PP-N-BAT33-V
definition: 6. Other activities: 6.1 Production in industrial installations of: (a) pulp from timber or other fibrous materials; (b) paper or card board; Reducing total nitrogen to water. The BAT-AEL emission level is 0,15 � 0,3 kg/ADt.
status: valid
status modified: 2019-04-23
accepted date: 2019-04-23
in scheme: BATAELValue

Production of pulp, paper and board - N - BAT33-VI
type: Concept
notation: PP-N-BAT33-VI
definition: 6. Other activities: 6.1 Production in industrial installations of: (a) pulp from timber or other fibrous materials; (b) paper or card board; Reducing total nitrogen to water. The BAT-AEL emission level is 0,1 � 0,25 kg/ADt.
status: valid
status modified: 2019-04-23
accepted date: 2019-04-23
in scheme: BATAELValue

Production of pulp, paper and board - N - BAT33-XII
type: Concept
notation: PP-N-BAT33-XII
definition: 6. Other activities: 6.1 Production in industrial installations of: (a) pulp from timber or other fibrous materials; (b) paper or card board; Reducing total nitrogen to water. The BAT-AEL emission level is 0,1 � 0,2 kg/ADt.
status: valid
status modified: 2019-04-23
accepted date: 2019-04-23
in scheme: BATAELValue

Production of pulp, paper and board - N - BAT40-III
type: Concept
notation: PP-N-BAT40-III
definition: 6. Other activities: 6.1 Production in industrial installations of: (a) pulp from timber or other fibrous materials; (b) paper or card board; Reducing total nitrogen to water. The BAT-AEL emission level is 0,03 � 0,1 kg/t.
status: valid
status modified: 2019-04-23
accepted date: 2019-04-23
in scheme: BATAELValue

Production of pulp, paper and board - N - BAT40-VII
type: Concept
notation: PP-N-BAT40-VII
definition: 6. Other activities: 6.1 Production in industrial installations of: (a) pulp from timber or other fibrous materials; (b) paper or card board; Reducing total nitrogen to water. The BAT-AEL emission level is 0,15 � 0,18 kg/ADt.
status: valid
status modified: 2019-04-23
accepted date: 2019-04-23
in scheme: BATAELValue

Production of pulp, paper and board - N - BAT50-III
type: Concept
notation: PP-N-BAT50-III
definition: 6. Other activities: 6.1 Production in industrial installations of: (a) pulp from timber or other fibrous materials; (b) paper or card board; Reducing total nitrogen to water. The BAT-AEL emission level is 0,01 � 0,1 kg/t.
status: valid
status modified: 2019-04-23
accepted date: 2019-04-23
in scheme: BATAELValue

Production of pulp, paper and board - N - BAT50-IV
type: Concept
notation: PP-N-BAT50-IV
definition: 6. Other activities: 6.1 Production in industrial installations of: (a) pulp from timber or other fibrous materials; (b) paper or card board; Reducing total nitrogen to water. The BAT-AEL emission level is 0,01 � 0,15 kg/t.
status: valid
status modified: 2019-04-23
accepted date: 2019-04-23
in scheme: BATAELValue

Production of pulp, paper and board - N - BAT50-IX
type: Concept
notation: PP-N-BAT50-IX
definition: 6. Other activities: 6.1 Production in industrial installations of: (a) pulp from timber or other fibrous materials; (b) paper or card board; Reducing total nitrogen to water. The BAT-AEL emission level is 0,015 � 0,4 kg/t .
status: valid
status modified: 2019-04-23
accepted date: 2019-04-23
in scheme: BATAELValue

Production of pulp, paper and board - NH3 - BAT36-III
type: Concept
notation: PP-NH3-BAT36-III
definition: 6. Other activities: 6.1 Production in industrial installations of: (a) pulp from timber or other fibrous materials; (b) paper or card board; Techniques (a)-(c) (see table); Reducing ammonia (NH3) emissions to air. The BAT-AEL emission level is < 5 mg/Nm3 at 5 % O2.
status: valid
status modified: 2019-04-23
accepted date: 2019-04-23
in scheme: BATAELValue

Production of pulp, paper and board - NO2 - BAT22-I
type: Concept
notation: PP-NO2-BAT22-I
definition: 6. Other activities: 6.1 Production in industrial installations of: (a) pulp from timber or other fibrous materials; (b) paper or card board; Techniques (a)-(c) (see table); Reducing nitrous oxides (NOx) emissions to air. The BAT-AEL emission level is 120 � 200 mg/Nm3 at 6 % O2.
status: valid
status modified: 2019-04-23
accepted date: 2019-04-23
in scheme: BATAELValue

Production of pulp, paper and board - NO2 - BAT22-II
type: Concept
notation: PP-NO2-BAT22-II
definition: 6. Other activities: 6.1 Production in industrial installations of: (a) pulp from timber or other fibrous materials; (b) paper or card board; Techniques (a)-(c) (see table); Reducing nitrous oxides (NOx) emissions to air. The BAT-AEL emission level is 0,8 � 1,4 kg NOx/ADt.
status: valid
status modified: 2019-04-23
accepted date: 2019-04-23
in scheme: BATAELValue

Production of pulp, paper and board - NO2 - BAT22-III
type: Concept
notation: PP-NO2-BAT22-III
definition: 6. Other activities: 6.1 Production in industrial installations of: (a) pulp from timber or other fibrous materials; (b) paper or card board; Techniques (a)-(c) (see table); Reducing nitrous oxides (NOx) emissions to air. The BAT-AEL emission level is 1,0 � 1,6 kg NOx/ADt.
status: valid
status modified: 2019-04-23
accepted date: 2019-04-23
in scheme: BATAELValue

Production of pulp, paper and board - NO2 - BAT22-IV
type: Concept
notation: PP-NO2-BAT22-IV
definition: 6. Other activities: 6.1 Production in industrial installations of: (a) pulp from timber or other fibrous materials; (b) paper or card board; Techniques (a)-(c) (see table); Reducing nitrous oxides (NOx) emissions to air. The BAT-AEL emission level is 120 � 200 mg/Nm3 at 6 % O2.
status: valid
status modified: 2019-04-23
accepted date: 2019-04-23
in scheme: BATAELValue

Production of pulp, paper and board - NO2 - BAT22-V
type: Concept
notation: PP-NO2-BAT22-V
definition: 6. Other activities: 6.1 Production in industrial installations of: (a) pulp from timber or other fibrous materials; (b) paper or card board; Techniques (a)-(c) (see table); Reducing nitrous oxides (NOx) emissions to air. The BAT-AEL emission level is 0,8 � 1,4 kg NOx/ADt.
status: valid
status modified: 2019-04-23
accepted date: 2019-04-23
in scheme: BATAELValue

Production of pulp, paper and board - NO2 - BAT22-VI
type: Concept
notation: PP-NO2-BAT22-VI
definition: 6. Other activities: 6.1 Production in industrial installations of: (a) pulp from timber or other fibrous materials; (b) paper or card board; Techniques (a)-(c) (see table); Reducing nitrous oxides (NOx) emissions to air. The BAT-AEL emission level is 1,0 � 1,7 kg NOx/ADt.
status: valid
status modified: 2019-04-23
accepted date: 2019-04-23
in scheme: BATAELValue

Production of pulp, paper and board - NO2 - BAT26-I
type: Concept
notation: PP-NO2-BAT26-I
definition: 6. Other activities: 6.1 Production in industrial installations of: (a) pulp from timber or other fibrous materials; (b) paper or card board; Techniques (a)-(d) (see table); Reducing nitrogen oxides (NOx) emissions to air. The BAT-AEL emission level is 100 � 200 mg/Nm3 at 6 % O2 .
status: valid
status modified: 2019-04-23
accepted date: 2019-04-23
in scheme: BATAELValue

Production of pulp, paper and board - NO2 - BAT26-II
type: Concept
notation: PP-NO2-BAT26-II
definition: 6. Other activities: 6.1 Production in industrial installations of: (a) pulp from timber or other fibrous materials; (b) paper or card board; Techniques (a)-(d) (see table); Reducing nitrogen oxides (NOx) emissions to air. The BAT-AEL emission level is 0,1 � 0,2 kg NOx/ADt .
status: valid
status modified: 2019-04-23
accepted date: 2019-04-23
in scheme: BATAELValue

Production of pulp, paper and board - NO2 - BAT26-III
type: Concept
notation: PP-NO2-BAT26-III
definition: 6. Other activities: 6.1 Production in industrial installations of: (a) pulp from timber or other fibrous materials; (b) paper or card board; Techniques (a)-(d) (see table); Reducing nitrogen oxides (NOx) emissions to air. The BAT-AEL emission level is 100 � 350 mg/Nm3 at 6 % O2 .
status: valid
status modified: 2019-04-23
accepted date: 2019-04-23
in scheme: BATAELValue

Production of pulp, paper and board - NO2 - BAT26-IV
type: Concept
notation: PP-NO2-BAT26-IV
definition: 6. Other activities: 6.1 Production in industrial installations of: (a) pulp from timber or other fibrous materials; (b) paper or card board; Techniques (a)-(d) (see table); Reducing nitrogen oxides (NOx) emissions to air. The BAT-AEL emission level is 0,1 � 0,3 kg NOx/ADt .
status: valid
status modified: 2019-04-23
accepted date: 2019-04-23
in scheme: BATAELValue

Production of pulp, paper and board - NO2 - BAT29-I
type: Concept
notation: PP-NO2-BAT29-I
definition: 6. Other activities: 6.1 Production in industrial installations of: (a) pulp from timber or other fibrous materials; (b) paper or card board; Techniques (a)-(b) (see table); Reducing nitrogen oxides (NOx) emissions to air. The BAT-AEL emission level is 50 � 400 mg/Nm3 at 9 % O2.
status: valid
status modified: 2019-04-23
accepted date: 2019-04-23
in scheme: BATAELValue

Production of pulp, paper and board - NO2 - BAT29-II
type: Concept
notation: PP-NO2-BAT29-II
definition: 6. Other activities: 6.1 Production in industrial installations of: (a) pulp from timber or other fibrous materials; (b) paper or card board; Techniques (a)-(b) (see table); Reducing nitrogen oxides (NOx) emissions to air. The BAT-AEL emission level is 0,01 � 0,1 kg NOx/ADt .
status: valid
status modified: 2019-04-23
accepted date: 2019-04-23
in scheme: BATAELValue

Production of pulp, paper and board - NO2 - BAT36-I
type: Concept
notation: PP-NO2-BAT36-I
definition: 6. Other activities: 6.1 Production in industrial installations of: (a) pulp from timber or other fibrous materials; (b) paper or card board; Techniques (a)-(c) (see table); Reducing nitrogen oxides (NOx) emissions to air. The BAT-AEL emission level is 100 � 350 mg/Nm3 at 5 % O2 .
status: valid
status modified: 2019-04-23
accepted date: 2019-04-23
in scheme: BATAELValue

Production of pulp, paper and board - NO2 - BAT36-II
type: Concept
notation: PP-NO2-BAT36-II
definition: 6. Other activities: 6.1 Production in industrial installations of: (a) pulp from timber or other fibrous materials; (b) paper or card board; Techniques (a)-(c) (see table); Reducing nitrogen oxides (NOx) emissions to air. The BAT-AEL emission level is 100 � 270 mg/Nm3 at 5 % O2.
status: valid
status modified: 2019-04-23
accepted date: 2019-04-23
in scheme: BATAELValue

Production of pulp, paper and board - S - BAT21-V
type: Concept
notation: PP-S-BAT21-V
definition: 6. Other activities: 6.1 Production in industrial installations of: (a) pulp from timber or other fibrous materials; (b) paper or card board; Techniques (a)-(c) (see table); Reducing total reduced sulphur (TRS) emissions to air. The BAT-AEL emission level is 1 � 10 mg/Nm3 at 6 % O2.
status: valid
status modified: 2019-04-23
accepted date: 2019-04-23
in scheme: BATAELValue

Production of pulp, paper and board - S - BAT21-VI
type: Concept
notation: PP-S-BAT21-VI
definition: 6. Other activities: 6.1 Production in industrial installations of: (a) pulp from timber or other fibrous materials; (b) paper or card board; Techniques (a)-(c) (see table); Reducing total reduced sulphur (TRS) emissions to air. The BAT-AEL emission level is 1 � 5 mg/Nm3 at 6 % O2.
status: valid
status modified: 2019-04-23
accepted date: 2019-04-23
in scheme: BATAELValue

Production of pulp, paper and board - S - BAT21-VII
type: Concept
notation: PP-S-BAT21-VII
definition: 6. Other activities: 6.1 Production in industrial installations of: (a) pulp from timber or other fibrous materials; (b) paper or card board; Techniques (a)-(c) (see table); Reducing gaseous S emissions to air. The BAT-AEL emission level is 0,03 � 0,17 kg S/ADt.
status: valid
status modified: 2019-04-23
accepted date: 2019-04-23
in scheme: BATAELValue

Production of pulp, paper and board - S - BAT21-VIII
type: Concept
notation: PP-S-BAT21-VIII
definition: 6. Other activities: 6.1 Production in industrial installations of: (a) pulp from timber or other fibrous materials; (b) paper or card board; Techniques (a)-(c) (see table); Reducing gaseous S emissions to air. The BAT-AEL emission level is 0,03 � 0,13 kg S/ADt.
status: valid
status modified: 2019-04-23
accepted date: 2019-04-23
in scheme: BATAELValue

Production of pulp, paper and board - S - BAT24-III
type: Concept
notation: PP-S-BAT24-III
definition: 6. Other activities: 6.1 Production in industrial installations of: (a) pulp from timber or other fibrous materials; (b) paper or card board; Techniques (a)-(d) (see table); Reducing gaseous S emissions to air. The BAT-AEL emission level is 0,005 � 0,07 kg S/ADt.
status: valid
status modified: 2019-04-23
accepted date: 2019-04-23
in scheme: BATAELValue

Production of pulp, paper and board - S - BAT24-IV
type: Concept
notation: PP-S-BAT24-IV
definition: 6. Other activities: 6.1 Production in industrial installations of: (a) pulp from timber or other fibrous materials; (b) paper or card board; Techniques (a)-(d) (see table); Reducing gaseous S emissions to air. The BAT-AEL emission level is 0,055 � 0,12 kg S/ADt.
status: valid
status modified: 2019-04-23
accepted date: 2019-04-23
in scheme: BATAELValue

Production of pulp, paper and board - S - BAT28-II
type: Concept
notation: PP-S-BAT28-II
definition: 6. Other activities: 6.1 Production in industrial installations of: (a) pulp from timber or other fibrous materials; (b) paper or card board; Use an alkaline SO2 scrubber; Reducing TRS emissions to air. The BAT-AEL emission level is 1 � 5 mg/Nm3 at 9 % O2.
status: valid
status modified: 2019-04-23
accepted date: 2019-04-23
in scheme: BATAELValue

Production of pulp, paper and board - S - BAT28-III
type: Concept
notation: PP-S-BAT28-III
definition: 6. Other activities: 6.1 Production in industrial installations of: (a) pulp from timber or other fibrous materials; (b) paper or card board; Use an alkaline SO2 scrubber; Reducing gaseous S emissions to air. The BAT-AEL emission level is 0,002 � 0,05 kg S/ADt.
status: valid
status modified: 2019-04-23
accepted date: 2019-04-23
in scheme: BATAELValue

Production of pulp, paper and board - SO2 - BAT21-I
type: Concept
notation: PP-SO2-BAT21-I
definition: 6. Other activities: 6.1 Production in industrial installations of: (a) pulp from timber or other fibrous materials; (b) paper or card board; Techniques (a)-(c) (see table); Reducing sulphur dioxide (SO2) emissions to air. The BAT-AEL emission level is 10 � 70 mg/Nm3 at 6 % O2.
status: valid
status modified: 2019-04-23
accepted date: 2019-04-23
in scheme: BATAELValue

Production of pulp, paper and board - SO2 - BAT21-II
type: Concept
notation: PP-SO2-BAT21-II
definition: 6. Other activities: 6.1 Production in industrial installations of: (a) pulp from timber or other fibrous materials; (b) paper or card board; Techniques (a)-(c) (see table); Reducing sulphur dioxide (SO2) emissions to air. The BAT-AEL emission level is 5 � 50 mg/Nm3 at 6 % O2.
status: valid
status modified: 2019-04-23
accepted date: 2019-04-23
in scheme: BATAELValue

Production of pulp, paper and board - SO2 - BAT21-III
type: Concept
notation: PP-SO2-BAT21-III
definition: 6. Other activities: 6.1 Production in industrial installations of: (a) pulp from timber or other fibrous materials; (b) paper or card board; Techniques (a)-(c) (see table); Reducing sulphur dioxide (SO2) emissions to air. The BAT-AEL emission level is 10 � 50 mg/Nm3 at 6 % O2.
status: valid
status modified: 2019-04-23
accepted date: 2019-04-23
in scheme: BATAELValue

Production of pulp, paper and board - SO2 - BAT21-IV
type: Concept
notation: PP-SO2-BAT21-IV
definition: 6. Other activities: 6.1 Production in industrial installations of: (a) pulp from timber or other fibrous materials; (b) paper or card board; Techniques (a)-(c) (see table); Reducing sulphur dioxide (SO2) emissions to air. The BAT-AEL emission level is 5 � 25 mg/Nm3 at 6 % O2.
status: valid
status modified: 2019-04-23
accepted date: 2019-04-23
in scheme: BATAELValue

Production of pulp, paper and board - SO2 - BAT24-I
type: Concept
notation: PP-SO2-BAT24-I
definition: 6. Other activities: 6.1 Production in industrial installations of: (a) pulp from timber or other fibrous materials; (b) paper or card board; Techniques (a)-(d) (see table); Reducing sulphur dioxide (SO2) emissions to air. The BAT-AEL emission level is 5 � 70 mg SO2/Nm3 at 6 % O2.
status: valid
status modified: 2019-04-23
accepted date: 2019-04-23
in scheme: BATAELValue

Production of pulp, paper and board - SO2 - BAT24-II
type: Concept
notation: PP-SO2-BAT24-II
definition: 6. Other activities: 6.1 Production in industrial installations of: (a) pulp from timber or other fibrous materials; (b) paper or card board; Techniques (a)-(d) (see table); Reducing sulphur dioxide (SO2) emissions to air. The BAT-AEL emission level is 55 � 120 mg SO2/Nm3 at 6 % O2.
status: valid
status modified: 2019-04-23
accepted date: 2019-04-23
in scheme: BATAELValue

Production of pulp, paper and board - SO2 - BAT28-I
type: Concept
notation: PP-SO2-BAT28-I
definition: 6. Other activities: 6.1 Production in industrial installations of: (a) pulp from timber or other fibrous materials; (b) paper or card board; Use an alkaline SO2 scrubber; Reducing sulphur dioxide (SO2) emissions to air. The BAT-AEL emission level is 20 � 120 mg/Nm3 at 9 % O2.
status: valid
status modified: 2019-04-23
accepted date: 2019-04-23
in scheme: BATAELValue

Production of pulp, paper and board - SO2 - BAT37-II
type: Concept
notation: PP-SO2-BAT37-II
definition: 6. Other activities: 6.1 Production in industrial installations of: (a) pulp from timber or other fibrous materials; (b) paper or card board; Techniques (a)-(b) (see table) and limit �acid operation� of the scrubbers to the minimum required to ensure their proper functioning; Reducing sulphur dioxide (SO2) emissions to air. The BAT-AEL emission level is 100 � 300 mg/Nm3 at 5 % O2.
status: valid
status modified: 2019-04-23
accepted date: 2019-04-23
in scheme: BATAELValue

Production of pulp, paper and board - SO2 - BAT37-III
type: Concept
notation: PP-SO2-BAT37-III
definition: 6. Other activities: 6.1 Production in industrial installations of: (a) pulp from timber or other fibrous materials; (b) paper or card board; Techniques (a)-(b) (see table) and limit �acid operation� of the scrubbers to the minimum required to ensure their proper functioning; Reducing sulphur dioxide (SO2) emissions to air. The BAT-AEL emission level is 50 � 250 mg/Nm3 at 5 % O2.
status: valid
status modified: 2019-04-23
accepted date: 2019-04-23
in scheme: BATAELValue

Production of pulp, paper and board - TN - BAT19-III
type: Concept
notation: PP-TN-BAT19-III
definition: 6. Other activities: 6.1 Production in industrial installations of: (a) pulp from timber or other fibrous materials; (b) paper or card board; Reducing total nitrogen to water. The BAT-AEL emission level is 0,05 - 0,25 kg/ADt.
status: valid
status modified: 2019-04-23
accepted date: 2019-04-23
in scheme: BATAELValue

Production of pulp, paper and board - TN - BAT19-IX
type: Concept
notation: PP-TN-BAT19-IX
definition: 6. Other activities: 6.1 Production in industrial installations of: (a) pulp from timber or other fibrous materials; (b) paper or card board; Reducing total nitrogen to water. The BAT-AEL emission level is 0,1 - 0,2 kg/ADt.
status: valid
status modified: 2019-04-23
accepted date: 2019-04-23
in scheme: BATAELValue

Production of pulp, paper and board - TN - BAT45-III
type: Concept
notation: PP-TN-BAT45-III
definition: 6. Other activities: 6.1 Production in industrial installations of: (a) pulp from timber or other fibrous materials; (b) paper or card board; Reducing total nitrogen to water. The BAT-AEL emission level is 0,008 - 0,09 kg/t.
status: valid
status modified: 2019-04-23
accepted date: 2019-04-23
in scheme: BATAELValue

Production of pulp, paper and board - TN - BAT45-X
type: Concept
notation: PP-TN-BAT45-X
definition: 6. Other activities: 6.1 Production in industrial installations of: (a) pulp from timber or other fibrous materials; (b) paper or card board; Reducing total nitrogen to water. The BAT-AEL emission level is 0,01 - 0,1 kg/t.
status: valid
status modified: 2019-04-23
accepted date: 2019-04-23
in scheme: BATAELValue

Production of pulp, paper and board - TN - BAT45-XI
type: Concept
notation: PP-TN-BAT45-XI
definition: 6. Other activities: 6.1 Production in industrial installations of: (a) pulp from timber or other fibrous materials; (b) paper or card board; Reducing total nitrogen to water. The BAT-AEL emission level is 0,01 - 0,15 kg/t.
status: valid
status modified: 2019-04-23
accepted date: 2019-04-23
in scheme: BATAELValue

Production of pulp, paper and board - TP - BAT19-IV
type: Concept
notation: PP-TP-BAT19-IV
definition: 6. Other activities: 6.1 Production in industrial installations of: (a) pulp from timber or other fibrous materials; (b) paper or card board; Reducing total phosphorus to water. The BAT-AEL emission level is 0,01 - 0,03 kg/ADt.
status: valid
status modified: 2019-04-23
accepted date: 2019-04-23
in scheme: BATAELValue

Production of pulp, paper and board - TP - BAT19-V
type: Concept
notation: PP-TP-BAT19-V
definition: 6. Other activities: 6.1 Production in industrial installations of: (a) pulp from timber or other fibrous materials; (b) paper or card board; Reducing total phosphorus to water. The BAT-AEL emission level is 0,02 - 0,11 kg/ADt.
status: valid
status modified: 2019-04-23
accepted date: 2019-04-23
in scheme: BATAELValue

Production of pulp, paper and board - TP - BAT19-X
type: Concept
notation: PP-TP-BAT19-X
definition: 6. Other activities: 6.1 Production in industrial installations of: (a) pulp from timber or other fibrous materials; (b) paper or card board; Reducing total phosphorus to water. The BAT-AEL emission level is 0,01 - 0,02 kg/ADt.
status: valid
status modified: 2019-04-23
accepted date: 2019-04-23
in scheme: BATAELValue

Production of pulp, paper and board - TP - BAT33-VII
type: Concept
notation: PP-TP-BAT33-VII
definition: 6. Other activities: 6.1 Production in industrial installations of: (a) pulp from timber or other fibrous materials; (b) paper or card board; Reducing total phosphorous to water. The BAT-AEL emission level is 0,01 � 0,05 kg/ADt.
status: valid
status modified: 2019-04-23
accepted date: 2019-04-23
in scheme: BATAELValue

Production of pulp, paper and board - TP - BAT33-VIII
type: Concept
notation: PP-TP-BAT33-VIII
definition: 6. Other activities: 6.1 Production in industrial installations of: (a) pulp from timber or other fibrous materials; (b) paper or card board; Reducing total phosphorous to water. The BAT-AEL emission level is 0,01 � 0,07 kg/ADt.
status: valid
status modified: 2019-04-23
accepted date: 2019-04-23
in scheme: BATAELValue

Production of pulp, paper and board - TP - BAT33-XIII
type: Concept
notation: PP-TP-BAT33-XIII
definition: 6. Other activities: 6.1 Production in industrial installations of: (a) pulp from timber or other fibrous materials; (b) paper or card board; Reducing total phosphorus to water. The BAT-AEL emission level is 0,01 � 0,02 kg/ADt.
status: valid
status modified: 2019-04-23
accepted date: 2019-04-23
in scheme: BATAELValue

Production of pulp, paper and board - TP - BAT40-IV
type: Concept
notation: PP-TP-BAT40-IV
definition: 6. Other activities: 6.1 Production in industrial installations of: (a) pulp from timber or other fibrous materials; (b) paper or card board; Reducing total phosphorus to water. The BAT-AEL emission level is 0,001 � 0,01 kg/t.
status: valid
status modified: 2019-04-23
accepted date: 2019-04-23
in scheme: BATAELValue

Production of pulp, paper and board - TP - BAT40-VIII
type: Concept
notation: PP-TP-BAT40-VIII
definition: 6. Other activities: 6.1 Production in industrial installations of: (a) pulp from timber or other fibrous materials; (b) paper or card board; Reducing total phosphorus to water. The BAT-AEL emission level is 0,001 � 0,01 kg/ADt.
status: valid
status modified: 2019-04-23
accepted date: 2019-04-23
in scheme: BATAELValue

Production of pulp, paper and board - TP - BAT45-IV
type: Concept
notation: PP-TP-BAT45-IV
definition: 6. Other activities: 6.1 Production in industrial installations of: (a) pulp from timber or other fibrous materials; (b) paper or card board; Reducing total phosphorus to water. The BAT-AEL emission level is 0,001 - 0,005 kg/t.
status: valid
status modified: 2019-04-23
accepted date: 2019-04-23
in scheme: BATAELValue

Production of pulp, paper and board - TP - BAT45-XII
type: Concept
notation: PP-TP-BAT45-XII
definition: 6. Other activities: 6.1 Production in industrial installations of: (a) pulp from timber or other fibrous materials; (b) paper or card board; Reducing total phosphorus to water. The BAT-AEL emission level is 0,002 - 0,01 kg/t.
status: valid
status modified: 2019-04-23
accepted date: 2019-04-23
in scheme: BATAELValue

Production of pulp, paper and board - TP - BAT45-XIII
type: Concept
notation: PP-TP-BAT45-XIII
definition: 6. Other activities: 6.1 Production in industrial installations of: (a) pulp from timber or other fibrous materials; (b) paper or card board; Reducing total phosphorus to water. The BAT-AEL emission level is 0,002 - 0,015 kg/t.
status: valid
status modified: 2019-04-23
accepted date: 2019-04-23
in scheme: BATAELValue

Production of pulp, paper and board - TP - BAT50-V
type: Concept
notation: PP-TP-BAT50-V
definition: 6. Other activities: 6.1 Production in industrial installations of: (a) pulp from timber or other fibrous materials; (b) paper or card board; Reducing total phosphorus to water. The BAT-AEL emission level is 0,003 � 0,012 kg/t.
status: valid
status modified: 2019-04-23
accepted date: 2019-04-23
in scheme: BATAELValue

Production of pulp, paper and board - TP - BAT50-X
type: Concept
notation: PP-TP-BAT50-X
definition: 6. Other activities: 6.1 Production in industrial installations of: (a) pulp from timber or other fibrous materials; (b) paper or card board; Reducing total phosphorus to water. The BAT-AEL emission level is 0,002 � 0,04 kg/t .
status: valid
status modified: 2019-04-23
accepted date: 2019-04-23
in scheme: BATAELValue

Production of pulp, paper and board - TRS - BAT20
type: Concept
notation: PP-TRS-BAT20
definition: 6. Other activities: 6.1 Production in industrial installations of: (a) pulp from timber or other fibrous materials; (b) paper or card board; Techniques (a)-(c) (see table incl. footnotes); Reducing total reduced sulphur (TRS) emissions to air. The BAT-AEL emission level is 0,05 - 0,2 kg/Adt.
status: valid
status modified: 2019-04-23
accepted date: 2019-04-23
in scheme: BATAELValue

Production of pulp, paper and board - TRS - BAT25-I
type: Concept
notation: PP-TRS-BAT25-I
definition: 6. Other activities: 6.1 Production in industrial installations of: (a) pulp from timber or other fibrous materials; (b) paper or card board; Techniques (a)-(c) (see table incl. footnotes); Reducing total reduced sulphur (TRS) emissions to air. The BAT-AEL emission level is < 1 - 10 mg S/Nm3.
status: valid
status modified: 2019-04-23
accepted date: 2019-04-23
in scheme: BATAELValue

Production of pulp, paper and board - TRS - BAT25-II
type: Concept
notation: PP-TRS-BAT25-II
definition: 6. Other activities: 6.1 Production in industrial installations of: (a) pulp from timber or other fibrous materials; (b) paper or card board; Techniques (a)-(c) (see table incl. footnotes); Reducing total reduced sulphur (TRS) emissions to air. The BAT-AEL emission level is < 1 - 40 mg S/Nm3.
status: valid
status modified: 2019-04-23
accepted date: 2019-04-23
in scheme: BATAELValue

Production of pulp, paper and board - TSS - BAT19-II
type: Concept
notation: PP-TSS-BAT19-II
definition: 6. Other activities: 6.1 Production in industrial installations of: (a) pulp from timber or other fibrous materials; (b) paper or card board; Reducing total suspended solids (TSS) to water. The BAT-AEL emission level is 0,3 - 1,5 kg/ADt.
status: valid
status modified: 2019-04-23
accepted date: 2019-04-23
in scheme: BATAELValue

Production of pulp, paper and board - TSS - BAT19-VIII
type: Concept
notation: PP-TSS-BAT19-VIII
definition: 6. Other activities: 6.1 Production in industrial installations of: (a) pulp from timber or other fibrous materials; (b) paper or card board; Reducing total suspended solids (TSS) to water. The BAT-AEL emission level is 0,3 - 1 kg/ADt.
status: valid
status modified: 2019-04-23
accepted date: 2019-04-23
in scheme: BATAELValue

Production of pulp, paper and board - TSS - BAT33-III
type: Concept
notation: PP-TSS-BAT33-III
definition: 6. Other activities: 6.1 Production in industrial installations of: (a) pulp from timber or other fibrous materials; (b) paper or card board; Reducing total suspended solids (TSS) to water. The BAT-AEL emission level is 0,4 � 1,5 kg/ADt.
status: valid
status modified: 2019-04-23
accepted date: 2019-04-23
in scheme: BATAELValue

Production of pulp, paper and board - TSS - BAT33-IV
type: Concept
notation: PP-TSS-BAT33-IV
definition: 6. Other activities: 6.1 Production in industrial installations of: (a) pulp from timber or other fibrous materials; (b) paper or card board; Reducing total suspended solids (TSS) to water. The BAT-AEL emission level is 0,5 � 2,0 kg/ADt.
status: valid
status modified: 2019-04-23
accepted date: 2019-04-23
in scheme: BATAELValue

Production of pulp, paper and board - TSS - BAT33-XI
type: Concept
notation: PP-TSS-BAT33-XI
definition: 6. Other activities: 6.1 Production in industrial installations of: (a) pulp from timber or other fibrous materials; (b) paper or card board; Reducing total suspended solids (TSS) to water. The BAT-AEL emission level is 0,5 � 1,3 kg/ADt.
status: valid
status modified: 2019-04-23
accepted date: 2019-04-23
in scheme: BATAELValue

Production of pulp, paper and board - TSS - BAT40-II
type: Concept
notation: PP-TSS-BAT40-II
definition: 6. Other activities: 6.1 Production in industrial installations of: (a) pulp from timber or other fibrous materials; (b) paper or card board; Reducing total suspended solids (TSS) to water. The BAT-AEL emission level is 0,06 � 0,45 kg/t.
status: valid
status modified: 2019-04-23
accepted date: 2019-04-23
in scheme: BATAELValue

Production of pulp, paper and board - TSS - BAT40-VI
type: Concept
notation: PP-TSS-BAT40-VI
definition: 6. Other activities: 6.1 Production in industrial installations of: (a) pulp from timber or other fibrous materials; (b) paper or card board; Reducing total suspended solids (TSS) to water. The BAT-AEL emission level is 0,5 � 0,9 kg/ADt.
status: valid
status modified: 2019-04-23
accepted date: 2019-04-23
in scheme: BATAELValue

Production of pulp, paper and board - TSS - BAT45-II
type: Concept
notation: PP-TSS-BAT45-II
definition: 6. Other activities: 6.1 Production in industrial installations of: (a) pulp from timber or other fibrous materials; (b) paper or card board; Reducing total suspended solids (TSS) to water. The BAT-AEL emission level is 0,02 - 0,2 kg/t.
status: valid
status modified: 2019-04-23
accepted date: 2019-04-23
in scheme: BATAELValue

Production of pulp, paper and board - TSS - BAT45-IX
type: Concept
notation: PP-TSS-BAT45-IX
definition: 6. Other activities: 6.1 Production in industrial installations of: (a) pulp from timber or other fibrous materials; (b) paper or card board; Reducing total suspended solids (TSS) to water. The BAT-AEL emission level is 0,1 - 0,4 kg/t.
status: valid
status modified: 2019-04-23
accepted date: 2019-04-23
in scheme: BATAELValue

Production of pulp, paper and board - TSS - BAT45-VIII
type: Concept
notation: PP-TSS-BAT45-VIII
definition: 6. Other activities: 6.1 Production in industrial installations of: (a) pulp from timber or other fibrous materials; (b) paper or card board; Reducing total suspended solids (TSS) to water. The BAT-AEL emission level is 0,08 - 0,3 kg/t.
status: valid
status modified: 2019-04-23
accepted date: 2019-04-23
in scheme: BATAELValue

Production of pulp, paper and board - TSS - BAT50-II
type: Concept
notation: PP-TSS-BAT50-II
definition: 6. Other activities: 6.1 Production in industrial installations of: (a) pulp from timber or other fibrous materials; (b) paper or card board; Reducing total suspended solids (TSS) to water. The BAT-AEL emission level is 0,02 � 0,35 kg/t.
status: valid
status modified: 2019-04-23
accepted date: 2019-04-23
in scheme: BATAELValue

Production of pulp, paper and board - TSS - BAT50-VIII
type: Concept
notation: PP-TSS-BAT50-VIII
definition: 6. Other activities: 6.1 Production in industrial installations of: (a) pulp from timber or other fibrous materials; (b) paper or card board; Reducing total suspended solids (TSS) to water. The BAT-AEL emission level is 0,10 � 1 kg/t .
status: valid
status modified: 2019-04-23
accepted date: 2019-04-23
in scheme: BATAELValue

Refining of mineral oil and gas - Benzene - BAT12-IX
type: Concept
notation: REF-Benzene-BAT12-IX
definition: Energy industries : 1.2 Refining of mineral oil and gas Reducing benzene to water. The BAT-AEL emission level is 0,001 - 0,05 mg/l.
status: valid
status modified: 2019-04-23
accepted date: 2019-04-23
in scheme: BATAELValue

Refining of mineral oil and gas - Benzene - BAT52-II
type: Concept
notation: REF-Benzene-BAT52-II
definition: Energy industries : 1.2 Refining of mineral oil and gas; Techniques (i) - (v) (see table); Reducing benzene emissions to air. The BAT-AEL emission level is < 1 mg/Nm3.
status: valid
status modified: 2019-04-23
accepted date: 2019-04-23
in scheme: BATAELValue

Refining of mineral oil and gas - CO - BAT27
type: Concept
notation: REF-CO-BAT27
definition: Energy industries : 1.2 Refining of mineral oil and gas; Partial combustion mode ; Reducing carbon monoxide (CO) emissions to air. The BAT-AEL emission level is ? 100 mg/Nm3.
status: valid
status modified: 2019-04-23
accepted date: 2019-04-23
in scheme: BATAELValue

Refining of mineral oil and gas - CO - BAT37
type: Concept
notation: REF-CO-BAT37
definition: Energy industries : 1.2 Refining of mineral oil and gas; Combustion operation control; Reducing carbon monoxide (CO) emissions to air. The BAT-AEL emission level is ? 100 mg/Nm3.
status: valid
status modified: 2019-04-23
accepted date: 2019-04-23
in scheme: BATAELValue

Refining of mineral oil and gas - COD - BAT12-III
type: Concept
notation: REF-COD-BAT12-III
definition: Energy industries : 1.2 Refining of mineral oil and gas Reducing chemical oxygen demand (COD) to water. The BAT-AEL emission level is 30 - 125 mg/l.
status: valid
status modified: 2019-04-23
accepted date: 2019-04-23
in scheme: BATAELValue

Refining of mineral oil and gas - Cd - BAT12-VI
type: Concept
notation: REF-Cd-BAT12-VI
definition: Energy industries : 1.2 Refining of mineral oil and gas Reducing cadmium to water. The BAT-AEL emission level is 0,002 - 0,008 mg/l.
status: valid
status modified: 2019-04-23
accepted date: 2019-04-23
in scheme: BATAELValue

Refining of mineral oil and gas - Dust - BAT25-I
type: Concept
notation: REF-Dust-BAT25-I
definition: Energy industries : 1.2 Refining of mineral oil and gas; Techniques I - II (see table); for New unit; Reducing dust emissions to air. The BAT-AEL emission level is 10 - 25 mg/Nm3.
status: valid
status modified: 2019-04-23
accepted date: 2019-04-23
in scheme: BATAELValue

Refining of mineral oil and gas - Dust - BAT25-II
type: Concept
notation: REF-Dust-BAT25-II
definition: Energy industries : 1.2 Refining of mineral oil and gas; Techniques I - II (see table); for Existing unit; Reducing dust emissions to air. The BAT-AEL emission level is 10 - 50 mg/Nm3.
status: valid
status modified: 2019-04-23
accepted date: 2019-04-23
in scheme: BATAELValue

Refining of mineral oil and gas - Dust - BAT32
type: Concept
notation: REF-Dust-BAT32
definition: Energy industries : 1.2 Refining of mineral oil and gas; Techniques (i) - (ii) (see table); Reducing dust emissions to air. The BAT-AEL emission level is 10 - 50 mg/Nm3.
status: valid
status modified: 2019-04-23
accepted date: 2019-04-23
in scheme: BATAELValue

Refining of mineral oil and gas - Dust - BAT35-I
type: Concept
notation: REF-Dust-BAT35-I
definition: Energy industries : 1.2 Refining of mineral oil and gas; Multi-fuel firing for Existing unit; Reducing dust emissions to air. The BAT-AEL emission level is 5 - 50 mg/Nm3.
status: valid
status modified: 2019-04-23
accepted date: 2019-04-23
in scheme: BATAELValue

Refining of mineral oil and gas - Dust - BAT35-II
type: Concept
notation: REF-Dust-BAT35-II
definition: Energy industries : 1.2 Refining of mineral oil and gas; Multi-fuel firing for New unit < 50 MW; Reducing dust emissions to air. The BAT-AEL emission level is 5 - 25 mg/Nm3.
status: valid
status modified: 2019-04-23
accepted date: 2019-04-23
in scheme: BATAELValue

Refining of mineral oil and gas - HOI - BAT12-I
type: Concept
notation: REF-HOI-BAT12-I
definition: Energy industries : 1.2 Refining of mineral oil and gas Reducing hydrocarbon oil index (HOI) to water. The BAT-AEL emission level is 0,1 - 2,5 mg/l.
status: valid
status modified: 2019-04-23
accepted date: 2019-04-23
in scheme: BATAELValue

Refining of mineral oil and gas - Hg - BAT12-VIII
type: Concept
notation: REF-Hg-BAT12-VIII
definition: Energy industries : 1.2 Refining of mineral oil and gas Reducing mercury to water. The BAT-AEL emission level is 0,0001 - 0,001 mg/l.
status: valid
status modified: 2019-04-23
accepted date: 2019-04-23
in scheme: BATAELValue

Refining of mineral oil and gas - N - BAT12-IV
type: Concept
notation: REF-N-BAT12-IV
definition: Energy industries : 1.2 Refining of mineral oil and gas Reducing total nitrogen to water. The BAT-AEL emission level is 1 - 25 mg/l.
status: valid
status modified: 2019-04-23
accepted date: 2019-04-23
in scheme: BATAELValue

Refining of mineral oil and gas - NH3 - BAT8
type: Concept
notation: REF-NH3-BAT8
definition: 1, Energy industries : 1.2 Refining of mineral oil and gas; SCR/SNCR; Reducing ammonia (NH3) emissions to air. The BAT-AEL emission level is < 5 - 15 mg/Nm3.
status: valid
status modified: 2019-04-23
accepted date: 2019-04-23
in scheme: BATAELValue

Refining of mineral oil and gas - NMVOC - BAT52-I
type: Concept
notation: REF-NMVOC-BAT52-I
definition: Energy industries : 1.2 Refining of mineral oil and gas; Techniques (i) - (v) (see table); Reducing NMVOC emissions to air. The BAT-AEL emission level is 0,15 - 10 g/Nm3.
status: valid
status modified: 2019-04-23
accepted date: 2019-04-23
in scheme: BATAELValue

Refining of mineral oil and gas - NO2 - BAT24-I
type: Concept
notation: REF-NO2-BAT24-I
definition: Energy industries : 1.2 Refining of mineral oil and gas; All combustion modes for New unit; Reducing nitrogen oxides (NOx) emissions to air. The BAT-AEL emission level is < 30 - 100 mg/Nm3.
status: valid
status modified: 2019-04-23
accepted date: 2019-04-23
in scheme: BATAELValue

Refining of mineral oil and gas - NO2 - BAT24-II
type: Concept
notation: REF-NO2-BAT24-II
definition: Energy industries : 1.2 Refining of mineral oil and gas; Full combustion mode for Existing unit; Reducing nitrogen oxides (NOx) emissions to air. The BAT-AEL emission level is < 100 - 300 mg/Nm3.
status: valid
status modified: 2019-04-23
accepted date: 2019-04-23
in scheme: BATAELValue

Refining of mineral oil and gas - NO2 - BAT24-III
type: Concept
notation: REF-NO2-BAT24-III
definition: Energy industries : 1.2 Refining of mineral oil and gas; Partial combustion mode for Existing unit; Reducing nitrogen oxides (NOx) emissions to air. The BAT-AEL emission level is 100 - 400 mg/Nm3.
status: valid
status modified: 2019-04-23
accepted date: 2019-04-23
in scheme: BATAELValue

Refining of mineral oil and gas - NO2 - BAT34-I
type: Concept
notation: REF-NO2-BAT34-I
definition: Energy industries : 1.2 Refining of mineral oil and gas; Combustion unit for Existing turbine; Reducing nitrogen oxides (NOx) emissions to air. The BAT-AEL emission level is 40 - 120 mg/Nm3.
status: valid
status modified: 2019-04-23
accepted date: 2019-04-23
in scheme: BATAELValue

Refining of mineral oil and gas - NO2 - BAT34-II
type: Concept
notation: REF-NO2-BAT34-II
definition: Energy industries : 1.2 Refining of mineral oil and gas; Gas turbine (including combined cycle gas turbine � CCGT) and integrated gasification combined cycle turbine (IGCC)) for New turbine; Reducing nitrogen oxides (NOx) emissions to air. The BAT-AEL emission level is 20 - 50 mg/Nm3.
status: valid
status modified: 2019-04-23
accepted date: 2019-04-23
in scheme: BATAELValue

Refining of mineral oil and gas - NO2 - BAT34-III
type: Concept
notation: REF-NO2-BAT34-III
definition: Energy industries : 1.2 Refining of mineral oil and gas; Gas firing with exception of gas turbines for Existing unit; Reducing nitrogen oxides (NOx) emissions to air. The BAT-AEL emission level is 30 - 150 mg/Nm3.
status: valid
status modified: 2019-04-23
accepted date: 2019-04-23
in scheme: BATAELValue

Refining of mineral oil and gas - NO2 - BAT34-IV
type: Concept
notation: REF-NO2-BAT34-IV
definition: Energy industries : 1.2 Refining of mineral oil and gas; Gas firing with exception of gas turbines for New unit; Reducing nitrogen oxides (NOx) emissions to air. The BAT-AEL emission level is 30 - 100 mg/Nm3.
status: valid
status modified: 2019-04-23
accepted date: 2019-04-23
in scheme: BATAELValue

Refining of mineral oil and gas - NO2 - BAT34-V
type: Concept
notation: REF-NO2-BAT34-V
definition: Energy industries : 1.2 Refining of mineral oil and gas; Multi-fuel fired combustion unit for Existing unit - should cover both new and existing ones; Reducing nitrogen oxides (NOx) emissions to air. The BAT-AEL emission level is 30 - 300 mg/Nm3.
status: valid
status modified: 2019-04-23
accepted date: 2019-04-23
in scheme: BATAELValue

Refining of mineral oil and gas - Ni - BAT12-VII
type: Concept
notation: REF-Ni-BAT12-VII
definition: Energy industries : 1.2 Refining of mineral oil and gas Reducing nickel to water. The BAT-AEL emission level is 0,005 - 0,1 mg/l.
status: valid
status modified: 2019-04-23
accepted date: 2019-04-23
in scheme: BATAELValue

Refining of mineral oil and gas - Pb - BAT12-V
type: Concept
notation: REF-Pb-BAT12-V
definition: Energy industries : 1.2 Refining of mineral oil and gas Reducing lead to water. The BAT-AEL emission level is 0,005 - 0,03 mg/l.
status: valid
status modified: 2019-04-23
accepted date: 2019-04-23
in scheme: BATAELValue

Refining of mineral oil and gas - SO2 - BAT26-I
type: Concept
notation: REF-SO2-BAT26-I
definition: Energy industries : 1.2 Refining of mineral oil and gas; Techniques I - II (see table); for New units; Reducing sulphur dioxide (SO2) emissions to air. The BAT-AEL emission level is ? 300 - mg/Nm3.
status: valid
status modified: 2019-04-23
accepted date: 2019-04-23
in scheme: BATAELValue

Refining of mineral oil and gas - SO2 - BAT26-II
type: Concept
notation: REF-SO2-BAT26-II
definition: Energy industries : 1.2 Refining of mineral oil and gas; Full combustion mode for Existing units; Reducing sulphur dioxide (SO2) emissions to air. The BAT-AEL emission level is < 100 - 800 mg/Nm3.
status: valid
status modified: 2019-04-23
accepted date: 2019-04-23
in scheme: BATAELValue

Refining of mineral oil and gas - SO2 - BAT26-III
type: Concept
notation: REF-SO2-BAT26-III
definition: Energy industries : 1.2 Refining of mineral oil and gas; Partial combustion mode for Existing units; Reducing sulphur dioxide (SO2) emissions to air. The BAT-AEL emission level is < 100 - 1200 mg/Nm3.
status: valid
status modified: 2019-04-23
accepted date: 2019-04-23
in scheme: BATAELValue

Refining of mineral oil and gas - SO2 - BAT36-I
type: Concept
notation: REF-SO2-BAT36-I
definition: Energy industries : 1.2 Refining of mineral oil and gas; RFG; Reducing sulphur dioxide (SO2) emissions to air. The BAT-AEL emission level is 5 - 35 mg/Nm3.
status: valid
status modified: 2019-04-23
accepted date: 2019-04-23
in scheme: BATAELValue

Refining of mineral oil and gas - SO2 - BAT36-II
type: Concept
notation: REF-SO2-BAT36-II
definition: Energy industries : 1.2 Refining of mineral oil and gas; Multi-fuel fired combustion units, with the exception of gas turbines and stationary gas engines for Existing units; Reducing sulphur dioxide (SO2) emissions to air. The BAT-AEL emission level is 35 - 600 mg/Nm3.
status: valid
status modified: 2019-04-23
accepted date: 2019-04-23
in scheme: BATAELValue

Refining of mineral oil and gas - TSS - BAT12-II
type: Concept
notation: REF-TSS-BAT12-II
definition: Energy industries : 1.2 Refining of mineral oil and gas Reducing total suspended solids (TSS) to water. The BAT-AEL emission level is 5 - 25 mg/l.
status: valid
status modified: 2019-04-23
accepted date: 2019-04-23
in scheme: BATAELValue

Tanning of Hides and Skins - BOD5 - BAT10-III
type: Concept
notation: TAN-BOD5-BAT10-III
definition: 6, Other activities: 6,3 Tanning of hides and skins where the treatment capacity exceeds 12�tonnes of finished products per day Reducing biological oxygen demand for 5 days (BOD5) to water. The BAT-AEL emission level is 15 - 25 mg/l.
status: valid
status modified: 2019-04-23
accepted date: 2019-04-23
in scheme: BATAELValue

Tanning of Hides and Skins - BOD5 - BAT10-IV
type: Concept
notation: TAN-BOD5-BAT10-IV
definition: 6, Other activities: 6,11 Independently operated treatment of waste water not covered by Directive 91/271/EEC and discharged by an installation undertaking activities covered under 6.3 Reducing biological oxygen demand for 5 days (BOD5) to water. The BAT-AEL emission level is 15 - 25 mg/l.
status: valid
status modified: 2019-04-23
accepted date: 2019-04-23
in scheme: BATAELValue

Surface Treatment using organic solvents including preservation of wood and wood products with chemicals - BAT 21
type: Concept
notation: STS-AOX-BAT21-I
definition: 6, Other activities: 6.7 Surface treatment of substances, objects or products using organic solvents, in particular for dressing, printing, coating, degreasing, waterproofing, sizing, painting, cleaning or impregnating, with an organic solvent consumption capacity of more than 150 kg per hour or more than 200 tonnes per year. 6.10: Preservation of wood and wood products with chemicals with a production capacity exceeding 75 m3 per day other than exclusively treating against sapstain. 6.11: Independently operated treatment of waste water not covered by Directive 91/271/EEC provided that the main pollutant load originates from activities specified in point 6.7 or 6.10 of Annex I to Directive 2010/75/EU; Reducing adsorbable organically bound halogens to water. The BAT-AEL emission level is 0.1�0.4 mg/l.
status: valid
status modified: 2025-03-12
accepted date: 2025-03-12
in scheme: BATAELValue

Surface Treatment using organic solvents including preservation of wood and wood products with chemicals - BAT 21
type: Concept
notation: STS-AOX-BAT21-II
definition: 6, Other activities: 6.7 Surface treatment of substances, objects or products using organic solvents, in particular for dressing, printing, coating, degreasing, waterproofing, sizing, painting, cleaning or impregnating, with an organic solvent consumption capacity of more than 150 kg per hour or more than 200 tonnes per year. 6.10: Preservation of wood and wood products with chemicals with a production capacity exceeding 75 m3 per day other than exclusively treating against sapstain. 6.11: Independently operated treatment of waste water not covered by Directive 91/271/EEC provided that the main pollutant load originates from activities specified in point 6.7 or 6.10 of Annex I to Directive 2010/75/EU; Reducing adsorbable organically bound halogens to water. The BAT-AEL emission level is 0.1�0.4 mg/l.
status: valid
status modified: 2025-03-12
accepted date: 2025-03-12
in scheme: BATAELValue

Surface Treatment using organic solvents including preservation of wood and wood products with chemicals - BAT 21
type: Concept
notation: STS-COD-BAT21-I
definition: 6, Other activities: 6.7 Surface treatment of substances, objects or products using organic solvents, in particular for dressing, printing, coating, degreasing, waterproofing, sizing, painting, cleaning or impregnating, with an organic solvent consumption capacity of more than 150 kg per hour or more than 200 tonnes per year. 6.10: Preservation of wood and wood products with chemicals with a production capacity exceeding 75 m3 per day other than exclusively treating against sapstain. 6.11: Independently operated treatment of waste water not covered by Directive 91/271/EEC provided that the main pollutant load originates from activities specified in point 6.7 or 6.10 of Annex I to Directive 2010/75/EU; Reducing chemical oxygen demand (COD) to water. The BAT-AEL emission level is 30�150 mg/l.
status: valid
status modified: 2025-03-12
accepted date: 2025-03-12
in scheme: BATAELValue

Surface Treatment using organic solvents including preservation of wood and wood products with chemicals - BAT 21
type: Concept
notation: STS-Cr-BAT21-I
definition: 6, Other activities: 6.7 Surface treatment of substances, objects or products using organic solvents, in particular for dressing, printing, coating, degreasing, waterproofing, sizing, painting, cleaning or impregnating, with an organic solvent consumption capacity of more than 150 kg per hour or more than 200 tonnes per year. 6.10: Preservation of wood and wood products with chemicals with a production capacity exceeding 75 m3 per day other than exclusively treating against sapstain. 6.11: Independently operated treatment of waste water not covered by Directive 91/271/EEC provided that the main pollutant load originates from activities specified in point 6.7 or 6.10 of Annex I to Directive 2010/75/EU; Reducing total chromium to water. The BAT-AEL emission level is 0.01�0.15 mg/l.
status: valid
status modified: 2025-03-12
accepted date: 2025-03-12
in scheme: BATAELValue

Surface Treatment using organic solvents including preservation of wood and wood products with chemicals - BAT 21
type: Concept
notation: STS-Cr-BAT21-II
definition: 6, Other activities: 6.7 Surface treatment of substances, objects or products using organic solvents, in particular for dressing, printing, coating, degreasing, waterproofing, sizing, painting, cleaning or impregnating, with an organic solvent consumption capacity of more than 150 kg per hour or more than 200 tonnes per year. 6.10: Preservation of wood and wood products with chemicals with a production capacity exceeding 75 m3 per day other than exclusively treating against sapstain. 6.11: Independently operated treatment of waste water not covered by Directive 91/271/EEC provided that the main pollutant load originates from activities specified in point 6.7 or 6.10 of Annex I to Directive 2010/75/EU; Reducing total chromium to water. The BAT-AEL emission level is 0.01�0.15 mg/l.
status: valid
status modified: 2025-03-12
accepted date: 2025-03-12
in scheme: BATAELValue

Tanning of Hides and Skins - COD - BAT10-I
type: Concept
notation: TAN-COD-BAT10-I
definition: 6, Other activities: 6,3 Tanning of hides and skins where the treatment capacity exceeds 12�tonnes of finished products per day Reducing chemical oxygen demand (COD) to water. The BAT-AEL emission level is 200 - 500 mg/l.
status: valid
status modified: 2019-04-23
accepted date: 2019-04-23
in scheme: BATAELValue

Tanning of Hides and Skins - COD - BAT10-II
type: Concept
notation: TAN-COD-BAT10-II
definition: 6, Other activities: 6,11 Independently operated treatment of waste water not covered by Directive 91/271/EEC and discharged by an installation undertaking activities covered under 6.3 Reducing chemical oxygen demand (COD) to water. The BAT-AEL emission level is 200 - 500 mg/l.
status: valid
status modified: 2019-04-23
accepted date: 2019-04-23
in scheme: BATAELValue

Tanning of Hides and Skins - Cr - BAT10-IX
type: Concept
notation: TAN-Cr-BAT10-IX
definition: 6, Other activities: 6,3 Tanning of hides and skins where the treatment capacity exceeds 12�tonnes of finished products per day Reducing total chromium to water. The BAT-AEL emission level is < 0,3 - 1 mg/l.
status: valid
status modified: 2019-04-23
accepted date: 2019-04-23
in scheme: BATAELValue

Tanning of Hides and Skins - Cr - BAT10-X
type: Concept
notation: TAN-Cr-BAT10-X
definition: 6, Other activities: 6,11 Independently operated treatment of waste water not covered by Directive 91/271/EEC and discharged by an installation undertaking activities covered under 6.3 Reducing total chromium to water. The BAT-AEL emission level is < 0,3 - 1 mg/l.
status: valid
status modified: 2019-04-23
accepted date: 2019-04-23
in scheme: BATAELValue

Tanning of Hides and Skins - Cr - BAT11-I
type: Concept
notation: TAN-Cr-BAT11-I
definition: 6, Other activities: 6,3 Tanning of hides and skins where the treatment capacity exceeds 12�tonnes of finished products per day Reducing total chromium to water. The BAT-AEL emission level is < 0,3 - 1 mg/l.
status: valid
status modified: 2019-04-23
accepted date: 2019-04-23
in scheme: BATAELValue

Tanning of Hides and Skins - Cr - BAT11-II
type: Concept
notation: TAN-Cr-BAT11-II
definition: 6, Other activities: 6,11 Independently operated treatment of waste water not covered by Directive 91/271/EEC and discharged by an installation undertaking activities covered under 6.3 Reducing total chromium to water. The BAT-AEL emission level is < 0,3 - 1 mg/l.
status: valid
status modified: 2019-04-23
accepted date: 2019-04-23
in scheme: BATAELValue

Tanning of Hides and Skins - Cr - BAT11-III
type: Concept
notation: TAN-Cr-BAT11-III
definition: 6, Other activities: 6,3 Tanning of hides and skins where the treatment capacity exceeds 12�tonnes of finished products per day Reducing total chromium to water. The BAT-AEL emission level is < 0,3 - 1 mg/l.
status: valid
status modified: 2019-04-23
accepted date: 2019-04-23
in scheme: BATAELValue

Tanning of Hides and Skins - Cr - BAT12-I
type: Concept
notation: TAN-Cr-BAT12-I
definition: 6, Other activities: 6,3 Tanning of hides and skins where the treatment capacity exceeds 12�tonnes of finished products per day Reducing total chromium to water. The BAT-AEL emission level is < 0,3 - 1 mg/l.
status: valid
status modified: 2019-04-23
accepted date: 2019-04-23
in scheme: BATAELValue

Surface Treatment using organic solvents including preservation of wood and wood products with chemicals - BAT 21
type: Concept
notation: STS-CrVI-BAT21-I
definition: 6, Other activities: 6.7 Surface treatment of substances, objects or products using organic solvents, in particular for dressing, printing, coating, degreasing, waterproofing, sizing, painting, cleaning or impregnating, with an organic solvent consumption capacity of more than 150 kg per hour or more than 200 tonnes per year. 6.10: Preservation of wood and wood products with chemicals with a production capacity exceeding 75 m3 per day other than exclusively treating against sapstain. 6.11: Independently operated treatment of waste water not covered by Directive 91/271/EEC provided that the main pollutant load originates from activities specified in point 6.7 or 6.10 of Annex I to Directive 2010/75/EU; Reducing hexavalent chromium to water. The BAT-AEL emission level is 0.01�0.05 mg/l.
status: valid
status modified: 2025-03-12
accepted date: 2025-03-12
in scheme: BATAELValue

Surface Treatment using organic solvents including preservation of wood and wood products with chemicals - BAT 21
type: Concept
notation: STS-CrVI-BAT21-II
definition: 6, Other activities: 6.7 Surface treatment of substances, objects or products using organic solvents, in particular for dressing, printing, coating, degreasing, waterproofing, sizing, painting, cleaning or impregnating, with an organic solvent consumption capacity of more than 150 kg per hour or more than 200 tonnes per year. 6.10: Preservation of wood and wood products with chemicals with a production capacity exceeding 75 m3 per day other than exclusively treating against sapstain. 6.11: Independently operated treatment of waste water not covered by Directive 91/271/EEC provided that the main pollutant load originates from activities specified in point 6.7 or 6.10 of Annex I to Directive 2010/75/EU; Reducing hexavalent chromium to water. The BAT-AEL emission level is 0.01�0.05 mg/l.
status: valid
status modified: 2025-03-12
accepted date: 2025-03-12
in scheme: BATAELValue

Surface Treatment using organic solvents including preservation of wood and wood products with chemicals - BAT 18
type: Concept
notation: STS-Dust-BAT18
definition: 6, Other activities: 6.7 Surface treatment of substances, objects or products using organic solvents, in particular for dressing, printing, coating, degreasing, waterproofing, sizing, painting, cleaning or impregnating, with an organic solvent consumption capacity of more than 150 kg per hour or more than 200 tonnes per year. 6.10: Preservation of wood and wood products with chemicals with a production capacity exceeding 75 m3 per day other than exclusively treating against sapstain. 6.11: Independently operated treatment of waste water not covered by Directive 91/271/EEC provided that the main pollutant load originates from activities specified in point 6.7 or 6.10 of Annex I to Directive 2010/75/EU; Reducing dust emissions to air. The BAT-AEL emission level is < 1-3 mg/Nm3.
status: valid
status modified: 2025-03-12
accepted date: 2025-03-12
in scheme: BATAELValue

Surface Treatment using organic solvents including preservation of wood and wood products with chemicals - BAT 21
type: Concept
notation: STS-F-BAT21-I
definition: 6, Other activities: 6.7 Surface treatment of substances, objects or products using organic solvents, in particular for dressing, printing, coating, degreasing, waterproofing, sizing, painting, cleaning or impregnating, with an organic solvent consumption capacity of more than 150 kg per hour or more than 200 tonnes per year. 6.10: Preservation of wood and wood products with chemicals with a production capacity exceeding 75 m3 per day other than exclusively treating against sapstain. 6.11: Independently operated treatment of waste water not covered by Directive 91/271/EEC provided that the main pollutant load originates from activities specified in point 6.7 or 6.10 of Annex I to Directive 2010/75/EU; Reducing fluorides to water. The BAT-AEL emission level is 2�25 mg/l.
status: valid
status modified: 2025-03-12
accepted date: 2025-03-12
in scheme: BATAELValue

Surface Treatment using organic solvents including preservation of wood and wood products with chemicals - BAT 21
type: Concept
notation: STS-F-BAT21-II
definition: 6, Other activities: 6.7 Surface treatment of substances, objects or products using organic solvents, in particular for dressing, printing, coating, degreasing, waterproofing, sizing, painting, cleaning or impregnating, with an organic solvent consumption capacity of more than 150 kg per hour or more than 200 tonnes per year. 6.10: Preservation of wood and wood products with chemicals with a production capacity exceeding 75 m3 per day other than exclusively treating against sapstain. 6.11: Independently operated treatment of waste water not covered by Directive 91/271/EEC provided that the main pollutant load originates from activities specified in point 6.7 or 6.10 of Annex I to Directive 2010/75/EU; Reducing fluorides to water. The BAT-AEL emission level is 2�25 mg/l.
status: valid
status modified: 2025-03-12
accepted date: 2025-03-12
in scheme: BATAELValue

Surface Treatment using organic solvents including preservation of wood and wood products with chemicals - BAT 17
type: Concept
notation: STS-NOX-BAT17
definition: 6, Other activities: 6.7 Surface treatment of substances, objects or products using organic solvents, in particular for dressing, printing, coating, degreasing, waterproofing, sizing, painting, cleaning or impregnating, with an organic solvent consumption capacity of more than 150 kg per hour or more than 200 tonnes per year. 6.10: Preservation of wood and wood products with chemicals with a production capacity exceeding 75 m3 per day other than exclusively treating against sapstain. 6.11: Independently operated treatment of waste water not covered by Directive 91/271/EEC provided that the main pollutant load originates from activities specified in point 6.7 or 6.10 of Annex I to Directive 2010/75/EU; Reducing nitrous oxides (Nox) emissions to air. The BAT-AEL emission level is 20�130 mg/Nm3.
status: valid
status modified: 2025-03-12
accepted date: 2025-03-12
in scheme: BATAELValue

Tanning of Hides and Skins - N - BAT10-VII
type: Concept
notation: TAN-N-BAT10-VII
definition: 6, Other activities: 6,3 Tanning of hides and skins where the treatment capacity exceeds 12�tonnes of finished products per day Reducing ammoniacal nitrogen (NH4-N) to water. The BAT-AEL emission level is < 10 mg/l.
status: valid
status modified: 2019-04-23
accepted date: 2019-04-23
in scheme: BATAELValue

Tanning of Hides and Skins - N - BAT10-VIII
type: Concept
notation: TAN-N-BAT10-VIII
definition: 6, Other activities: 6,11 Independently operated treatment of waste water not covered by Directive 91/271/EEC and discharged by an installation undertaking activities covered under 6.3 Reducing ammoniacal nitrogen (NH4-N) to water. The BAT-AEL emission level is < 10 mg/l.
status: valid
status modified: 2019-04-23
accepted date: 2019-04-23
in scheme: BATAELValue

Tanning of Hides and Skins - PM - BAT20
type: Concept
notation: TAN-PM-BAT20
definition: 6, Other activities: 6,3 Tanning of hides and skins where the treatment capacity exceeds 12�tonnes of finished products per day; Extraction ventilation system with bag filters or wet scrubbers; Reducing particulate matter emissions to air. The BAT-AEL emission level is 3 - 6 mg/Nm3.
status: valid
status modified: 2019-04-23
accepted date: 2019-04-23
in scheme: BATAELValue

Tanning of Hides and Skins - S - BAT10-XI
type: Concept
notation: TAN-S-BAT10-XI
definition: 6, Other activities: 6,3 Tanning of hides and skins where the treatment capacity exceeds 12�tonnes of finished products per day Reducing sulphide to water. The BAT-AEL emission level is < 1 mg/l.
status: valid
status modified: 2019-04-23
accepted date: 2019-04-23
in scheme: BATAELValue

Tanning of Hides and Skins - S - BAT10-XII
type: Concept
notation: TAN-S-BAT10-XII
definition: 6, Other activities: 6,11 Independently operated treatment of waste water not covered by Directive 91/271/EEC and discharged by an installation undertaking activities covered under 6.3 Reducing sulphide to water. The BAT-AEL emission level is < 1 mg/l.
status: valid
status modified: 2019-04-23
accepted date: 2019-04-23
in scheme: BATAELValue

Surface Treatment using organic solvents including preservation of wood and wood products with chemicals - BAT 52
type: Concept
notation: STS-NOX-BAT52
definition: 6, Other activities: 6.7 Surface treatment of substances, objects or products using organic solvents, in particular for dressing, printing, coating, degreasing, waterproofing, sizing, painting, cleaning or impregnating, with an organic solvent consumption capacity of more than 150 kg per hour or more than 200 tonnes per year. 6.10: Preservation of wood and wood products with chemicals with a production capacity exceeding 75 m3 per day other than exclusively treating against sapstain. 6.11: Independently operated treatment of waste water not covered by Directive 91/271/EEC provided that the main pollutant load originates from activities specified in point 6.7 or 6.10 of Annex I to Directive 2010/75/EU; Reducing nitrous oxides (Nox) emissions to air. The BAT-AEL emission level is 20�130 mg/Nm3.
status: valid
status modified: 2025-03-12
accepted date: 2025-03-12
in scheme: BATAELValue

Surface Treatment using organic solvents including preservation of wood and wood products with chemicals - BAT 21
type: Concept
notation: STS-Ni-BAT21-I
definition: 6, Other activities: 6.7 Surface treatment of substances, objects or products using organic solvents, in particular for dressing, printing, coating, degreasing, waterproofing, sizing, painting, cleaning or impregnating, with an organic solvent consumption capacity of more than 150 kg per hour or more than 200 tonnes per year. 6.10: Preservation of wood and wood products with chemicals with a production capacity exceeding 75 m3 per day other than exclusively treating against sapstain. 6.11: Independently operated treatment of waste water not covered by Directive 91/271/EEC provided that the main pollutant load originates from activities specified in point 6.7 or 6.10 of Annex I to Directive 2010/75/EU; Reducing nickel to water. The BAT-AEL emission level is 0.05�0.4 mg/l.
status: valid
status modified: 2025-03-12
accepted date: 2025-03-12
in scheme: BATAELValue

Surface Treatment using organic solvents including preservation of wood and wood products with chemicals - BAT 21
type: Concept
notation: STS-Ni-BAT21-II
definition: 6, Other activities: 6.7 Surface treatment of substances, objects or products using organic solvents, in particular for dressing, printing, coating, degreasing, waterproofing, sizing, painting, cleaning or impregnating, with an organic solvent consumption capacity of more than 150 kg per hour or more than 200 tonnes per year. 6.10: Preservation of wood and wood products with chemicals with a production capacity exceeding 75 m3 per day other than exclusively treating against sapstain. 6.11: Independently operated treatment of waste water not covered by Directive 91/271/EEC provided that the main pollutant load originates from activities specified in point 6.7 or 6.10 of Annex I to Directive 2010/75/EU; Reducing nickel to water. The BAT-AEL emission level is 0.05�0.4 mg/l.
status: valid
status modified: 2025-03-12
accepted date: 2025-03-12
in scheme: BATAELValue

Surface Treatment using organic solvents including preservation of wood and wood products with chemicals - BAT 51
type: Concept
notation: STS-PAH-BAT51
definition: 6, Other activities: 6.7 Surface treatment of substances, objects or products using organic solvents, in particular for dressing, printing, coating, degreasing, waterproofing, sizing, painting, cleaning or impregnating, with an organic solvent consumption capacity of more than 150 kg per hour or more than 200 tonnes per year. 6.10: Preservation of wood and wood products with chemicals with a production capacity exceeding 75 m3 per day other than exclusively treating against sapstain. 6.11: Independently operated treatment of waste water not covered by Directive 91/271/EEC provided that the main pollutant load originates from activities specified in point 6.7 or 6.10 of Annex I to Directive 2010/75/EU; Reducing polycyclic aromatic hydrocarbons emissions to air. The BAT-AEL emission level is < 1 mg/Nm3.
status: valid
status modified: 2025-03-12
accepted date: 2025-03-12
in scheme: BATAELValue

Surface Treatment using organic solvents including preservation of wood and wood products with chemicals - BAT 21
type: Concept
notation: STS-TSS-BAT21
definition: 6, Other activities: 6.7 Surface treatment of substances, objects or products using organic solvents, in particular for dressing, printing, coating, degreasing, waterproofing, sizing, painting, cleaning or impregnating, with an organic solvent consumption capacity of more than 150 kg per hour or more than 200 tonnes per year. 6.10: Preservation of wood and wood products with chemicals with a production capacity exceeding 75 m3 per day other than exclusively treating against sapstain. 6.11: Independently operated treatment of waste water not covered by Directive 91/271/EEC provided that the main pollutant load originates from activities specified in point 6.7 or 6.10 of Annex I to Directive 2010/75/EU; Reducing total suspended solids to water. The BAT-AEL emission level is 5�30 mg/l.
status: valid
status modified: 2025-03-12
accepted date: 2025-03-12
in scheme: BATAELValue

Surface Treatment using organic solvents including preservation of wood and wood products with chemicals - BAT 24
type: Concept
notation: STS-TVOC-BAT24-I
definition: 6, Other activities: 6.7 Surface treatment of substances, objects or products using organic solvents, in particular for dressing, printing, coating, degreasing, waterproofing, sizing, painting, cleaning or impregnating, with an organic solvent consumption capacity of more than 150 kg per hour or more than 200 tonnes per year. 6.10: Preservation of wood and wood products with chemicals with a production capacity exceeding 75 m3 per day other than exclusively treating against sapstain. 6.11: Independently operated treatment of waste water not covered by Directive 91/271/EEC provided that the main pollutant load originates from activities specified in point 6.7 or 6.10 of Annex I to Directive 2010/75/EU; Reducing total volatile organic compounds emissions to air. The BAT-AEL emission level is 8�15 g VOCs per m2 of surface area.
status: valid
status modified: 2025-03-12
accepted date: 2025-03-12
in scheme: BATAELValue

Tanning of Hides and Skins - S - BAT12-II
type: Concept
notation: TAN-S-BAT12-II
definition: 6, Other activities: 6,3 Tanning of hides and skins where the treatment capacity exceeds 12�tonnes of finished products per day Reducing sulphide to water. The BAT-AEL emission level is < 1 mg/l.
status: valid
status modified: 2019-04-23
accepted date: 2019-04-23
in scheme: BATAELValue

Tanning of Hides and Skins - SS - BAT10-V
type: Concept
notation: TAN-SS-BAT10-V
definition: 6, Other activities: 6,3 Tanning of hides and skins where the treatment capacity exceeds 12�tonnes of finished products per day Reducing suspended solids to water. The BAT-AEL emission level is < 35 mg/l.
status: valid
status modified: 2019-04-23
accepted date: 2019-04-23
in scheme: BATAELValue

Tanning of Hides and Skins - SS - BAT10-VI
type: Concept
notation: TAN-SS-BAT10-VI
definition: 6, Other activities: 6,11 Independently operated treatment of waste water not covered by Directive 91/271/EEC and discharged by an installation undertaking activities covered under 6.3 Reducing suspended solids to water. The BAT-AEL emission level is < 35 mg/l.
status: valid
status modified: 2019-04-23
accepted date: 2019-04-23
in scheme: BATAELValue

Tanning of Hides and Skins - TC - BAT19
type: Concept
notation: TAN-TC-BAT19
definition: 6, Other activities: 6,3 Tanning of hides and skins where the treatment capacity exceeds 12�tonnes of finished products per day; Techniques (a)-(b) (see table); Reducing volatile organic compounds (VOC) emissions to air. The BAT-AEL emission level is 9 - 23 g/m2.
status: valid
status modified: 2019-04-23
accepted date: 2019-04-23
in scheme: BATAELValue

Production of Wood-based Panels - C - BAT17-IV
type: Concept
notation: WBP-C-BAT17-IV
definition: 6, Other activities: 6,1 Production in industrial installations of: (c) one or more of the following wood-based panels: oriented strand board, particleboard or fibreboard with a production capacity exceeding 600 m3 per day; For PB and all dryer types; Reducing total Volatile Organic Compounds (TVOC) emissions to air. The BAT-AEL emission level is < 20 - 200 mg/Nm3.
status: valid
status modified: 2019-04-23
accepted date: 2019-04-23
in scheme: BATAELValue

Surface Treatment using organic solvents including preservation of wood and wood products with chemicals - BAT 24
type: Concept
notation: STS-TVOC-BAT24-II
definition: 6, Other activities: 6.7 Surface treatment of substances, objects or products using organic solvents, in particular for dressing, printing, coating, degreasing, waterproofing, sizing, painting, cleaning or impregnating, with an organic solvent consumption capacity of more than 150 kg per hour or more than 200 tonnes per year. 6.10: Preservation of wood and wood products with chemicals with a production capacity exceeding 75 m3 per day other than exclusively treating against sapstain. 6.11: Independently operated treatment of waste water not covered by Directive 91/271/EEC provided that the main pollutant load originates from activities specified in point 6.7 or 6.10 of Annex I to Directive 2010/75/EU; Reducing total volatile organic compounds emissions to air. The BAT-AEL emission level is 8�30 g VOCs per m2 of surface area.
status: valid
status modified: 2025-03-12
accepted date: 2025-03-12
in scheme: BATAELValue

Surface Treatment using organic solvents including preservation of wood and wood products with chemicals - BAT 24
type: Concept
notation: STS-TVOC-BAT24-III
definition: 6, Other activities: 6.7 Surface treatment of substances, objects or products using organic solvents, in particular for dressing, printing, coating, degreasing, waterproofing, sizing, painting, cleaning or impregnating, with an organic solvent consumption capacity of more than 150 kg per hour or more than 200 tonnes per year. 6.10: Preservation of wood and wood products with chemicals with a production capacity exceeding 75 m3 per day other than exclusively treating against sapstain. 6.11: Independently operated treatment of waste water not covered by Directive 91/271/EEC provided that the main pollutant load originates from activities specified in point 6.7 or 6.10 of Annex I to Directive 2010/75/EU; Reducing total volatile organic compounds emissions to air. The BAT-AEL emission level is 10�20 g VOCs per m2 of surface area.
status: valid
status modified: 2025-03-12
accepted date: 2025-03-12
in scheme: BATAELValue

Surface Treatment using organic solvents including preservation of wood and wood products with chemicals - BAT 24
type: Concept
notation: STS-TVOC-BAT24-IV
definition: 6, Other activities: 6.7 Surface treatment of substances, objects or products using organic solvents, in particular for dressing, printing, coating, degreasing, waterproofing, sizing, painting, cleaning or impregnating, with an organic solvent consumption capacity of more than 150 kg per hour or more than 200 tonnes per year. 6.10: Preservation of wood and wood products with chemicals with a production capacity exceeding 75 m3 per day other than exclusively treating against sapstain. 6.11: Independently operated treatment of waste water not covered by Directive 91/271/EEC provided that the main pollutant load originates from activities specified in point 6.7 or 6.10 of Annex I to Directive 2010/75/EU; Reducing total volatile organic compounds emissions to air. The BAT-AEL emission level is 10�40 g VOCs per m2 of surface area.
status: valid
status modified: 2025-03-12
accepted date: 2025-03-12
in scheme: BATAELValue

Surface Treatment using organic solvents including preservation of wood and wood products with chemicals - BAT 24
type: Concept
notation: STS-TVOC-BAT24-IX
definition: 6, Other activities: 6.7 Surface treatment of substances, objects or products using organic solvents, in particular for dressing, printing, coating, degreasing, waterproofing, sizing, painting, cleaning or impregnating, with an organic solvent consumption capacity of more than 150 kg per hour or more than 200 tonnes per year. 6.10: Preservation of wood and wood products with chemicals with a production capacity exceeding 75 m3 per day other than exclusively treating against sapstain. 6.11: Independently operated treatment of waste water not covered by Directive 91/271/EEC provided that the main pollutant load originates from activities specified in point 6.7 or 6.10 of Annex I to Directive 2010/75/EU; Reducing total volatile organic compounds emissions to air. The BAT-AEL emission level is < 100 g VOCs per m2 of surface area.
status: valid
status modified: 2025-03-12
accepted date: 2025-03-12
in scheme: BATAELValue

Surface Treatment using organic solvents including preservation of wood and wood products with chemicals - BAT 24
type: Concept
notation: STS-TVOC-BAT24-V
definition: 6, Other activities: 6.7 Surface treatment of substances, objects or products using organic solvents, in particular for dressing, printing, coating, degreasing, waterproofing, sizing, painting, cleaning or impregnating, with an organic solvent consumption capacity of more than 150 kg per hour or more than 200 tonnes per year. 6.10: Preservation of wood and wood products with chemicals with a production capacity exceeding 75 m3 per day other than exclusively treating against sapstain. 6.11: Independently operated treatment of waste water not covered by Directive 91/271/EEC provided that the main pollutant load originates from activities specified in point 6.7 or 6.10 of Annex I to Directive 2010/75/EU; Reducing total volatile organic compounds emissions to air. The BAT-AEL emission level is 8�20 g VOCs per m2 of surface area.
status: valid
status modified: 2025-03-12
accepted date: 2025-03-12
in scheme: BATAELValue

Production of Wood-based Panels - C - BAT17-V
type: Concept
notation: WBP-C-BAT17-V
definition: 6, Other activities: 6,1 Production in industrial installations of: (c) one or more of the following wood-based panels: oriented strand board, particleboard or fibreboard with a production capacity exceeding 600 m3 per day; For OSB and all dryer types; Reducing total Volatile Organic Compounds (TVOC) emissions to air. The BAT-AEL emission level is 10 - 400 mg/Nm3.
status: valid
status modified: 2019-04-23
accepted date: 2019-04-23
in scheme: BATAELValue

Production of Wood-based Panels - C - BAT17-VI
type: Concept
notation: WBP-C-BAT17-VI
definition: 6, Other activities: 6,1 Production in industrial installations of: (c) one or more of the following wood-based panels: oriented strand board, particleboard or fibreboard with a production capacity exceeding 600 m3 per day; For fibre and all dryer types; Reducing total Volatile Organic Compounds (TVOC) emissions to air. The BAT-AEL emission level is < 20 - 120 mg/Nm3.
status: valid
status modified: 2019-04-23
accepted date: 2019-04-23
in scheme: BATAELValue

Production of Wood-based Panels - C - BAT19-II
type: Concept
notation: WBP-C-BAT19-II
definition: 6, Other activities: 6,1 Production in industrial installations of: (c) one or more of the following wood-based panels: oriented strand board, particleboard or fibreboard with a production capacity exceeding 600 m3 per day; Techniques (a)-(f) (see table); Reducing total Volatile Organic Compounds (TVOC) emissions to air. The BAT-AEL emission level is 10 - 100 mg/Nm3.
status: valid
status modified: 2019-04-23
accepted date: 2019-04-23
in scheme: BATAELValue

Production of Wood-based Panels - C - BAT21-I
type: Concept
notation: WBP-C-BAT21-I
definition: 6, Other activities: 6,1 Production in industrial installations of: (c) one or more of the following wood-based panels: oriented strand board, particleboard or fibreboard with a production capacity exceeding 600 m3 per day; Techniques (a)-(e) (see table); Reducing total Volatile Organic Compounds (TVOC) emissions to air. The BAT-AEL emission level is 5 - 30 mg/Nm3.
status: valid
status modified: 2019-04-23
accepted date: 2019-04-23
in scheme: BATAELValue

Production of Wood-based Panels - CH2O - BAT17-IX
type: Concept
notation: WBP-CH2O-BAT17-IX
definition: 6, Other activities: 6,1 Production in industrial installations of: (c) one or more of the following wood-based panels: oriented strand board, particleboard or fibreboard with a production capacity exceeding 600 m3 per day; For fibre and all dryer types; Reducing formaldehyde emissions to air. The BAT-AEL emission level is < 5 - 15 mg/Nm3.
status: valid
status modified: 2019-04-23
accepted date: 2019-04-23
in scheme: BATAELValue

Surface Treatment using organic solvents including preservation of wood and wood products with chemicals - BAT 24
type: Concept
notation: STS-TVOC-BAT24-VI
definition: 6, Other activities: 6.7 Surface treatment of substances, objects or products using organic solvents, in particular for dressing, printing, coating, degreasing, waterproofing, sizing, painting, cleaning or impregnating, with an organic solvent consumption capacity of more than 150 kg per hour or more than 200 tonnes per year. 6.10: Preservation of wood and wood products with chemicals with a production capacity exceeding 75 m3 per day other than exclusively treating against sapstain. 6.11: Independently operated treatment of waste water not covered by Directive 91/271/EEC provided that the main pollutant load originates from activities specified in point 6.7 or 6.10 of Annex I to Directive 2010/75/EU; Reducing total volatile organic compounds emissions to air. The BAT-AEL emission level is 8�40 g VOCs per m2 of surface area.
status: valid
status modified: 2025-03-12
accepted date: 2025-03-12
in scheme: BATAELValue

Surface Treatment using organic solvents including preservation of wood and wood products with chemicals - BAT 24
type: Concept
notation: STS-TVOC-BAT24-VII
definition: 6, Other activities: 6.7 Surface treatment of substances, objects or products using organic solvents, in particular for dressing, printing, coating, degreasing, waterproofing, sizing, painting, cleaning or impregnating, with an organic solvent consumption capacity of more than 150 kg per hour or more than 200 tonnes per year. 6.10: Preservation of wood and wood products with chemicals with a production capacity exceeding 75 m3 per day other than exclusively treating against sapstain. 6.11: Independently operated treatment of waste water not covered by Directive 91/271/EEC provided that the main pollutant load originates from activities specified in point 6.7 or 6.10 of Annex I to Directive 2010/75/EU; Reducing total volatile organic compounds emissions to air. The BAT-AEL emission level is 10�40 g VOCs per m2 of surface area.
status: valid
status modified: 2025-03-12
accepted date: 2025-03-12
in scheme: BATAELValue

Surface Treatment using organic solvents including preservation of wood and wood products with chemicals - BAT 24
type: Concept
notation: STS-TVOC-BAT24-VIII
definition: 6, Other activities: 6.7 Surface treatment of substances, objects or products using organic solvents, in particular for dressing, printing, coating, degreasing, waterproofing, sizing, painting, cleaning or impregnating, with an organic solvent consumption capacity of more than 150 kg per hour or more than 200 tonnes per year. 6.10: Preservation of wood and wood products with chemicals with a production capacity exceeding 75 m3 per day other than exclusively treating against sapstain. 6.11: Independently operated treatment of waste water not covered by Directive 91/271/EEC provided that the main pollutant load originates from activities specified in point 6.7 or 6.10 of Annex I to Directive 2010/75/EU; Reducing total volatile organic compounds emissions to air. The BAT-AEL emission level is 10�50 g VOCs per m2 of surface area.
status: valid
status modified: 2025-03-12
accepted date: 2025-03-12
in scheme: BATAELValue

Surface Treatment using organic solvents including preservation of wood and wood products with chemicals - BAT 24
type: Concept
notation: STS-TVOC-BAT24-X
definition: 6, Other activities: 6.7 Surface treatment of substances, objects or products using organic solvents, in particular for dressing, printing, coating, degreasing, waterproofing, sizing, painting, cleaning or impregnating, with an organic solvent consumption capacity of more than 150 kg per hour or more than 200 tonnes per year. 6.10: Preservation of wood and wood products with chemicals with a production capacity exceeding 75 m3 per day other than exclusively treating against sapstain. 6.11: Independently operated treatment of waste water not covered by Directive 91/271/EEC provided that the main pollutant load originates from activities specified in point 6.7 or 6.10 of Annex I to Directive 2010/75/EU; Reducing total volatile organic compounds emissions to air. The BAT-AEL emission level is 90�150 g VOCs per m2 of surface area.
status: valid
status modified: 2025-03-12
accepted date: 2025-03-12
in scheme: BATAELValue

Surface Treatment using organic solvents including preservation of wood and wood products with chemicals - BAT 24
type: Concept
notation: STS-TVOC-BAT24-XI
definition: 6, Other activities: 6.7 Surface treatment of substances, objects or products using organic solvents, in particular for dressing, printing, coating, degreasing, waterproofing, sizing, painting, cleaning or impregnating, with an organic solvent consumption capacity of more than 150 kg per hour or more than 200 tonnes per year. 6.10: Preservation of wood and wood products with chemicals with a production capacity exceeding 75 m3 per day other than exclusively treating against sapstain. 6.11: Independently operated treatment of waste water not covered by Directive 91/271/EEC provided that the main pollutant load originates from activities specified in point 6.7 or 6.10 of Annex I to Directive 2010/75/EU; Reducing total volatile organic compounds emissions to air. The BAT-AEL emission level is < 0.05�0.2 kg VOCs per kg of solid mass.
status: valid
status modified: 2025-03-12
accepted date: 2025-03-12
in scheme: BATAELValue

Production of Wood-based Panels - CH2O - BAT17-VII
type: Concept
notation: WBP-CH2O-BAT17-VII
definition: 6, Other activities: 6,1 Production in industrial installations of: (c) one or more of the following wood-based panels: oriented strand board, particleboard or fibreboard with a production capacity exceeding 600 m3 per day; For PB and all dryer types; Reducing formaldehyde emissions to air. The BAT-AEL emission level is < 5 - 10 mg/Nm3.
status: valid
status modified: 2019-04-23
accepted date: 2019-04-23
in scheme: BATAELValue

Production of Wood-based Panels - CH2O - BAT17-VIII
type: Concept
notation: WBP-CH2O-BAT17-VIII
definition: 6, Other activities: 6,1 Production in industrial installations of: (c) one or more of the following wood-based panels: oriented strand board, particleboard or fibreboard with a production capacity exceeding 600 m3 per day; For OSB and all dryer types; Reducing formaldehyde emissions to air. The BAT-AEL emission level is < 5 - 20 mg/Nm3.
status: valid
status modified: 2019-04-23
accepted date: 2019-04-23
in scheme: BATAELValue

Production of Wood-based Panels - CH2O - BAT19-III
type: Concept
notation: WBP-CH2O-BAT19-III
definition: 6, Other activities: 6,1 Production in industrial installations of: (c) one or more of the following wood-based panels: oriented strand board, particleboard or fibreboard with a production capacity exceeding 600 m3 per day; Techniques (a)-(f) (see table); Reducing formaldehyde emissions to air. The BAT-AEL emission level is 2 - 15 mg/Nm3.
status: valid
status modified: 2019-04-23
accepted date: 2019-04-23
in scheme: BATAELValue

Production of Wood-based Panels - CH2O - BAT21-II
type: Concept
notation: WBP-CH2O-BAT21-II
definition: 6, Other activities: 6,1 Production in industrial installations of: (c) one or more of the following wood-based panels: oriented strand board, particleboard or fibreboard with a production capacity exceeding 600 m3 per day; Techniques (a)-(e) (see table); Reducing formaldehyde emissions to air. The BAT-AEL emission level is < 5 - 10 mg/Nm3.
status: valid
status modified: 2019-04-23
accepted date: 2019-04-23
in scheme: BATAELValue

Production of Wood-based Panels - COD - BAT27-II
type: Concept
notation: WBP-COD-BAT27-II
definition: 6, Other activities: 6,1 Production in industrial installations of: (c) one or more of the following wood-based panels: oriented strand board, particleboard or fibreboard with a production capacity exceeding 600 m3 per day. Reducing chemical oxygen demand (COD) to water. The BAT-AEL emission level is 20 - 200 mg/l.
status: valid
status modified: 2019-04-23
accepted date: 2019-04-23
in scheme: BATAELValue

Surface Treatment using organic solvents including preservation of wood and wood products with chemicals - BAT 24
type: Concept
notation: STS-TVOC-BAT24-XII
definition: 6, Other activities: 6.7 Surface treatment of substances, objects or products using organic solvents, in particular for dressing, printing, coating, degreasing, waterproofing, sizing, painting, cleaning or impregnating, with an organic solvent consumption capacity of more than 150 kg per hour or more than 200 tonnes per year. 6.10: Preservation of wood and wood products with chemicals with a production capacity exceeding 75 m3 per day other than exclusively treating against sapstain. 6.11: Independently operated treatment of waste water not covered by Directive 91/271/EEC provided that the main pollutant load originates from activities specified in point 6.7 or 6.10 of Annex I to Directive 2010/75/EU; Reducing total volatile organic compounds emissions to air. The BAT-AEL emission level is < 0.05�0.3 kg VOCs per kg of solid mass.
status: valid
status modified: 2025-03-12
accepted date: 2025-03-12
in scheme: BATAELValue

Surface Treatment using organic solvents including preservation of wood and wood products with chemicals - BAT 24
type: Concept
notation: STS-TVOC-BAT24-XIII
definition: 6, Other activities: 6.7 Surface treatment of substances, objects or products using organic solvents, in particular for dressing, printing, coating, degreasing, waterproofing, sizing, painting, cleaning or impregnating, with an organic solvent consumption capacity of more than 150 kg per hour or more than 200 tonnes per year. 6.10: Preservation of wood and wood products with chemicals with a production capacity exceeding 75 m3 per day other than exclusively treating against sapstain. 6.11: Independently operated treatment of waste water not covered by Directive 91/271/EEC provided that the main pollutant load originates from activities specified in point 6.7 or 6.10 of Annex I to Directive 2010/75/EU; Reducing total volatile organic compounds emissions to air. The BAT-AEL emission level is < 1�10 % of the solvent input.
status: valid
status modified: 2025-03-12
accepted date: 2025-03-12
in scheme: BATAELValue

Surface Treatment using organic solvents including preservation of wood and wood products with chemicals - BAT 24
type: Concept
notation: STS-TVOC-BAT24-XIV
definition: 6, Other activities: 6.7 Surface treatment of substances, objects or products using organic solvents, in particular for dressing, printing, coating, degreasing, waterproofing, sizing, painting, cleaning or impregnating, with an organic solvent consumption capacity of more than 150 kg per hour or more than 200 tonnes per year. 6.10: Preservation of wood and wood products with chemicals with a production capacity exceeding 75 m3 per day other than exclusively treating against sapstain. 6.11: Independently operated treatment of waste water not covered by Directive 91/271/EEC provided that the main pollutant load originates from activities specified in point 6.7 or 6.10 of Annex I to Directive 2010/75/EU; Reducing total volatile organic compounds emissions to air. The BAT-AEL emission level is 1�20 mg C/Nm3.
status: valid
status modified: 2025-03-12
accepted date: 2025-03-12
in scheme: BATAELValue

Surface Treatment using organic solvents including preservation of wood and wood products with chemicals - BAT 24
type: Concept
notation: STS-TVOC-BAT24-XV
definition: 6, Other activities: 6.7 Surface treatment of substances, objects or products using organic solvents, in particular for dressing, printing, coating, degreasing, waterproofing, sizing, painting, cleaning or impregnating, with an organic solvent consumption capacity of more than 150 kg per hour or more than 200 tonnes per year. 6.10: Preservation of wood and wood products with chemicals with a production capacity exceeding 75 m3 per day other than exclusively treating against sapstain. 6.11: Independently operated treatment of waste water not covered by Directive 91/271/EEC provided that the main pollutant load originates from activities specified in point 6.7 or 6.10 of Annex I to Directive 2010/75/EU; Reducing total volatile organic compounds emissions to air. The BAT-AEL emission level is 35 mg C/Nm3.
status: valid
status modified: 2025-03-12
accepted date: 2025-03-12
in scheme: BATAELValue

Surface Treatment using organic solvents including preservation of wood and wood products with chemicals - BAT 25
type: Concept
notation: STS-TVOC-BAT25
definition: 6, Other activities: 6.7 Surface treatment of substances, objects or products using organic solvents, in particular for dressing, printing, coating, degreasing, waterproofing, sizing, painting, cleaning or impregnating, with an organic solvent consumption capacity of more than 150 kg per hour or more than 200 tonnes per year. 6.10: Preservation of wood and wood products with chemicals with a production capacity exceeding 75 m3 per day other than exclusively treating against sapstain. 6.11: Independently operated treatment of waste water not covered by Directive 91/271/EEC provided that the main pollutant load originates from activities specified in point 6.7 or 6.10 of Annex I to Directive 2010/75/EU; Reducing total volatile organic compounds emissions to air. The BAT-AEL emission level is < 0.375 kg VOCs per kg of solid mass input.
status: valid
status modified: 2025-03-12
accepted date: 2025-03-12
in scheme: BATAELValue

Production of Wood-based Panels - NO2 - BAT18
type: Concept
notation: WBP-NO2-BAT18
definition: 6, Other activities: 6,1 Production in industrial installations of: (c) one or more of the following wood-based panels: oriented strand board, particleboard or fibreboard with a production capacity exceeding 600 m3 per day; Techniques (a)-(b) (see table); Reducing nitrogen oxides (NOx) emissions to air. The BAT-AEL emission level is 30 - 250 mg/Nm3.
status: valid
status modified: 2019-04-23
accepted date: 2019-04-23
in scheme: BATAELValue

Production of Wood-based Panels - TPM - BAT17-I
type: Concept
notation: WBP-TPM-BAT17-I
definition: 6, Other activities: 6,1 Production in industrial installations of: (c) one or more of the following wood-based panels: oriented strand board, particleboard or fibreboard with a production capacity exceeding 600 m3 per day; For PB or OSB and directly heated dryer; Reducing dust emissions to air. The BAT-AEL emission level is 3 - 30 mg/Nm3.
status: valid
status modified: 2019-04-23
accepted date: 2019-04-23
in scheme: BATAELValue

Production of Wood-based Panels - TPM - BAT17-II
type: Concept
notation: WBP-TPM-BAT17-II
definition: 6, Other activities: 6,1 Production in industrial installations of: (c) one or more of the following wood-based panels: oriented strand board, particleboard or fibreboard with a production capacity exceeding 600 m3 per day; For PB or OSB and indirectly heated dryer; Reducing dust emissions to air. The BAT-AEL emission level is 3 - 10 mg/Nm3.
status: valid
status modified: 2019-04-23
accepted date: 2019-04-23
in scheme: BATAELValue

Production of Wood-based Panels - TPM - BAT17-III
type: Concept
notation: WBP-TPM-BAT17-III
definition: 6, Other activities: 6,1 Production in industrial installations of: (c) one or more of the following wood-based panels: oriented strand board, particleboard or fibreboard with a production capacity exceeding 600 m3 per day; For fibre and all dryer types; Reducing dust emissions to air. The BAT-AEL emission level is 3 - 20 mg/Nm3.
status: valid
status modified: 2019-04-23
accepted date: 2019-04-23
in scheme: BATAELValue

Production of Wood-based Panels - TPM - BAT19-I
type: Concept
notation: WBP-TPM-BAT19-I
definition: 6, Other activities: 6,1 Production in industrial installations of: (c) one or more of the following wood-based panels: oriented strand board, particleboard or fibreboard with a production capacity exceeding 600 m3 per day; Techniques (a)-(f) (see table); Reducing dust emissions to air. The BAT-AEL emission level is 3 - 15 mg/Nm3.
status: valid
status modified: 2019-04-23
accepted date: 2019-04-23
in scheme: BATAELValue

Production of Wood-based Panels - TPM - BAT20
type: Concept
notation: WBP-TPM-BAT20
definition: 6, Other activities: 6,1 Production in industrial installations of: (c) one or more of the following wood-based panels: oriented strand board, particleboard or fibreboard with a production capacity exceeding 600 m3 per day; Bag filter or cyclofilter; Reducing dust emissions to air. The BAT-AEL emission level is < 3 - 5 mg/Nm3.
status: valid
status modified: 2019-04-23
accepted date: 2019-04-23
in scheme: BATAELValue

Surface Treatment using organic solvents including preservation of wood and wood products with chemicals - BAT 26
type: Concept
notation: STS-TVOC-BAT26-I
definition: 6, Other activities: 6.7 Surface treatment of substances, objects or products using organic solvents, in particular for dressing, printing, coating, degreasing, waterproofing, sizing, painting, cleaning or impregnating, with an organic solvent consumption capacity of more than 150 kg per hour or more than 200 tonnes per year. 6.10: Preservation of wood and wood products with chemicals with a production capacity exceeding 75 m3 per day other than exclusively treating against sapstain. 6.11: Independently operated treatment of waste water not covered by Directive 91/271/EEC provided that the main pollutant load originates from activities specified in point 6.7 or 6.10 of Annex I to Directive 2010/75/EU; Reducing total volatile organic compounds emissions to air. The BAT-AEL emission level is 0.2�0.58 kg VOCs per kg of solid mass input.
status: valid
status modified: 2025-03-12
accepted date: 2025-03-12
in scheme: BATAELValue

Surface Treatment using organic solvents including preservation of wood and wood products with chemicals - BAT 26
type: Concept
notation: STS-TVOC-BAT26-II
definition: 6, Other activities: 6.7 Surface treatment of substances, objects or products using organic solvents, in particular for dressing, printing, coating, degreasing, waterproofing, sizing, painting, cleaning or impregnating, with an organic solvent consumption capacity of more than 150 kg per hour or more than 200 tonnes per year. 6.10: Preservation of wood and wood products with chemicals with a production capacity exceeding 75 m3 per day other than exclusively treating against sapstain. 6.11: Independently operated treatment of waste water not covered by Directive 91/271/EEC provided that the main pollutant load originates from activities specified in point 6.7 or 6.10 of Annex I to Directive 2010/75/EU; Reducing total volatile organic compounds emissions to air. The BAT-AEL emission level is < 1�3 % of the solvent input.
status: valid
status modified: 2025-03-12
accepted date: 2025-03-12
in scheme: BATAELValue

Surface Treatment using organic solvents including preservation of wood and wood products with chemicals - BAT 26
type: Concept
notation: STS-TVOC-BAT26-III
definition: 6, Other activities: 6.7 Surface treatment of substances, objects or products using organic solvents, in particular for dressing, printing, coating, degreasing, waterproofing, sizing, painting, cleaning or impregnating, with an organic solvent consumption capacity of more than 150 kg per hour or more than 200 tonnes per year. 6.10: Preservation of wood and wood products with chemicals with a production capacity exceeding 75 m3 per day other than exclusively treating against sapstain. 6.11: Independently operated treatment of waste water not covered by Directive 91/271/EEC provided that the main pollutant load originates from activities specified in point 6.7 or 6.10 of Annex I to Directive 2010/75/EU; Reducing total volatile organic compounds emissions to air. The BAT-AEL emission level is 1�20 mg C/Nm3.
status: valid
status modified: 2025-03-12
accepted date: 2025-03-12
in scheme: BATAELValue

Surface Treatment using organic solvents including preservation of wood and wood products with chemicals - BAT 26
type: Concept
notation: STS-TVOC-BAT26-IV
definition: 6, Other activities: 6.7 Surface treatment of substances, objects or products using organic solvents, in particular for dressing, printing, coating, degreasing, waterproofing, sizing, painting, cleaning or impregnating, with an organic solvent consumption capacity of more than 150 kg per hour or more than 200 tonnes per year. 6.10: Preservation of wood and wood products with chemicals with a production capacity exceeding 75 m3 per day other than exclusively treating against sapstain. 6.11: Independently operated treatment of waste water not covered by Directive 91/271/EEC provided that the main pollutant load originates from activities specified in point 6.7 or 6.10 of Annex I to Directive 2010/75/EU; Reducing total volatile organic compounds emissions to air. The BAT-AEL emission level is 50 mg C/Nm3.
status: valid
status modified: 2025-03-12
accepted date: 2025-03-12
in scheme: BATAELValue

Surface Treatment using organic solvents including preservation of wood and wood products with chemicals - BAT 26
type: Concept
notation: STS-TVOC-BAT26-IX
definition: 6, Other activities: 6.7 Surface treatment of substances, objects or products using organic solvents, in particular for dressing, printing, coating, degreasing, waterproofing, sizing, painting, cleaning or impregnating, with an organic solvent consumption capacity of more than 150 kg per hour or more than 200 tonnes per year. 6.10: Preservation of wood and wood products with chemicals with a production capacity exceeding 75 m3 per day other than exclusively treating against sapstain. 6.11: Independently operated treatment of waste water not covered by Directive 91/271/EEC provided that the main pollutant load originates from activities specified in point 6.7 or 6.10 of Annex I to Directive 2010/75/EU; Reducing total volatile organic compounds emissions to air. The BAT-AEL emission level is 5�20 mg C/Nm3.
status: valid
status modified: 2025-03-12
accepted date: 2025-03-12
in scheme: BATAELValue

Production of Wood-based Panels - TSS - BAT25
type: Concept
notation: WBP-TSS-BAT25
definition: 6, Other activities: 6,1 Production in industrial installations of: (c) one or more of the following wood-based panels: oriented strand board, particleboard or fibreboard with a production capacity exceeding 600 m3 per day. Reducing total suspended solids (TSS) to water. The BAT-AEL emission level is 10 - 40 mg/l.
status: valid
status modified: 2019-04-23
accepted date: 2019-04-23
in scheme: BATAELValue

Production of Wood-based Panels - TSS - BAT27-I
type: Concept
notation: WBP-TSS-BAT27-I
definition: 6, Other activities: 6,1 Production in industrial installations of: (c) one or more of the following wood-based panels: oriented strand board, particleboard or fibreboard with a production capacity exceeding 600 m3 per day. Reducing total suspended solids (TSS) to water. The BAT-AEL emission level is 5 - 35 mg/l.
status: valid
status modified: 2019-04-23
accepted date: 2019-04-23
in scheme: BATAELValue

Waste Incineration - As - BAT34-III
type: Concept
notation: WI-As-BAT34-III
definition: Waste management reducing arsenic to water. The BAT-AEL emission level is 0.01�0.05 mg/l.
status: valid
status modified: 2020-05-25
accepted date: 2020-05-25
in scheme: BATAELValue

Waste Incineration - As - BAT34-XVI
type: Concept
notation: WI-As-BAT34-XVI
definition: Waste management reducing arsenic to water. The BAT-AEL emission level is 0.01�0.05 mg/l.
status: valid
status modified: 2020-05-25
accepted date: 2020-05-25
in scheme: BATAELValue

Waste Incineration - C - BAT30-I
type: Concept
notation: WI-C-BAT30-I
definition: Waste management reducing volatile organic compounds (VOC) emissions to air. The BAT-AEL emission level is < 3�10 mg/Nm3.
status: valid
status modified: 2020-05-25
accepted date: 2020-05-25
in scheme: BATAELValue

Waste Incineration - CO - BAT29-III
type: Concept
notation: WI-CO-BAT29-III
definition: Waste management reducing carbon monoxide emissions to air. The BAT-AEL emission level is 10�50mg/Nm3.
status: valid
status modified: 2020-05-25
accepted date: 2020-05-25
in scheme: BATAELValue

Waste Incineration - Cd - BAT34-IV
type: Concept
notation: WI-Cd-BAT34-IV
definition: Waste management reducing cadmium to water. The BAT-AEL emission level is 0.005�0.03 mg/l.
status: valid
status modified: 2020-05-25
accepted date: 2020-05-25
in scheme: BATAELValue

Waste Incineration - Cd - BAT34-XVII
type: Concept
notation: WI-Cd-BAT34-XVII
definition: Waste management reducing cadmium to water. The BAT-AEL emission level is 0.005�0.03 mg/l.
status: valid
status modified: 2020-05-25
accepted date: 2020-05-25
in scheme: BATAELValue

Waste Incineration - CdTl - BAT25-II
type: Concept
notation: WI-CdTl-BAT25-II
definition: Waste management reducing cadmium, thallium and their compounds emissions to air. The BAT-AEL emission level is 0.005�0.02 mg/Nm3.
status: valid
status modified: 2020-05-25
accepted date: 2020-05-25
in scheme: BATAELValue

Waste Incineration - Cr - BAT34-V
type: Concept
notation: WI-Cr-BAT34-V
definition: Waste management reducing chromium to water. The BAT-AEL emission level is 0.01�0.1 mg/l.
status: valid
status modified: 2020-05-25
accepted date: 2020-05-25
in scheme: BATAELValue

Surface Treatment using organic solvents including preservation of wood and wood products with chemicals - BAT 26
type: Concept
notation: STS-TVOC-BAT26-V
definition: 6, Other activities: 6.7 Surface treatment of substances, objects or products using organic solvents, in particular for dressing, printing, coating, degreasing, waterproofing, sizing, painting, cleaning or impregnating, with an organic solvent consumption capacity of more than 150 kg per hour or more than 200 tonnes per year. 6.10: Preservation of wood and wood products with chemicals with a production capacity exceeding 75 m3 per day other than exclusively treating against sapstain. 6.11: Independently operated treatment of waste water not covered by Directive 91/271/EEC provided that the main pollutant load originates from activities specified in point 6.7 or 6.10 of Annex I to Directive 2010/75/EU; Reducing total volatile organic compounds emissions to air. The BAT-AEL emission level is < 1�3 % of the solvent input.
status: valid
status modified: 2025-03-12
accepted date: 2025-03-12
in scheme: BATAELValue

Surface Treatment using organic solvents including preservation of wood and wood products with chemicals - BAT 26
type: Concept
notation: STS-TVOC-BAT26-VI
definition: 6, Other activities: 6.7 Surface treatment of substances, objects or products using organic solvents, in particular for dressing, printing, coating, degreasing, waterproofing, sizing, painting, cleaning or impregnating, with an organic solvent consumption capacity of more than 150 kg per hour or more than 200 tonnes per year. 6.10: Preservation of wood and wood products with chemicals with a production capacity exceeding 75 m3 per day other than exclusively treating against sapstain. 6.11: Independently operated treatment of waste water not covered by Directive 91/271/EEC provided that the main pollutant load originates from activities specified in point 6.7 or 6.10 of Annex I to Directive 2010/75/EU; Reducing total volatile organic compounds emissions to air. The BAT-AEL emission level is 2�20 mg C/Nm3.
status: valid
status modified: 2025-03-12
accepted date: 2025-03-12
in scheme: BATAELValue

Surface Treatment using organic solvents including preservation of wood and wood products with chemicals - BAT 26
type: Concept
notation: STS-TVOC-BAT26-VII
definition: 6, Other activities: 6.7 Surface treatment of substances, objects or products using organic solvents, in particular for dressing, printing, coating, degreasing, waterproofing, sizing, painting, cleaning or impregnating, with an organic solvent consumption capacity of more than 150 kg per hour or more than 200 tonnes per year. 6.10: Preservation of wood and wood products with chemicals with a production capacity exceeding 75 m3 per day other than exclusively treating against sapstain. 6.11: Independently operated treatment of waste water not covered by Directive 91/271/EEC provided that the main pollutant load originates from activities specified in point 6.7 or 6.10 of Annex I to Directive 2010/75/EU; Reducing total volatile organic compounds emissions to air. The BAT-AEL emission level is 50 mg C/Nm3.
status: valid
status modified: 2025-03-12
accepted date: 2025-03-12
in scheme: BATAELValue

Surface Treatment using organic solvents including preservation of wood and wood products with chemicals - BAT 26
type: Concept
notation: STS-TVOC-BAT26-VIII
definition: 6, Other activities: 6.7 Surface treatment of substances, objects or products using organic solvents, in particular for dressing, printing, coating, degreasing, waterproofing, sizing, painting, cleaning or impregnating, with an organic solvent consumption capacity of more than 150 kg per hour or more than 200 tonnes per year. 6.10: Preservation of wood and wood products with chemicals with a production capacity exceeding 75 m3 per day other than exclusively treating against sapstain. 6.11: Independently operated treatment of waste water not covered by Directive 91/271/EEC provided that the main pollutant load originates from activities specified in point 6.7 or 6.10 of Annex I to Directive 2010/75/EU; Reducing total volatile organic compounds emissions to air. The BAT-AEL emission level is < 1�5 % of the solvent input.
status: valid
status modified: 2025-03-12
accepted date: 2025-03-12
in scheme: BATAELValue

Surface Treatment using organic solvents including preservation of wood and wood products with chemicals - BAT 26
type: Concept
notation: STS-TVOC-BAT26-X
definition: 6, Other activities: 6.7 Surface treatment of substances, objects or products using organic solvents, in particular for dressing, printing, coating, degreasing, waterproofing, sizing, painting, cleaning or impregnating, with an organic solvent consumption capacity of more than 150 kg per hour or more than 200 tonnes per year. 6.10: Preservation of wood and wood products with chemicals with a production capacity exceeding 75 m3 per day other than exclusively treating against sapstain. 6.11: Independently operated treatment of waste water not covered by Directive 91/271/EEC provided that the main pollutant load originates from activities specified in point 6.7 or 6.10 of Annex I to Directive 2010/75/EU; Reducing total volatile organic compounds emissions to air. The BAT-AEL emission level is 50 mg C/Nm3.
status: valid
status modified: 2025-03-12
accepted date: 2025-03-12
in scheme: BATAELValue

Waste Incineration - Cr - BAT34-XVIII
type: Concept
notation: WI-Cr-BAT34-XVIII
definition: Waste management reducing chromium to water. The BAT-AEL emission level is 0.01�0.1 mg/l.
status: valid
status modified: 2020-05-25
accepted date: 2020-05-25
in scheme: BATAELValue

Waste Incineration - Cu - BAT34-VI
type: Concept
notation: WI-Cu-BAT34-VI
definition: Waste management reducing copper to water. The BAT-AEL emission level is 0.03�0.15 mg/l.
status: valid
status modified: 2020-05-25
accepted date: 2020-05-25
in scheme: BATAELValue

Waste Incineration - Cu - BAT34-XIX
type: Concept
notation: WI-Cu-BAT34-XIX
definition: Waste management reducing copper to water. The BAT-AEL emission level is 0.03�0.15 mg/l.
status: valid
status modified: 2020-05-25
accepted date: 2020-05-25
in scheme: BATAELValue

Waste Incineration - Dust - BAT25-I
type: Concept
notation: WI-Dust-BAT25-I
definition: Waste management reducing dust emissions to air. The BAT-AEL emission level is 2�5 mg/Nm3.
status: valid
status modified: 2020-05-25
accepted date: 2020-05-25
in scheme: BATAELValue

Waste Incineration - Dust - BAT26
type: Concept
notation: WI-Dust-BAT26
definition: Waste management reducing dust emissions to air. The BAT-AEL emission level is 2-5 mg/Nm3.
status: valid
status modified: 2020-05-25
accepted date: 2020-05-25
in scheme: BATAELValue

Waste Incineration - HCI - BAT28-I
type: Concept
notation: WI-HCI-BAT28-I
definition: Waste management reducing hydrogen chloride emissions to air. The BAT-AEL emission level is < 2�8 mg/Nm3.
status: valid
status modified: 2020-05-25
accepted date: 2020-05-25
in scheme: BATAELValue

Waste Incineration - HCI - BAT28-II
type: Concept
notation: WI-HCI-BAT28-II
definition: Waste management reducing hydrogen chloride emissions to air. The BAT-AEL emission level is <2�6 mg/Nm3.
status: valid
status modified: 2020-05-25
accepted date: 2020-05-25
in scheme: BATAELValue

Waste Incineration - HF - BAT28-III
type: Concept
notation: WI-HF-BAT28-III
definition: Waste management reducing hydrogen fluoride emissions to air. The BAT-AEL emission level is < 1 mg/Nm3.
status: valid
status modified: 2020-05-25
accepted date: 2020-05-25
in scheme: BATAELValue

Waste Incineration - HF - BAT28-IV
type: Concept
notation: WI-HF-BAT28-IV
definition: Waste management reducing hydrogen fluoride emissions to air. The BAT-AEL emission level is < 1 mg/Nm3.
status: valid
status modified: 2020-05-25
accepted date: 2020-05-25
in scheme: BATAELValue

Waste Incineration - Hg - BAT31-I
type: Concept
notation: WI-Hg-BAT31-I
definition: Waste management reducing sulphur dioxide (SO2) emissions to air. The BAT-AEL emission level is 1�10 �g/Nm3.
status: valid
status modified: 2020-05-25
accepted date: 2020-05-25
in scheme: BATAELValue

Waste Incineration - Hg - BAT31-II
type: Concept
notation: WI-Hg-BAT31-II
definition: Waste management reducing sulphur dioxide (SO2) emissions to air. The BAT-AEL emission level is < 5�20 �g/Nm3.
status: valid
status modified: 2020-05-25
accepted date: 2020-05-25
in scheme: BATAELValue

Waste Incineration - Hg - BAT34-VII
type: Concept
notation: WI-Hg-BAT34-VII
definition: Waste management reducing sulphur dioxide (SO2) to water. The BAT-AEL emission level is 0.001�0.01 mg/l.
status: valid
status modified: 2020-05-25
accepted date: 2020-05-25
in scheme: BATAELValue

Surface Treatment using organic solvents including preservation of wood and wood products with chemicals - BAT 27
type: Concept
notation: STS-TVOC-BAT27-I
definition: 6, Other activities: 6.7 Surface treatment of substances, objects or products using organic solvents, in particular for dressing, printing, coating, degreasing, waterproofing, sizing, painting, cleaning or impregnating, with an organic solvent consumption capacity of more than 150 kg per hour or more than 200 tonnes per year. 6.10: Preservation of wood and wood products with chemicals with a production capacity exceeding 75 m3 per day other than exclusively treating against sapstain. 6.11: Independently operated treatment of waste water not covered by Directive 91/271/EEC provided that the main pollutant load originates from activities specified in point 6.7 or 6.10 of Annex I to Directive 2010/75/EU; Reducing total volatile organic compounds emissions to air. The BAT-AEL emission level is 1�3.3 g VOCs per kg of coated wire.
status: valid
status modified: 2025-03-12
accepted date: 2025-03-12
in scheme: BATAELValue

Surface Treatment using organic solvents including preservation of wood and wood products with chemicals - BAT 27
type: Concept
notation: STS-TVOC-BAT27-II
definition: 6, Other activities: 6.7 Surface treatment of substances, objects or products using organic solvents, in particular for dressing, printing, coating, degreasing, waterproofing, sizing, painting, cleaning or impregnating, with an organic solvent consumption capacity of more than 150 kg per hour or more than 200 tonnes per year. 6.10: Preservation of wood and wood products with chemicals with a production capacity exceeding 75 m3 per day other than exclusively treating against sapstain. 6.11: Independently operated treatment of waste water not covered by Directive 91/271/EEC provided that the main pollutant load originates from activities specified in point 6.7 or 6.10 of Annex I to Directive 2010/75/EU; Reducing total volatile organic compounds emissions to air. The BAT-AEL emission level is 5�40 mg C/Nm3.
status: valid
status modified: 2025-03-12
accepted date: 2025-03-12
in scheme: BATAELValue

Surface Treatment using organic solvents including preservation of wood and wood products with chemicals - BAT 27
type: Concept
notation: STS-TVOC-BAT27-III
definition: 6, Other activities: 6.7 Surface treatment of substances, objects or products using organic solvents, in particular for dressing, printing, coating, degreasing, waterproofing, sizing, painting, cleaning or impregnating, with an organic solvent consumption capacity of more than 150 kg per hour or more than 200 tonnes per year. 6.10: Preservation of wood and wood products with chemicals with a production capacity exceeding 75 m3 per day other than exclusively treating against sapstain. 6.11: Independently operated treatment of waste water not covered by Directive 91/271/EEC provided that the main pollutant load originates from activities specified in point 6.7 or 6.10 of Annex I to Directive 2010/75/EU; Reducing total volatile organic compounds emissions to air. The BAT-AEL emission level is < 1�3.5 g VOCs per m2 of coated/printed surface.
status: valid
status modified: 2025-03-12
accepted date: 2025-03-12
in scheme: BATAELValue

Surface Treatment using organic solvents including preservation of wood and wood products with chemicals - BAT 27
type: Concept
notation: STS-TVOC-BAT27-IV
definition: 6, Other activities: 6.7 Surface treatment of substances, objects or products using organic solvents, in particular for dressing, printing, coating, degreasing, waterproofing, sizing, painting, cleaning or impregnating, with an organic solvent consumption capacity of more than 150 kg per hour or more than 200 tonnes per year. 6.10: Preservation of wood and wood products with chemicals with a production capacity exceeding 75 m3 per day other than exclusively treating against sapstain. 6.11: Independently operated treatment of waste water not covered by Directive 91/271/EEC provided that the main pollutant load originates from activities specified in point 6.7 or 6.10 of Annex I to Directive 2010/75/EU; Reducing total volatile organic compounds emissions to air. The BAT-AEL emission level is < 1�12 % of the solvent input.
status: valid
status modified: 2025-03-12
accepted date: 2025-03-12
in scheme: BATAELValue

Surface Treatment using organic solvents including preservation of wood and wood products with chemicals - BAT 27
type: Concept
notation: STS-TVOC-BAT27-V
definition: 6, Other activities: 6.7 Surface treatment of substances, objects or products using organic solvents, in particular for dressing, printing, coating, degreasing, waterproofing, sizing, painting, cleaning or impregnating, with an organic solvent consumption capacity of more than 150 kg per hour or more than 200 tonnes per year. 6.10: Preservation of wood and wood products with chemicals with a production capacity exceeding 75 m3 per day other than exclusively treating against sapstain. 6.11: Independently operated treatment of waste water not covered by Directive 91/271/EEC provided that the main pollutant load originates from activities specified in point 6.7 or 6.10 of Annex I to Directive 2010/75/EU; Reducing total volatile organic compounds emissions to air. The BAT-AEL emission level is 1�20 mg C/Nm3.
status: valid
status modified: 2025-03-12
accepted date: 2025-03-12
in scheme: BATAELValue

Waste Incineration - Hg - BAT34-XX
type: Concept
notation: WI-Hg-BAT34-XX
definition: Waste management reducing sulphur dioxide (SO2) to water. The BAT-AEL emission level is 0.001�0.01 mg/l.
status: valid
status modified: 2020-05-25
accepted date: 2020-05-25
in scheme: BATAELValue

Waste Incineration - NH3 - BAT29-IV
type: Concept
notation: WI-NH3-BAT29-IV
definition: Waste management reducing total nitrogen emissions to air. The BAT-AEL emission level is 2�10 mg/Nm3.
status: valid
status modified: 2020-05-25
accepted date: 2020-05-25
in scheme: BATAELValue

Waste Incineration - NH4-N - BAT34-XIII
type: Concept
notation: WI-NH4-N-BAT34-XIII
definition: Waste management reducing total nitrogen to water. The BAT-AEL emission level is 10�30 mg/l.
status: valid
status modified: 2020-05-25
accepted date: 2020-05-25
in scheme: BATAELValue

Waste Incineration - NOx - BAT29-I
type: Concept
notation: WI-NOx-BAT29-I
definition: Waste management reducing nitrogen oxides emissions to air. The BAT-AEL emission level is 50�150 mg/Nm3.
status: valid
status modified: 2020-05-25
accepted date: 2020-05-25
in scheme: BATAELValue

Waste Incineration - NOx - BAT29-II
type: Concept
notation: WI-NOx-BAT29-II
definition: Waste management reducing nitrogen oxides emissions to air. The BAT-AEL emission level is 50�120 mg/Nm3.
status: valid
status modified: 2020-05-25
accepted date: 2020-05-25
in scheme: BATAELValue

Waste Incineration - Ni - BAT34-VIII
type: Concept
notation: WI-Ni-BAT34-VIII
definition: Waste management reducing nickel to water. The BAT-AEL emission level is 0.03�0.15 mg/l.
status: valid
status modified: 2020-05-25
accepted date: 2020-05-25
in scheme: BATAELValue

Waste Incineration - Ni - BAT34-XXI
type: Concept
notation: WI-Ni-BAT34-XXI
definition: Waste management reducing nickel to water. The BAT-AEL emission level is 0.03�0.15 mg/l.
status: valid
status modified: 2020-05-25
accepted date: 2020-05-25
in scheme: BATAELValue

Waste Incineration - PCDDF - BAT30-II
type: Concept
notation: WI-PCDDF-BAT30-II
definition: Waste management reducing polychlorinaned dibenzo- dioxins and - furans emissions to air. The BAT-AEL emission level is < 0.01�0.06 ng I-TEQ/Nm3 for the average over the sampling period < 0.01�0.08 ng I-TEQ/Nm3 for the long-term sampling period.
status: valid
status modified: 2020-05-25
accepted date: 2020-05-25
in scheme: BATAELValue

Waste Incineration - PCDDF - BAT30-III
type: Concept
notation: WI-PCDDF-BAT30-III
definition: Waste management reducing polychlorinaned dibenzo- dioxins and - furans emissions to air. The BAT-AEL emission level is < 0.01�0.04 ng I-TEQ/Nm3 for the average over the sampling period < 0.01�0.06 ng I-TEQ/Nm3 for the long-term sampling period.
status: valid
status modified: 2020-05-25
accepted date: 2020-05-25
in scheme: BATAELValue

Waste Incineration - PCDDF - BAT34-XV
type: Concept
notation: WI-PCDDF-BAT34-XV
definition: Waste management reducing polychlorinaned dibenzo- dioxins and - furans to water. The BAT-AEL emission level is 0.01�0.05 ng I-TEQ/l.
status: valid
status modified: 2020-05-25
accepted date: 2020-05-25
in scheme: BATAELValue

Surface Treatment using organic solvents including preservation of wood and wood products with chemicals - BAT 28
type: Concept
notation: STS-TVOC-BAT28-I
definition: 6, Other activities: 6.7 Surface treatment of substances, objects or products using organic solvents, in particular for dressing, printing, coating, degreasing, waterproofing, sizing, painting, cleaning or impregnating, with an organic solvent consumption capacity of more than 150 kg per hour or more than 200 tonnes per year. 6.10: Preservation of wood and wood products with chemicals with a production capacity exceeding 75 m3 per day other than exclusively treating against sapstain. 6.11: Independently operated treatment of waste water not covered by Directive 91/271/EEC provided that the main pollutant load originates from activities specified in point 6.7 or 6.10 of Annex I to Directive 2010/75/EU; Reducing total volatile organic compounds emissions to air. The BAT-AEL emission level is < 0.01�0.04 kg VOCs per kg of ink input.
status: valid
status modified: 2025-03-12
accepted date: 2025-03-12
in scheme: BATAELValue

Surface Treatment using organic solvents including preservation of wood and wood products with chemicals - BAT 28
type: Concept
notation: STS-TVOC-BAT28-II
definition: 6, Other activities: 6.7 Surface treatment of substances, objects or products using organic solvents, in particular for dressing, printing, coating, degreasing, waterproofing, sizing, painting, cleaning or impregnating, with an organic solvent consumption capacity of more than 150 kg per hour or more than 200 tonnes per year. 6.10: Preservation of wood and wood products with chemicals with a production capacity exceeding 75 m3 per day other than exclusively treating against sapstain. 6.11: Independently operated treatment of waste water not covered by Directive 91/271/EEC provided that the main pollutant load originates from activities specified in point 6.7 or 6.10 of Annex I to Directive 2010/75/EU; Reducing total volatile organic compounds emissions to air. The BAT-AEL emission level is < 1�10 % of the solvent input.
status: valid
status modified: 2025-03-12
accepted date: 2025-03-12
in scheme: BATAELValue

Surface Treatment using organic solvents including preservation of wood and wood products with chemicals - BAT 28
type: Concept
notation: STS-TVOC-BAT28-III
definition: 6, Other activities: 6.7 Surface treatment of substances, objects or products using organic solvents, in particular for dressing, printing, coating, degreasing, waterproofing, sizing, painting, cleaning or impregnating, with an organic solvent consumption capacity of more than 150 kg per hour or more than 200 tonnes per year. 6.10: Preservation of wood and wood products with chemicals with a production capacity exceeding 75 m3 per day other than exclusively treating against sapstain. 6.11: Independently operated treatment of waste water not covered by Directive 91/271/EEC provided that the main pollutant load originates from activities specified in point 6.7 or 6.10 of Annex I to Directive 2010/75/EU; Reducing total volatile organic compounds emissions to air. The BAT-AEL emission level is 1�15 mg C/Nm3.
status: valid
status modified: 2025-03-12
accepted date: 2025-03-12
in scheme: BATAELValue

Surface Treatment using organic solvents including preservation of wood and wood products with chemicals - BAT 28
type: Concept
notation: STS-TVOC-BAT28-IV
definition: 6, Other activities: 6.7 Surface treatment of substances, objects or products using organic solvents, in particular for dressing, printing, coating, degreasing, waterproofing, sizing, painting, cleaning or impregnating, with an organic solvent consumption capacity of more than 150 kg per hour or more than 200 tonnes per year. 6.10: Preservation of wood and wood products with chemicals with a production capacity exceeding 75 m3 per day other than exclusively treating against sapstain. 6.11: Independently operated treatment of waste water not covered by Directive 91/271/EEC provided that the main pollutant load originates from activities specified in point 6.7 or 6.10 of Annex I to Directive 2010/75/EU; Reducing total volatile organic compounds emissions to air. The BAT-AEL emission level is < 0.1�0.3 kg VOCs per kg of solid mass input.
status: valid
status modified: 2025-03-12
accepted date: 2025-03-12
in scheme: BATAELValue

Surface Treatment using organic solvents including preservation of wood and wood products with chemicals - BAT 28
type: Concept
notation: STS-TVOC-BAT28-V
definition: 6, Other activities: 6.7 Surface treatment of substances, objects or products using organic solvents, in particular for dressing, printing, coating, degreasing, waterproofing, sizing, painting, cleaning or impregnating, with an organic solvent consumption capacity of more than 150 kg per hour or more than 200 tonnes per year. 6.10: Preservation of wood and wood products with chemicals with a production capacity exceeding 75 m3 per day other than exclusively treating against sapstain. 6.11: Independently operated treatment of waste water not covered by Directive 91/271/EEC provided that the main pollutant load originates from activities specified in point 6.7 or 6.10 of Annex I to Directive 2010/75/EU; Reducing total volatile organic compounds emissions to air. The BAT-AEL emission level is < 1�12 % of the solvent input.
status: valid
status modified: 2025-03-12
accepted date: 2025-03-12
in scheme: BATAELValue

Waste Incineration - PCDDFdioxin - BAT30-IV
type: Concept
notation: WI-PCDDFdioxin-BAT30-IV
definition: Waste management reducing polychlorinaned dibenzo-dioxins and -furans + Polychlorinated biphenyls emissions to air. The BAT-AEL emission level is < 0.01�0.08 ng WHO-TEQ/Nm3 for the average over the sampling period < 0.01�0.1 ng WHO-TEQ/Nm3 for the long-term sampling period.
status: valid
status modified: 2020-05-25
accepted date: 2020-05-25
in scheme: BATAELValue

Waste Incineration - PCDDFdioxin - BAT30-V
type: Concept
notation: WI-PCDDFdioxin-BAT30-V
definition: Waste management reducing polychlorinaned dibenzo-dioxins and -furans + Polychlorinated biphenyls emissions to air. The BAT-AEL emission level is < 0.01�0.06 ng WHO-TEQ/Nm3 for the average over the sampling period < 0.01�0.08 ng WHO-TEQ/Nm3 for the long-term sampling period.
status: valid
status modified: 2020-05-25
accepted date: 2020-05-25
in scheme: BATAELValue

Waste Incineration - Pb - BAT34-IX
type: Concept
notation: WI-Pb-BAT34-IX
definition: Waste management reducing lead to water. The BAT-AEL emission level is 0.02�0.06 mg/l.
status: valid
status modified: 2020-05-25
accepted date: 2020-05-25
in scheme: BATAELValue

Waste Incineration - Pb - BAT34-XXII
type: Concept
notation: WI-Pb-BAT34-XXII
definition: Waste management reducing lead to water. The BAT-AEL emission level is 0.02�0.06 mg/l.
status: valid
status modified: 2020-05-25
accepted date: 2020-05-25
in scheme: BATAELValue

Waste Incineration - SO2 - BAT28-V
type: Concept
notation: WI-SO2-BAT28-V
definition: Waste management reducing sulphur dioxide (SO2) emissions to air. The BAT-AEL emission level is 5�40 mg/Nm3.
status: valid
status modified: 2020-05-25
accepted date: 2020-05-25
in scheme: BATAELValue

Waste Incineration - SO2 - BAT28-VI
type: Concept
notation: WI-SO2-BAT28-VI
definition: Waste management reducing sulphur dioxide (SO2) emissions to air. The BAT-AEL emission level is 5�30 mg/Nm3.
status: valid
status modified: 2020-05-25
accepted date: 2020-05-25
in scheme: BATAELValue

Waste Incineration - SO4 - BAT34-XIV
type: Concept
notation: WI-SO4-BAT34-XIV
definition: Waste management reducing sulphates to water. The BAT-AEL emission level is 1400�1 000 mg/l.
status: valid
status modified: 2020-05-25
accepted date: 2020-05-25
in scheme: BATAELValue

Waste Incineration - Sb - BAT34-X
type: Concept
notation: WI-Sb-BAT34-X
definition: Waste management reducing antimony to water. The BAT-AEL emission level is 0.02�0.9 mg/l.
status: valid
status modified: 2020-05-25
accepted date: 2020-05-25
in scheme: BATAELValue

Waste Incineration - Sb - BAT34-XXIII
type: Concept
notation: WI-Sb-BAT34-XXIII
definition: Waste management reducing antimony to water. The BAT-AEL emission level is 0.02�0.9 mg/l.
status: valid
status modified: 2020-05-25
accepted date: 2020-05-25
in scheme: BATAELValue

Waste Incineration - SbAsPbCrCoCuMnNiV - BAT25-III
type: Concept
notation: WI-SbAsPbCrCoCuMnNiV-BAT25-III
definition: Waste management reducing metals emissions to air. The BAT-AEL emission level is 0.01�0.3 mg/Nm3.
status: valid
status modified: 2020-05-25
accepted date: 2020-05-25
in scheme: BATAELValue

Surface Treatment using organic solvents including preservation of wood and wood products with chemicals - BAT 28
type: Concept
notation: STS-TVOC-BAT28-VI
definition: 6, Other activities: 6.7 Surface treatment of substances, objects or products using organic solvents, in particular for dressing, printing, coating, degreasing, waterproofing, sizing, painting, cleaning or impregnating, with an organic solvent consumption capacity of more than 150 kg per hour or more than 200 tonnes per year. 6.10: Preservation of wood and wood products with chemicals with a production capacity exceeding 75 m3 per day other than exclusively treating against sapstain. 6.11: Independently operated treatment of waste water not covered by Directive 91/271/EEC provided that the main pollutant load originates from activities specified in point 6.7 or 6.10 of Annex I to Directive 2010/75/EU; Reducing total volatile organic compounds emissions to air. The BAT-AEL emission level is 1�20 mg C/Nm3.
status: valid
status modified: 2025-03-12
accepted date: 2025-03-12
in scheme: BATAELValue

Surface Treatment using organic solvents including preservation of wood and wood products with chemicals - BAT 28
type: Concept
notation: STS-TVOC-BAT28-VII
definition: 6, Other activities: 6.7 Surface treatment of substances, objects or products using organic solvents, in particular for dressing, printing, coating, degreasing, waterproofing, sizing, painting, cleaning or impregnating, with an organic solvent consumption capacity of more than 150 kg per hour or more than 200 tonnes per year. 6.10: Preservation of wood and wood products with chemicals with a production capacity exceeding 75 m3 per day other than exclusively treating against sapstain. 6.11: Independently operated treatment of waste water not covered by Directive 91/271/EEC provided that the main pollutant load originates from activities specified in point 6.7 or 6.10 of Annex I to Directive 2010/75/EU; Reducing total volatile organic compounds emissions to air. The BAT-AEL emission level is 50 mg C/Nm3.
status: valid
status modified: 2025-03-12
accepted date: 2025-03-12
in scheme: BATAELValue

Surface Treatment using organic solvents including preservation of wood and wood products with chemicals - BAT 29
type: Concept
notation: STS-TVOC-BAT29-I
definition: 6, Other activities: 6.7 Surface treatment of substances, objects or products using organic solvents, in particular for dressing, printing, coating, degreasing, waterproofing, sizing, painting, cleaning or impregnating, with an organic solvent consumption capacity of more than 150 kg per hour or more than 200 tonnes per year. 6.10: Preservation of wood and wood products with chemicals with a production capacity exceeding 75 m3 per day other than exclusively treating against sapstain. 6.11: Independently operated treatment of waste water not covered by Directive 91/271/EEC provided that the main pollutant load originates from activities specified in point 6.7 or 6.10 of Annex I to Directive 2010/75/EU; Reducing total volatile organic compounds emissions to air. The BAT-AEL emission level is < 2.5 % of the solvent input.
status: valid
status modified: 2025-03-12
accepted date: 2025-03-12
in scheme: BATAELValue

Surface Treatment using organic solvents including preservation of wood and wood products with chemicals - BAT 29
type: Concept
notation: STS-TVOC-BAT29-II
definition: 6, Other activities: 6.7 Surface treatment of substances, objects or products using organic solvents, in particular for dressing, printing, coating, degreasing, waterproofing, sizing, painting, cleaning or impregnating, with an organic solvent consumption capacity of more than 150 kg per hour or more than 200 tonnes per year. 6.10: Preservation of wood and wood products with chemicals with a production capacity exceeding 75 m3 per day other than exclusively treating against sapstain. 6.11: Independently operated treatment of waste water not covered by Directive 91/271/EEC provided that the main pollutant load originates from activities specified in point 6.7 or 6.10 of Annex I to Directive 2010/75/EU; Reducing total volatile organic compounds emissions to air. The BAT-AEL emission level is 10�20 mg C/Nm3.
status: valid
status modified: 2025-03-12
accepted date: 2025-03-12
in scheme: BATAELValue

Surface Treatment using organic solvents including preservation of wood and wood products with chemicals - BAT 29
type: Concept
notation: STS-TVOC-BAT29-III
definition: 6, Other activities: 6.7 Surface treatment of substances, objects or products using organic solvents, in particular for dressing, printing, coating, degreasing, waterproofing, sizing, painting, cleaning or impregnating, with an organic solvent consumption capacity of more than 150 kg per hour or more than 200 tonnes per year. 6.10: Preservation of wood and wood products with chemicals with a production capacity exceeding 75 m3 per day other than exclusively treating against sapstain. 6.11: Independently operated treatment of waste water not covered by Directive 91/271/EEC provided that the main pollutant load originates from activities specified in point 6.7 or 6.10 of Annex I to Directive 2010/75/EU; Reducing total volatile organic compounds emissions to air. The BAT-AEL emission level is < 0.1 kg VOCs per kg of solid mass input.
status: valid
status modified: 2025-03-12
accepted date: 2025-03-12
in scheme: BATAELValue

Waste Incineration - TOC - BAT34-II
type: Concept
notation: WI-TOC-BAT34-II
definition: Waste management reducing total organic carbon (TOC) to water. The BAT-AEL emission level is 15�40 mg/l.
status: valid
status modified: 2020-05-25
accepted date: 2020-05-25
in scheme: BATAELValue

Waste Incineration - TSS - BAT34-I
type: Concept
notation: WI-TSS-BAT34-I
definition: Waste management reducing total suspended solids to water. The BAT-AEL emission level is 10�30 mg/l.
status: valid
status modified: 2020-05-25
accepted date: 2020-05-25
in scheme: BATAELValue

Waste Incineration - Tl - BAT34-XI
type: Concept
notation: WI-Tl-BAT34-XI
definition: Waste management reducing thallium to water. The BAT-AEL emission level is 0.005�0.03 mg/l.
status: valid
status modified: 2020-05-25
accepted date: 2020-05-25
in scheme: BATAELValue

Waste Incineration - Tl - BAT34-XXIV
type: Concept
notation: WI-Tl-BAT34-XXIV
definition: Waste management reducing thallium to water. The BAT-AEL emission level is 0.005�0.03 mg/l.
status: valid
status modified: 2020-05-25
accepted date: 2020-05-25
in scheme: BATAELValue

Waste Incineration - Zn - BAT34-XII
type: Concept
notation: WI-Zn-BAT34-XII
definition: Waste management reducing zinc to water. The BAT-AEL emission level is 0.01�0.5 mg/l.
status: valid
status modified: 2020-05-25
accepted date: 2020-05-25
in scheme: BATAELValue

Waste Incineration - Zn - BAT34-XXV
type: Concept
notation: WI-Zn-BAT34-XXV
definition: Waste management reducing zinc to water. The BAT-AEL emission level is 0.01�0.5 mg/l.
status: valid
status modified: 2020-05-25
accepted date: 2020-05-25
in scheme: BATAELValue

Surface Treatment using organic solvents including preservation of wood and wood products with chemicals - BAT 29
type: Concept
notation: STS-TVOC-BAT29-IV
definition: 6, Other activities: 6.7 Surface treatment of substances, objects or products using organic solvents, in particular for dressing, printing, coating, degreasing, waterproofing, sizing, painting, cleaning or impregnating, with an organic solvent consumption capacity of more than 150 kg per hour or more than 200 tonnes per year. 6.10: Preservation of wood and wood products with chemicals with a production capacity exceeding 75 m3 per day other than exclusively treating against sapstain. 6.11: Independently operated treatment of waste water not covered by Directive 91/271/EEC provided that the main pollutant load originates from activities specified in point 6.7 or 6.10 of Annex I to Directive 2010/75/EU; Reducing total volatile organic compounds emissions to air. The BAT-AEL emission level is < 0.25 kg VOCs per kg of solid mass input.
status: valid
status modified: 2025-03-12
accepted date: 2025-03-12
in scheme: BATAELValue

Surface Treatment using organic solvents including preservation of wood and wood products with chemicals - BAT 29
type: Concept
notation: STS-TVOC-BAT29-V
definition: 6, Other activities: 6.7 Surface treatment of substances, objects or products using organic solvents, in particular for dressing, printing, coating, degreasing, waterproofing, sizing, painting, cleaning or impregnating, with an organic solvent consumption capacity of more than 150 kg per hour or more than 200 tonnes per year. 6.10: Preservation of wood and wood products with chemicals with a production capacity exceeding 75 m3 per day other than exclusively treating against sapstain. 6.11: Independently operated treatment of waste water not covered by Directive 91/271/EEC provided that the main pollutant load originates from activities specified in point 6.7 or 6.10 of Annex I to Directive 2010/75/EU; Reducing total volatile organic compounds emissions to air. The BAT-AEL emission level is < 10 % of the solvent input.
status: valid
status modified: 2025-03-12
accepted date: 2025-03-12
in scheme: BATAELValue

Surface Treatment using organic solvents including preservation of wood and wood products with chemicals - BAT 29
type: Concept
notation: STS-TVOC-BAT29-VI
definition: 6, Other activities: 6.7 Surface treatment of substances, objects or products using organic solvents, in particular for dressing, printing, coating, degreasing, waterproofing, sizing, painting, cleaning or impregnating, with an organic solvent consumption capacity of more than 150 kg per hour or more than 200 tonnes per year. 6.10: Preservation of wood and wood products with chemicals with a production capacity exceeding 75 m3 per day other than exclusively treating against sapstain. 6.11: Independently operated treatment of waste water not covered by Directive 91/271/EEC provided that the main pollutant load originates from activities specified in point 6.7 or 6.10 of Annex I to Directive 2010/75/EU; Reducing total volatile organic compounds emissions to air. The BAT-AEL emission level is 5-20 mg C/Nm3.
status: valid
status modified: 2025-03-12
accepted date: 2025-03-12
in scheme: BATAELValue

Surface Treatment using organic solvents including preservation of wood and wood products with chemicals - BAT 51
type: Concept
notation: STS-TVOC-BAT51
definition: 6, Other activities: 6.7 Surface treatment of substances, objects or products using organic solvents, in particular for dressing, printing, coating, degreasing, waterproofing, sizing, painting, cleaning or impregnating, with an organic solvent consumption capacity of more than 150 kg per hour or more than 200 tonnes per year. 6.10: Preservation of wood and wood products with chemicals with a production capacity exceeding 75 m3 per day other than exclusively treating against sapstain. 6.11: Independently operated treatment of waste water not covered by Directive 91/271/EEC provided that the main pollutant load originates from activities specified in point 6.7 or 6.10 of Annex I to Directive 2010/75/EU; Reducing total volatile organic compounds emissions to air. The BAT-AEL emission level is < 4�20 mg C/Nm3.
status: valid
status modified: 2025-03-12
accepted date: 2025-03-12
in scheme: BATAELValue

Surface Treatment using organic solvents including preservation of wood and wood products with chemicals - BAT 21
type: Concept
notation: STS-Zn-BAT21-I
definition: 6, Other activities: 6.7 Surface treatment of substances, objects or products using organic solvents, in particular for dressing, printing, coating, degreasing, waterproofing, sizing, painting, cleaning or impregnating, with an organic solvent consumption capacity of more than 150 kg per hour or more than 200 tonnes per year. 6.10: Preservation of wood and wood products with chemicals with a production capacity exceeding 75 m3 per day other than exclusively treating against sapstain. 6.11: Independently operated treatment of waste water not covered by Directive 91/271/EEC provided that the main pollutant load originates from activities specified in point 6.7 or 6.10 of Annex I to Directive 2010/75/EU; Reducing zinc to water. The BAT-AEL emission level is 0.05�0.6 mg/l.
status: valid
status modified: 2025-03-12
accepted date: 2025-03-12
in scheme: BATAELValue

Surface Treatment using organic solvents including preservation of wood and wood products with chemicals - BAT 21
type: Concept
notation: STS-Zn-BAT21-II
definition: 6, Other activities: 6.7 Surface treatment of substances, objects or products using organic solvents, in particular for dressing, printing, coating, degreasing, waterproofing, sizing, painting, cleaning or impregnating, with an organic solvent consumption capacity of more than 150 kg per hour or more than 200 tonnes per year. 6.10: Preservation of wood and wood products with chemicals with a production capacity exceeding 75 m3 per day other than exclusively treating against sapstain. 6.11: Independently operated treatment of waste water not covered by Directive 91/271/EEC provided that the main pollutant load originates from activities specified in point 6.7 or 6.10 of Annex I to Directive 2010/75/EU; Reducing zinc to water. The BAT-AEL emission level is 0.05�0.6 mg/l.
status: valid
status modified: 2025-03-12
accepted date: 2025-03-12
in scheme: BATAELValue

Waste Treatment - AOX - BAT20-XIV
type: Concept
notation: WT-AOX-BAT20-XIV
definition: 5.� Waste management; 6. Other activities: 5.1. Disposal or recovery of hazardous waste with a capacity exceeding 10 tonnes per day involving one or more of the following activities: (a)-(j) (see scope); 5.3. (a) Disposal of non-hazardous waste with a capacity exceeding 50 tonnes per day involving one or more of the following activities, and excluding activities covered by Council Directive 91/271/EEC (1): (i)-(v) (see scope). (b) Recovery, or a mix of recovery and disposal, of non-hazardous waste with a capacity exceeding 75 tonnes per day involving one or more of the following activities, and excluding activities covered by Directive 91/271/EEC: (i)-(iv) (see scope). 5.5. Temporary storage of hazardous waste not covered under point 5.4 of Annex I to Directive 2010/75/EU pending any of the activities listed in points 5.1, 5.2, 5.4 and 5.6 of Annex I to Directive 2010/75/EU with a total capacity exceeding 50 tonnes, excluding temporary storage, pending collection, on the site where the waste is generated. 6.11. Independently operated treatment of waste water not covered by Directive 91/271/EEC and discharged by an installation undertaking activities covered under points 5.1, 5.3 or 5.5 as listed above. Reducing adsorbable organically bound halogens to water. The BAT-AEL emission level is 0,2-1 mg/l .
status: valid
status modified: 2019-04-23
accepted date: 2019-04-23
in scheme: BATAELValue

Waste Treatment - AOX - BAT20-XXXIV
type: Concept
notation: WT-AOX-BAT20-XXXIV
definition: 5.� Waste management; 6. Other activities: 5.1. Disposal or recovery of hazardous waste with a capacity exceeding 10 tonnes per day involving one or more of the following activities: (a)-(j) (see scope); 5.3. (a) Disposal of non-hazardous waste with a capacity exceeding 50 tonnes per day involving one or more of the following activities, and excluding activities covered by Council Directive 91/271/EEC (1): (i)-(v) (see scope). (b) Recovery, or a mix of recovery and disposal, of non-hazardous waste with a capacity exceeding 75 tonnes per day involving one or more of the following activities, and excluding activities covered by Directive 91/271/EEC: (i)-(iv) (see scope). 5.5. Temporary storage of hazardous waste not covered under point 5.4 of Annex I to Directive 2010/75/EU pending any of the activities listed in points 5.1, 5.2, 5.4 and 5.6 of Annex I to Directive 2010/75/EU with a total capacity exceeding 50 tonnes, excluding temporary storage, pending collection, on the site where the waste is generated. 6.11. Independently operated treatment of waste water not covered by Directive 91/271/EEC and discharged by an installation undertaking activities covered under points 5.1, 5.3 or 5.5 as listed above. Reducing adsorbable organically bound halogens to water. The BAT-AEL emission level is 0,2-1 mg/l .
status: valid
status modified: 2019-04-23
accepted date: 2019-04-23
in scheme: BATAELValue

Waste Treatment - As - BAT20-XLIII
type: Concept
notation: WT-As-BAT20-XLIII
definition: 5.� Waste management; 6. Other activities: 5.1. Disposal or recovery of hazardous waste with a capacity exceeding 10 tonnes per day involving one or more of the following activities: (a)-(j) (see scope); 5.3. (a) Disposal of non-hazardous waste with a capacity exceeding 50 tonnes per day involving one or more of the following activities, and excluding activities covered by Council Directive 91/271/EEC (1): (i)-(v) (see scope). (b) Recovery, or a mix of recovery and disposal, of non-hazardous waste with a capacity exceeding 75 tonnes per day involving one or more of the following activities, and excluding activities covered by Directive 91/271/EEC: (i)-(iv) (see scope). 5.5. Temporary storage of hazardous waste not covered under point 5.4 of Annex I to Directive 2010/75/EU pending any of the activities listed in points 5.1, 5.2, 5.4 and 5.6 of Annex I to Directive 2010/75/EU with a total capacity exceeding 50 tonnes, excluding temporary storage, pending collection, on the site where the waste is generated. 6.11. Independently operated treatment of waste water not covered by Directive 91/271/EEC and discharged by an installation undertaking activities covered under points 5.1, 5.3 or 5.5 as listed above. Reducing arsenic to water. The BAT-AEL emission level is 0,01-0,1 mg/l.
status: valid
status modified: 2019-04-23
accepted date: 2019-04-23
in scheme: BATAELValue

Waste Treatment - As - BAT20-XV
type: Concept
notation: WT-As-BAT20-XV
definition: 5.� Waste management; 6. Other activities: 5.1. Disposal or recovery of hazardous waste with a capacity exceeding 10 tonnes per day involving one or more of the following activities: (a)-(j) (see scope); 5.3. (a) Disposal of non-hazardous waste with a capacity exceeding 50 tonnes per day involving one or more of the following activities, and excluding activities covered by Council Directive 91/271/EEC (1): (i)-(v) (see scope). (b) Recovery, or a mix of recovery and disposal, of non-hazardous waste with a capacity exceeding 75 tonnes per day involving one or more of the following activities, and excluding activities covered by Directive 91/271/EEC: (i)-(iv) (see scope). 5.5. Temporary storage of hazardous waste not covered under point 5.4 of Annex I to Directive 2010/75/EU pending any of the activities listed in points 5.1, 5.2, 5.4 and 5.6 of Annex I to Directive 2010/75/EU with a total capacity exceeding 50 tonnes, excluding temporary storage, pending collection, on the site where the waste is generated. 6.11. Independently operated treatment of waste water not covered by Directive 91/271/EEC and discharged by an installation undertaking activities covered under points 5.1, 5.3 or 5.5 as listed above. Reducing arsenic to water. The BAT-AEL emission level is 0,01-0,05 mg/l .
status: valid
status modified: 2019-04-23
accepted date: 2019-04-23
in scheme: BATAELValue

Waste Treatment - As - BAT20-XXIII
type: Concept
notation: WT-As-BAT20-XXIII
definition: 5.� Waste management; 6. Other activities: 5.1. Disposal or recovery of hazardous waste with a capacity exceeding 10 tonnes per day involving one or more of the following activities: (a)-(j) (see scope); 5.3. (a) Disposal of non-hazardous waste with a capacity exceeding 50 tonnes per day involving one or more of the following activities, and excluding activities covered by Council Directive 91/271/EEC (1): (i)-(v) (see scope). (b) Recovery, or a mix of recovery and disposal, of non-hazardous waste with a capacity exceeding 75 tonnes per day involving one or more of the following activities, and excluding activities covered by Directive 91/271/EEC: (i)-(iv) (see scope). 5.5. Temporary storage of hazardous waste not covered under point 5.4 of Annex I to Directive 2010/75/EU pending any of the activities listed in points 5.1, 5.2, 5.4 and 5.6 of Annex I to Directive 2010/75/EU with a total capacity exceeding 50 tonnes, excluding temporary storage, pending collection, on the site where the waste is generated. 6.11. Independently operated treatment of waste water not covered by Directive 91/271/EEC and discharged by an installation undertaking activities covered under points 5.1, 5.3 or 5.5 as listed above. Reducing arsenic to water. The BAT-AEL emission level is 0,01-0,1 mg/l.
status: valid
status modified: 2019-04-23
accepted date: 2019-04-23
in scheme: BATAELValue

Waste Treatment - As - BAT20-XXXV
type: Concept
notation: WT-As-BAT20-XXXV
definition: 5.� Waste management; 6. Other activities: 5.1. Disposal or recovery of hazardous waste with a capacity exceeding 10 tonnes per day involving one or more of the following activities: (a)-(j) (see scope); 5.3. (a) Disposal of non-hazardous waste with a capacity exceeding 50 tonnes per day involving one or more of the following activities, and excluding activities covered by Council Directive 91/271/EEC (1): (i)-(v) (see scope). (b) Recovery, or a mix of recovery and disposal, of non-hazardous waste with a capacity exceeding 75 tonnes per day involving one or more of the following activities, and excluding activities covered by Directive 91/271/EEC: (i)-(iv) (see scope). 5.5. Temporary storage of hazardous waste not covered under point 5.4 of Annex I to Directive 2010/75/EU pending any of the activities listed in points 5.1, 5.2, 5.4 and 5.6 of Annex I to Directive 2010/75/EU with a total capacity exceeding 50 tonnes, excluding temporary storage, pending collection, on the site where the waste is generated. 6.11. Independently operated treatment of waste water not covered by Directive 91/271/EEC and discharged by an installation undertaking activities covered under points 5.1, 5.3 or 5.5 as listed above. Reducing arsenic to water. The BAT-AEL emission level is 0,01-0,05 mg/l.
status: valid
status modified: 2019-04-23
accepted date: 2019-04-23
in scheme: BATAELValue

Waste Treatment - CFCs - BAT29-II
type: Concept
notation: WT-CFCs-BAT29-II
definition: 5.� Waste management; 6. Other activities: 5.1. Disposal or recovery of hazardous waste with a capacity exceeding 10 tonnes per day involving one or more of the following activities: (a)-(j) (see scope); 5.3. (a) Disposal of non-hazardous waste with a capacity exceeding 50 tonnes per day involving one or more of the following activities, and excluding activities covered by Council Directive 91/271/EEC (1): (i)-(v) (see scope). (b) Recovery, or a mix of recovery and disposal, of non-hazardous waste with a capacity exceeding 75 tonnes per day involving one or more of the following activities, and excluding activities covered by Directive 91/271/EEC: (i)-(iv) (see scope). 5.5. Temporary storage of hazardous waste not covered under point 5.4 of Annex I to Directive 2010/75/EU pending any of the activities listed in points 5.1, 5.2, 5.4 and 5.6 of Annex I to Directive 2010/75/EU with a total capacity exceeding 50 tonnes, excluding temporary storage, pending collection, on the site where the waste is generated. 6.11. Independently operated treatment of waste water not covered by Directive 91/271/EEC and discharged by an installation undertaking activities covered under points 5.1, 5.3 or 5.5 as listed above; Apply BAT 14d, BAT 14h and use technique (a) and one or both of the techniques (b) and (c); Reducing CFCs emissions to air. The BAT-AEL emission level is 0,5-10 mg/Nm3 .
status: valid
status modified: 2019-04-23
accepted date: 2019-04-23
in scheme: BATAELValue

Waste Treatment - CN - BAT20-XIII
type: Concept
notation: WT-CN-BAT20-XIII
definition: 5.� Waste management; 6. Other activities: 5.1. Disposal or recovery of hazardous waste with a capacity exceeding 10 tonnes per day involving one or more of the following activities: (a)-(j) (see scope); 5.3. (a) Disposal of non-hazardous waste with a capacity exceeding 50 tonnes per day involving one or more of the following activities, and excluding activities covered by Council Directive 91/271/EEC (1): (i)-(v) (see scope). (b) Recovery, or a mix of recovery and disposal, of non-hazardous waste with a capacity exceeding 75 tonnes per day involving one or more of the following activities, and excluding activities covered by Directive 91/271/EEC: (i)-(iv) (see scope). 5.5. Temporary storage of hazardous waste not covered under point 5.4 of Annex I to Directive 2010/75/EU pending any of the activities listed in points 5.1, 5.2, 5.4 and 5.6 of Annex I to Directive 2010/75/EU with a total capacity exceeding 50 tonnes, excluding temporary storage, pending collection, on the site where the waste is generated. 6.11. Independently operated treatment of waste water not covered by Directive 91/271/EEC and discharged by an installation undertaking activities covered under points 5.1, 5.3 or 5.5 as listed above. Reducing free cyanide to water. The BAT-AEL emission level is 0,02-0,1 mg/l .
status: valid
status modified: 2019-04-23
accepted date: 2019-04-23
in scheme: BATAELValue

Waste Treatment - CN - BAT20-XXXIII
type: Concept
notation: WT-CN-BAT20-XXXIII
definition: 5.� Waste management; 6. Other activities: 5.1. Disposal or recovery of hazardous waste with a capacity exceeding 10 tonnes per day involving one or more of the following activities: (a)-(j) (see scope); 5.3. (a) Disposal of non-hazardous waste with a capacity exceeding 50 tonnes per day involving one or more of the following activities, and excluding activities covered by Council Directive 91/271/EEC (1): (i)-(v) (see scope). (b) Recovery, or a mix of recovery and disposal, of non-hazardous waste with a capacity exceeding 75 tonnes per day involving one or more of the following activities, and excluding activities covered by Directive 91/271/EEC: (i)-(iv) (see scope). 5.5. Temporary storage of hazardous waste not covered under point 5.4 of Annex I to Directive 2010/75/EU pending any of the activities listed in points 5.1, 5.2, 5.4 and 5.6 of Annex I to Directive 2010/75/EU with a total capacity exceeding 50 tonnes, excluding temporary storage, pending collection, on the site where the waste is generated. 6.11. Independently operated treatment of waste water not covered by Directive 91/271/EEC and discharged by an installation undertaking activities covered under points 5.1, 5.3 or 5.5 as listed above. Reducing free cyanide to water. The BAT-AEL emission level is 0,02-0,1 mg/l .
status: valid
status modified: 2019-04-23
accepted date: 2019-04-23
in scheme: BATAELValue

Waste Treatment - COD - BAT20-III
type: Concept
notation: WT-COD-BAT20-III
definition: 5.� Waste management; 6. Other activities: 5.1. Disposal or recovery of hazardous waste with a capacity exceeding 10 tonnes per day involving one or more of the following activities: (a)-(j) (see scope); 5.3. (a) Disposal of non-hazardous waste with a capacity exceeding 50 tonnes per day involving one or more of the following activities, and excluding activities covered by Council Directive 91/271/EEC (1): (i)-(v) (see scope). (b) Recovery, or a mix of recovery and disposal, of non-hazardous waste with a capacity exceeding 75 tonnes per day involving one or more of the following activities, and excluding activities covered by Directive 91/271/EEC: (i)-(iv) (see scope). 5.5. Temporary storage of hazardous waste not covered under point 5.4 of Annex I to Directive 2010/75/EU pending any of the activities listed in points 5.1, 5.2, 5.4 and 5.6 of Annex I to Directive 2010/75/EU with a total capacity exceeding 50 tonnes, excluding temporary storage, pending collection, on the site where the waste is generated. 6.11. Independently operated treatment of waste water not covered by Directive 91/271/EEC and discharged by an installation undertaking activities covered under points 5.1, 5.3 or 5.5 as listed above. Reducing chemical oxygen demand (COD) to water. The BAT-AEL emission level is 30-180 mg/l .
status: valid
status modified: 2019-04-23
accepted date: 2019-04-23
in scheme: BATAELValue

Waste Treatment - COD - BAT20-IV
type: Concept
notation: WT-COD-BAT20-IV
definition: 5.� Waste management; 6. Other activities: 5.1. Disposal or recovery of hazardous waste with a capacity exceeding 10 tonnes per day involving one or more of the following activities: (a)-(j) (see scope); 5.3. (a) Disposal of non-hazardous waste with a capacity exceeding 50 tonnes per day involving one or more of the following activities, and excluding activities covered by Council Directive 91/271/EEC (1): (i)-(v) (see scope). (b) Recovery, or a mix of recovery and disposal, of non-hazardous waste with a capacity exceeding 75 tonnes per day involving one or more of the following activities, and excluding activities covered by Directive 91/271/EEC: (i)-(iv) (see scope). 5.5. Temporary storage of hazardous waste not covered under point 5.4 of Annex I to Directive 2010/75/EU pending any of the activities listed in points 5.1, 5.2, 5.4 and 5.6 of Annex I to Directive 2010/75/EU with a total capacity exceeding 50 tonnes, excluding temporary storage, pending collection, on the site where the waste is generated. 6.11. Independently operated treatment of waste water not covered by Directive 91/271/EEC and discharged by an installation undertaking activities covered under points 5.1, 5.3 or 5.5 as listed above. Reducing chemical oxygen demand (COD) to water. The BAT-AEL emission level is 30-300 mg/l .
status: valid
status modified: 2019-04-23
accepted date: 2019-04-23
in scheme: BATAELValue

Waste Treatment - Cd - BAT20-XLIV
type: Concept
notation: WT-Cd-BAT20-XLIV
definition: 5.� Waste management; 6. Other activities: 5.1. Disposal or recovery of hazardous waste with a capacity exceeding 10 tonnes per day involving one or more of the following activities: (a)-(j) (see scope); 5.3. (a) Disposal of non-hazardous waste with a capacity exceeding 50 tonnes per day involving one or more of the following activities, and excluding activities covered by Council Directive 91/271/EEC (1): (i)-(v) (see scope). (b) Recovery, or a mix of recovery and disposal, of non-hazardous waste with a capacity exceeding 75 tonnes per day involving one or more of the following activities, and excluding activities covered by Directive 91/271/EEC: (i)-(iv) (see scope). 5.5. Temporary storage of hazardous waste not covered under point 5.4 of Annex I to Directive 2010/75/EU pending any of the activities listed in points 5.1, 5.2, 5.4 and 5.6 of Annex I to Directive 2010/75/EU with a total capacity exceeding 50 tonnes, excluding temporary storage, pending collection, on the site where the waste is generated. 6.11. Independently operated treatment of waste water not covered by Directive 91/271/EEC and discharged by an installation undertaking activities covered under points 5.1, 5.3 or 5.5 as listed above. Reducing cadmium to water. The BAT-AEL emission level is 0,01-0,1 mg/l.
status: valid
status modified: 2019-04-23
accepted date: 2019-04-23
in scheme: BATAELValue

Waste Treatment - Cd - BAT20-XVI
type: Concept
notation: WT-Cd-BAT20-XVI
definition: 5.� Waste management; 6. Other activities: 5.1. Disposal or recovery of hazardous waste with a capacity exceeding 10 tonnes per day involving one or more of the following activities: (a)-(j) (see scope); 5.3. (a) Disposal of non-hazardous waste with a capacity exceeding 50 tonnes per day involving one or more of the following activities, and excluding activities covered by Council Directive 91/271/EEC (1): (i)-(v) (see scope). (b) Recovery, or a mix of recovery and disposal, of non-hazardous waste with a capacity exceeding 75 tonnes per day involving one or more of the following activities, and excluding activities covered by Directive 91/271/EEC: (i)-(iv) (see scope). 5.5. Temporary storage of hazardous waste not covered under point 5.4 of Annex I to Directive 2010/75/EU pending any of the activities listed in points 5.1, 5.2, 5.4 and 5.6 of Annex I to Directive 2010/75/EU with a total capacity exceeding 50 tonnes, excluding temporary storage, pending collection, on the site where the waste is generated. 6.11. Independently operated treatment of waste water not covered by Directive 91/271/EEC and discharged by an installation undertaking activities covered under points 5.1, 5.3 or 5.5 as listed above. Reducing cadmium to water. The BAT-AEL emission level is 0,01-0,05 mg/l .
status: valid
status modified: 2019-04-23
accepted date: 2019-04-23
in scheme: BATAELValue

Waste Treatment - Cd - BAT20-XXIV
type: Concept
notation: WT-Cd-BAT20-XXIV
definition: 5.� Waste management; 6. Other activities: 5.1. Disposal or recovery of hazardous waste with a capacity exceeding 10 tonnes per day involving one or more of the following activities: (a)-(j) (see scope); 5.3. (a) Disposal of non-hazardous waste with a capacity exceeding 50 tonnes per day involving one or more of the following activities, and excluding activities covered by Council Directive 91/271/EEC (1): (i)-(v) (see scope). (b) Recovery, or a mix of recovery and disposal, of non-hazardous waste with a capacity exceeding 75 tonnes per day involving one or more of the following activities, and excluding activities covered by Directive 91/271/EEC: (i)-(iv) (see scope). 5.5. Temporary storage of hazardous waste not covered under point 5.4 of Annex I to Directive 2010/75/EU pending any of the activities listed in points 5.1, 5.2, 5.4 and 5.6 of Annex I to Directive 2010/75/EU with a total capacity exceeding 50 tonnes, excluding temporary storage, pending collection, on the site where the waste is generated. 6.11. Independently operated treatment of waste water not covered by Directive 91/271/EEC and discharged by an installation undertaking activities covered under points 5.1, 5.3 or 5.5 as listed above. Reducing cadmium to water. The BAT-AEL emission level is 0,01-0,1 mg/l.
status: valid
status modified: 2019-04-23
accepted date: 2019-04-23
in scheme: BATAELValue

Waste Treatment - Cd - BAT20-XXXVI
type: Concept
notation: WT-Cd-BAT20-XXXVI
definition: 5.� Waste management; 6. Other activities: 5.1. Disposal or recovery of hazardous waste with a capacity exceeding 10 tonnes per day involving one or more of the following activities: (a)-(j) (see scope); 5.3. (a) Disposal of non-hazardous waste with a capacity exceeding 50 tonnes per day involving one or more of the following activities, and excluding activities covered by Council Directive 91/271/EEC (1): (i)-(v) (see scope). (b) Recovery, or a mix of recovery and disposal, of non-hazardous waste with a capacity exceeding 75 tonnes per day involving one or more of the following activities, and excluding activities covered by Directive 91/271/EEC: (i)-(iv) (see scope). 5.5. Temporary storage of hazardous waste not covered under point 5.4 of Annex I to Directive 2010/75/EU pending any of the activities listed in points 5.1, 5.2, 5.4 and 5.6 of Annex I to Directive 2010/75/EU with a total capacity exceeding 50 tonnes, excluding temporary storage, pending collection, on the site where the waste is generated. 6.11. Independently operated treatment of waste water not covered by Directive 91/271/EEC and discharged by an installation undertaking activities covered under points 5.1, 5.3 or 5.5 as listed above. Reducing cadmium to water. The BAT-AEL emission level is 0,01-0,05 mg/l.
status: valid
status modified: 2019-04-23
accepted date: 2019-04-23
in scheme: BATAELValue

Waste Treatment - Cr - BAT20-XLV
type: Concept
notation: WT-Cr-BAT20-XLV
definition: 5.� Waste management; 6. Other activities: 5.1. Disposal or recovery of hazardous waste with a capacity exceeding 10 tonnes per day involving one or more of the following activities: (a)-(j) (see scope); 5.3. (a) Disposal of non-hazardous waste with a capacity exceeding 50 tonnes per day involving one or more of the following activities, and excluding activities covered by Council Directive 91/271/EEC (1): (i)-(v) (see scope). (b) Recovery, or a mix of recovery and disposal, of non-hazardous waste with a capacity exceeding 75 tonnes per day involving one or more of the following activities, and excluding activities covered by Directive 91/271/EEC: (i)-(iv) (see scope). 5.5. Temporary storage of hazardous waste not covered under point 5.4 of Annex I to Directive 2010/75/EU pending any of the activities listed in points 5.1, 5.2, 5.4 and 5.6 of Annex I to Directive 2010/75/EU with a total capacity exceeding 50 tonnes, excluding temporary storage, pending collection, on the site where the waste is generated. 6.11. Independently operated treatment of waste water not covered by Directive 91/271/EEC and discharged by an installation undertaking activities covered under points 5.1, 5.3 or 5.5 as listed above. Reducing chromium to water. The BAT-AEL emission level is 0,01-0,3 mg/l .
status: valid
status modified: 2019-04-23
accepted date: 2019-04-23
in scheme: BATAELValue

Waste Treatment - Cr - BAT20-XLVI
type: Concept
notation: WT-Cr-BAT20-XLVI
definition: 5.� Waste management; 6. Other activities: 5.1. Disposal or recovery of hazardous waste with a capacity exceeding 10 tonnes per day involving one or more of the following activities: (a)-(j) (see scope); 5.3. (a) Disposal of non-hazardous waste with a capacity exceeding 50 tonnes per day involving one or more of the following activities, and excluding activities covered by Council Directive 91/271/EEC (1): (i)-(v) (see scope). (b) Recovery, or a mix of recovery and disposal, of non-hazardous waste with a capacity exceeding 75 tonnes per day involving one or more of the following activities, and excluding activities covered by Directive 91/271/EEC: (i)-(iv) (see scope). 5.5. Temporary storage of hazardous waste not covered under point 5.4 of Annex I to Directive 2010/75/EU pending any of the activities listed in points 5.1, 5.2, 5.4 and 5.6 of Annex I to Directive 2010/75/EU with a total capacity exceeding 50 tonnes, excluding temporary storage, pending collection, on the site where the waste is generated. 6.11. Independently operated treatment of waste water not covered by Directive 91/271/EEC and discharged by an installation undertaking activities covered under points 5.1, 5.3 or 5.5 as listed above. Reducing hexavalent chromium to water. The BAT-AEL emission level is 0,01-0,1 mg/l.
status: valid
status modified: 2019-04-23
accepted date: 2019-04-23
in scheme: BATAELValue

Waste Treatment - Cr - BAT20-XVII
type: Concept
notation: WT-Cr-BAT20-XVII
definition: 5.� Waste management; 6. Other activities: 5.1. Disposal or recovery of hazardous waste with a capacity exceeding 10 tonnes per day involving one or more of the following activities: (a)-(j) (see scope); 5.3. (a) Disposal of non-hazardous waste with a capacity exceeding 50 tonnes per day involving one or more of the following activities, and excluding activities covered by Council Directive 91/271/EEC (1): (i)-(v) (see scope). (b) Recovery, or a mix of recovery and disposal, of non-hazardous waste with a capacity exceeding 75 tonnes per day involving one or more of the following activities, and excluding activities covered by Directive 91/271/EEC: (i)-(iv) (see scope). 5.5. Temporary storage of hazardous waste not covered under point 5.4 of Annex I to Directive 2010/75/EU pending any of the activities listed in points 5.1, 5.2, 5.4 and 5.6 of Annex I to Directive 2010/75/EU with a total capacity exceeding 50 tonnes, excluding temporary storage, pending collection, on the site where the waste is generated. 6.11. Independently operated treatment of waste water not covered by Directive 91/271/EEC and discharged by an installation undertaking activities covered under points 5.1, 5.3 or 5.5 as listed above. Reducing chromium to water. The BAT-AEL emission level is 0,01-0,15 mg/l .
status: valid
status modified: 2019-04-23
accepted date: 2019-04-23
in scheme: BATAELValue

Waste Treatment - Cr - BAT20-XXV
type: Concept
notation: WT-Cr-BAT20-XXV
definition: 5.� Waste management; 6. Other activities: 5.1. Disposal or recovery of hazardous waste with a capacity exceeding 10 tonnes per day involving one or more of the following activities: (a)-(j) (see scope); 5.3. (a) Disposal of non-hazardous waste with a capacity exceeding 50 tonnes per day involving one or more of the following activities, and excluding activities covered by Council Directive 91/271/EEC (1): (i)-(v) (see scope). (b) Recovery, or a mix of recovery and disposal, of non-hazardous waste with a capacity exceeding 75 tonnes per day involving one or more of the following activities, and excluding activities covered by Directive 91/271/EEC: (i)-(iv) (see scope). 5.5. Temporary storage of hazardous waste not covered under point 5.4 of Annex I to Directive 2010/75/EU pending any of the activities listed in points 5.1, 5.2, 5.4 and 5.6 of Annex I to Directive 2010/75/EU with a total capacity exceeding 50 tonnes, excluding temporary storage, pending collection, on the site where the waste is generated. 6.11. Independently operated treatment of waste water not covered by Directive 91/271/EEC and discharged by an installation undertaking activities covered under points 5.1, 5.3 or 5.5 as listed above. Reducing chromium to water. The BAT-AEL emission level is 0,01-0,3 mg/l .
status: valid
status modified: 2019-04-23
accepted date: 2019-04-23
in scheme: BATAELValue

Waste Treatment - Cr - BAT20-XXVI
type: Concept
notation: WT-Cr-BAT20-XXVI
definition: 5.� Waste management; 6. Other activities: 5.1. Disposal or recovery of hazardous waste with a capacity exceeding 10 tonnes per day involving one or more of the following activities: (a)-(j) (see scope); 5.3. (a) Disposal of non-hazardous waste with a capacity exceeding 50 tonnes per day involving one or more of the following activities, and excluding activities covered by Council Directive 91/271/EEC (1): (i)-(v) (see scope). (b) Recovery, or a mix of recovery and disposal, of non-hazardous waste with a capacity exceeding 75 tonnes per day involving one or more of the following activities, and excluding activities covered by Directive 91/271/EEC: (i)-(iv) (see scope). 5.5. Temporary storage of hazardous waste not covered under point 5.4 of Annex I to Directive 2010/75/EU pending any of the activities listed in points 5.1, 5.2, 5.4 and 5.6 of Annex I to Directive 2010/75/EU with a total capacity exceeding 50 tonnes, excluding temporary storage, pending collection, on the site where the waste is generated. 6.11. Independently operated treatment of waste water not covered by Directive 91/271/EEC and discharged by an installation undertaking activities covered under points 5.1, 5.3 or 5.5 as listed above. Reducing hexavalent chromium to water. The BAT-AEL emission level is 0,01-0,1 mg/l.
status: valid
status modified: 2019-04-23
accepted date: 2019-04-23
in scheme: BATAELValue

Waste Treatment - Cr - BAT20-XXXVII
type: Concept
notation: WT-Cr-BAT20-XXXVII
definition: 5.� Waste management; 6. Other activities: 5.1. Disposal or recovery of hazardous waste with a capacity exceeding 10 tonnes per day involving one or more of the following activities: (a)-(j) (see scope); 5.3. (a) Disposal of non-hazardous waste with a capacity exceeding 50 tonnes per day involving one or more of the following activities, and excluding activities covered by Council Directive 91/271/EEC (1): (i)-(v) (see scope). (b) Recovery, or a mix of recovery and disposal, of non-hazardous waste with a capacity exceeding 75 tonnes per day involving one or more of the following activities, and excluding activities covered by Directive 91/271/EEC: (i)-(iv) (see scope). 5.5. Temporary storage of hazardous waste not covered under point 5.4 of Annex I to Directive 2010/75/EU pending any of the activities listed in points 5.1, 5.2, 5.4 and 5.6 of Annex I to Directive 2010/75/EU with a total capacity exceeding 50 tonnes, excluding temporary storage, pending collection, on the site where the waste is generated. 6.11. Independently operated treatment of waste water not covered by Directive 91/271/EEC and discharged by an installation undertaking activities covered under points 5.1, 5.3 or 5.5 as listed above. Reducing chromium to water. The BAT-AEL emission level is 0,01-0,15 mg/l.
status: valid
status modified: 2019-04-23
accepted date: 2019-04-23
in scheme: BATAELValue

Waste Treatment - Cu - BAT20-XLVII
type: Concept
notation: WT-Cu-BAT20-XLVII
definition: 5.� Waste management; 6. Other activities: 5.1. Disposal or recovery of hazardous waste with a capacity exceeding 10 tonnes per day involving one or more of the following activities: (a)-(j) (see scope); 5.3. (a) Disposal of non-hazardous waste with a capacity exceeding 50 tonnes per day involving one or more of the following activities, and excluding activities covered by Council Directive 91/271/EEC (1): (i)-(v) (see scope). (b) Recovery, or a mix of recovery and disposal, of non-hazardous waste with a capacity exceeding 75 tonnes per day involving one or more of the following activities, and excluding activities covered by Directive 91/271/EEC: (i)-(iv) (see scope). 5.5. Temporary storage of hazardous waste not covered under point 5.4 of Annex I to Directive 2010/75/EU pending any of the activities listed in points 5.1, 5.2, 5.4 and 5.6 of Annex I to Directive 2010/75/EU with a total capacity exceeding 50 tonnes, excluding temporary storage, pending collection, on the site where the waste is generated. 6.11. Independently operated treatment of waste water not covered by Directive 91/271/EEC and discharged by an installation undertaking activities covered under points 5.1, 5.3 or 5.5 as listed above. Reducing copper to water. The BAT-AEL emission level is 0,05-0,5 mg/l .
status: valid
status modified: 2019-04-23
accepted date: 2019-04-23
in scheme: BATAELValue

Waste Treatment - Cu - BAT20-XVIII
type: Concept
notation: WT-Cu-BAT20-XVIII
definition: 5.� Waste management; 6. Other activities: 5.1. Disposal or recovery of hazardous waste with a capacity exceeding 10 tonnes per day involving one or more of the following activities: (a)-(j) (see scope); 5.3. (a) Disposal of non-hazardous waste with a capacity exceeding 50 tonnes per day involving one or more of the following activities, and excluding activities covered by Council Directive 91/271/EEC (1): (i)-(v) (see scope). (b) Recovery, or a mix of recovery and disposal, of non-hazardous waste with a capacity exceeding 75 tonnes per day involving one or more of the following activities, and excluding activities covered by Directive 91/271/EEC: (i)-(iv) (see scope). 5.5. Temporary storage of hazardous waste not covered under point 5.4 of Annex I to Directive 2010/75/EU pending any of the activities listed in points 5.1, 5.2, 5.4 and 5.6 of Annex I to Directive 2010/75/EU with a total capacity exceeding 50 tonnes, excluding temporary storage, pending collection, on the site where the waste is generated. 6.11. Independently operated treatment of waste water not covered by Directive 91/271/EEC and discharged by an installation undertaking activities covered under points 5.1, 5.3 or 5.5 as listed above. Reducing copper to water. The BAT-AEL emission level is 0,05-0,5 mg/l .
status: valid
status modified: 2019-04-23
accepted date: 2019-04-23
in scheme: BATAELValue

Waste Treatment - Cu - BAT20-XXVII
type: Concept
notation: WT-Cu-BAT20-XXVII
definition: 5.� Waste management; 6. Other activities: 5.1. Disposal or recovery of hazardous waste with a capacity exceeding 10 tonnes per day involving one or more of the following activities: (a)-(j) (see scope); 5.3. (a) Disposal of non-hazardous waste with a capacity exceeding 50 tonnes per day involving one or more of the following activities, and excluding activities covered by Council Directive 91/271/EEC (1): (i)-(v) (see scope). (b) Recovery, or a mix of recovery and disposal, of non-hazardous waste with a capacity exceeding 75 tonnes per day involving one or more of the following activities, and excluding activities covered by Directive 91/271/EEC: (i)-(iv) (see scope). 5.5. Temporary storage of hazardous waste not covered under point 5.4 of Annex I to Directive 2010/75/EU pending any of the activities listed in points 5.1, 5.2, 5.4 and 5.6 of Annex I to Directive 2010/75/EU with a total capacity exceeding 50 tonnes, excluding temporary storage, pending collection, on the site where the waste is generated. 6.11. Independently operated treatment of waste water not covered by Directive 91/271/EEC and discharged by an installation undertaking activities covered under points 5.1, 5.3 or 5.5 as listed above. Reducing copper to water. The BAT-AEL emission level is 0,05-0,5 mg/l .
status: valid
status modified: 2019-04-23
accepted date: 2019-04-23
in scheme: BATAELValue

Waste Treatment - Cu - BAT20-XXXVIII
type: Concept
notation: WT-Cu-BAT20-XXXVIII
definition: 5.� Waste management; 6. Other activities: 5.1. Disposal or recovery of hazardous waste with a capacity exceeding 10 tonnes per day involving one or more of the following activities: (a)-(j) (see scope); 5.3. (a) Disposal of non-hazardous waste with a capacity exceeding 50 tonnes per day involving one or more of the following activities, and excluding activities covered by Council Directive 91/271/EEC (1): (i)-(v) (see scope). (b) Recovery, or a mix of recovery and disposal, of non-hazardous waste with a capacity exceeding 75 tonnes per day involving one or more of the following activities, and excluding activities covered by Directive 91/271/EEC: (i)-(iv) (see scope). 5.5. Temporary storage of hazardous waste not covered under point 5.4 of Annex I to Directive 2010/75/EU pending any of the activities listed in points 5.1, 5.2, 5.4 and 5.6 of Annex I to Directive 2010/75/EU with a total capacity exceeding 50 tonnes, excluding temporary storage, pending collection, on the site where the waste is generated. 6.11. Independently operated treatment of waste water not covered by Directive 91/271/EEC and discharged by an installation undertaking activities covered under points 5.1, 5.3 or 5.5 as listed above. Reducing copper to water. The BAT-AEL emission level is 0,05-0,5 mg/l.
status: valid
status modified: 2019-04-23
accepted date: 2019-04-23
in scheme: BATAELValue

Waste Treatment - Dust - BAT25
type: Concept
notation: WT-Dust-BAT25
definition: 5.� Waste management; 6. Other activities: 5.1. Disposal or recovery of hazardous waste with a capacity exceeding 10 tonnes per day involving one or more of the following activities: (a)-(j) (see scope); 5.3. (a) Disposal of non-hazardous waste with a capacity exceeding 50 tonnes per day involving one or more of the following activities, and excluding activities covered by Council Directive 91/271/EEC (1): (i)-(v) (see scope). (b) Recovery, or a mix of recovery and disposal, of non-hazardous waste with a capacity exceeding 75 tonnes per day involving one or more of the following activities, and excluding activities covered by Directive 91/271/EEC: (i)-(iv) (see scope). 5.5. Temporary storage of hazardous waste not covered under point 5.4 of Annex I to Directive 2010/75/EU pending any of the activities listed in points 5.1, 5.2, 5.4 and 5.6 of Annex I to Directive 2010/75/EU with a total capacity exceeding 50 tonnes, excluding temporary storage, pending collection, on the site where the waste is generated. 6.11. Independently operated treatment of waste water not covered by Directive 91/271/EEC and discharged by an installation undertaking activities covered under points 5.1, 5.3 or 5.5 as listed above; Techniques (a)-(r) (see table incl. footnotes) for treatment of water-based liquid waste; Reducing dust emissions to air. The BAT-AEL emission level is 2-5 mg/Nm3 .
status: valid
status modified: 2019-04-23
accepted date: 2019-04-23
in scheme: BATAELValue

Waste Treatment - Dust - BAT34-III
type: Concept
notation: WT-Dust-BAT34-III
definition: 5.� Waste management; 6. Other activities: 5.1. Disposal or recovery of hazardous waste with a capacity exceeding 10 tonnes per day involving one or more of the following activities: (a)-(j) (see scope); 5.3. (a) Disposal of non-hazardous waste with a capacity exceeding 50 tonnes per day involving one or more of the following activities, and excluding activities covered by Council Directive 91/271/EEC (1): (i)-(v) (see scope). (b) Recovery, or a mix of recovery and disposal, of non-hazardous waste with a capacity exceeding 75 tonnes per day involving one or more of the following activities, and excluding activities covered by Directive 91/271/EEC: (i)-(iv) (see scope). 5.5. Temporary storage of hazardous waste not covered under point 5.4 of Annex I to Directive 2010/75/EU pending any of the activities listed in points 5.1, 5.2, 5.4 and 5.6 of Annex I to Directive 2010/75/EU with a total capacity exceeding 50 tonnes, excluding temporary storage, pending collection, on the site where the waste is generated. 6.11. Independently operated treatment of waste water not covered by Directive 91/271/EEC and discharged by an installation undertaking activities covered under points 5.1, 5.3 or 5.5 as listed above; Techniques (a)-(e) (see table); Reducing dust emissions to air. The BAT-AEL emission level is 2-5 mg/Nm3 .
status: valid
status modified: 2019-04-23
accepted date: 2019-04-23
in scheme: BATAELValue

Waste Treatment - Dust - BAT41
type: Concept
notation: WT-Dust-BAT41
definition: 5.� Waste management; 6. Other activities: 5.1. Disposal or recovery of hazardous waste with a capacity exceeding 10 tonnes per day involving one or more of the following activities: (a)-(j) (see scope); 5.3. (a) Disposal of non-hazardous waste with a capacity exceeding 50 tonnes per day involving one or more of the following activities, and excluding activities covered by Council Directive 91/271/EEC (1): (i)-(v) (see scope). (b) Recovery, or a mix of recovery and disposal, of non-hazardous waste with a capacity exceeding 75 tonnes per day involving one or more of the following activities, and excluding activities covered by Directive 91/271/EEC: (i)-(iv) (see scope). 5.5. Temporary storage of hazardous waste not covered under point 5.4 of Annex I to Directive 2010/75/EU pending any of the activities listed in points 5.1, 5.2, 5.4 and 5.6 of Annex I to Directive 2010/75/EU with a total capacity exceeding 50 tonnes, excluding temporary storage, pending collection, on the site where the waste is generated. 6.11. Independently operated treatment of waste water not covered by Directive 91/271/EEC and discharged by an installation undertaking activities covered under points 5.1, 5.3 or 5.5 as listed above; Reducing dust emissions to air. The BAT-AEL emission level is 2-5 mg/Nm3 .
status: valid
status modified: 2019-04-23
accepted date: 2019-04-23
in scheme: BATAELValue

Waste Treatment - HCl - BAT53-I
type: Concept
notation: WT-HCl-BAT53-I
definition: 5.� Waste management; 6. Other activities: 5.1. Disposal or recovery of hazardous waste with a capacity exceeding 10 tonnes per day involving one or more of the following activities: (a)-(j) (see scope); 5.3. (a) Disposal of non-hazardous waste with a capacity exceeding 50 tonnes per day involving one or more of the following activities, and excluding activities covered by Council Directive 91/271/EEC (1): (i)-(v) (see scope). (b) Recovery, or a mix of recovery and disposal, of non-hazardous waste with a capacity exceeding 75 tonnes per day involving one or more of the following activities, and excluding activities covered by Directive 91/271/EEC: (i)-(iv) (see scope). 5.5. Temporary storage of hazardous waste not covered under point 5.4 of Annex I to Directive 2010/75/EU pending any of the activities listed in points 5.1, 5.2, 5.4 and 5.6 of Annex I to Directive 2010/75/EU with a total capacity exceeding 50 tonnes, excluding temporary storage, pending collection, on the site where the waste is generated. 6.11. Independently operated treatment of waste water not covered by Directive 91/271/EEC and discharged by an installation undertaking activities covered under points 5.1, 5.3 or 5.5 as listed above; Reducing hydrogen chloride emissions to air. The BAT-AEL emission level is 1-5 mg/Nm3 .
status: valid
status modified: 2019-04-23
accepted date: 2019-04-23
in scheme: BATAELValue

Waste Treatment - HOI - BAT20-VI
type: Concept
notation: WT-HOI-BAT20-VI
definition: 5.� Waste management; 6. Other activities: 5.1. Disposal or recovery of hazardous waste with a capacity exceeding 10 tonnes per day involving one or more of the following activities: (a)-(j) (see scope); 5.3. (a) Disposal of non-hazardous waste with a capacity exceeding 50 tonnes per day involving one or more of the following activities, and excluding activities covered by Council Directive 91/271/EEC (1): (i)-(v) (see scope). (b) Recovery, or a mix of recovery and disposal, of non-hazardous waste with a capacity exceeding 75 tonnes per day involving one or more of the following activities, and excluding activities covered by Directive 91/271/EEC: (i)-(iv) (see scope). 5.5. Temporary storage of hazardous waste not covered under point 5.4 of Annex I to Directive 2010/75/EU pending any of the activities listed in points 5.1, 5.2, 5.4 and 5.6 of Annex I to Directive 2010/75/EU with a total capacity exceeding 50 tonnes, excluding temporary storage, pending collection, on the site where the waste is generated. 6.11. Independently operated treatment of waste water not covered by Directive 91/271/EEC and discharged by an installation undertaking activities covered under points 5.1, 5.3 or 5.5 as listed above. Reducing hydrocarbon oil index to water. The BAT-AEL emission level is 0,5-10 mg/l .
status: valid
status modified: 2019-04-23
accepted date: 2019-04-23
in scheme: BATAELValue

Waste Treatment - HOI - BAT20-XXXII
type: Concept
notation: WT-HOI-BAT20-XXXII
definition: 5.� Waste management; 6. Other activities: 5.1. Disposal or recovery of hazardous waste with a capacity exceeding 10 tonnes per day involving one or more of the following activities: (a)-(j) (see scope); 5.3. (a) Disposal of non-hazardous waste with a capacity exceeding 50 tonnes per day involving one or more of the following activities, and excluding activities covered by Council Directive 91/271/EEC (1): (i)-(v) (see scope). (b) Recovery, or a mix of recovery and disposal, of non-hazardous waste with a capacity exceeding 75 tonnes per day involving one or more of the following activities, and excluding activities covered by Directive 91/271/EEC: (i)-(iv) (see scope). 5.5. Temporary storage of hazardous waste not covered under point 5.4 of Annex I to Directive 2010/75/EU pending any of the activities listed in points 5.1, 5.2, 5.4 and 5.6 of Annex I to Directive 2010/75/EU with a total capacity exceeding 50 tonnes, excluding temporary storage, pending collection, on the site where the waste is generated. 6.11. Independently operated treatment of waste water not covered by Directive 91/271/EEC and discharged by an installation undertaking activities covered under points 5.1, 5.3 or 5.5 as listed above. Reducing hydrocarbon oil index to water. The BAT-AEL emission level is 0,5-10 mg/l .
status: valid
status modified: 2019-04-23
accepted date: 2019-04-23
in scheme: BATAELValue

Waste Treatment - Hg - BAT20-L
type: Concept
notation: WT-Hg-BAT20-L
definition: 5.� Waste management; 6. Other activities: 5.1. Disposal or recovery of hazardous waste with a capacity exceeding 10 tonnes per day involving one or more of the following activities: (a)-(j) (see scope); 5.3. (a) Disposal of non-hazardous waste with a capacity exceeding 50 tonnes per day involving one or more of the following activities, and excluding activities covered by Council Directive 91/271/EEC (1): (i)-(v) (see scope). (b) Recovery, or a mix of recovery and disposal, of non-hazardous waste with a capacity exceeding 75 tonnes per day involving one or more of the following activities, and excluding activities covered by Directive 91/271/EEC: (i)-(iv) (see scope). 5.5. Temporary storage of hazardous waste not covered under point 5.4 of Annex I to Directive 2010/75/EU pending any of the activities listed in points 5.1, 5.2, 5.4 and 5.6 of Annex I to Directive 2010/75/EU with a total capacity exceeding 50 tonnes, excluding temporary storage, pending collection, on the site where the waste is generated. 6.11. Independently operated treatment of waste water not covered by Directive 91/271/EEC and discharged by an installation undertaking activities covered under points 5.1, 5.3 or 5.5 as listed above. Reducing mercury to water. The BAT-AEL emission level is 1-10 �g/l .
status: valid
status modified: 2019-04-23
accepted date: 2019-04-23
in scheme: BATAELValue

Waste Treatment - Hg - BAT20-XLI
type: Concept
notation: WT-Hg-BAT20-XLI
definition: 5.� Waste management; 6. Other activities: 5.1. Disposal or recovery of hazardous waste with a capacity exceeding 10 tonnes per day involving one or more of the following activities: (a)-(j) (see scope); 5.3. (a) Disposal of non-hazardous waste with a capacity exceeding 50 tonnes per day involving one or more of the following activities, and excluding activities covered by Council Directive 91/271/EEC (1): (i)-(v) (see scope). (b) Recovery, or a mix of recovery and disposal, of non-hazardous waste with a capacity exceeding 75 tonnes per day involving one or more of the following activities, and excluding activities covered by Directive 91/271/EEC: (i)-(iv) (see scope). 5.5. Temporary storage of hazardous waste not covered under point 5.4 of Annex I to Directive 2010/75/EU pending any of the activities listed in points 5.1, 5.2, 5.4 and 5.6 of Annex I to Directive 2010/75/EU with a total capacity exceeding 50 tonnes, excluding temporary storage, pending collection, on the site where the waste is generated. 6.11. Independently operated treatment of waste water not covered by Directive 91/271/EEC and discharged by an installation undertaking activities covered under points 5.1, 5.3 or 5.5 as listed above. Reducing mercury to water. The BAT-AEL emission level is 0,5-5 �g/l .
status: valid
status modified: 2019-04-23
accepted date: 2019-04-23
in scheme: BATAELValue

Waste Treatment - Hg - BAT20-XXI
type: Concept
notation: WT-Hg-BAT20-XXI
definition: 5.� Waste management; 6. Other activities: 5.1. Disposal or recovery of hazardous waste with a capacity exceeding 10 tonnes per day involving one or more of the following activities: (a)-(j) (see scope); 5.3. (a) Disposal of non-hazardous waste with a capacity exceeding 50 tonnes per day involving one or more of the following activities, and excluding activities covered by Council Directive 91/271/EEC (1): (i)-(v) (see scope). (b) Recovery, or a mix of recovery and disposal, of non-hazardous waste with a capacity exceeding 75 tonnes per day involving one or more of the following activities, and excluding activities covered by Directive 91/271/EEC: (i)-(iv) (see scope). 5.5. Temporary storage of hazardous waste not covered under point 5.4 of Annex I to Directive 2010/75/EU pending any of the activities listed in points 5.1, 5.2, 5.4 and 5.6 of Annex I to Directive 2010/75/EU with a total capacity exceeding 50 tonnes, excluding temporary storage, pending collection, on the site where the waste is generated. 6.11. Independently operated treatment of waste water not covered by Directive 91/271/EEC and discharged by an installation undertaking activities covered under points 5.1, 5.3 or 5.5 as listed above. Reducing mercury to water. The BAT-AEL emission level is 0,5-5 �g/l .
status: valid
status modified: 2019-04-23
accepted date: 2019-04-23
in scheme: BATAELValue

Waste Treatment - Hg - BAT20-XXX
type: Concept
notation: WT-Hg-BAT20-XXX
definition: 5.� Waste management; 6. Other activities: 5.1. Disposal or recovery of hazardous waste with a capacity exceeding 10 tonnes per day involving one or more of the following activities: (a)-(j) (see scope); 5.3. (a) Disposal of non-hazardous waste with a capacity exceeding 50 tonnes per day involving one or more of the following activities, and excluding activities covered by Council Directive 91/271/EEC (1): (i)-(v) (see scope). (b) Recovery, or a mix of recovery and disposal, of non-hazardous waste with a capacity exceeding 75 tonnes per day involving one or more of the following activities, and excluding activities covered by Directive 91/271/EEC: (i)-(iv) (see scope). 5.5. Temporary storage of hazardous waste not covered under point 5.4 of Annex I to Directive 2010/75/EU pending any of the activities listed in points 5.1, 5.2, 5.4 and 5.6 of Annex I to Directive 2010/75/EU with a total capacity exceeding 50 tonnes, excluding temporary storage, pending collection, on the site where the waste is generated. 6.11. Independently operated treatment of waste water not covered by Directive 91/271/EEC and discharged by an installation undertaking activities covered under points 5.1, 5.3 or 5.5 as listed above. Reducing mercury to water. The BAT-AEL emission level is 1-10 �g/l .
status: valid
status modified: 2019-04-23
accepted date: 2019-04-23
in scheme: BATAELValue

Waste Treatment - Hg - BAT32
type: Concept
notation: WT-Hg-BAT32
definition: 5.� Waste management; 6. Other activities: 5.1. Disposal or recovery of hazardous waste with a capacity exceeding 10 tonnes per day involving one or more of the following activities: (a)-(j) (see scope); 5.3. (a) Disposal of non-hazardous waste with a capacity exceeding 50 tonnes per day involving one or more of the following activities, and excluding activities covered by Council Directive 91/271/EEC (1): (i)-(v) (see scope). (b) Recovery, or a mix of recovery and disposal, of non-hazardous waste with a capacity exceeding 75 tonnes per day involving one or more of the following activities, and excluding activities covered by Directive 91/271/EEC: (i)-(iv) (see scope). 5.5. Temporary storage of hazardous waste not covered under point 5.4 of Annex I to Directive 2010/75/EU pending any of the activities listed in points 5.1, 5.2, 5.4 and 5.6 of Annex I to Directive 2010/75/EU with a total capacity exceeding 50 tonnes, excluding temporary storage, pending collection, on the site where the waste is generated. 6.11. Independently operated treatment of waste water not covered by Directive 91/271/EEC and discharged by an installation undertaking activities covered under points 5.1, 5.3 or 5.5 as listed above; Techniques (a)-(d) (see table); Reducing mercury emissions to air. The BAT-AEL emission level is 2-7 �g/Nm3 .
status: valid
status modified: 2019-04-23
accepted date: 2019-04-23
in scheme: BATAELValue

Waste Treatment - NH3 - BAT34-I
type: Concept
notation: WT-NH3-BAT34-I
definition: 5.� Waste management; 6. Other activities: 5.1. Disposal or recovery of hazardous waste with a capacity exceeding 10 tonnes per day involving one or more of the following activities: (a)-(j) (see scope); 5.3. (a) Disposal of non-hazardous waste with a capacity exceeding 50 tonnes per day involving one or more of the following activities, and excluding activities covered by Council Directive 91/271/EEC (1): (i)-(v) (see scope). (b) Recovery, or a mix of recovery and disposal, of non-hazardous waste with a capacity exceeding 75 tonnes per day involving one or more of the following activities, and excluding activities covered by Directive 91/271/EEC: (i)-(iv) (see scope). 5.5. Temporary storage of hazardous waste not covered under point 5.4 of Annex I to Directive 2010/75/EU pending any of the activities listed in points 5.1, 5.2, 5.4 and 5.6 of Annex I to Directive 2010/75/EU with a total capacity exceeding 50 tonnes, excluding temporary storage, pending collection, on the site where the waste is generated. 6.11. Independently operated treatment of waste water not covered by Directive 91/271/EEC and discharged by an installation undertaking activities covered under points 5.1, 5.3 or 5.5 as listed above; Collect mercury emissions at source, send them to abatement and carry out adequate monitoring (see description); Reducing ammonia (NH3) emissions to air. The BAT-AEL emission level is 0,3-20 mg/Nm3 .
status: valid
status modified: 2019-04-23
accepted date: 2019-04-23
in scheme: BATAELValue

Waste Treatment - Ni - BAT20-XL
type: Concept
notation: WT-Ni-BAT20-XL
definition: 5.� Waste management; 6. Other activities: 5.1. Disposal or recovery of hazardous waste with a capacity exceeding 10 tonnes per day involving one or more of the following activities: (a)-(j) (see scope); 5.3. (a) Disposal of non-hazardous waste with a capacity exceeding 50 tonnes per day involving one or more of the following activities, and excluding activities covered by Council Directive 91/271/EEC (1): (i)-(v) (see scope). (b) Recovery, or a mix of recovery and disposal, of non-hazardous waste with a capacity exceeding 75 tonnes per day involving one or more of the following activities, and excluding activities covered by Directive 91/271/EEC: (i)-(iv) (see scope). 5.5. Temporary storage of hazardous waste not covered under point 5.4 of Annex I to Directive 2010/75/EU pending any of the activities listed in points 5.1, 5.2, 5.4 and 5.6 of Annex I to Directive 2010/75/EU with a total capacity exceeding 50 tonnes, excluding temporary storage, pending collection, on the site where the waste is generated. 6.11. Independently operated treatment of waste water not covered by Directive 91/271/EEC and discharged by an installation undertaking activities covered under points 5.1, 5.3 or 5.5 as listed above. Reducing nickel to water. The BAT-AEL emission level is 0,05-0,5 mg/l .
status: valid
status modified: 2019-04-23
accepted date: 2019-04-23
in scheme: BATAELValue

Waste Treatment - Ni - BAT20-XLIX
type: Concept
notation: WT-Ni-BAT20-XLIX
definition: 5.� Waste management; 6. Other activities: 5.1. Disposal or recovery of hazardous waste with a capacity exceeding 10 tonnes per day involving one or more of the following activities: (a)-(j) (see scope); 5.3. (a) Disposal of non-hazardous waste with a capacity exceeding 50 tonnes per day involving one or more of the following activities, and excluding activities covered by Council Directive 91/271/EEC (1): (i)-(v) (see scope). (b) Recovery, or a mix of recovery and disposal, of non-hazardous waste with a capacity exceeding 75 tonnes per day involving one or more of the following activities, and excluding activities covered by Directive 91/271/EEC: (i)-(iv) (see scope). 5.5. Temporary storage of hazardous waste not covered under point 5.4 of Annex I to Directive 2010/75/EU pending any of the activities listed in points 5.1, 5.2, 5.4 and 5.6 of Annex I to Directive 2010/75/EU with a total capacity exceeding 50 tonnes, excluding temporary storage, pending collection, on the site where the waste is generated. 6.11. Independently operated treatment of waste water not covered by Directive 91/271/EEC and discharged by an installation undertaking activities covered under points 5.1, 5.3 or 5.5 as listed above. Reducing nickel to water. The BAT-AEL emission level is 0,05-1 mg/l .
status: valid
status modified: 2019-04-23
accepted date: 2019-04-23
in scheme: BATAELValue

Waste Treatment - Ni - BAT20-XX
type: Concept
notation: WT-Ni-BAT20-XX
definition: 5.� Waste management; 6. Other activities: 5.1. Disposal or recovery of hazardous waste with a capacity exceeding 10 tonnes per day involving one or more of the following activities: (a)-(j) (see scope); 5.3. (a) Disposal of non-hazardous waste with a capacity exceeding 50 tonnes per day involving one or more of the following activities, and excluding activities covered by Council Directive 91/271/EEC (1): (i)-(v) (see scope). (b) Recovery, or a mix of recovery and disposal, of non-hazardous waste with a capacity exceeding 75 tonnes per day involving one or more of the following activities, and excluding activities covered by Directive 91/271/EEC: (i)-(iv) (see scope). 5.5. Temporary storage of hazardous waste not covered under point 5.4 of Annex I to Directive 2010/75/EU pending any of the activities listed in points 5.1, 5.2, 5.4 and 5.6 of Annex I to Directive 2010/75/EU with a total capacity exceeding 50 tonnes, excluding temporary storage, pending collection, on the site where the waste is generated. 6.11. Independently operated treatment of waste water not covered by Directive 91/271/EEC and discharged by an installation undertaking activities covered under points 5.1, 5.3 or 5.5 as listed above. Reducing nickel to water. The BAT-AEL emission level is 0,05-0,5 mg/l .
status: valid
status modified: 2019-04-23
accepted date: 2019-04-23
in scheme: BATAELValue

Waste Treatment - Ni - BAT20-XXIX
type: Concept
notation: WT-Ni-BAT20-XXIX
definition: 5.� Waste management; 6. Other activities: 5.1. Disposal or recovery of hazardous waste with a capacity exceeding 10 tonnes per day involving one or more of the following activities: (a)-(j) (see scope); 5.3. (a) Disposal of non-hazardous waste with a capacity exceeding 50 tonnes per day involving one or more of the following activities, and excluding activities covered by Council Directive 91/271/EEC (1): (i)-(v) (see scope). (b) Recovery, or a mix of recovery and disposal, of non-hazardous waste with a capacity exceeding 75 tonnes per day involving one or more of the following activities, and excluding activities covered by Directive 91/271/EEC: (i)-(iv) (see scope). 5.5. Temporary storage of hazardous waste not covered under point 5.4 of Annex I to Directive 2010/75/EU pending any of the activities listed in points 5.1, 5.2, 5.4 and 5.6 of Annex I to Directive 2010/75/EU with a total capacity exceeding 50 tonnes, excluding temporary storage, pending collection, on the site where the waste is generated. 6.11. Independently operated treatment of waste water not covered by Directive 91/271/EEC and discharged by an installation undertaking activities covered under points 5.1, 5.3 or 5.5 as listed above. Reducing nickel to water. The BAT-AEL emission level is 0,05-1 mg/l .
status: valid
status modified: 2019-04-23
accepted date: 2019-04-23
in scheme: BATAELValue

Waste Treatment - Odour - BAT34-II
type: Concept
notation: WT-Odour-BAT34-II
definition: 5.� Waste management; 6. Other activities: 5.1. Disposal or recovery of hazardous waste with a capacity exceeding 10 tonnes per day involving one or more of the following activities: (a)-(j) (see scope); 5.3. (a) Disposal of non-hazardous waste with a capacity exceeding 50 tonnes per day involving one or more of the following activities, and excluding activities covered by Council Directive 91/271/EEC (1): (i)-(v) (see scope). (b) Recovery, or a mix of recovery and disposal, of non-hazardous waste with a capacity exceeding 75 tonnes per day involving one or more of the following activities, and excluding activities covered by Directive 91/271/EEC: (i)-(iv) (see scope). 5.5. Temporary storage of hazardous waste not covered under point 5.4 of Annex I to Directive 2010/75/EU pending any of the activities listed in points 5.1, 5.2, 5.4 and 5.6 of Annex I to Directive 2010/75/EU with a total capacity exceeding 50 tonnes, excluding temporary storage, pending collection, on the site where the waste is generated. 6.11. Independently operated treatment of waste water not covered by Directive 91/271/EEC and discharged by an installation undertaking activities covered under points 5.1, 5.3 or 5.5 as listed above; Techniques (a)-(e) (see table); Reducing odour concentration emissions to air. The BAT-AEL emission level is 200-1 000 ouE/Nm3 .
status: valid
status modified: 2019-04-23
accepted date: 2019-04-23
in scheme: BATAELValue

Waste Treatment - Pb - BAT20-XIX
type: Concept
notation: WT-Pb-BAT20-XIX
definition: 5.� Waste management; 6. Other activities: 5.1. Disposal or recovery of hazardous waste with a capacity exceeding 10 tonnes per day involving one or more of the following activities: (a)-(j) (see scope); 5.3. (a) Disposal of non-hazardous waste with a capacity exceeding 50 tonnes per day involving one or more of the following activities, and excluding activities covered by Council Directive 91/271/EEC (1): (i)-(v) (see scope). (b) Recovery, or a mix of recovery and disposal, of non-hazardous waste with a capacity exceeding 75 tonnes per day involving one or more of the following activities, and excluding activities covered by Directive 91/271/EEC: (i)-(iv) (see scope). 5.5. Temporary storage of hazardous waste not covered under point 5.4 of Annex I to Directive 2010/75/EU pending any of the activities listed in points 5.1, 5.2, 5.4 and 5.6 of Annex I to Directive 2010/75/EU with a total capacity exceeding 50 tonnes, excluding temporary storage, pending collection, on the site where the waste is generated. 6.11. Independently operated treatment of waste water not covered by Directive 91/271/EEC and discharged by an installation undertaking activities covered under points 5.1, 5.3 or 5.5 as listed above. Reducing lead to water. The BAT-AEL emission level is 0,05-0,1 mg/l .
status: valid
status modified: 2019-04-23
accepted date: 2019-04-23
in scheme: BATAELValue

Waste Treatment - Pb - BAT20-XLVIII
type: Concept
notation: WT-Pb-BAT20-XLVIII
definition: 5.� Waste management; 6. Other activities: 5.1. Disposal or recovery of hazardous waste with a capacity exceeding 10 tonnes per day involving one or more of the following activities: (a)-(j) (see scope); 5.3. (a) Disposal of non-hazardous waste with a capacity exceeding 50 tonnes per day involving one or more of the following activities, and excluding activities covered by Council Directive 91/271/EEC (1): (i)-(v) (see scope). (b) Recovery, or a mix of recovery and disposal, of non-hazardous waste with a capacity exceeding 75 tonnes per day involving one or more of the following activities, and excluding activities covered by Directive 91/271/EEC: (i)-(iv) (see scope). 5.5. Temporary storage of hazardous waste not covered under point 5.4 of Annex I to Directive 2010/75/EU pending any of the activities listed in points 5.1, 5.2, 5.4 and 5.6 of Annex I to Directive 2010/75/EU with a total capacity exceeding 50 tonnes, excluding temporary storage, pending collection, on the site where the waste is generated. 6.11. Independently operated treatment of waste water not covered by Directive 91/271/EEC and discharged by an installation undertaking activities covered under points 5.1, 5.3 or 5.5 as listed above. Reducing lead to water. The BAT-AEL emission level is 0,05-0,3 mg/l .
status: valid
status modified: 2019-04-23
accepted date: 2019-04-23
in scheme: BATAELValue

Waste Treatment - Pb - BAT20-XXVIII
type: Concept
notation: WT-Pb-BAT20-XXVIII
definition: 5.� Waste management; 6. Other activities: 5.1. Disposal or recovery of hazardous waste with a capacity exceeding 10 tonnes per day involving one or more of the following activities: (a)-(j) (see scope); 5.3. (a) Disposal of non-hazardous waste with a capacity exceeding 50 tonnes per day involving one or more of the following activities, and excluding activities covered by Council Directive 91/271/EEC (1): (i)-(v) (see scope). (b) Recovery, or a mix of recovery and disposal, of non-hazardous waste with a capacity exceeding 75 tonnes per day involving one or more of the following activities, and excluding activities covered by Directive 91/271/EEC: (i)-(iv) (see scope). 5.5. Temporary storage of hazardous waste not covered under point 5.4 of Annex I to Directive 2010/75/EU pending any of the activities listed in points 5.1, 5.2, 5.4 and 5.6 of Annex I to Directive 2010/75/EU with a total capacity exceeding 50 tonnes, excluding temporary storage, pending collection, on the site where the waste is generated. 6.11. Independently operated treatment of waste water not covered by Directive 91/271/EEC and discharged by an installation undertaking activities covered under points 5.1, 5.3 or 5.5 as listed above. Reducing lead to water. The BAT-AEL emission level is 0,05-0,3 mg/l .
status: valid
status modified: 2019-04-23
accepted date: 2019-04-23
in scheme: BATAELValue

Waste Treatment - Pb - BAT20-XXXIX
type: Concept
notation: WT-Pb-BAT20-XXXIX
definition: 5.� Waste management; 6. Other activities: 5.1. Disposal or recovery of hazardous waste with a capacity exceeding 10 tonnes per day involving one or more of the following activities: (a)-(j) (see scope); 5.3. (a) Disposal of non-hazardous waste with a capacity exceeding 50 tonnes per day involving one or more of the following activities, and excluding activities covered by Council Directive 91/271/EEC (1): (i)-(v) (see scope). (b) Recovery, or a mix of recovery and disposal, of non-hazardous waste with a capacity exceeding 75 tonnes per day involving one or more of the following activities, and excluding activities covered by Directive 91/271/EEC: (i)-(iv) (see scope). 5.5. Temporary storage of hazardous waste not covered under point 5.4 of Annex I to Directive 2010/75/EU pending any of the activities listed in points 5.1, 5.2, 5.4 and 5.6 of Annex I to Directive 2010/75/EU with a total capacity exceeding 50 tonnes, excluding temporary storage, pending collection, on the site where the waste is generated. 6.11. Independently operated treatment of waste water not covered by Directive 91/271/EEC and discharged by an installation undertaking activities covered under points 5.1, 5.3 or 5.5 as listed above. Reducing lead to water. The BAT-AEL emission level is 0,05-0,1 mg/l .
status: valid
status modified: 2019-04-23
accepted date: 2019-04-23
in scheme: BATAELValue

Waste Treatment - Phenols - BAT20-XI
type: Concept
notation: WT-Phenols-BAT20-XI
definition: 5.� Waste management; 6. Other activities: 5.1. Disposal or recovery of hazardous waste with a capacity exceeding 10 tonnes per day involving one or more of the following activities: (a)-(j) (see scope); 5.3. (a) Disposal of non-hazardous waste with a capacity exceeding 50 tonnes per day involving one or more of the following activities, and excluding activities covered by Council Directive 91/271/EEC (1): (i)-(v) (see scope). (b) Recovery, or a mix of recovery and disposal, of non-hazardous waste with a capacity exceeding 75 tonnes per day involving one or more of the following activities, and excluding activities covered by Directive 91/271/EEC: (i)-(iv) (see scope). 5.5. Temporary storage of hazardous waste not covered under point 5.4 of Annex I to Directive 2010/75/EU pending any of the activities listed in points 5.1, 5.2, 5.4 and 5.6 of Annex I to Directive 2010/75/EU with a total capacity exceeding 50 tonnes, excluding temporary storage, pending collection, on the site where the waste is generated. 6.11. Independently operated treatment of waste water not covered by Directive 91/271/EEC and discharged by an installation undertaking activities covered under points 5.1, 5.3 or 5.5 as listed above. Reducing phenol index to water. The BAT-AEL emission level is 0,05-0,2 mg/l .
status: valid
status modified: 2019-04-23
accepted date: 2019-04-23
in scheme: BATAELValue

Waste Treatment - Phenols - BAT20-XII
type: Concept
notation: WT-Phenols-BAT20-XII
definition: 5.� Waste management; 6. Other activities: 5.1. Disposal or recovery of hazardous waste with a capacity exceeding 10 tonnes per day involving one or more of the following activities: (a)-(j) (see scope); 5.3. (a) Disposal of non-hazardous waste with a capacity exceeding 50 tonnes per day involving one or more of the following activities, and excluding activities covered by Council Directive 91/271/EEC (1): (i)-(v) (see scope). (b) Recovery, or a mix of recovery and disposal, of non-hazardous waste with a capacity exceeding 75 tonnes per day involving one or more of the following activities, and excluding activities covered by Directive 91/271/EEC: (i)-(iv) (see scope). 5.5. Temporary storage of hazardous waste not covered under point 5.4 of Annex I to Directive 2010/75/EU pending any of the activities listed in points 5.1, 5.2, 5.4 and 5.6 of Annex I to Directive 2010/75/EU with a total capacity exceeding 50 tonnes, excluding temporary storage, pending collection, on the site where the waste is generated. 6.11. Independently operated treatment of waste water not covered by Directive 91/271/EEC and discharged by an installation undertaking activities covered under points 5.1, 5.3 or 5.5 as listed above. Reducing phenol index to water. The BAT-AEL emission level is 0,05-0,3 mg/l .
status: valid
status modified: 2019-04-23
accepted date: 2019-04-23
in scheme: BATAELValue

Waste Treatment - TN - BAT20-VII
type: Concept
notation: WT-TN-BAT20-VII
definition: 5.� Waste management; 6. Other activities: 5.1. Disposal or recovery of hazardous waste with a capacity exceeding 10 tonnes per day involving one or more of the following activities: (a)-(j) (see scope); 5.3. (a) Disposal of non-hazardous waste with a capacity exceeding 50 tonnes per day involving one or more of the following activities, and excluding activities covered by Council Directive 91/271/EEC (1): (i)-(v) (see scope). (b) Recovery, or a mix of recovery and disposal, of non-hazardous waste with a capacity exceeding 75 tonnes per day involving one or more of the following activities, and excluding activities covered by Directive 91/271/EEC: (i)-(iv) (see scope). 5.5. Temporary storage of hazardous waste not covered under point 5.4 of Annex I to Directive 2010/75/EU pending any of the activities listed in points 5.1, 5.2, 5.4 and 5.6 of Annex I to Directive 2010/75/EU with a total capacity exceeding 50 tonnes, excluding temporary storage, pending collection, on the site where the waste is generated. 6.11. Independently operated treatment of waste water not covered by Directive 91/271/EEC and discharged by an installation undertaking activities covered under points 5.1, 5.3 or 5.5 as listed above. Reducing total nitrogen to water. The BAT-AEL emission level is 1-25 mg/l .
status: valid
status modified: 2019-04-23
accepted date: 2019-04-23
in scheme: BATAELValue

Waste Treatment - TN - BAT20-VIII
type: Concept
notation: WT-TN-BAT20-VIII
definition: 5.� Waste management; 6. Other activities: 5.1. Disposal or recovery of hazardous waste with a capacity exceeding 10 tonnes per day involving one or more of the following activities: (a)-(j) (see scope); 5.3. (a) Disposal of non-hazardous waste with a capacity exceeding 50 tonnes per day involving one or more of the following activities, and excluding activities covered by Council Directive 91/271/EEC (1): (i)-(v) (see scope). (b) Recovery, or a mix of recovery and disposal, of non-hazardous waste with a capacity exceeding 75 tonnes per day involving one or more of the following activities, and excluding activities covered by Directive 91/271/EEC: (i)-(iv) (see scope). 5.5. Temporary storage of hazardous waste not covered under point 5.4 of Annex I to Directive 2010/75/EU pending any of the activities listed in points 5.1, 5.2, 5.4 and 5.6 of Annex I to Directive 2010/75/EU with a total capacity exceeding 50 tonnes, excluding temporary storage, pending collection, on the site where the waste is generated. 6.11. Independently operated treatment of waste water not covered by Directive 91/271/EEC and discharged by an installation undertaking activities covered under points 5.1, 5.3 or 5.5 as listed above. Reducing total nitrogen to water. The BAT-AEL emission level is 10-60 mg/l .
status: valid
status modified: 2019-04-23
accepted date: 2019-04-23
in scheme: BATAELValue

Waste Treatment - TOC - BAT20-I
type: Concept
notation: WT-TOC-BAT20-I
definition: 5.� Waste management; 6. Other activities: 5.1. Disposal or recovery of hazardous waste with a capacity exceeding 10 tonnes per day involving one or more of the following activities: (a)-(j) (see scope); 5.3. (a) Disposal of non-hazardous waste with a capacity exceeding 50 tonnes per day involving one or more of the following activities, and excluding activities covered by Council Directive 91/271/EEC (1): (i)-(v) (see scope). (b) Recovery, or a mix of recovery and disposal, of non-hazardous waste with a capacity exceeding 75 tonnes per day involving one or more of the following activities, and excluding activities covered by Directive 91/271/EEC: (i)-(iv) (see scope). 5.5. Temporary storage of hazardous waste not covered under point 5.4 of Annex I to Directive 2010/75/EU pending any of the activities listed in points 5.1, 5.2, 5.4 and 5.6 of Annex I to Directive 2010/75/EU with a total capacity exceeding 50 tonnes, excluding temporary storage, pending collection, on the site where the waste is generated. 6.11. Independently operated treatment of waste water not covered by Directive 91/271/EEC and discharged by an installation undertaking activities covered under points 5.1, 5.3 or 5.5 as listed above. Reducing total organic carbon to water. The BAT-AEL emission level is 10-60 mg/l .
status: valid
status modified: 2019-04-23
accepted date: 2019-04-23
in scheme: BATAELValue

Waste Treatment - TOC - BAT20-II
type: Concept
notation: WT-TOC-BAT20-II
definition: 5.� Waste management; 6. Other activities: 5.1. Disposal or recovery of hazardous waste with a capacity exceeding 10 tonnes per day involving one or more of the following activities: (a)-(j) (see scope); 5.3. (a) Disposal of non-hazardous waste with a capacity exceeding 50 tonnes per day involving one or more of the following activities, and excluding activities covered by Council Directive 91/271/EEC (1): (i)-(v) (see scope). (b) Recovery, or a mix of recovery and disposal, of non-hazardous waste with a capacity exceeding 75 tonnes per day involving one or more of the following activities, and excluding activities covered by Directive 91/271/EEC: (i)-(iv) (see scope). 5.5. Temporary storage of hazardous waste not covered under point 5.4 of Annex I to Directive 2010/75/EU pending any of the activities listed in points 5.1, 5.2, 5.4 and 5.6 of Annex I to Directive 2010/75/EU with a total capacity exceeding 50 tonnes, excluding temporary storage, pending collection, on the site where the waste is generated. 6.11. Independently operated treatment of waste water not covered by Directive 91/271/EEC and discharged by an installation undertaking activities covered under points 5.1, 5.3 or 5.5 as listed above. Reducing total organic carbon to water. The BAT-AEL emission level is 10-100 mg/l .
status: valid
status modified: 2019-04-23
accepted date: 2019-04-23
in scheme: BATAELValue

Waste Treatment - TP - BAT20-IX
type: Concept
notation: WT-TP-BAT20-IX
definition: 5.� Waste management; 6. Other activities: 5.1. Disposal or recovery of hazardous waste with a capacity exceeding 10 tonnes per day involving one or more of the following activities: (a)-(j) (see scope); 5.3. (a) Disposal of non-hazardous waste with a capacity exceeding 50 tonnes per day involving one or more of the following activities, and excluding activities covered by Council Directive 91/271/EEC (1): (i)-(v) (see scope). (b) Recovery, or a mix of recovery and disposal, of non-hazardous waste with a capacity exceeding 75 tonnes per day involving one or more of the following activities, and excluding activities covered by Directive 91/271/EEC: (i)-(iv) (see scope). 5.5. Temporary storage of hazardous waste not covered under point 5.4 of Annex I to Directive 2010/75/EU pending any of the activities listed in points 5.1, 5.2, 5.4 and 5.6 of Annex I to Directive 2010/75/EU with a total capacity exceeding 50 tonnes, excluding temporary storage, pending collection, on the site where the waste is generated. 6.11. Independently operated treatment of waste water not covered by Directive 91/271/EEC and discharged by an installation undertaking activities covered under points 5.1, 5.3 or 5.5 as listed above. Reducing total phosphorus to water. The BAT-AEL emission level is 0,3-2 mg/l .
status: valid
status modified: 2019-04-23
accepted date: 2019-04-23
in scheme: BATAELValue

Waste Treatment - TP - BAT20-X
type: Concept
notation: WT-TP-BAT20-X
definition: 5.� Waste management; 6. Other activities: 5.1. Disposal or recovery of hazardous waste with a capacity exceeding 10 tonnes per day involving one or more of the following activities: (a)-(j) (see scope); 5.3. (a) Disposal of non-hazardous waste with a capacity exceeding 50 tonnes per day involving one or more of the following activities, and excluding activities covered by Council Directive 91/271/EEC (1): (i)-(v) (see scope). (b) Recovery, or a mix of recovery and disposal, of non-hazardous waste with a capacity exceeding 75 tonnes per day involving one or more of the following activities, and excluding activities covered by Directive 91/271/EEC: (i)-(iv) (see scope). 5.5. Temporary storage of hazardous waste not covered under point 5.4 of Annex I to Directive 2010/75/EU pending any of the activities listed in points 5.1, 5.2, 5.4 and 5.6 of Annex I to Directive 2010/75/EU with a total capacity exceeding 50 tonnes, excluding temporary storage, pending collection, on the site where the waste is generated. 6.11. Independently operated treatment of waste water not covered by Directive 91/271/EEC and discharged by an installation undertaking activities covered under points 5.1, 5.3 or 5.5 as listed above. Reducing total phosphorus to water. The BAT-AEL emission level is 1-3 mg/l .
status: valid
status modified: 2019-04-23
accepted date: 2019-04-23
in scheme: BATAELValue

Waste Treatment - TSS - BAT20-V
type: Concept
notation: WT-TSS-BAT20-V
definition: 5.� Waste management; 6. Other activities: 5.1. Disposal or recovery of hazardous waste with a capacity exceeding 10 tonnes per day involving one or more of the following activities: (a)-(j) (see scope); 5.3. (a) Disposal of non-hazardous waste with a capacity exceeding 50 tonnes per day involving one or more of the following activities, and excluding activities covered by Council Directive 91/271/EEC (1): (i)-(v) (see scope). (b) Recovery, or a mix of recovery and disposal, of non-hazardous waste with a capacity exceeding 75 tonnes per day involving one or more of the following activities, and excluding activities covered by Directive 91/271/EEC: (i)-(iv) (see scope). 5.5. Temporary storage of hazardous waste not covered under point 5.4 of Annex I to Directive 2010/75/EU pending any of the activities listed in points 5.1, 5.2, 5.4 and 5.6 of Annex I to Directive 2010/75/EU with a total capacity exceeding 50 tonnes, excluding temporary storage, pending collection, on the site where the waste is generated. 6.11. Independently operated treatment of waste water not covered by Directive 91/271/EEC and discharged by an installation undertaking activities covered under points 5.1, 5.3 or 5.5 as listed above. Reducing total suspended solids to water. The BAT-AEL emission level is 5-60 mg/l .
status: valid
status modified: 2019-04-23
accepted date: 2019-04-23
in scheme: BATAELValue

Waste Treatment - TVOC - BAT29-I
type: Concept
notation: WT-TVOC-BAT29-I
definition: 5.� Waste management; 6. Other activities: 5.1. Disposal or recovery of hazardous waste with a capacity exceeding 10 tonnes per day involving one or more of the following activities: (a)-(j) (see scope); 5.3. (a) Disposal of non-hazardous waste with a capacity exceeding 50 tonnes per day involving one or more of the following activities, and excluding activities covered by Council Directive 91/271/EEC (1): (i)-(v) (see scope). (b) Recovery, or a mix of recovery and disposal, of non-hazardous waste with a capacity exceeding 75 tonnes per day involving one or more of the following activities, and excluding activities covered by Directive 91/271/EEC: (i)-(iv) (see scope). 5.5. Temporary storage of hazardous waste not covered under point 5.4 of Annex I to Directive 2010/75/EU pending any of the activities listed in points 5.1, 5.2, 5.4 and 5.6 of Annex I to Directive 2010/75/EU with a total capacity exceeding 50 tonnes, excluding temporary storage, pending collection, on the site where the waste is generated. 6.11. Independently operated treatment of waste water not covered by Directive 91/271/EEC and discharged by an installation undertaking activities covered under points 5.1, 5.3 or 5.5 as listed above; Techniques (a)-(d) (see table incl. footnote); Reducing TVOC emissions to air. The BAT-AEL emission level is 3-15 mg/Nm3 .
status: valid
status modified: 2019-04-23
accepted date: 2019-04-23
in scheme: BATAELValue

Waste Treatment - TVOC - BAT31
type: Concept
notation: WT-TVOC-BAT31
definition: 5.� Waste management; 6. Other activities: 5.1. Disposal or recovery of hazardous waste with a capacity exceeding 10 tonnes per day involving one or more of the following activities: (a)-(j) (see scope); 5.3. (a) Disposal of non-hazardous waste with a capacity exceeding 50 tonnes per day involving one or more of the following activities, and excluding activities covered by Council Directive 91/271/EEC (1): (i)-(v) (see scope). (b) Recovery, or a mix of recovery and disposal, of non-hazardous waste with a capacity exceeding 75 tonnes per day involving one or more of the following activities, and excluding activities covered by Directive 91/271/EEC: (i)-(iv) (see scope). 5.5. Temporary storage of hazardous waste not covered under point 5.4 of Annex I to Directive 2010/75/EU pending any of the activities listed in points 5.1, 5.2, 5.4 and 5.6 of Annex I to Directive 2010/75/EU with a total capacity exceeding 50 tonnes, excluding temporary storage, pending collection, on the site where the waste is generated. 6.11. Independently operated treatment of waste water not covered by Directive 91/271/EEC and discharged by an installation undertaking activities covered under points 5.1, 5.3 or 5.5 as listed above; Apply BAT 14d, BAT 14h and use technique (a) and one or both of the techniques (b) and (c); Reducing TVOC emissions to air. The BAT-AEL emission level is 10-30 mg/Nm3 .
status: valid
status modified: 2019-04-23
accepted date: 2019-04-23
in scheme: BATAELValue

Waste Treatment - TVOC - BAT34-IV
type: Concept
notation: WT-TVOC-BAT34-IV
definition: 5.� Waste management; 6. Other activities: 5.1. Disposal or recovery of hazardous waste with a capacity exceeding 10 tonnes per day involving one or more of the following activities: (a)-(j) (see scope); 5.3. (a) Disposal of non-hazardous waste with a capacity exceeding 50 tonnes per day involving one or more of the following activities, and excluding activities covered by Council Directive 91/271/EEC (1): (i)-(v) (see scope). (b) Recovery, or a mix of recovery and disposal, of non-hazardous waste with a capacity exceeding 75 tonnes per day involving one or more of the following activities, and excluding activities covered by Directive 91/271/EEC: (i)-(iv) (see scope). 5.5. Temporary storage of hazardous waste not covered under point 5.4 of Annex I to Directive 2010/75/EU pending any of the activities listed in points 5.1, 5.2, 5.4 and 5.6 of Annex I to Directive 2010/75/EU with a total capacity exceeding 50 tonnes, excluding temporary storage, pending collection, on the site where the waste is generated. 6.11. Independently operated treatment of waste water not covered by Directive 91/271/EEC and discharged by an installation undertaking activities covered under points 5.1, 5.3 or 5.5 as listed above; Techniques (a)-(e) (see table); Reducing TVOC emissions to air. The BAT-AEL emission level is 5-40 mg/Nm3 .
status: valid
status modified: 2019-04-23
accepted date: 2019-04-23
in scheme: BATAELValue

Waste Treatment - TVOC - BAT45
type: Concept
notation: WT-TVOC-BAT45
definition: 5.� Waste management; 6. Other activities: 5.1. Disposal or recovery of hazardous waste with a capacity exceeding 10 tonnes per day involving one or more of the following activities: (a)-(j) (see scope); 5.3. (a) Disposal of non-hazardous waste with a capacity exceeding 50 tonnes per day involving one or more of the following activities, and excluding activities covered by Council Directive 91/271/EEC (1): (i)-(v) (see scope). (b) Recovery, or a mix of recovery and disposal, of non-hazardous waste with a capacity exceeding 75 tonnes per day involving one or more of the following activities, and excluding activities covered by Directive 91/271/EEC: (i)-(iv) (see scope). 5.5. Temporary storage of hazardous waste not covered under point 5.4 of Annex I to Directive 2010/75/EU pending any of the activities listed in points 5.1, 5.2, 5.4 and 5.6 of Annex I to Directive 2010/75/EU with a total capacity exceeding 50 tonnes, excluding temporary storage, pending collection, on the site where the waste is generated. 6.11. Independently operated treatment of waste water not covered by Directive 91/271/EEC and discharged by an installation undertaking activities covered under points 5.1, 5.3 or 5.5 as listed above; Reducing TVOC emissions to air. The BAT-AEL emission level is 5-30 mg/Nm3 .
status: valid
status modified: 2019-04-23
accepted date: 2019-04-23
in scheme: BATAELValue

Waste Treatment - TVOC - BAT47
type: Concept
notation: WT-TVOC-BAT47
definition: 5.� Waste management; 6. Other activities: 5.1. Disposal or recovery of hazardous waste with a capacity exceeding 10 tonnes per day involving one or more of the following activities: (a)-(j) (see scope); 5.3. (a) Disposal of non-hazardous waste with a capacity exceeding 50 tonnes per day involving one or more of the following activities, and excluding activities covered by Council Directive 91/271/EEC (1): (i)-(v) (see scope). (b) Recovery, or a mix of recovery and disposal, of non-hazardous waste with a capacity exceeding 75 tonnes per day involving one or more of the following activities, and excluding activities covered by Directive 91/271/EEC: (i)-(iv) (see scope). 5.5. Temporary storage of hazardous waste not covered under point 5.4 of Annex I to Directive 2010/75/EU pending any of the activities listed in points 5.1, 5.2, 5.4 and 5.6 of Annex I to Directive 2010/75/EU with a total capacity exceeding 50 tonnes, excluding temporary storage, pending collection, on the site where the waste is generated. 6.11. Independently operated treatment of waste water not covered by Directive 91/271/EEC and discharged by an installation undertaking activities covered under points 5.1, 5.3 or 5.5 as listed above; Reducing TVOC emissions to air. The BAT-AEL emission level is 5-30 mg/Nm3 .
status: valid
status modified: 2019-04-23
accepted date: 2019-04-23
in scheme: BATAELValue

Waste Treatment - TVOC - BAT53-II
type: Concept
notation: WT-TVOC-BAT53-II
definition: 5.� Waste management; 6. Other activities: 5.1. Disposal or recovery of hazardous waste with a capacity exceeding 10 tonnes per day involving one or more of the following activities: (a)-(j) (see scope); 5.3. (a) Disposal of non-hazardous waste with a capacity exceeding 50 tonnes per day involving one or more of the following activities, and excluding activities covered by Council Directive 91/271/EEC (1): (i)-(v) (see scope). (b) Recovery, or a mix of recovery and disposal, of non-hazardous waste with a capacity exceeding 75 tonnes per day involving one or more of the following activities, and excluding activities covered by Directive 91/271/EEC: (i)-(iv) (see scope). 5.5. Temporary storage of hazardous waste not covered under point 5.4 of Annex I to Directive 2010/75/EU pending any of the activities listed in points 5.1, 5.2, 5.4 and 5.6 of Annex I to Directive 2010/75/EU with a total capacity exceeding 50 tonnes, excluding temporary storage, pending collection, on the site where the waste is generated. 6.11. Independently operated treatment of waste water not covered by Directive 91/271/EEC and discharged by an installation undertaking activities covered under points 5.1, 5.3 or 5.5 as listed above; Reducing TVOC emissions to air. The BAT-AEL emission level is 3-20 mg/Nm3 .
status: valid
status modified: 2019-04-23
accepted date: 2019-04-23
in scheme: BATAELValue

Waste Treatment - Zn - BAT20-LI
type: Concept
notation: WT-Zn-BAT20-LI
definition: 5.� Waste management; 6. Other activities: 5.1. Disposal or recovery of hazardous waste with a capacity exceeding 10 tonnes per day involving one or more of the following activities: (a)-(j) (see scope); 5.3. (a) Disposal of non-hazardous waste with a capacity exceeding 50 tonnes per day involving one or more of the following activities, and excluding activities covered by Council Directive 91/271/EEC (1): (i)-(v) (see scope). (b) Recovery, or a mix of recovery and disposal, of non-hazardous waste with a capacity exceeding 75 tonnes per day involving one or more of the following activities, and excluding activities covered by Directive 91/271/EEC: (i)-(iv) (see scope). 5.5. Temporary storage of hazardous waste not covered under point 5.4 of Annex I to Directive 2010/75/EU pending any of the activities listed in points 5.1, 5.2, 5.4 and 5.6 of Annex I to Directive 2010/75/EU with a total capacity exceeding 50 tonnes, excluding temporary storage, pending collection, on the site where the waste is generated. 6.11. Independently operated treatment of waste water not covered by Directive 91/271/EEC and discharged by an installation undertaking activities covered under points 5.1, 5.3 or 5.5 as listed above. Reducing zinc to water. The BAT-AEL emission level is 0,1-2 mg/l .
status: valid
status modified: 2019-04-23
accepted date: 2019-04-23
in scheme: BATAELValue

Waste Treatment - Zn - BAT20-XLII
type: Concept
notation: WT-Zn-BAT20-XLII
definition: 5.� Waste management; 6. Other activities: 5.1. Disposal or recovery of hazardous waste with a capacity exceeding 10 tonnes per day involving one or more of the following activities: (a)-(j) (see scope); 5.3. (a) Disposal of non-hazardous waste with a capacity exceeding 50 tonnes per day involving one or more of the following activities, and excluding activities covered by Council Directive 91/271/EEC (1): (i)-(v) (see scope). (b) Recovery, or a mix of recovery and disposal, of non-hazardous waste with a capacity exceeding 75 tonnes per day involving one or more of the following activities, and excluding activities covered by Directive 91/271/EEC: (i)-(iv) (see scope). 5.5. Temporary storage of hazardous waste not covered under point 5.4 of Annex I to Directive 2010/75/EU pending any of the activities listed in points 5.1, 5.2, 5.4 and 5.6 of Annex I to Directive 2010/75/EU with a total capacity exceeding 50 tonnes, excluding temporary storage, pending collection, on the site where the waste is generated. 6.11. Independently operated treatment of waste water not covered by Directive 91/271/EEC and discharged by an installation undertaking activities covered under points 5.1, 5.3 or 5.5 as listed above. Reducing zinc to water. The BAT-AEL emission level is 0,1-1 mg/l .
status: valid
status modified: 2019-04-23
accepted date: 2019-04-23
in scheme: BATAELValue

Waste Treatment - Zn - BAT20-XXII
type: Concept
notation: WT-Zn-BAT20-XXII
definition: 5.� Waste management; 6. Other activities: 5.1. Disposal or recovery of hazardous waste with a capacity exceeding 10 tonnes per day involving one or more of the following activities: (a)-(j) (see scope); 5.3. (a) Disposal of non-hazardous waste with a capacity exceeding 50 tonnes per day involving one or more of the following activities, and excluding activities covered by Council Directive 91/271/EEC (1): (i)-(v) (see scope). (b) Recovery, or a mix of recovery and disposal, of non-hazardous waste with a capacity exceeding 75 tonnes per day involving one or more of the following activities, and excluding activities covered by Directive 91/271/EEC: (i)-(iv) (see scope). 5.5. Temporary storage of hazardous waste not covered under point 5.4 of Annex I to Directive 2010/75/EU pending any of the activities listed in points 5.1, 5.2, 5.4 and 5.6 of Annex I to Directive 2010/75/EU with a total capacity exceeding 50 tonnes, excluding temporary storage, pending collection, on the site where the waste is generated. 6.11. Independently operated treatment of waste water not covered by Directive 91/271/EEC and discharged by an installation undertaking activities covered under points 5.1, 5.3 or 5.5 as listed above. Reducing zinc to water. The BAT-AEL emission level is 0,1-1 mg/l .
status: valid
status modified: 2019-04-23
accepted date: 2019-04-23
in scheme: BATAELValue

Waste Treatment - Zn - BAT20-XXXI
type: Concept
notation: WT-Zn-BAT20-XXXI
definition: 5.� Waste management; 6. Other activities: 5.1. Disposal or recovery of hazardous waste with a capacity exceeding 10 tonnes per day involving one or more of the following activities: (a)-(j) (see scope); 5.3. (a) Disposal of non-hazardous waste with a capacity exceeding 50 tonnes per day involving one or more of the following activities, and excluding activities covered by Council Directive 91/271/EEC (1): (i)-(v) (see scope). (b) Recovery, or a mix of recovery and disposal, of non-hazardous waste with a capacity exceeding 75 tonnes per day involving one or more of the following activities, and excluding activities covered by Directive 91/271/EEC: (i)-(iv) (see scope). 5.5. Temporary storage of hazardous waste not covered under point 5.4 of Annex I to Directive 2010/75/EU pending any of the activities listed in points 5.1, 5.2, 5.4 and 5.6 of Annex I to Directive 2010/75/EU with a total capacity exceeding 50 tonnes, excluding temporary storage, pending collection, on the site where the waste is generated. 6.11. Independently operated treatment of waste water not covered by Directive 91/271/EEC and discharged by an installation undertaking activities covered under points 5.1, 5.3 or 5.5 as listed above. Reducing zinc to water. The BAT-AEL emission level is 0,1-2 mg/l .
status: valid
status modified: 2019-04-23
accepted date: 2019-04-23
in scheme: BATAELValue