Codes for Nature 2000 site types
type: ConceptScheme
notation: n2000sitetypes
is part of: biodiversity
registration status: Public draft
user modified: simoens
date modified: 2018-12-03 08:30:03.0
vocabulary type: Common
is numeric concept identifiers: false
is notations equal identifiers: false

SPA
type: Concept
notation: A
definition: Special Protection Areas
status: valid
status modified: 2015-07-22
in scheme: Codes for Nature 2000 site types
narrow match: http://dd.eionet.europa.eu/vocabulary/biodiversity/n2000sites/DE2016401
narrow match: GR4210015
narrow match: GR4210016
narrow match: GR4210017
narrow match: GR4210018
narrow match: GR4220024
narrow match: PLB020007
narrow match: PLB020008
narrow match: PLB120007
narrow match: UK9005031
narrow match: UK9005081
narrow match: DK005B352
narrow match: DK006B370
narrow match: DK007B351
narrow match: DK007B371
narrow match: DK008B358
narrow match: DK008B369
narrow match: DK008B372
narrow match: DK009B357
narrow match: DK009B373
narrow match: DK009B374
narrow match: DK009B375
narrow match: DK009B376
narrow match: DK009B377
narrow match: DK00AB356
narrow match: DK00AB378
narrow match: DK00AB379
narrow match: DK00BB355
narrow match: DK00BB380
narrow match: DK00CB349
narrow match: DK00CB350
narrow match: DK00CB353
narrow match: DK00CB381
narrow match: DK00CB382
narrow match: DK00EB354
narrow match: DK00EB383
narrow match: DK00EB384
narrow match: DK00EB385
narrow match: UK9020323
narrow match: UK9020325
narrow match: UK9020326
narrow match: UK9020327
narrow match: UK9020328
narrow match: UK9020329
narrow match: http://dd.eionet.europa.eu/vocabulary/biodiversity/n2000sites/DE2323401
narrow match: ES0000036
narrow match: ES0000088
narrow match: ES0000089
narrow match: ES0000091
narrow match: ES0000092
narrow match: ES0000093
narrow match: ES0000094
narrow match: ES0000155
narrow match: ES0000159
narrow match: ES0000162
narrow match: ES0000163
narrow match: ES0000387
narrow match: ES0000388
narrow match: ES0000389
narrow match: ES0000391
narrow match: ES0000392
narrow match: ES0000488
narrow match: ES0000489
narrow match: ITB030039
narrow match: UK9001011
narrow match: UK9001021
narrow match: UK9001031
narrow match: UK9001041
narrow match: UK9001051
narrow match: UK9001071
narrow match: UK9001082
narrow match: UK9001083
narrow match: UK9001121

SCI or SAC
type: Concept
notation: B
definition: Sites of Community Importance or Special Areas of Conservation
status: valid
status modified: 2015-07-22
in scheme: Codes for Nature 2000 site types
narrow match: http://dd.eionet.europa.eu/vocabulary/biodiversity/n2000sites/DE2842303
narrow match: http://dd.eionet.europa.eu/vocabulary/biodiversity/n2000sites/DE2843327
narrow match: http://dd.eionet.europa.eu/vocabulary/biodiversity/n2000sites/DE2942303
narrow match: http://dd.eionet.europa.eu/vocabulary/biodiversity/n2000sites/DE2942304
narrow match: http://dd.eionet.europa.eu/vocabulary/biodiversity/n2000sites/DE2943301
narrow match: http://dd.eionet.europa.eu/vocabulary/biodiversity/n2000sites/DE3243303
narrow match: http://dd.eionet.europa.eu/vocabulary/biodiversity/n2000sites/DE3247302
narrow match: http://dd.eionet.europa.eu/vocabulary/biodiversity/n2000sites/DE3250304
narrow match: http://dd.eionet.europa.eu/vocabulary/biodiversity/n2000sites/DE3551325
narrow match: http://dd.eionet.europa.eu/vocabulary/biodiversity/n2000sites/DE3748306
narrow match: http://dd.eionet.europa.eu/vocabulary/biodiversity/n2000sites/DE3852302
narrow match: http://dd.eionet.europa.eu/vocabulary/biodiversity/n2000sites/EE0080309
narrow match: FR8201769
narrow match: FR8301090
narrow match: FR9101376
narrow match: IT8050017
narrow match: PLH020006
narrow match: PLH020018
narrow match: PLH120016
narrow match: SE0410174
narrow match: DK002B364
narrow match: DK002B365
narrow match: DK003B366
narrow match: DK003B367
narrow match: DK005B368
narrow match: DK006B362
narrow match: DK006B363
narrow match: DK006B386
narrow match: DK007B387
narrow match: DK008B361
narrow match: DK008B388
narrow match: DK009B360
narrow match: DK009B389
narrow match: DK009B390
narrow match: DK009B391
narrow match: DK009B392
narrow match: DK009B393
narrow match: DK00AB359
narrow match: DK00AB394
narrow match: DK00AB395
narrow match: DK00BB396
narrow match: DK00CB397
narrow match: DK00CB398
narrow match: DK00EB399
narrow match: DK00EB400
narrow match: DK00EB401
narrow match: CY2000007
narrow match: CY2000008
narrow match: CY4000011
narrow match: CY4000012
narrow match: FR1102008
narrow match: FR1102016
narrow match: FR2100342
narrow match: FR2400522
narrow match: FR2600958
narrow match: FR2600960
narrow match: FR2600961
narrow match: FR2600962
narrow match: FR2600968
narrow match: FR2600969
narrow match: FR2600982
narrow match: FR2600983
narrow match: FR2600986
narrow match: FR2600988
narrow match: FR2600989
narrow match: FR2600991
narrow match: FR2600992
narrow match: FR2600995
narrow match: FR2600999
narrow match: FR2601000
narrow match: FR2601002
narrow match: FR2601009
narrow match: FR4301284

Both SPA and SCI/SAC
type: Concept
notation: C
definition: Both Special Protection Areas and Sites of Community Importance/Special Areas of Conservation
status: valid
status modified: 2015-07-22
in scheme: Codes for Nature 2000 site types
narrow match: UKGIB0001
narrow match: UKGIB0002
narrow match: AT1302000
narrow match: AT2112000
narrow match: AT2133000
narrow match: AT2225000
narrow match: AT3101000
narrow match: AT3203010
narrow match: AT3205021
narrow match: AT3210001
narrow match: AT1110137
narrow match: AT3301000
narrow match: AT2124000
narrow match: AT3408000
narrow match: AT2104000
narrow match: AT2111000
narrow match: AT2117000
narrow match: AT2126000
narrow match: http://dd.eionet.europa.eu/vocabulary/biodiversity/n2000sites/BE31003C0
narrow match: http://dd.eionet.europa.eu/vocabulary/biodiversity/n2000sites/BE31008C0
narrow match: http://dd.eionet.europa.eu/vocabulary/biodiversity/n2000sites/BE31011C0
narrow match: http://dd.eionet.europa.eu/vocabulary/biodiversity/n2000sites/BE32006C0
narrow match: http://dd.eionet.europa.eu/vocabulary/biodiversity/n2000sites/BE32010C0
narrow match: http://dd.eionet.europa.eu/vocabulary/biodiversity/n2000sites/BE32011C0
narrow match: http://dd.eionet.europa.eu/vocabulary/biodiversity/n2000sites/BE32012C0
narrow match: http://dd.eionet.europa.eu/vocabulary/biodiversity/n2000sites/BE32019C0
narrow match: http://dd.eionet.europa.eu/vocabulary/biodiversity/n2000sites/BE32020C0
narrow match: http://dd.eionet.europa.eu/vocabulary/biodiversity/n2000sites/BE32021C0
narrow match: http://dd.eionet.europa.eu/vocabulary/biodiversity/n2000sites/BE32032C0
narrow match: http://dd.eionet.europa.eu/vocabulary/biodiversity/n2000sites/BE32035C0
narrow match: http://dd.eionet.europa.eu/vocabulary/biodiversity/n2000sites/BE33009C0
narrow match: http://dd.eionet.europa.eu/vocabulary/biodiversity/n2000sites/BE33010C0
narrow match: http://dd.eionet.europa.eu/vocabulary/biodiversity/n2000sites/BE33012C0
narrow match: http://dd.eionet.europa.eu/vocabulary/biodiversity/n2000sites/BE33015C0
narrow match: AT2207000
narrow match: http://dd.eionet.europa.eu/vocabulary/biodiversity/n2000sites/BE33016C0
narrow match: http://dd.eionet.europa.eu/vocabulary/biodiversity/n2000sites/BE33017C0
narrow match: AT2205000
narrow match: http://dd.eionet.europa.eu/vocabulary/biodiversity/n2000sites/BE33019C0
narrow match: http://dd.eionet.europa.eu/vocabulary/biodiversity/n2000sites/BE33020C0
narrow match: http://dd.eionet.europa.eu/vocabulary/biodiversity/n2000sites/BE33022C0
narrow match: http://dd.eionet.europa.eu/vocabulary/biodiversity/n2000sites/BE33023C0
narrow match: http://dd.eionet.europa.eu/vocabulary/biodiversity/n2000sites/BE33029C0
narrow match: http://dd.eionet.europa.eu/vocabulary/biodiversity/n2000sites/BE33031C0
narrow match: http://dd.eionet.europa.eu/vocabulary/biodiversity/n2000sites/BE33038C0
narrow match: http://dd.eionet.europa.eu/vocabulary/biodiversity/n2000sites/BE33039C0
narrow match: http://dd.eionet.europa.eu/vocabulary/biodiversity/n2000sites/BE33042C0
narrow match: http://dd.eionet.europa.eu/vocabulary/biodiversity/n2000sites/BE33048C0
narrow match: http://dd.eionet.europa.eu/vocabulary/biodiversity/n2000sites/BE33050C0
narrow match: http://dd.eionet.europa.eu/vocabulary/biodiversity/n2000sites/BE33052C0
narrow match: http://dd.eionet.europa.eu/vocabulary/biodiversity/n2000sites/BE33053C0
narrow match: http://dd.eionet.europa.eu/vocabulary/biodiversity/n2000sites/BE33055C0
narrow match: http://dd.eionet.europa.eu/vocabulary/biodiversity/n2000sites/BE33063C0
narrow match: http://dd.eionet.europa.eu/vocabulary/biodiversity/n2000sites/BE33064C0
narrow match: http://dd.eionet.europa.eu/vocabulary/biodiversity/n2000sites/BE33067C0
narrow match: http://dd.eionet.europa.eu/vocabulary/biodiversity/n2000sites/BE34004C0
narrow match: http://dd.eionet.europa.eu/vocabulary/biodiversity/n2000sites/BE34005C0
narrow match: http://dd.eionet.europa.eu/vocabulary/biodiversity/n2000sites/BE34012C0
narrow match: http://dd.eionet.europa.eu/vocabulary/biodiversity/n2000sites/BE34015C0
narrow match: http://dd.eionet.europa.eu/vocabulary/biodiversity/n2000sites/BE34016C0
narrow match: http://dd.eionet.europa.eu/vocabulary/biodiversity/n2000sites/BE34018C0
narrow match: http://dd.eionet.europa.eu/vocabulary/biodiversity/n2000sites/BE34019C0
narrow match: http://dd.eionet.europa.eu/vocabulary/biodiversity/n2000sites/BE34028C0
narrow match: http://dd.eionet.europa.eu/vocabulary/biodiversity/n2000sites/BE34030C0
narrow match: http://dd.eionet.europa.eu/vocabulary/biodiversity/n2000sites/BE34034C0
narrow match: http://dd.eionet.europa.eu/vocabulary/biodiversity/n2000sites/BE34035C0
narrow match: http://dd.eionet.europa.eu/vocabulary/biodiversity/n2000sites/BE34036C0
narrow match: http://dd.eionet.europa.eu/vocabulary/biodiversity/n2000sites/BE34038C0
narrow match: http://dd.eionet.europa.eu/vocabulary/biodiversity/n2000sites/BE34042C0
narrow match: http://dd.eionet.europa.eu/vocabulary/biodiversity/n2000sites/BE34046C0
narrow match: http://dd.eionet.europa.eu/vocabulary/biodiversity/n2000sites/BE34049C0
narrow match: http://dd.eionet.europa.eu/vocabulary/biodiversity/n2000sites/BE34050C0
narrow match: http://dd.eionet.europa.eu/vocabulary/biodiversity/n2000sites/BE34057C0