CDR QaQc Birds Directive Article 12 Reporting
type: ConceptScheme
notation: cdrqaqc
is part of: art12 2018
registration status: Public draft
user modified: roschsab
date modified: 2019-05-14 10:18:24.0
vocabulary type: Common
is numeric concept identifiers: false
is notations equal identifiers: false

Invalid code.
type: Concept
notation: B001
definition: Please check the vocabulary countries.
status: valid
status modified: 2019-04-16
accepted date: 2019-04-16
in scheme: CDR QaQc Birds Directive Article 12 Reporting
error type: BLOCKER

Mandatory information missing.
type: Concept
notation: B002
definition: The country code should be provided.
status: valid
status modified: 2019-04-16
accepted date: 2019-04-16
in scheme: CDR QaQc Birds Directive Article 12 Reporting
error type: BLOCKER

Invalid code.
type: Concept
notation: B003
definition: Please check the vocabulary countries.
status: valid
status modified: 2019-04-16
accepted date: 2019-04-16
in scheme: CDR QaQc Birds Directive Article 12 Reporting
error type: BLOCKER

Mandatory information missing.
type: Concept
notation: B004
definition: The country code should be provided.
status: valid
status modified: 2019-04-16
accepted date: 2019-04-16
in scheme: CDR QaQc Birds Directive Article 12 Reporting
error type: BLOCKER

Invalid code.
type: Concept
notation: B005
definition: Please check the look up table lu_bird_species.
status: valid
status modified: 2019-04-16
accepted date: 2019-04-16
in scheme: CDR QaQc Birds Directive Article 12 Reporting
error type: BLOCKER

Mandatory information missing.
type: Concept
notation: B006
definition: The species code should be provided.
status: valid
status modified: 2019-04-16
accepted date: 2019-04-16
in scheme: CDR QaQc Birds Directive Article 12 Reporting
error type: BLOCKER

Incoherent information.
type: Concept
notation: B007
definition: The combination species code/EURING code should exist in the look up table lu_bird_species.
status: valid
status modified: 2019-04-16
accepted date: 2019-04-16
in scheme: CDR QaQc Birds Directive Article 12 Reporting
error type: WARNING

Incoherent information.
type: Concept
notation: B008
definition: The combination species code/scientific name should exist in the look up table lu_bird_species.
status: valid
status modified: 2019-04-16
accepted date: 2019-04-16
in scheme: CDR QaQc Birds Directive Article 12 Reporting
error type: WARNING

Incoherent information.
type: Concept
notation: B009
definition: The scientific name should be provided.
status: valid
status modified: 2019-04-16
accepted date: 2019-04-16
in scheme: CDR QaQc Birds Directive Article 12 Reporting
error type: ERROR

Incoherent information.
type: Concept
notation: B010
definition: The combination species code/ subspecific population should exist in the the look up table lu_bird_species.
status: valid
status modified: 2019-04-16
accepted date: 2019-04-16
in scheme: CDR QaQc Birds Directive Article 12 Reporting
error type: WARNING

Incoherent information.
type: Concept
notation: B011
definition: The combination species code/ subspecific population should exist in the look up table lu_bird_species.
status: valid
status modified: 2019-04-16
accepted date: 2019-04-16
in scheme: CDR QaQc Birds Directive Article 12 Reporting
error type: WARNING

Invalid code.
type: Concept
notation: B012
definition: Please check the vocabulary seasonArt12.
status: valid
status modified: 2019-04-16
accepted date: 2019-04-16
in scheme: CDR QaQc Birds Directive Article 12 Reporting
error type: BLOCKER

Mandatory information missing.
type: Concept
notation: B013
definition: Information on Season is expected for all reports.
status: valid
status modified: 2019-04-16
accepted date: 2019-04-16
in scheme: CDR QaQc Birds Directive Article 12 Reporting
error type: ERROR

Incorrect data format.
type: Concept
notation: B014
definition: Format must be YYYY or YYYY-YYYY.
status: valid
status modified: 2019-04-16
accepted date: 2019-04-16
in scheme: CDR QaQc Birds Directive Article 12 Reporting
error type: ERROR

Incoherent information.
type: Concept
notation: B015
definition: Year1 should be lower or equal than year2.
status: valid
status modified: 2019-04-16
accepted date: 2019-04-16
in scheme: CDR QaQc Birds Directive Article 12 Reporting
error type: ERROR

Mandatory information missing.
type: Concept
notation: B016
definition: The year or period should be provided.
status: valid
status modified: 2019-04-16
accepted date: 2019-04-16
in scheme: CDR QaQc Birds Directive Article 12 Reporting
error type: ERROR

Invalid code.
type: Concept
notation: B017
definition: Please check the vocabulary populationUnits.
status: valid
status modified: 2019-04-16
accepted date: 2019-04-16
in scheme: CDR QaQc Birds Directive Article 12 Reporting
error type: BLOCKER

Incoherent information.
type: Concept
notation: B018
definition: The reported population unit differs with the recommended unit in the checklist on the reference portal.
status: valid
status modified: 2019-04-16
accepted date: 2019-04-16
in scheme: CDR QaQc Birds Directive Article 12 Reporting
error type: ERROR

Incoherent information.
type: Concept
notation: B019
definition: The reported population unit differs with the recommended unit in the reported checklist.
status: valid
status modified: 2019-04-16
accepted date: 2019-04-16
in scheme: CDR QaQc Birds Directive Article 12 Reporting
error type: ERROR

Incoherent information.
type: Concept
notation: B020
definition: Population size unit (2.2a) cannot be empty when Population size (2.2b,c,d) is provided.
status: valid
status modified: 2019-04-16
accepted date: 2019-04-16
in scheme: CDR QaQc Birds Directive Article 12 Reporting
error type: ERROR

Mandatory information missing.
type: Concept
notation: B021
definition: Population size unit should be provided.
status: valid
status modified: 2019-04-16
accepted date: 2019-04-16
in scheme: CDR QaQc Birds Directive Article 12 Reporting
error type: ERROR

Incorrect data format.
type: Concept
notation: B022
definition: Numeric field, only integers greater or equal 0 are permitted.
status: valid
status modified: 2019-04-16
accepted date: 2019-04-16
in scheme: CDR QaQc Birds Directive Article 12 Reporting
error type: ERROR

Incorrect data format.
type: Concept
notation: B023
definition: Numeric field, only integers greater or equal 0 are permitted.
status: valid
status modified: 2019-04-16
accepted date: 2019-04-16
in scheme: CDR QaQc Birds Directive Article 12 Reporting
error type: ERROR

2.2c Population size - max should be greater or equal min.
type: Concept
notation: B024
status: valid
status modified: 2019-04-16
accepted date: 2019-04-16
in scheme: CDR QaQc Birds Directive Article 12 Reporting
error type: ERROR

Incorrect data format.
type: Concept
notation: B025
definition: Numeric field, only integers greater or equal 0 are permitted.
status: valid
status modified: 2019-04-16
accepted date: 2019-04-16
in scheme: CDR QaQc Birds Directive Article 12 Reporting
error type: ERROR

Mandatory information missing.
type: Concept
notation: B026
definition: Population size should be provided as interval (2.2b,c) and/or best single value (2.2d). When only a minimum (or maximum) estimate of population size is available (e.g. through expert opinion) this should be entered in the 'Best single value' field and NOT the '(b) Minimum' or '(c) Maximum' fields.
status: valid
status modified: 2019-04-16
accepted date: 2019-04-16
in scheme: CDR QaQc Birds Directive Article 12 Reporting
error type: ERROR

Invalid code.
type: Concept
notation: B027
definition: Please check the vocabulary typeEstimate.
status: valid
status modified: 2019-04-16
accepted date: 2019-04-16
in scheme: CDR QaQc Birds Directive Article 12 Reporting
error type: BLOCKER

Incoherent information.
type: Concept
notation: B028
definition: Type of estimate was provided although there is no entry for population size (2.2b,c,d). Check coherence between these two fields. If both interval (2.2b 'Minimum' and 2.2c 'Maximum') and a best single value (2.2d 'Best single value') are provided, field 2.3 'Type of estimate' should correspond to the more accurate estimate. This should be noted in 2.7 'Additional information'.
status: valid
status modified: 2019-04-16
accepted date: 2019-04-16
in scheme: CDR QaQc Birds Directive Article 12 Reporting
error type: WARNING

Mandatory information missing.
type: Concept
notation: B029
definition: The type of estimate for population size should be provided.
status: valid
status modified: 2019-04-16
accepted date: 2019-04-16
in scheme: CDR QaQc Birds Directive Article 12 Reporting
error type: ERROR

Invalid code.
type: Concept
notation: B030
definition: Please check the vocabulary methodsUsed.
status: valid
status modified: 2019-04-16
accepted date: 2019-04-16
in scheme: CDR QaQc Birds Directive Article 12 Reporting
error type: BLOCKER

Incoherent information.
type: Concept
notation: B031
definition: 2.3 Type of estimate should be empty when Population size Method used is 'AbsentData - Insufficient or no data available'. When the method is assessed as 'AbsentData - Insufficient or no data available', the type of estimate used for the population size cannot be defined. If you want to report an estimate based on a method using limited data, please select 'estimateExpert - Based mainly on expert opinion with very limited data' for the method used.
status: valid
status modified: 2019-04-16
accepted date: 2019-04-16
in scheme: CDR QaQc Birds Directive Article 12 Reporting
error type: WARNING

Mandatory information missing.
type: Concept
notation: B032
definition: The method should be provided. In case the information to be reported in this section is not available use 'AbsentData - Insufficient or no data available'.
status: valid
status modified: 2019-04-16
accepted date: 2019-04-16
in scheme: CDR QaQc Birds Directive Article 12 Reporting
error type: ERROR

Invalid code.
type: Concept
notation: B033
definition: Please check the vocabulary reasonChange.
status: valid
status modified: 2019-04-16
accepted date: 2019-04-16
in scheme: CDR QaQc Birds Directive Article 12 Reporting
error type: BLOCKER

Incoherent information.
type: Concept
notation: B034
definition: If 'noChange' is selected, there is no need to explain the nature of change.
status: valid
status modified: 2019-04-16
accepted date: 2019-04-16
in scheme: CDR QaQc Birds Directive Article 12 Reporting
error type: ERROR

Incoherent information.
type: Concept
notation: B035
definition: Only one main reason is expected and should be part of the reported reasons.
status: valid
status modified: 2019-04-16
accepted date: 2019-04-16
in scheme: CDR QaQc Birds Directive Article 12 Reporting
error type: ERROR

Mandatory information missing.
type: Concept
notation: B036
definition: Indicate if there is any change since the previous reporting period (2008 - 2012) in the population size reported. Report 'noChange' if the answer to the question: 'Is there a change between reporting periods?' is 'No'. Provide the nature of that change (more than one option can be chosen) if the answer is 'Yes'.
status: valid
status modified: 2019-04-16
accepted date: 2019-04-16
in scheme: CDR QaQc Birds Directive Article 12 Reporting
error type: ERROR

Incorrect data format.
type: Concept
notation: B037
definition: Format must be YYYY-YYYY.
status: valid
status modified: 2019-04-16
accepted date: 2019-04-16
in scheme: CDR QaQc Birds Directive Article 12 Reporting
error type: ERROR

Incoherent information.
type: Concept
notation: B038
definition: Year1 should be lower or equal than year2.
status: valid
status modified: 2019-04-16
accepted date: 2019-04-16
in scheme: CDR QaQc Birds Directive Article 12 Reporting
error type: ERROR

Mandatory information missing.
type: Concept
notation: B039
definition: The period should be provided.
status: valid
status modified: 2019-04-16
accepted date: 2019-04-16
in scheme: CDR QaQc Birds Directive Article 12 Reporting
error type: ERROR

Invalid code.
type: Concept
notation: B040
definition: Please check the vocabulary trends.
status: valid
status modified: 2019-04-16
accepted date: 2019-04-16
in scheme: CDR QaQc Birds Directive Article 12 Reporting
error type: BLOCKER

Mandatory information missing.
type: Concept
notation: B041
definition: Trend should be provided. In case the information to be reported in this section is not available use 'Unk - unknown'.
status: valid
status modified: 2019-04-16
accepted date: 2019-04-16
in scheme: CDR QaQc Birds Directive Article 12 Reporting
error type: ERROR

Incorrect data format.
type: Concept
notation: B042
definition: Numeric field, only decimals are permitted.
status: valid
status modified: 2019-04-16
accepted date: 2019-04-16
in scheme: CDR QaQc Birds Directive Article 12 Reporting
error type: ERROR

Incorrect data format.
type: Concept
notation: B043
definition: Numeric field, only decimals are permitted.
status: valid
status modified: 2019-04-16
accepted date: 2019-04-16
in scheme: CDR QaQc Birds Directive Article 12 Reporting
error type: ERROR

3.1.3b Short-term trend Magnitude - max should be greater or equal min.
type: Concept
notation: B044
status: valid
status modified: 2019-04-16
accepted date: 2019-04-16
in scheme: CDR QaQc Birds Directive Article 12 Reporting
error type: ERROR

Incorrect data format.
type: Concept
notation: B045
definition: Numeric field, only decimals are permitted.
status: valid
status modified: 2019-04-16
accepted date: 2019-04-16
in scheme: CDR QaQc Birds Directive Article 12 Reporting
error type: ERROR

Mandatory information missing.
type: Concept
notation: B046
definition: Short term trend magnitude should be provided as interval (3.1.3a, b) and/or single value (3.1.3c). When only a minimum (or maximum) value of magnitude is known (e.g. through expert opinion) this should be entered in the 'Best single value' field and NOT the '(a) Minimum' or '(b) Maximum' fields.
status: valid
status modified: 2019-04-16
accepted date: 2019-04-16
in scheme: CDR QaQc Birds Directive Article 12 Reporting
error type: ERROR

Invalid code.
type: Concept
notation: B047
definition: Please check the vocabulary methodsUsed.
status: valid
status modified: 2019-04-16
accepted date: 2019-04-16
in scheme: CDR QaQc Birds Directive Article 12 Reporting
error type: BLOCKER

Incoherent information.
type: Concept
notation: B048
definition: Inconsistent values provided in fields 3.1.2 Short-term trend Direction and 3.1.4 Short-term trend Method used. When the method is assessed as 'AbsentData - Insufficient or no data available', the trend cannot be defined. If you want to report a trend as stable, increasing or decreasing based on a method using limited data, please select'?estimateExpert - Based mainly on expert opinion with very limited data' for the method used.
status: valid
status modified: 2019-04-16
accepted date: 2019-04-16
in scheme: CDR QaQc Birds Directive Article 12 Reporting
error type: WARNING

Mandatory information missing.
type: Concept
notation: B049
definition: The method should be provided. In case the information to be reported in this section is not available use 'AbsentData - Insufficient or no data available'.
status: valid
status modified: 2019-04-16
accepted date: 2019-04-16
in scheme: CDR QaQc Birds Directive Article 12 Reporting
error type: ERROR

Incorrect data format.
type: Concept
notation: B050
definition: Format must be YYYY-YYYY.
status: valid
status modified: 2019-04-16
accepted date: 2019-04-16
in scheme: CDR QaQc Birds Directive Article 12 Reporting
error type: ERROR

Incoherent information.
type: Concept
notation: B051
definition: Year1 should be lower or equal than year2.
status: valid
status modified: 2019-04-16
accepted date: 2019-04-16
in scheme: CDR QaQc Birds Directive Article 12 Reporting
error type: ERROR

Mandatory information missing.
type: Concept
notation: B052
definition: The period should be provided.
status: valid
status modified: 2019-04-16
accepted date: 2019-04-16
in scheme: CDR QaQc Birds Directive Article 12 Reporting
error type: ERROR

Invalid code.
type: Concept
notation: B053
definition: Please check the vocabulary trends.
status: valid
status modified: 2019-04-16
accepted date: 2019-04-16
in scheme: CDR QaQc Birds Directive Article 12 Reporting
error type: BLOCKER

Mandatory information missing.
type: Concept
notation: B054
definition: Trend should be provided. In case the information to be reported in this section is not available use 'Unk - unknown'.
status: valid
status modified: 2019-04-16
accepted date: 2019-04-16
in scheme: CDR QaQc Birds Directive Article 12 Reporting
error type: ERROR

Incorrect data format.
type: Concept
notation: B055
definition: Numeric field, only decimals are permitted.
status: valid
status modified: 2019-04-16
accepted date: 2019-04-16
in scheme: CDR QaQc Birds Directive Article 12 Reporting
error type: ERROR

Incorrect data format.
type: Concept
notation: B056
definition: Numeric field, only decimals are permitted.
status: valid
status modified: 2019-04-16
accepted date: 2019-04-16
in scheme: CDR QaQc Birds Directive Article 12 Reporting
error type: ERROR

3.2.3b Long-term trend Magnitude - max should be greater or equal min.
type: Concept
notation: B057
status: valid
status modified: 2019-04-16
accepted date: 2019-04-16
in scheme: CDR QaQc Birds Directive Article 12 Reporting
error type: ERROR

Incorrect data format.
type: Concept
notation: B058
definition: Numeric field, only decimals are permitted.
status: valid
status modified: 2019-04-16
accepted date: 2019-04-16
in scheme: CDR QaQc Birds Directive Article 12 Reporting
error type: ERROR

Mandatory information missing.
type: Concept
notation: B059
definition: Long term trend magnitude should be provided as interval (3.2.3a, b) and/or single value (3.2.3c). When only a minimum (or maximum) value of magnitude is known (e.g. through expert opinion) this should be entered in the 'Best single value' field and NOT the '(a) Minimum' or '(b) Maximum' fields.
status: valid
status modified: 2019-04-16
accepted date: 2019-04-16
in scheme: CDR QaQc Birds Directive Article 12 Reporting
error type: ERROR

Invalid code.
type: Concept
notation: B060
definition: Please check the vocabulary methodsUsed.
status: valid
status modified: 2019-04-16
accepted date: 2019-04-16
in scheme: CDR QaQc Birds Directive Article 12 Reporting
error type: BLOCKER

Incoherent information.
type: Concept
notation: B061
definition: Inconsistent values provided in fields 3.2.2 Long-term trend Direction and 3.2.4 Long-term trend Method used. When the method is assessed as 'AbsentData - Insufficient or no data available', the trend cannot be defined. If you want to report a trend as stable, increasing or decreasing based on a method using limited data, please select'?estimateExpert - Based mainly on expert opinion with very limited data' for the method used.
status: valid
status modified: 2019-04-16
accepted date: 2019-04-16
in scheme: CDR QaQc Birds Directive Article 12 Reporting
error type: WARNING

Mandatory information missing.
type: Concept
notation: B062
definition: The method should be provided. In case the information to be reported in this section is not available use 'AbsentData - Insufficient or no data available'.
status: valid
status modified: 2019-04-16
accepted date: 2019-04-16
in scheme: CDR QaQc Birds Directive Article 12 Reporting
error type: ERROR

Invalid code.
type: Concept
notation: B063
definition: Code should be 'Yes' or 'No'.
status: valid
status modified: 2019-04-16
accepted date: 2019-04-16
in scheme: CDR QaQc Birds Directive Article 12 Reporting
error type: BLOCKER

Mandatory information missing.
type: Concept
notation: B064
definition: Indicate whether information on species distribution is sensitive.
status: valid
status modified: 2019-04-16
accepted date: 2019-04-16
in scheme: CDR QaQc Birds Directive Article 12 Reporting
error type: ERROR

Incorrect data format.
type: Concept
notation: B065
definition: Format must be YYYY or YYYY-YYYY.
status: valid
status modified: 2019-04-16
accepted date: 2019-04-16
in scheme: CDR QaQc Birds Directive Article 12 Reporting
error type: ERROR

Incoherent information.
type: Concept
notation: B066
definition: Year1 should be lower or equal than year2.
status: valid
status modified: 2019-04-16
accepted date: 2019-04-16
in scheme: CDR QaQc Birds Directive Article 12 Reporting
error type: ERROR

Mandatory information missing.
type: Concept
notation: B067
definition: Year or period should be provided.
status: valid
status modified: 2019-04-16
accepted date: 2019-04-16
in scheme: CDR QaQc Birds Directive Article 12 Reporting
error type: ERROR

Incorrect data format.
type: Concept
notation: B068
definition: Numeric field, only decimals greater or equal 0 is permitted.
status: valid
status modified: 2019-04-16
accepted date: 2019-04-16
in scheme: CDR QaQc Birds Directive Article 12 Reporting
error type: ERROR

Mandatory information missing.
type: Concept
notation: B069
definition: Breeding distribution surface area should be provided.
status: valid
status modified: 2019-04-16
accepted date: 2019-04-16
in scheme: CDR QaQc Birds Directive Article 12 Reporting
error type: ERROR

Invalid code.
type: Concept
notation: B070
definition: Please check the vocabulary methodsUsed.
status: valid
status modified: 2019-04-16
accepted date: 2019-04-16
in scheme: CDR QaQc Birds Directive Article 12 Reporting
error type: BLOCKER

Mandatory information missing.
type: Concept
notation: B071
definition: Method should be provided. In case the information to be reported in this section is not available use 'AbsentData - Insufficient or no data available'.
status: valid
status modified: 2019-04-16
accepted date: 2019-04-16
in scheme: CDR QaQc Birds Directive Article 12 Reporting
error type: ERROR

Incorrect data format.
type: Concept
notation: B072
definition: Format must be YYYY-YYYY.
status: valid
status modified: 2019-04-16
accepted date: 2019-04-16
in scheme: CDR QaQc Birds Directive Article 12 Reporting
error type: ERROR

Incoherent information.
type: Concept
notation: B073
definition: Year1 should be lower or equal than year2.
status: valid
status modified: 2019-04-16
accepted date: 2019-04-16
in scheme: CDR QaQc Birds Directive Article 12 Reporting
error type: ERROR

Mandatory information missing.
type: Concept
notation: B074
definition: The period should be provided.
status: valid
status modified: 2019-04-16
accepted date: 2019-04-16
in scheme: CDR QaQc Birds Directive Article 12 Reporting
error type: ERROR

Invalid code.
type: Concept
notation: B075
definition: Please check the vocabulary trends.
status: valid
status modified: 2019-04-16
accepted date: 2019-04-16
in scheme: CDR QaQc Birds Directive Article 12 Reporting
error type: BLOCKER

Mandatory information missing.
type: Concept
notation: B076
definition: Trend should be provided. In case the information to be reported in this section is not available use 'Unk - unknown'.
status: valid
status modified: 2019-04-16
accepted date: 2019-04-16
in scheme: CDR QaQc Birds Directive Article 12 Reporting
error type: ERROR

Incorrect data format.
type: Concept
notation: B077
definition: Numeric field, only decimals are permitted.
status: valid
status modified: 2019-04-16
accepted date: 2019-04-16
in scheme: CDR QaQc Birds Directive Article 12 Reporting
error type: ERROR

Incorrect data format.
type: Concept
notation: B078
definition: Numeric field, only decimals are permitted.
status: valid
status modified: 2019-04-16
accepted date: 2019-04-16
in scheme: CDR QaQc Birds Directive Article 12 Reporting
error type: ERROR

5.1.3b Short-term trend Magnitude - max should be greater or equal min.
type: Concept
notation: B079
status: valid
status modified: 2019-04-16
accepted date: 2019-04-16
in scheme: CDR QaQc Birds Directive Article 12 Reporting
error type: ERROR

Incorrect data format.
type: Concept
notation: B080
definition: Numeric field, only decimals are permitted.
status: valid
status modified: 2019-04-16
accepted date: 2019-04-16
in scheme: CDR QaQc Birds Directive Article 12 Reporting
error type: ERROR

Mandatory information missing.
type: Concept
notation: B081
definition: Short term trend magnitude should be provided as interval (5.1.3a, b) and/or single value (5.1.3c). When only a minimum (or maximum) value of magnitude is known (e.g. through expert opinion) this should be entered in the 'Best single value' field and NOT the '(a) Minimum' or '(b) Maximum' fields.
status: valid
status modified: 2019-04-16
accepted date: 2019-04-16
in scheme: CDR QaQc Birds Directive Article 12 Reporting
error type: ERROR

Invalid code.
type: Concept
notation: B082
definition: Please check the vocabulary methodsUsed.
status: valid
status modified: 2019-04-16
accepted date: 2019-04-16
in scheme: CDR QaQc Birds Directive Article 12 Reporting
error type: BLOCKER

Incoherent information.
type: Concept
notation: B083
definition: Inconsistent values provided in fields 5.1.2 Short-term trend Direction and 5.1.4 Short-term trend Method used. When the method is assessed as 'AbsentData - Insufficient or no data available', the trend cannot be defined. If you want to report a trend as stable, increasing or decreasing based on a method using limited data, please select'?estimateExpert - Based mainly on expert opinion with very limited data' for the method used.
status: valid
status modified: 2019-04-16
accepted date: 2019-04-16
in scheme: CDR QaQc Birds Directive Article 12 Reporting
error type: WARNING

Mandatory information missing.
type: Concept
notation: B084
definition: The method should be provided. In case the information to be reported in this section is not available use 'AbsentData - Insufficient or no data available'.
status: valid
status modified: 2019-04-16
accepted date: 2019-04-16
in scheme: CDR QaQc Birds Directive Article 12 Reporting
error type: ERROR

Incorrect data format.
type: Concept
notation: B085
definition: Format must be YYYY-YYYY.
status: valid
status modified: 2019-04-16
accepted date: 2019-04-16
in scheme: CDR QaQc Birds Directive Article 12 Reporting
error type: ERROR

Incoherent information.
type: Concept
notation: B086
definition: Year1 should be lower or equal than year2.
status: valid
status modified: 2019-04-16
accepted date: 2019-04-16
in scheme: CDR QaQc Birds Directive Article 12 Reporting
error type: ERROR

Mandatory information missing.
type: Concept
notation: B087
definition: The period should be provided.
status: valid
status modified: 2019-04-16
accepted date: 2019-04-16
in scheme: CDR QaQc Birds Directive Article 12 Reporting
error type: ERROR

Invalid code.
type: Concept
notation: B088
definition: Please check the vocabulary trends.
status: valid
status modified: 2019-04-16
accepted date: 2019-04-16
in scheme: CDR QaQc Birds Directive Article 12 Reporting
error type: BLOCKER

Mandatory information missing.
type: Concept
notation: B089
definition: Trend should be provided. In case the information to be reported in this section is not available use 'Unk - unknown'.
status: valid
status modified: 2019-04-16
accepted date: 2019-04-16
in scheme: CDR QaQc Birds Directive Article 12 Reporting
error type: ERROR

Incorrect data format.
type: Concept
notation: B090
definition: Numeric field, only decimals are permitted.
status: valid
status modified: 2019-04-16
accepted date: 2019-04-16
in scheme: CDR QaQc Birds Directive Article 12 Reporting
error type: ERROR

Incorrect data format.
type: Concept
notation: B091
definition: Numeric field, only decimals are permitted.
status: valid
status modified: 2019-04-16
accepted date: 2019-04-16
in scheme: CDR QaQc Birds Directive Article 12 Reporting
error type: ERROR

5.2.3b Long-term trend Magnitude - max should be greater or equal min.
type: Concept
notation: B092
status: valid
status modified: 2019-04-16
accepted date: 2019-04-16
in scheme: CDR QaQc Birds Directive Article 12 Reporting
error type: ERROR

Incorrect data format.
type: Concept
notation: B093
definition: Numeric field, only decimals are permitted.
status: valid
status modified: 2019-04-16
accepted date: 2019-04-16
in scheme: CDR QaQc Birds Directive Article 12 Reporting
error type: ERROR

Mandatory information missing.
type: Concept
notation: B094
definition: Long term trend magnitude should be provided as interval (5.2.3a, b) and/or single value (5.2.3c). When only a minimum (or maximum) value of magnitude is known (e.g. through expert opinion) this should be entered in the 'Best single value' field and NOT the '(a) Minimum' or '(b) Maximum' fields.
status: valid
status modified: 2019-04-16
accepted date: 2019-04-16
in scheme: CDR QaQc Birds Directive Article 12 Reporting
error type: ERROR

Invalid code.
type: Concept
notation: B095
definition: Please check the vocabulary methodsUsed.
status: valid
status modified: 2019-04-16
accepted date: 2019-04-16
in scheme: CDR QaQc Birds Directive Article 12 Reporting
error type: BLOCKER

Incoherent information.
type: Concept
notation: B096
definition: Inconsistent values provided in fields 5.2.2 Long-term trend Direction and 5.2.4 Long-term trend Method used. When the method is assessed as 'AbsentData - Insufficient or no data available', the trend cannot be defined. If you want to report a trend as stable, increasing or decreasing based on a method using limited data, please select'?estimateExpert - Based mainly on expert opinion with very limited data' for the method used.
status: valid
status modified: 2019-04-16
accepted date: 2019-04-16
in scheme: CDR QaQc Birds Directive Article 12 Reporting
error type: WARNING

Mandatory information missing.
type: Concept
notation: B097
definition: The method should be provided. In case the information to be reported in this section is not available use 'AbsentData - Insufficient or no data available'.
status: valid
status modified: 2019-04-16
accepted date: 2019-04-16
in scheme: CDR QaQc Birds Directive Article 12 Reporting
error type: ERROR

Invalid code.
type: Concept
notation: B098
definition: Please check the vocabulary typeOfPlan .
status: valid
status modified: 2019-04-16
accepted date: 2019-04-16
in scheme: CDR QaQc Birds Directive Article 12 Reporting
error type: BLOCKER

Incoherent information.
type: Concept
notation: B099
definition: The reported type of international plan differs with the one specified in the look up table linkage_species_plans.
status: valid
status modified: 2019-04-16
accepted date: 2019-04-16
in scheme: CDR QaQc Birds Directive Article 12 Reporting
error type: ERROR

Mandatory information missing.
type: Concept
notation: B100
definition: Information on Type of international plan is expected for all reports. In case there is no international plan ue 'NA - No plan'.
status: valid
status modified: 2019-04-16
accepted date: 2019-04-16
in scheme: CDR QaQc Birds Directive Article 12 Reporting
error type: ERROR

Invalid code.
type: Concept
notation: B101
definition: Code should be 'Yes' or 'No'.
status: valid
status modified: 2019-04-16
accepted date: 2019-04-16
in scheme: CDR QaQc Birds Directive Article 12 Reporting
error type: BLOCKER

Mandatory information missing.
type: Concept
notation: B102
definition: Indicate whether a national plan linked to the international one has been adopted.
status: valid
status modified: 2019-04-16
accepted date: 2019-04-16
in scheme: CDR QaQc Birds Directive Article 12 Reporting
error type: ERROR

Incoherent information.
type: Concept
notation: B103
definition: Description of measures or initiatives is not expected if a national plan linked to the international one has been adopted (6.2 is 'Yes').
status: valid
status modified: 2019-04-16
accepted date: 2019-04-16
in scheme: CDR QaQc Birds Directive Article 12 Reporting
error type: ERROR

Incoherent information.
type: Concept
notation: B104
definition: Description of measures or initiatives is expected if a national plan linked to the international one has not been adopted (6.2 is 'No').
status: valid
status modified: 2019-04-16
accepted date: 2019-04-16
in scheme: CDR QaQc Birds Directive Article 12 Reporting
error type: ERROR

Invalid code.
type: Concept
notation: B105
definition: Please check the vocabulary effectivenessSAPs.
status: valid
status modified: 2019-04-16
accepted date: 2019-04-16
in scheme: CDR QaQc Birds Directive Article 12 Reporting
error type: BLOCKER

Invalid code.
type: Concept
notation: B106
definition: Please check the vocabulary effectivenessMPs.
status: valid
status modified: 2019-04-16
accepted date: 2019-04-16
in scheme: CDR QaQc Birds Directive Article 12 Reporting
error type: BLOCKER

Invalid code.
type: Concept
notation: B107
definition: Please check the vocabulary threats.
status: valid
status modified: 2019-04-16
accepted date: 2019-04-16
in scheme: CDR QaQc Birds Directive Article 12 Reporting
error type: BLOCKER

More entries than permitted.
type: Concept
notation: B108
definition: More entries than permitted. Maximum of 10 pressures per report.
status: valid
status modified: 2019-04-16
accepted date: 2019-04-16
in scheme: CDR QaQc Birds Directive Article 12 Reporting
error type: ERROR

More entries than permitted.
type: Concept
notation: B109
definition: More entries than permitted. Maximum of 10 threats per report.
status: valid
status modified: 2019-04-16
accepted date: 2019-04-16
in scheme: CDR QaQc Birds Directive Article 12 Reporting
error type: ERROR

More entries than permitted.
type: Concept
notation: B110
definition: More entries than permitted. Maximum of 5 pressures with 'H - High importance' per report.
status: valid
status modified: 2019-04-16
accepted date: 2019-04-16
in scheme: CDR QaQc Birds Directive Article 12 Reporting
error type: ERROR

More entries than permitted.
type: Concept
notation: B111
definition: More entries than permitted. Maximum of 5 threats with 'H - High importance' per report.
status: valid
status modified: 2019-04-16
accepted date: 2019-04-16
in scheme: CDR QaQc Birds Directive Article 12 Reporting
error type: ERROR

Incoherent information.
type: Concept
notation: B112
definition: Code 'Xu - Unknown pressure', 'Xp - No information on pressures ' or 'Xxp - No pressures ' should be reported as a pressure, not as a threat.
status: valid
status modified: 2019-04-16
accepted date: 2019-04-16
in scheme: CDR QaQc Birds Directive Article 12 Reporting
error type: ERROR

Incoherent information.
type: Concept
notation: B113
definition: Code 'Xt - No information on threats' or 'Xxt - No threats ' should be reported as a threat, not as a pressure.
status: valid
status modified: 2019-04-16
accepted date: 2019-04-16
in scheme: CDR QaQc Birds Directive Article 12 Reporting
error type: ERROR

Incoherent information.
type: Concept
notation: B114
definition: Code 'Xt - No information on threats' used but other threats listed.
status: valid
status modified: 2019-04-16
accepted date: 2019-04-16
in scheme: CDR QaQc Birds Directive Article 12 Reporting
error type: WARNING

Incoherent information.
type: Concept
notation: B115
definition: Code 'Xp - No information on pressures' used but other pressures listed.
status: valid
status modified: 2019-04-16
accepted date: 2019-04-16
in scheme: CDR QaQc Birds Directive Article 12 Reporting
error type: WARNING

Mandatory information missing.
type: Concept
notation: B116
definition: The list of pressures and/or threats should be provided. Report 'Xp - No information on pressures' and/or 'Xt - No information on threats' for missing information.
status: valid
status modified: 2019-04-16
accepted date: 2019-04-16
in scheme: CDR QaQc Birds Directive Article 12 Reporting
error type: ERROR

Mandatory information missing.
type: Concept
notation: B117
definition: The list of threats should be provided. Report 'Xt - No information on threats' for missing information.
status: valid
status modified: 2019-04-16
accepted date: 2019-04-16
in scheme: CDR QaQc Birds Directive Article 12 Reporting
error type: ERROR

Mandatory information missing.
type: Concept
notation: B118
definition: The list of pressures should be provided. Report 'Xp - No information on pressures' for missing information.
status: valid
status modified: 2019-04-16
accepted date: 2019-04-16
in scheme: CDR QaQc Birds Directive Article 12 Reporting
error type: ERROR

Invalid code.
type: Concept
notation: B119
definition: Please check the vocabulary ranking.
status: valid
status modified: 2019-04-16
accepted date: 2019-04-16
in scheme: CDR QaQc Birds Directive Article 12 Reporting
error type: BLOCKER

Incoherent information.
type: Concept
notation: B120
definition: Ranking is provided although no code indicated for pressure and/or threat.
status: valid
status modified: 2019-04-16
accepted date: 2019-04-16
in scheme: CDR QaQc Birds Directive Article 12 Reporting
error type: ERROR

Mandatory information missing.
type: Concept
notation: B121
definition: This field cannot be empty unless the reported code is 'Xp', 'Xt', 'Xu', 'Xxp' or 'Xxt'.
status: valid
status modified: 2019-04-16
accepted date: 2019-04-16
in scheme: CDR QaQc Birds Directive Article 12 Reporting
error type: ERROR

Invalid code.
type: Concept
notation: B122
definition: Please check the vocabulary pressuresThreatsLocation .
status: valid
status modified: 2019-04-16
accepted date: 2019-04-16
in scheme: CDR QaQc Birds Directive Article 12 Reporting
error type: BLOCKER

Incoherent information.
type: Concept
notation: B123
definition: Location is provided although no code indicated for pressure and/or threat.
status: valid
status modified: 2019-04-16
accepted date: 2019-04-16
in scheme: CDR QaQc Birds Directive Article 12 Reporting
error type: ERROR

Mandatory information missing.
type: Concept
notation: B124
definition: This field cannot be empty unless the reported code is 'Xp', 'Xt', 'Xu', 'Xxp' or 'Xxt'. Report 'unk - unknown' if needed.
status: valid
status modified: 2019-04-16
accepted date: 2019-04-16
in scheme: CDR QaQc Birds Directive Article 12 Reporting
error type: ERROR

Invalid code.
type: Concept
notation: B125
definition: Code should be 'p' = pressure or 't' = threat.
status: valid
status modified: 2019-04-16
accepted date: 2019-04-16
in scheme: CDR QaQc Birds Directive Article 12 Reporting
error type: ERROR

Incoherent information.
type: Concept
notation: B126
definition: Type of pressure/threat is provided although no code indicated for pressure and/or threat.
status: valid
status modified: 2019-04-16
accepted date: 2019-04-16
in scheme: CDR QaQc Birds Directive Article 12 Reporting
error type: ERROR

Mandatory information missing.
type: Concept
notation: B127
definition: The type of pressure or threats should be systematically provided. Code should be 'p' = pressure or 't' = threat.
status: valid
status modified: 2019-04-16
accepted date: 2019-04-16
in scheme: CDR QaQc Birds Directive Article 12 Reporting
error type: ERROR

Invalid code.
type: Concept
notation: B128
definition: Code should be 'Yes' or 'No'.
status: valid
status modified: 2019-04-16
accepted date: 2019-04-16
in scheme: CDR QaQc Birds Directive Article 12 Reporting
error type: BLOCKER

Mandatory information missing.
type: Concept
notation: B129
definition: Indicate whether measures are needed or not.
status: valid
status modified: 2019-04-16
accepted date: 2019-04-16
in scheme: CDR QaQc Birds Directive Article 12 Reporting
error type: ERROR

Incoherent information.
type: Concept
notation: B130
definition: Status of measures is not expected if no measures are needed.
status: valid
status modified: 2019-04-16
accepted date: 2019-04-16
in scheme: CDR QaQc Birds Directive Article 12 Reporting
error type: ERROR

Invalid code.
type: Concept
notation: B131
definition: Please check the vocabulary measuresIdentified.
status: valid
status modified: 2019-04-16
accepted date: 2019-04-16
in scheme: CDR QaQc Birds Directive Article 12 Reporting
error type: BLOCKER

Mandatory information missing.
type: Concept
notation: B132
definition: Status of measures should be provided if measures are needed.
status: valid
status modified: 2019-04-16
accepted date: 2019-04-16
in scheme: CDR QaQc Birds Directive Article 12 Reporting
error type: ERROR

Incoherent information.
type: Concept
notation: B133
definition: The main purpose of measures taken is not expected if no measures are identified and taken.
status: valid
status modified: 2019-04-16
accepted date: 2019-04-16
in scheme: CDR QaQc Birds Directive Article 12 Reporting
error type: WARNING

Invalid code.
type: Concept
notation: B134
definition: Please check the vocabulary measuresPurposeBirds.
status: valid
status modified: 2019-04-16
accepted date: 2019-04-16
in scheme: CDR QaQc Birds Directive Article 12 Reporting
error type: BLOCKER

Incoherent information.
type: Concept
notation: B135
definition: The main purpose of measures taken is expected if measures are identified and taken.
status: valid
status modified: 2019-04-16
accepted date: 2019-04-16
in scheme: CDR QaQc Birds Directive Article 12 Reporting
error type: ERROR

Incoherent information.
type: Concept
notation: B136
definition: Location of measures is not expected if no measures identified and taken.
status: valid
status modified: 2019-04-16
accepted date: 2019-04-16
in scheme: CDR QaQc Birds Directive Article 12 Reporting
error type: WARNING

Invalid code.
type: Concept
notation: B137
definition: Please check the vocabulary measuresLocation.
status: valid
status modified: 2019-04-16
accepted date: 2019-04-16
in scheme: CDR QaQc Birds Directive Article 12 Reporting
error type: BLOCKER

Incoherent information.
type: Concept
notation: B138
definition: The location of the measures is expected if measures are identified and taken.
status: valid
status modified: 2019-04-16
accepted date: 2019-04-16
in scheme: CDR QaQc Birds Directive Article 12 Reporting
error type: ERROR

Incoherent information.
type: Concept
notation: B139
definition: Time frame of response to measures is not expected if no measures are identified and taken.
status: valid
status modified: 2019-04-16
accepted date: 2019-04-16
in scheme: CDR QaQc Birds Directive Article 12 Reporting
error type: WARNING

Invalid code.
type: Concept
notation: B140
definition: Please check the vocabulary measuresResponse.
status: valid
status modified: 2019-04-16
accepted date: 2019-04-16
in scheme: CDR QaQc Birds Directive Article 12 Reporting
error type: BLOCKER

Mandatory information missing.
type: Concept
notation: B141
definition: The time frame of the response to measures should be provided if measures are identified and taken.
status: valid
status modified: 2019-04-16
accepted date: 2019-04-16
in scheme: CDR QaQc Birds Directive Article 12 Reporting
error type: ERROR

Invalid code.
type: Concept
notation: B142
definition: Please check the vocabulary measures.
status: valid
status modified: 2019-04-16
accepted date: 2019-04-16
in scheme: CDR QaQc Birds Directive Article 12 Reporting
error type: BLOCKER

More entries than permitted.
type: Concept
notation: B143
definition: More entries than permitted. Maximum of 10 measures per biogeographical assessment.
status: valid
status modified: 2019-04-16
accepted date: 2019-04-16
in scheme: CDR QaQc Birds Directive Article 12 Reporting
error type: ERROR

Mandatory information missing.
type: Concept
notation: B144
definition: The list of measures should be provided if measures are identified and taken.
status: valid
status modified: 2019-04-16
accepted date: 2019-04-16
in scheme: CDR QaQc Birds Directive Article 12 Reporting
error type: ERROR

Invalid code.
type: Concept
notation: B145
definition: Please check the vocabulary populationUnits.
status: valid
status modified: 2019-04-16
accepted date: 2019-04-16
in scheme: CDR QaQc Birds Directive Article 12 Reporting
error type: BLOCKER

Incoherent information.
type: Concept
notation: B146
definition: The reported population size unit within Natura 2000 network differs with the reporting unit used in 2.2.
status: valid
status modified: 2019-04-16
accepted date: 2019-04-16
in scheme: CDR QaQc Birds Directive Article 12 Reporting
error type: ERROR

Incoherent information.
type: Concept
notation: B147
definition: Population size unit within Natura 2000 network (9.1a) cannot be empty when Population size within within Natura 2000 network (9.1b,c,d) is provided.
status: valid
status modified: 2019-04-16
accepted date: 2019-04-16
in scheme: CDR QaQc Birds Directive Article 12 Reporting
error type: ERROR

Mandatory information missing.
type: Concept
notation: B148
definition: Population size unit within Natura 2000 network should be provided.
status: valid
status modified: 2019-04-16
accepted date: 2019-04-16
in scheme: CDR QaQc Birds Directive Article 12 Reporting
error type: ERROR

Incorrect data format.
type: Concept
notation: B149
definition: Numeric field, only integers greater or equal 0 are permitted.
status: valid
status modified: 2019-04-16
accepted date: 2019-04-16
in scheme: CDR QaQc Birds Directive Article 12 Reporting
error type: ERROR

Incorrect data format.
type: Concept
notation: B150
definition: Numeric field, only integers greater or equal 0 are permitted.
status: valid
status modified: 2019-04-16
accepted date: 2019-04-16
in scheme: CDR QaQc Birds Directive Article 12 Reporting
error type: ERROR

9.1c Population size within Natura 2000 network - max should be greater or equal min.
type: Concept
notation: B151
status: valid
status modified: 2019-04-16
accepted date: 2019-04-16
in scheme: CDR QaQc Birds Directive Article 12 Reporting
error type: ERROR

Incorrect data format.
type: Concept
notation: B152
definition: Numeric field, only integers greater or equal 0 are permitted.
status: valid
status modified: 2019-04-16
accepted date: 2019-04-16
in scheme: CDR QaQc Birds Directive Article 12 Reporting
error type: ERROR

Mandatory information missing.
type: Concept
notation: B153
definition: Population size within Natura 2000 network should be provided as interval (9.1b, c) and/or best single value (9.1d) for annex I species and non-annex I species triggering SPA classification. When only a minimum (or maximum) estimation of population size is available (e.g. through expert opinion) this should be entered in the 'Best single value' field and NOT the '(b) Minimum' or '(c) Maximum' fields.
status: valid
status modified: 2019-04-16
accepted date: 2019-04-16
in scheme: CDR QaQc Birds Directive Article 12 Reporting
error type: ERROR

Invalid code.
type: Concept
notation: B154
definition: Please check the vocabulary typeEstimate.
status: valid
status modified: 2019-04-16
accepted date: 2019-04-16
in scheme: CDR QaQc Birds Directive Article 12 Reporting
error type: BLOCKER

Incoherent information.
type: Concept
notation: B155
definition: Incoherent information provided. Type of estimate was provided although there is no entry for population size within Natura 2000 network (9.1b,c,d). Check coherence between these two fields. If both interval (9.1b 'Minimum' and 9.1c 'Maximum') and a best single value (9.1d 'Best single value') are provided, field 9.2 'Type of estimate' should correspond to the more accurate estimate. This should be noted in 9.6 'Additional information'.
status: valid
status modified: 2019-04-16
accepted date: 2019-04-16
in scheme: CDR QaQc Birds Directive Article 12 Reporting
error type: WARNING

Mandatory information missing.
type: Concept
notation: B156
definition: The type of estimate for the population size within Natura 2000 network should be provided.
status: valid
status modified: 2019-04-16
accepted date: 2019-04-16
in scheme: CDR QaQc Birds Directive Article 12 Reporting
error type: ERROR

Invalid code.
type: Concept
notation: B157
definition: Please check the vocabulary methodsUsed.
status: valid
status modified: 2019-04-16
accepted date: 2019-04-16
in scheme: CDR QaQc Birds Directive Article 12 Reporting
error type: BLOCKER

Incoherent information.
type: Concept
notation: B158
definition: 9.2 Type of estimate should be empty when Population size inside the network Method used is 'AbsentData - Insufficient or no data available'. When the method is assessed as 'AbsentData - Insufficient or no data available', the type of estimate used for the population size cannot be defined. If you want to report an estimate based on a method using limited data, please select 'estimateExpert - Based mainly on expert opinion with very limited data' for the method used.
status: valid
status modified: 2019-04-16
accepted date: 2019-04-16
in scheme: CDR QaQc Birds Directive Article 12 Reporting
error type: WARNING

Mandatory information missing.
type: Concept
notation: B159
definition: The method should be provided. In case the information to be reported in this section is not available use 'AbsentData - Insufficient or no data available'.
status: valid
status modified: 2019-04-16
accepted date: 2019-04-16
in scheme: CDR QaQc Birds Directive Article 12 Reporting
error type: ERROR

Invalid code.
type: Concept
notation: B160
definition: Please check the vocabulary trends.
status: valid
status modified: 2019-04-16
accepted date: 2019-04-16
in scheme: CDR QaQc Birds Directive Article 12 Reporting
error type: BLOCKER

Mandatory information missing.
type: Concept
notation: B161
definition: The Trend should be provided. In case the information to be reported in this section is not available use 'Unk - unknown'.
status: valid
status modified: 2019-04-16
accepted date: 2019-04-16
in scheme: CDR QaQc Birds Directive Article 12 Reporting
error type: ERROR

Invalid code.
type: Concept
notation: B162
definition: Please check the vocabulary methodsUsed.
status: valid
status modified: 2019-04-16
accepted date: 2019-04-16
in scheme: CDR QaQc Birds Directive Article 12 Reporting
error type: BLOCKER

Incoherent information.
type: Concept
notation: B163
definition: Inconsistent values provided in fields 9.4 Short-term trend Direction and 9.5 Short-term trend Method used. When the method is assessed as 'AbsentData - Insufficient or no data available', the trend cannot be defined. If you want to report a trend as stable, increasing or decreasing based on a method using limited data, please select'?estimateExpert - Based mainly on expert opinion with very limited data' for the method used.
status: valid
status modified: 2019-04-16
accepted date: 2019-04-16
in scheme: CDR QaQc Birds Directive Article 12 Reporting
error type: WARNING

Mandatory information missing.
type: Concept
notation: B164
definition: The method should be provided. In case the information to be reported in this section is not available use 'AbsentData - Insufficient or no data available'.
status: valid
status modified: 2019-04-16
accepted date: 2019-04-16
in scheme: CDR QaQc Birds Directive Article 12 Reporting
error type: ERROR

Invalid code.
type: Concept
notation: B165
definition: Code should be 'Yes' or 'No'.
status: valid
status modified: 2019-04-16
accepted date: 2019-04-16
in scheme: CDR QaQc Birds Directive Article 12 Reporting
error type: BLOCKER

Incoherent information.
type: Concept
notation: B166
definition: This section is to report on Annex II species only.
status: valid
status modified: 2019-04-16
accepted date: 2019-04-16
in scheme: CDR QaQc Birds Directive Article 12 Reporting
error type: ERROR

Mandatory information missing.
type: Concept
notation: B167
definition: Indicate whether this Annex II species is nationally hunted. Report 'No' if the answer to the question: 'Is the species nationally hunted' is 'No'.
status: valid
status modified: 2019-04-16
accepted date: 2019-04-16
in scheme: CDR QaQc Birds Directive Article 12 Reporting
error type: ERROR

Invalid code.
type: Concept
notation: B168
definition: Please check the vocabulary populationUnits.
status: valid
status modified: 2019-04-16
accepted date: 2019-04-16
in scheme: CDR QaQc Birds Directive Article 12 Reporting
error type: ERROR

Incoherent information.
type: Concept
notation: B169
definition: The reported unit for hunting bag differs with the recommended unit 'i - number of individuals' defined in the reporting format.
status: valid
status modified: 2019-04-16
accepted date: 2019-04-16
in scheme: CDR QaQc Birds Directive Article 12 Reporting
error type: ERROR

Mandatory information missing.
type: Concept
notation: B170
definition: Population unit for hunting bag should be provided.
status: valid
status modified: 2019-04-16
accepted date: 2019-04-16
in scheme: CDR QaQc Birds Directive Article 12 Reporting
error type: ERROR

Min/max value should be provided systematically for all seasons.
type: Concept
notation: B171
definition: Min/max value should be provided systematically for all seasons. Report '0' if no hunting bag or there was a temporary ban.
status: valid
status modified: 2019-04-16
accepted date: 2019-04-16
in scheme: CDR QaQc Birds Directive Article 12 Reporting
error type: ERROR

Incoherent information.
type: Concept
notation: B172
definition: Only min/max or unknown value is expected for 10.2b1 Statistics/quantity per hunting season or year over the reporting period 'Season/year1'.
status: valid
status modified: 2019-04-16
accepted date: 2019-04-16
in scheme: CDR QaQc Birds Directive Article 12 Reporting
error type: ERROR

Mandatory information missing.
type: Concept
notation: B173
definition: Statistics/quantity per hunting season or year over the reporting period 'Season/year1' should be provided (10.2b1min, 10.2b1max, 10.2b1x).
status: valid
status modified: 2019-04-16
accepted date: 2019-04-16
in scheme: CDR QaQc Birds Directive Article 12 Reporting
error type: ERROR

Incorrect data format.
type: Concept
notation: B174
definition: Numeric field, only decimals greater or equal 0 are permitted.
status: valid
status modified: 2019-04-16
accepted date: 2019-04-16
in scheme: CDR QaQc Birds Directive Article 12 Reporting
error type: ERROR

Incorrect data format.
type: Concept
notation: B175
definition: Numeric field, only decimals greater or equal 0 are permitted.
status: valid
status modified: 2019-04-16
accepted date: 2019-04-16
in scheme: CDR QaQc Birds Directive Article 12 Reporting
error type: ERROR

10.2b1max Statistics/quantity on season/year 1- max should be greater or equal min.
type: Concept
notation: B176
status: valid
status modified: 2019-04-16
accepted date: 2019-04-16
in scheme: CDR QaQc Birds Directive Article 12 Reporting
error type: ERROR

Invalid code.
type: Concept
notation: B177
definition: Code should be 'Yes' or 'No'.
status: valid
status modified: 2019-04-16
accepted date: 2019-04-16
in scheme: CDR QaQc Birds Directive Article 12 Reporting
error type: ERROR

Incorrect data format.
type: Concept
notation: B178
definition: This field cannot be empty. Code should be 'Yes' or 'No'.
status: valid
status modified: 2019-04-16
accepted date: 2019-04-16
in scheme: CDR QaQc Birds Directive Article 12 Reporting
error type: ERROR

Min/max value should be provided systematically for all seasons.
type: Concept
notation: B179
definition: Min/max value should be provided systematically for all seasons. Report '0' if no hunting bag or there was a temporary ban.
status: valid
status modified: 2019-04-16
accepted date: 2019-04-16
in scheme: CDR QaQc Birds Directive Article 12 Reporting
error type: ERROR

Incoherent information.
type: Concept
notation: B180
definition: Only min/max or unknown value is expected for 10.2b2 Statistics/quantity per hunting season or year over the reporting period 'Season/year2'.
status: valid
status modified: 2019-04-16
accepted date: 2019-04-16
in scheme: CDR QaQc Birds Directive Article 12 Reporting
error type: ERROR

Mandatory information missing.
type: Concept
notation: B181
definition: Statistics/quantity per hunting season or year over the reporting period 'Season/year2' should be provided (10.2b2min, 10.2b2max, 10.2b2x).
status: valid
status modified: 2019-04-16
accepted date: 2019-04-16
in scheme: CDR QaQc Birds Directive Article 12 Reporting
error type: ERROR

Incorrect data format.
type: Concept
notation: B182
definition: Numeric field, only decimals greater or equal 0 are permitted.
status: valid
status modified: 2019-04-16
accepted date: 2019-04-16
in scheme: CDR QaQc Birds Directive Article 12 Reporting
error type: ERROR

Incorrect data format.
type: Concept
notation: B183
definition: Numeric field, only decimals greater or equal 0 are permitted.
status: valid
status modified: 2019-04-16
accepted date: 2019-04-16
in scheme: CDR QaQc Birds Directive Article 12 Reporting
error type: ERROR

10.2b2max Statistics/quantity on season/year 2- max should be greater or equal min.
type: Concept
notation: B184
status: valid
status modified: 2019-04-16
accepted date: 2019-04-16
in scheme: CDR QaQc Birds Directive Article 12 Reporting
error type: ERROR

Invalid code.
type: Concept
notation: B185
definition: Code should be 'Yes' or 'No'.
status: valid
status modified: 2019-04-16
accepted date: 2019-04-16
in scheme: CDR QaQc Birds Directive Article 12 Reporting
error type: ERROR

Incorrect data format.
type: Concept
notation: B186
definition: This field cannot be empty. Code should be 'Yes' or 'No'.
status: valid
status modified: 2019-04-16
accepted date: 2019-04-16
in scheme: CDR QaQc Birds Directive Article 12 Reporting
error type: ERROR

Min/max value should be provided systematically for all seasons.
type: Concept
notation: B187
definition: Min/max value should be provided systematically for all seasons. Report '0' if no hunting bag or there was a temporary ban.
status: valid
status modified: 2019-04-16
accepted date: 2019-04-16
in scheme: CDR QaQc Birds Directive Article 12 Reporting
error type: ERROR

Incoherent information.
type: Concept
notation: B188
definition: Only min/max or unknown value is expected for 10.2b3 Statistics/quantity per hunting season or year over the reporting period 'Season/year3'.
status: valid
status modified: 2019-04-16
accepted date: 2019-04-16
in scheme: CDR QaQc Birds Directive Article 12 Reporting
error type: ERROR

Mandatory information missing.
type: Concept
notation: B189
definition: Statistics/quantity per hunting season or year over the reporting period 'Season/year3' should be provided (10.2b3min, 10.2b3max, 10.2b3x).
status: valid
status modified: 2019-04-16
accepted date: 2019-04-16
in scheme: CDR QaQc Birds Directive Article 12 Reporting
error type: ERROR

Incorrect data format.
type: Concept
notation: B190
definition: Numeric field, only decimals greater or equal 0 are permitted.
status: valid
status modified: 2019-04-16
accepted date: 2019-04-16
in scheme: CDR QaQc Birds Directive Article 12 Reporting
error type: ERROR

Incorrect data format.
type: Concept
notation: B191
definition: Numeric field, only decimals greater or equal 0 are permitted.
status: valid
status modified: 2019-04-16
accepted date: 2019-04-16
in scheme: CDR QaQc Birds Directive Article 12 Reporting
error type: ERROR

10.2b3max Statistics/quantity on season/year 3 - max should be greater or equal min.
type: Concept
notation: B192
status: valid
status modified: 2019-04-16
accepted date: 2019-04-16
in scheme: CDR QaQc Birds Directive Article 12 Reporting
error type: ERROR

Invalid code.
type: Concept
notation: B193
definition: Code should be 'Yes' or 'No'.
status: valid
status modified: 2019-04-16
accepted date: 2019-04-16
in scheme: CDR QaQc Birds Directive Article 12 Reporting
error type: ERROR

Incorrect data format.
type: Concept
notation: B194
definition: This field cannot be empty. Code should be 'Yes' or 'No'.
status: valid
status modified: 2019-04-16
accepted date: 2019-04-16
in scheme: CDR QaQc Birds Directive Article 12 Reporting
error type: ERROR

Min/max value should be provided systematically for all seasons.
type: Concept
notation: B195
definition: Min/max value should be provided systematically for all seasons. Report '0' if no hunting bag or there was a temporary ban.
status: valid
status modified: 2019-04-16
accepted date: 2019-04-16
in scheme: CDR QaQc Birds Directive Article 12 Reporting
error type: ERROR

Incoherent information.
type: Concept
notation: B196
definition: Only min/max or unknown value is expected for 10.2b4 Statistics/quantity per hunting season or year over the reporting period 'Season/year4'.
status: valid
status modified: 2019-04-16
accepted date: 2019-04-16
in scheme: CDR QaQc Birds Directive Article 12 Reporting
error type: ERROR

Mandatory information missing.
type: Concept
notation: B197
definition: M Statistics/quantity per hunting season or year over the reporting period 'Season/year4' should be provided (10.2b4min, 10.2b4max, 10.2b4x).
status: valid
status modified: 2019-04-16
accepted date: 2019-04-16
in scheme: CDR QaQc Birds Directive Article 12 Reporting
error type: ERROR

Incorrect data format.
type: Concept
notation: B198
definition: Numeric field, only decimals greater or equal 0 are permitted.
status: valid
status modified: 2019-04-16
accepted date: 2019-04-16
in scheme: CDR QaQc Birds Directive Article 12 Reporting
error type: ERROR

Incorrect data format.
type: Concept
notation: B199
definition: Numeric field, only decimals greater or equal 0 are permitted.
status: valid
status modified: 2019-04-16
accepted date: 2019-04-16
in scheme: CDR QaQc Birds Directive Article 12 Reporting
error type: ERROR

10.2b4max Statistics/quantity on season/year 4 - max should be greater or equal min.
type: Concept
notation: B200
status: valid
status modified: 2019-04-16
accepted date: 2019-04-16
in scheme: CDR QaQc Birds Directive Article 12 Reporting
error type: ERROR

Invalid code.
type: Concept
notation: B201
definition: Code should be 'Yes' or 'No'.
status: valid
status modified: 2019-04-16
accepted date: 2019-04-16
in scheme: CDR QaQc Birds Directive Article 12 Reporting
error type: ERROR

Incorrect data format.
type: Concept
notation: B202
definition: This field cannot be empty. Code should be 'Yes' or 'No'.
status: valid
status modified: 2019-04-16
accepted date: 2019-04-16
in scheme: CDR QaQc Birds Directive Article 12 Reporting
error type: ERROR

Min/max value should be provided systematically for all seasons.
type: Concept
notation: B203
definition: Min/max value should be provided systematically for all seasons. Report '0' if no hunting bag or there was a temporary ban.
status: valid
status modified: 2019-04-16
accepted date: 2019-04-16
in scheme: CDR QaQc Birds Directive Article 12 Reporting
error type: ERROR

Incoherent information.
type: Concept
notation: B204
definition: Only min/max or unknown value is expected for 10.2b5 Statistics/quantity per hunting season or year over the reporting period 'Season/year5'.
status: valid
status modified: 2019-04-16
accepted date: 2019-04-16
in scheme: CDR QaQc Birds Directive Article 12 Reporting
error type: ERROR

Mandatory information missing.
type: Concept
notation: B205
definition: Statistics/quantity per hunting season or year over the reporting period 'Season/year5' should be provided (10.2b5min, 10.2b5max, 10.2b5x).
status: valid
status modified: 2019-04-16
accepted date: 2019-04-16
in scheme: CDR QaQc Birds Directive Article 12 Reporting
error type: ERROR

Incorrect data format.
type: Concept
notation: B206
definition: Numeric field, only decimals greater or equal 0 are permitted.
status: valid
status modified: 2019-04-16
accepted date: 2019-04-16
in scheme: CDR QaQc Birds Directive Article 12 Reporting
error type: ERROR

Incorrect data format.
type: Concept
notation: B207
definition: Numeric field, only decimals greater or equal 0 are permitted.
status: valid
status modified: 2019-04-16
accepted date: 2019-04-16
in scheme: CDR QaQc Birds Directive Article 12 Reporting
error type: ERROR

10.2b5max Statistics/quantity on season/year 5 - max should be greater or equal min.
type: Concept
notation: B208
status: valid
status modified: 2019-04-16
accepted date: 2019-04-16
in scheme: CDR QaQc Birds Directive Article 12 Reporting
error type: ERROR

Invalid code.
type: Concept
notation: B209
definition: Code should be 'Yes' or 'No'.
status: valid
status modified: 2019-04-16
accepted date: 2019-04-16
in scheme: CDR QaQc Birds Directive Article 12 Reporting
error type: ERROR

Incorrect data format.
type: Concept
notation: B210
definition: This field cannot be empty. Code should be 'Yes' or 'No'.
status: valid
status modified: 2019-04-16
accepted date: 2019-04-16
in scheme: CDR QaQc Birds Directive Article 12 Reporting
error type: ERROR

Min/max value should be provided systematically for all seasons.
type: Concept
notation: B211
definition: Min/max value should be provided systematically for all seasons. Report '0' if no hunting bag or there was a temporary ban.
status: valid
status modified: 2019-04-16
accepted date: 2019-04-16
in scheme: CDR QaQc Birds Directive Article 12 Reporting
error type: ERROR

Incoherent information.
type: Concept
notation: B212
definition: Only min/max or unknown value is expected for 10.2b6 Statistics/quantity per hunting season or year over the reporting period 'Season/year6'.
status: valid
status modified: 2019-04-16
accepted date: 2019-04-16
in scheme: CDR QaQc Birds Directive Article 12 Reporting
error type: ERROR

Mandatory information missing.
type: Concept
notation: B213
definition: Statistics/quantity per hunting season or year over the reporting period 'Season/year6' should be provided (10.2b6min, 10.2b6max, 10.2b6x).
status: valid
status modified: 2019-04-16
accepted date: 2019-04-16
in scheme: CDR QaQc Birds Directive Article 12 Reporting
error type: ERROR

Incorrect data format.
type: Concept
notation: B214
definition: Numeric field, only decimals greater or equal 0 are permitted.
status: valid
status modified: 2019-04-16
accepted date: 2019-04-16
in scheme: CDR QaQc Birds Directive Article 12 Reporting
error type: ERROR

Incorrect data format.
type: Concept
notation: B215
definition: Numeric field, only decimals greater or equal 0 are permitted.
status: valid
status modified: 2019-04-16
accepted date: 2019-04-16
in scheme: CDR QaQc Birds Directive Article 12 Reporting
error type: ERROR

10.2b6max Statistics/quantity on season/year 6 - max should be greater or equal min.
type: Concept
notation: B216
status: valid
status modified: 2019-04-16
accepted date: 2019-04-16
in scheme: CDR QaQc Birds Directive Article 12 Reporting
error type: ERROR

Invalid code.
type: Concept
notation: B217
definition: Code should be 'Yes' or 'No'.
status: valid
status modified: 2019-04-16
accepted date: 2019-04-16
in scheme: CDR QaQc Birds Directive Article 12 Reporting
error type: ERROR

Incorrect data format.
type: Concept
notation: B218
definition: This field cannot be empty. Code should be 'Yes' or 'No'.
status: valid
status modified: 2019-04-16
accepted date: 2019-04-16
in scheme: CDR QaQc Birds Directive Article 12 Reporting
error type: ERROR

Invalid code.
type: Concept
notation: B219
definition: Please check the vocabulary methodsUsed.
status: valid
status modified: 2019-04-16
accepted date: 2019-04-16
in scheme: CDR QaQc Birds Directive Article 12 Reporting
error type: BLOCKER

Mandatory information missing.
type: Concept
notation: B220
definition: The method should be provided. In case the information to be reported in this section is not available use 'AbsentData - Insufficient or no data available'.
status: valid
status modified: 2019-04-16
accepted date: 2019-04-16
in scheme: CDR QaQc Birds Directive Article 12 Reporting
error type: ERROR

Incoherent information.
type: Concept
notation: B221
definition: This section is to report on the species' national status in relation to objectives outlined in the SAPs/BMSs.
status: valid
status modified: 2019-04-16
accepted date: 2019-04-16
in scheme: CDR QaQc Birds Directive Article 12 Reporting
error type: ERROR

Mandatory information missing.
type: Concept
notation: B222
definition: Information on the species' national status in relation to objectives outlined in the SAPs/BMSs should be provided.
status: valid
status modified: 2019-04-16
accepted date: 2019-04-16
in scheme: CDR QaQc Birds Directive Article 12 Reporting
error type: ERROR

Incoherent information.
type: Concept
notation: B223
definition: This section is to report on the status of huntable species in non-Secure status, in relation to objectives outlined in the MPs.
status: valid
status modified: 2019-04-16
accepted date: 2019-04-16
in scheme: CDR QaQc Birds Directive Article 12 Reporting
error type: ERROR

Mandatory information missing.
type: Concept
notation: B224
definition: Information on the status of huntable species in non-Secure status, in relation to objectives outlined in the MPs should be provided.
status: valid
status modified: 2019-04-16
accepted date: 2019-04-16
in scheme: CDR QaQc Birds Directive Article 12 Reporting
error type: ERROR

Mandatory information missing.
type: Concept
notation: B225
definition: Source of information is expected.
status: valid
status modified: 2019-04-16
accepted date: 2019-04-16
in scheme: CDR QaQc Birds Directive Article 12 Reporting
error type: ERROR

Mandatory information missing.
type: Concept
notation: B226
definition: Source of information is expected.
status: valid
status modified: 2019-04-16
accepted date: 2019-04-16
in scheme: CDR QaQc Birds Directive Article 12 Reporting
error type: ERROR

Mandatory information missing.
type: Concept
notation: B227
definition: Source of information is expected.
status: valid
status modified: 2019-04-16
accepted date: 2019-04-16
in scheme: CDR QaQc Birds Directive Article 12 Reporting
error type: ERROR

Mandatory information missing.
type: Concept
notation: B228
definition: Source of information is expected.
status: valid
status modified: 2019-04-16
accepted date: 2019-04-16
in scheme: CDR QaQc Birds Directive Article 12 Reporting
error type: ERROR

Mandatory information missing.
type: Concept
notation: B229
definition: Source of information is expected.
status: valid
status modified: 2019-04-16
accepted date: 2019-04-16
in scheme: CDR QaQc Birds Directive Article 12 Reporting
error type: ERROR

Mandatory information missing.
type: Concept
notation: B230
definition: Source of information is expected.
status: valid
status modified: 2019-04-16
accepted date: 2019-04-16
in scheme: CDR QaQc Birds Directive Article 12 Reporting
error type: ERROR

Mandatory information missing.
type: Concept
notation: B231
definition: Source of information is expected.
status: valid
status modified: 2019-04-16
accepted date: 2019-04-16
in scheme: CDR QaQc Birds Directive Article 12 Reporting
error type: ERROR

Invalid code.
type: Concept
notation: B232
definition: Code should be 'Yes' or 'No'.
status: valid
status modified: 2019-04-16
accepted date: 2019-04-16
in scheme: CDR QaQc Birds Directive Article 12 Reporting
error type: BLOCKER

Mandatory information missing.
type: Concept
notation: B233
definition: Indicate whether information related to international plans is provided for the other season.
status: valid
status modified: 2019-04-16
accepted date: 2019-04-16
in scheme: CDR QaQc Birds Directive Article 12 Reporting
error type: ERROR

Invalid code.
type: Concept
notation: B234
definition: Code should be 'Yes' or 'No'.
status: valid
status modified: 2019-04-16
accepted date: 2019-04-16
in scheme: CDR QaQc Birds Directive Article 12 Reporting
error type: BLOCKER

Mandatory information missing.
type: Concept
notation: B235
definition: Indicate whether information related to Annex II species is provided for the other season.
status: valid
status modified: 2019-04-16
accepted date: 2019-04-16
in scheme: CDR QaQc Birds Directive Article 12 Reporting
error type: ERROR

Incoherent information.
type: Concept
notation: B236
definition: The best single value (2.2d) should not be less than the minimum (2.2b) or higher than the maximum (2.2c).
status: valid
status modified: 2019-04-16
accepted date: 2019-04-16
in scheme: CDR QaQc Birds Directive Article 12 Reporting
error type: WARNING

Incoherent information.
type: Concept
notation: B237
definition: The best single value (9.1d) should not be less than the minimum (9.1b) or higher than the maximum (9.1c).
status: valid
status modified: 2019-04-16
accepted date: 2019-04-16
in scheme: CDR QaQc Birds Directive Article 12 Reporting
error type: WARNING

Incoherent information.
type: Concept
notation: B238
definition: The trend direction is reported as 'D - decreasing'. At least one of the min, max or best single value should be negative.
status: valid
status modified: 2019-04-16
accepted date: 2019-04-16
in scheme: CDR QaQc Birds Directive Article 12 Reporting
error type: ERROR

Incoherent information.
type: Concept
notation: B239
definition: The trend direction is reported as 'D - decreasing'. At least one of the min, max or best single value should be negative.
status: valid
status modified: 2019-04-16
accepted date: 2019-04-16
in scheme: CDR QaQc Birds Directive Article 12 Reporting
error type: ERROR

Incoherent information.
type: Concept
notation: B240
definition: The trend direction is reported as 'D - decreasing'. At least one of the min, max or best single value should be negative.
status: valid
status modified: 2019-04-16
accepted date: 2019-04-16
in scheme: CDR QaQc Birds Directive Article 12 Reporting
error type: ERROR

Incoherent information.
type: Concept
notation: B241
definition: The trend direction is reported as 'D - decreasing'. At least one of the min, max or best single value should be negative.
status: valid
status modified: 2019-04-16
accepted date: 2019-04-16
in scheme: CDR QaQc Birds Directive Article 12 Reporting
error type: ERROR

Invalid code.
type: Concept
notation: GB001
definition: Please check the vocabulary countries.
status: valid
status modified: 2019-04-16
accepted date: 2019-04-16
in scheme: CDR QaQc Birds Directive Article 12 Reporting
error type: BLOCKER

Mandatory information missing.
type: Concept
notation: GB002
definition: The country code should be provided.
status: valid
status modified: 2019-04-16
accepted date: 2019-04-16
in scheme: CDR QaQc Birds Directive Article 12 Reporting
error type: BLOCKER

Invalid code.
type: Concept
notation: GB003
definition: Please check the vocabulary countries.
status: valid
status modified: 2019-04-16
accepted date: 2019-04-16
in scheme: CDR QaQc Birds Directive Article 12 Reporting
error type: BLOCKER

Mandatory information missing.
type: Concept
notation: GB004
definition: The country code should be provided.
status: valid
status modified: 2019-04-16
accepted date: 2019-04-16
in scheme: CDR QaQc Birds Directive Article 12 Reporting
error type: BLOCKER

Mandatory information missing.
type: Concept
notation: GB005
definition: Information on main achievements under the Birds Directive during the reporting period is expected.
status: valid
status modified: 2019-04-16
accepted date: 2019-04-16
in scheme: CDR QaQc Birds Directive Article 12 Reporting
error type: ERROR

Mandatory information missing.
type: Concept
notation: GB006
definition: Information related to the Birds Directive is expected.
status: valid
status modified: 2019-04-16
accepted date: 2019-04-16
in scheme: CDR QaQc Birds Directive Article 12 Reporting
error type: ERROR

Mandatory information missing.
type: Concept
notation: GB007
definition: General information on the network of SPAs is expected.
status: valid
status modified: 2019-04-16
accepted date: 2019-04-16
in scheme: CDR QaQc Birds Directive Article 12 Reporting
error type: ERROR

Mandatory information missing.
type: Concept
notation: GB008
definition: General information on monitoring is expected.
status: valid
status modified: 2019-04-16
accepted date: 2019-04-16
in scheme: CDR QaQc Birds Directive Article 12 Reporting
error type: ERROR

Mandatory information missing.
type: Concept
notation: GB009
definition: General information on species protection is expected.
status: valid
status modified: 2019-04-16
accepted date: 2019-04-16
in scheme: CDR QaQc Birds Directive Article 12 Reporting
error type: ERROR

Mandatory information missing.
type: Concept
notation: GB010
definition: General information on transposition of the Directive is expected.
status: valid
status modified: 2019-04-16
accepted date: 2019-04-16
in scheme: CDR QaQc Birds Directive Article 12 Reporting
error type: ERROR

Incorrect data format.
type: Concept
notation: GB011
definition: Numeric field, only integers greater or equal 0 are permitted.
status: valid
status modified: 2019-04-16
accepted date: 2019-04-16
in scheme: CDR QaQc Birds Directive Article 12 Reporting
error type: ERROR

Incoherent information.
type: Concept
notation: GB012
definition: The number of marine SPAs cannot be higher than the total number of SPAs.
status: valid
status modified: 2019-04-16
accepted date: 2019-04-16
in scheme: CDR QaQc Birds Directive Article 12 Reporting
error type: ERROR

Mandatory information missing.
type: Concept
notation: GB013
definition: The total number of SPAs should be provided.
status: valid
status modified: 2019-04-16
accepted date: 2019-04-16
in scheme: CDR QaQc Birds Directive Article 12 Reporting
error type: ERROR

Incorrect data format.
type: Concept
notation: GB014
definition: Numeric field, only decimals greater or equal 0 are permitted.
status: valid
status modified: 2019-04-16
accepted date: 2019-04-16
in scheme: CDR QaQc Birds Directive Article 12 Reporting
error type: ERROR

Incoherent information.
type: Concept
notation: GB015
definition: The surface area of terrestrial SPAs cannot be higher than the surface area of all SPAs.
status: valid
status modified: 2019-04-16
accepted date: 2019-04-16
in scheme: CDR QaQc Birds Directive Article 12 Reporting
error type: ERROR

Incoherent information.
type: Concept
notation: GB016
definition: The surface area of marine SPAs cannot be higher than the surface area of all SPAs.
status: valid
status modified: 2019-04-16
accepted date: 2019-04-16
in scheme: CDR QaQc Birds Directive Article 12 Reporting
error type: ERROR

Incoherent information.
type: Concept
notation: GB017
definition: The surface area of terrestrial SPAs plus the surface area of marine SPAs together should give the surface area of all SPAs.
status: valid
status modified: 2019-04-16
accepted date: 2019-04-16
in scheme: CDR QaQc Birds Directive Article 12 Reporting
error type: ERROR

Mandatory information missing.
type: Concept
notation: GB018
definition: The surface area of all SPAs should be provided.
status: valid
status modified: 2019-04-16
accepted date: 2019-04-16
in scheme: CDR QaQc Birds Directive Article 12 Reporting
error type: ERROR

Incorrect data format.
type: Concept
notation: GB019
definition: Numeric field, only decimals greater or equal 0 are permitted.
status: valid
status modified: 2019-04-16
accepted date: 2019-04-16
in scheme: CDR QaQc Birds Directive Article 12 Reporting
error type: ERROR

Mandatory information missing.
type: Concept
notation: GB020
definition: The surface area of terrestrial SPAs should be provided.
status: valid
status modified: 2019-04-16
accepted date: 2019-04-16
in scheme: CDR QaQc Birds Directive Article 12 Reporting
error type: ERROR

Incorrect data format.
type: Concept
notation: GB021
definition: Numeric field, only integers greater or equal 0 are permitted.
status: valid
status modified: 2019-04-16
accepted date: 2019-04-16
in scheme: CDR QaQc Birds Directive Article 12 Reporting
error type: ERROR

Mandatory information missing.
type: Concept
notation: GB022
definition: The total number of marine SPAs should be provided.
status: valid
status modified: 2019-04-16
accepted date: 2019-04-16
in scheme: CDR QaQc Birds Directive Article 12 Reporting
error type: ERROR

Incorrect data format.
type: Concept
notation: GB023
definition: Numeric field, only decimals greater or equal 0 are permitted.
status: valid
status modified: 2019-04-16
accepted date: 2019-04-16
in scheme: CDR QaQc Birds Directive Article 12 Reporting
error type: ERROR

Mandatory information missing.
type: Concept
notation: GB024
definition: The surface area of marine SPAs should be provided.
status: valid
status modified: 2019-04-16
accepted date: 2019-04-16
in scheme: CDR QaQc Birds Directive Article 12 Reporting
error type: ERROR

Mandatory information missing.
type: Concept
notation: GB025
definition: The date of the last database delivered during the reporting period (2013 - 2018) is expected. Supply this information in the [DD]-MM-YYYY format.
status: valid
status modified: 2019-04-16
accepted date: 2019-04-16
in scheme: CDR QaQc Birds Directive Article 12 Reporting
error type: ERROR

Incorrect data format.
type: Concept
notation: GB026
definition: Numeric field, only integers greater or equal 0 are permitted.
status: valid
status modified: 2019-04-16
accepted date: 2019-04-16
in scheme: CDR QaQc Birds Directive Article 12 Reporting
error type: ERROR

Mandatory information missing.
type: Concept
notation: GB027
definition: The total number of SPAs for which necessary conservation measures have been established should be provided.
status: valid
status modified: 2019-04-16
accepted date: 2019-04-16
in scheme: CDR QaQc Birds Directive Article 12 Reporting
error type: ERROR

Incorrect data format.
type: Concept
notation: GB028
definition: Numeric field, only decimals greater or equal 0 are permitted.
status: valid
status modified: 2019-04-16
accepted date: 2019-04-16
in scheme: CDR QaQc Birds Directive Article 12 Reporting
error type: ERROR

Incoherent information.
type: Concept
notation: GB029
definition: The proportion of the network area for which necessary conservation measures have been established should be between 0 and 100 %.
status: valid
status modified: 2019-04-16
accepted date: 2019-04-16
in scheme: CDR QaQc Birds Directive Article 12 Reporting
error type: ERROR

Mandatory information missing.
type: Concept
notation: GB030
definition: The proportion of the network area for which necessary conservation measures have been established should be provided.
status: valid
status modified: 2019-04-16
accepted date: 2019-04-16
in scheme: CDR QaQc Birds Directive Article 12 Reporting
error type: ERROR

Incorrect data format.
type: Concept
notation: GB031
definition: Numeric field, only integers greater or equal 0 are permitted.
status: valid
status modified: 2019-04-16
accepted date: 2019-04-16
in scheme: CDR QaQc Birds Directive Article 12 Reporting
error type: ERROR

Mandatory information missing.
type: Concept
notation: GB032
definition: The total number of SPAs for which a comprehensive management plan or a similar instrument is in place should be provided.
status: valid
status modified: 2019-04-16
accepted date: 2019-04-16
in scheme: CDR QaQc Birds Directive Article 12 Reporting
error type: ERROR

Incorrect data format.
type: Concept
notation: GB033
definition: Numeric field, only decimals greater or equal 0 are permitted.
status: valid
status modified: 2019-04-16
accepted date: 2019-04-16
in scheme: CDR QaQc Birds Directive Article 12 Reporting
error type: ERROR

Incoherent information.
type: Concept
notation: GB034
definition: The proportion of the network area for which a comprehensive management plan or a similar instrument is in place should be between 0 and 100 %.
status: valid
status modified: 2019-04-16
accepted date: 2019-04-16
in scheme: CDR QaQc Birds Directive Article 12 Reporting
error type: ERROR

Mandatory information missing.
type: Concept
notation: GB035
definition: The proportion of the network area for which a comprehensive management plan or a similar instrument is in place should be provided.
status: valid
status modified: 2019-04-16
accepted date: 2019-04-16
in scheme: CDR QaQc Birds Directive Article 12 Reporting
error type: ERROR

Incorrect data format.
type: Concept
notation: GB036
definition: The site code should contain 9 characters (letters and numbers).
status: valid
status modified: 2019-04-16
accepted date: 2019-04-16
in scheme: CDR QaQc Birds Directive Article 12 Reporting
error type: WARNING

Incoherent information.
type: Concept
notation: GB037
definition: The site name should be provided in addition to the sitecode.
status: valid
status modified: 2019-04-16
accepted date: 2019-04-16
in scheme: CDR QaQc Birds Directive Article 12 Reporting
error type: ERROR

Incoherent information.
type: Concept
notation: GB038
definition: The title of project/plan should be provided.
status: valid
status modified: 2019-04-16
accepted date: 2019-04-16
in scheme: CDR QaQc Birds Directive Article 12 Reporting
error type: ERROR

Incoherent information.
type: Concept
notation: GB039
definition: The year when Commission was informed about compensatory measures should be provided.
status: valid
status modified: 2019-04-16
accepted date: 2019-04-16
in scheme: CDR QaQc Birds Directive Article 12 Reporting
error type: ERROR

Incoherent information.
type: Concept
notation: GB040
definition: The year when project/plan was started to be implemented should be provided.
status: valid
status modified: 2019-04-16
accepted date: 2019-04-16
in scheme: CDR QaQc Birds Directive Article 12 Reporting
error type: ERROR

Incoherent information.
type: Concept
notation: GB041
definition: The year of publication should be provided.
status: valid
status modified: 2019-04-16
accepted date: 2019-04-16
in scheme: CDR QaQc Birds Directive Article 12 Reporting
error type: ERROR

Incoherent information.
type: Concept
notation: GB042
definition: Web-link and/or bibliographic reference should be provided.
status: valid
status modified: 2019-04-16
accepted date: 2019-04-16
in scheme: CDR QaQc Birds Directive Article 12 Reporting
error type: ERROR

Incoherent information.
type: Concept
notation: GB043
definition: The year of publication should be provided.
status: valid
status modified: 2019-04-16
accepted date: 2019-04-16
in scheme: CDR QaQc Birds Directive Article 12 Reporting
error type: ERROR

Incoherent information.
type: Concept
notation: GB044
definition: Web-link and/or bibliographic reference should be provided.
status: valid
status modified: 2019-04-16
accepted date: 2019-04-16
in scheme: CDR QaQc Birds Directive Article 12 Reporting
error type: ERROR

Incoherent information.
type: Concept
notation: GB045
definition: The year of publication should be provided.
status: valid
status modified: 2019-04-16
accepted date: 2019-04-16
in scheme: CDR QaQc Birds Directive Article 12 Reporting
error type: ERROR

Incoherent information.
type: Concept
notation: GB046
definition: Web-link and/or bibliographic reference should be provided.
status: valid
status modified: 2019-04-16
accepted date: 2019-04-16
in scheme: CDR QaQc Birds Directive Article 12 Reporting
error type: ERROR

Incoherent information.
type: Concept
notation: GB047
definition: The year of publication should be provided.
status: valid
status modified: 2019-04-16
accepted date: 2019-04-16
in scheme: CDR QaQc Birds Directive Article 12 Reporting
error type: ERROR

Incoherent information.
type: Concept
notation: GB048
definition: Web-link and/or bibliographic reference should be provided.
status: valid
status modified: 2019-04-16
accepted date: 2019-04-16
in scheme: CDR QaQc Birds Directive Article 12 Reporting
error type: ERROR

Incoherent information.
type: Concept
notation: GB049
definition: Main contents of legal decision for introduction should be provided.
status: valid
status modified: 2019-04-16
accepted date: 2019-04-16
in scheme: CDR QaQc Birds Directive Article 12 Reporting
error type: ERROR

Incoherent information.
type: Concept
notation: GB050
definition: The date of consultation with the Commission should be provided.
status: valid
status modified: 2019-04-16
accepted date: 2019-04-16
in scheme: CDR QaQc Birds Directive Article 12 Reporting
error type: ERROR