AQD - Namespace
type: ConceptScheme
notation: namespace
is part of: aq
registration status: Public draft
user modified: gsellart
date modified: 2025-09-01 11:01:58.0
vocabulary type: Common
is numeric concept identifiers: false
is notations equal identifiers: false

AD.GovernAndorra.AQ
type: Concept
notation: AD.GovernAndorra.AQ
definition: Namespace for Andorra for reporting air quality information under Decision 2011/850/EC
status: valid
status modified: 2021-06-17
accepted date: 2021-06-17
in scheme: AQD - Namespace
surface area: 468
alternative label: test
in country: AD
longitude min: 0.4135781
longitude max: 2.7863837
latitude min: 41.4288238
latitude max: 43.6559357
population: 68403
area: 4.68
population difference: 684.03
area difference: 4.68

AL.AEF.AQ
type: Concept
notation: AL.AEF.AQ
definition: Namespace for Albania for reporting air quality information under Decision 2011/850/EC
status: valid
status modified: 2021-06-17
accepted date: 2021-06-17
in scheme: AQD - Namespace
surface area: 28748
in country: AL
longitude min: 18.30448612
longitude max: 22.02004032
latitude min: 38.62499767
latitude max: 43.68824738
population: 2886026
area: 50
population difference: 28860.26
area difference: 50

AR.AQD
type: Concept
notation: AR.AQD
definition: Namespace for Armenia for reporting air quality information under Decision 2011/850/EC
status: valid
status modified: 2021-06-17
accepted date: 2021-06-17
in scheme: AQD - Namespace
longitude min: 43.5827458
longitude max: 38.74120148
latitude min: 46.50571984
latitude max: 41.24812857

AT.0008.20.AQ
type: Concept
notation: AT.0008.20.AQ
definition: Namespace for Austria for reporting air quality information under Decision 2011/850/EC
status: valid
status modified: 2021-06-17
accepted date: 2021-06-17
in scheme: AQD - Namespace
surface area: 83858
in country: AT
longitude min: 8.479969517
longitude max: 17.97966678
latitude min: 45.43181733
latitude max: 50.03907421
population: 9158750
area: 50
population difference: 50000
area difference: 50

BA.EREP.AQD
type: Concept
notation: BA.EREP.AQD
definition: Namespace for Bosnia and Herzegovina for reporting air quality information under Decision 2011/850/EC
status: valid
status modified: 2021-06-17
accepted date: 2021-06-17
in scheme: AQD - Namespace
surface area: 51129
in country: BA
longitude min: 14.75002608
longitude max: 20.59976
latitude min: 41.65
latitude max: 46.23377676
population: 3964388
area: 50
population difference: 39643.88
area difference: 50

BE.CELINE-IRCEL.AQ
type: Concept
definition: Namespace for Belgium for reporting air quality information under Decision 2011/850/EC
status: valid
status modified: 2021-06-17
accepted date: 2021-06-17
in scheme: AQD - Namespace
surface area: 30688
in country: BE
longitude min: 1.513573032
longitude max: 7.156658156
latitude min: 48.52948355
latitude max: 52.47502371
population: 11311117
area: 50
population difference: 50000
area difference: 50

BG.BG-ExEA.AQ
type: Concept
notation: BG.BG-ExEA.AQ
definition: Namespace for Bulgaria for reporting air quality information under Decision 2011/850/EC
status: valid
status modified: 2021-06-17
accepted date: 2021-06-17
in scheme: AQD - Namespace
surface area: 110910
in country: BG
longitude min: 21.38052575
longitude max: 29.5580815
latitude min: 40.23448599
latitude max: 45.234923
population: 6447710
area: 50
population difference: 50000
area difference: 50

CH.BAFU.AQ
type: Concept
notation: CH.BAFU.AQ
definition: Namespace for Switzerland for reporting air quality information under Decision 2011/850/EC
status: valid
status modified: 2021-06-17
accepted date: 2021-06-17
in scheme: AQD - Namespace
surface area: 41290
in country: CH
longitude min: 5.9
longitude max: 10.44270145
latitude min: 45.77694774
latitude max: 47.83082754
population: 8327126
area: 50
population difference: 50000
area difference: 50

CY.DLI-MLSI.AQ
type: Concept
notation: CY.DLI-MLSI.AQ
definition: Namespace for Cyprus for reporting air quality information under Decision 2011/850/EC
status: valid
status modified: 2021-06-17
accepted date: 2021-06-17
in scheme: AQD - Namespace
surface area: 9248
in country: CY
longitude min: 31.25666711
longitude max: 35.00488081
latitude min: 33.57186941
latitude max: 36.1731247
population: 848319
area: 50
population difference: 8483.19
area difference: 50

CZ.CHMI-Prague-Komorany.AQ
type: Concept
notation: CZ.CHMI-Prague-Komorany.AQ
definition: Namespace for Czech Republic for reporting air quality information under Decision 2011/850/EC
status: valid
status modified: 2021-06-17
accepted date: 2021-06-17
in scheme: AQD - Namespace
surface area: 78866
in country: CZ
longitude min: 11.24011112
longitude max: 19.85314416
latitude min: 47.55530528
latitude max: 52.11726777
population: 10553843
area: 50
population difference: 50000
area difference: 50

de
type: Concept
notation: http://gdi.uba.de/arcgis/rest/services/inspire/DE.UBA.AQD
preferred label: http://gdi.uba.de/arcgis/rest/services/inspire/DE.UBA.AQD
status: valid
status modified: 2021-06-17
accepted date: 2021-06-17
in scheme: AQD - Namespace
surface area: 357021
alternative label: http://gdi.uba.de/arcgis/rest/services/inspire/DE.UBA.AQD
in country: DE
longitude min: 4.988658075
longitude max: 16.01699588
latitude min: 46.3024877
latitude max: 55.98310415
population: 82175684
area: 50
population difference: 50000
area difference: 50

DK.NERI.AQ
type: Concept
notation: DK.NERI.AQ
definition: Namespace for Denmark for reporting air quality information under Decision 2011/850/EC
status: valid
status modified: 2021-06-17
accepted date: 2021-06-17
in scheme: AQD - Namespace
surface area: 43094
in country: DK
longitude min: 8.089976841
longitude max: 12.69000614
latitude min: 54.54
latitude max: 57.73001659
population: 5961249
area: 50
population difference: 50000
area difference: 50

EE.EERC.AQ
type: Concept
notation: EE.EERC.AQ
definition: Namespace for Estonia for reporting air quality information under Decision 2011/850/EC
status: valid
status modified: 2021-06-17
accepted date: 2021-06-17
in scheme: AQD - Namespace
surface area: 45226
in country: EE
longitude min: 21.5
longitude max: 29.13169925
latitude min: 56.47452831
latitude max: 60.6110904
population: 1315944
area: 50
population difference: 13159.44
area difference: 50

ES.BDCA.AQD
type: Concept
notation: ES.BDCA.AQD
definition: Namespace for Spain for reporting air quality information under Decision 2011/850/EC
status: valid
status modified: 2021-06-17
accepted date: 2021-06-17
in scheme: AQD - Namespace
surface area: 505782
in country: ES
longitude min: -18.5
longitude max: 4.4
latitude min: 27.5
latitude max: 43.8
population: 46440099
area: 50
population difference: 50000
area difference: 50

FI.FMI.AQ
type: Concept
notation: FI.FMI.AQ
definition: Namespace for Finland for reporting air quality information under Decision 2011/850/EC
status: valid
status modified: 2021-06-17
accepted date: 2021-06-17
in scheme: AQD - Namespace
surface area: 338424
in country: FI
longitude min: 19.64559289
longitude max: 32.51609216
latitude min: 58.75
latitude max: 71.16419302
population: 5487308
area: 50
population difference: 50000
area difference: 50

FR.LCSQA-INERIS.AQ
type: Concept
notation: FR.LCSQA-INERIS.AQ
definition: Namespace for France for reporting air quality information under Decision 2011/850/EC
status: valid
status modified: 2021-06-17
accepted date: 2021-06-17
in scheme: AQD - Namespace
surface area: 640679
in country: FR
longitude min: -54.5247542
longitude max: 9.56001631
latitude min: -30.05338919
latitude max: 51.14850617
population: 66730453
area: 50
population difference: 50000
area difference: 50

gb
type: Concept
notation: http://environment.data.gov.uk/air-quality/so
preferred label: http://environment.data.gov.uk/air-quality/so
definition: Namespace for United Kingdom for reporting air quality information under Decision 2011/850/EC
status: valid
status modified: 2021-06-17
accepted date: 2021-06-17
in scheme: AQD - Namespace
surface area: 243610
alternative label: http://environment.data.gov.uk/air-quality/so
in country: GB
longitude min: -8
longitude max: 1.681530796
latitude min: 49.95999991
latitude max: 60.9
population: 65382556
area: 50
population difference: 50000
area difference: 50

GE.MEPA.AQ
type: Concept
notation: GE.MEPA.AQ
definition: Namespace for Georgia for reporting air quality information under Decision 2011/850/EC
status: valid
status modified: 2021-06-17
accepted date: 2021-06-17
in scheme: AQD - Namespace
in country: GE
longitude min: 38.95500858
longitude max: 47.63790816
latitude min: 40.06444469
latitude max: 44.55310415

gib.air-quality
type: Concept
notation: gib.air-quality
definition: Namespace for Gibraltar for reporting air quality information under Decision 2011/850/EC
status: valid
status modified: 2021-06-17
accepted date: 2021-06-17
in scheme: AQD - Namespace
surface area: 6.25
in country: GI
longitude min: -6.3941295
longitude max: -4.3141295
latitude min: 35.100807
latitude max: 37.180807
population: 33573
area: 0.0625
population difference: 335.73
area difference: 0.0625

GR.MINNENV.AQ
type: Concept
notation: GR.MINNENV.AQ
definition: Namespace for Greece for reporting air quality information under Decision 2011/850/EC
status: valid
status modified: 2021-06-17
accepted date: 2021-06-17
in scheme: AQD - Namespace
surface area: 131940
in country: GR
longitude min: 19.1500159
longitude max: 27.60419559
latitude min: 33.9199877
latitude max: 42.82690461
population: 10783748
area: 50
population difference: 50000
area difference: 50

aqd.azo.hr
type: Concept
notation: aqd.azo.hr
definition: Namespace for Croatia for reporting air quality information under Decision 2011/850/EC
status: valid
status modified: 2021-06-17
accepted date: 2021-06-17
in scheme: AQD - Namespace
surface area: 56542
in country: HR
longitude min: 12.65697554
longitude max: 20.3904757
latitude min: 41.47999136
latitude max: 47.50375092
population: 3861967
area: 50
population difference: 41906.69
area difference: 50

HU.OMSZ.AQ
type: Concept
notation: HU.OMSZ.AQ
definition: Namespace for Hungary for reporting air quality information under Decision 2011/850/EC
status: valid
status modified: 2021-06-17
accepted date: 2021-06-17
in scheme: AQD - Namespace
surface area: 93030
in country: HU
longitude min: 15.20229821
longitude max: 23.71053145
latitude min: 44.75948111
latitude max: 49.62385407
population: 9830485
area: 50
population difference: 50000
area difference: 50

ie
type: Concept
notation: http://erc.epa.ie/airquality/ipr
preferred label: http://erc.epa.ie/airquality/ipr
definition: Namespace for Ireland for reporting air quality information under Decision 2011/850/EC
status: valid
status modified: 2021-06-17
accepted date: 2021-06-17
in scheme: AQD - Namespace
surface area: 70280
alternative label: http://erc.epa.ie/airquality/ipr
in country: IE
longitude min: -10.97708574
longitude max: -5.032985399
latitude min: 50.66930126
latitude max: 56.13162222
population: 4234925
area: 50
population difference: 42349.25
area difference: 50

IS.EA-Iceland.AQ
type: Concept
notation: IS.EA-Iceland.AQ
definition: Namespace for Iceland for reporting air quality information under Decision 2011/850/EC
status: valid
status modified: 2021-06-17
accepted date: 2021-06-17
in scheme: AQD - Namespace
surface area: 103001
in country: IS
longitude min: -25.32618405
longitude max: -12.60973223
latitude min: 62.49638296
latitude max: 67.5267923
population: 368792
area: 50
population difference: 3680
area difference: 50

IT.ISPRA.AQD
type: Concept
notation: IT.ISPRA.AQD
definition: Namespace for Italy for reporting air quality information under Decision 2011/850/EC
status: valid
status modified: 2021-06-17
accepted date: 2021-06-17
in scheme: AQD - Namespace
surface area: 301230
in country: IT
longitude min: 5.749955275
longitude max: 19.48024702
latitude min: 35.4937
latitude max: 48.11539317
population: 60665551
area: 50
population difference: 50000
area difference: 50

KG.NAMESPACE.AQ
type: Concept
notation: KG.NAMESPACE.AQ
definition: TEST namespace
status: valid
status modified: 2021-06-17
accepted date: 2021-06-17
in scheme: AQD - Namespace

LT.LT-EPA.AQ
type: Concept
notation: LT.LT-EPA.AQ
definition: Namespace for Lithuania for reporting air quality information under Decision 2011/850/EC
status: valid
status modified: 2021-06-17
accepted date: 2021-06-17
in scheme: AQD - Namespace
surface area: 65200
in country: LT
longitude min: 20.05580041
longitude max: 27.58827925
latitude min: 52.90570222
latitude max: 57.37252839
population: 2888558
area: 50
population difference: 28885.58
area difference: 50

LU.AdmEnv_AirBruit.AQ
type: Concept
notation: LU.AdmEnv_AirBruit.AQ
definition: Namespace for Luxembourg for reporting air quality information under Decision 2011/850/EC - Population updated 2021
status: valid
status modified: 2025-08-21
accepted date: 2025-08-21
in scheme: AQD - Namespace
surface area: 2586
in country: LU
longitude min: 5.674051955
longitude max: 6.53
latitude min: 49.44266714
latitude max: 50.12805166
population: 672050
area: 25.86
population difference: 26653
area difference: 25.86

LV.LEGMC.AQ
type: Concept
notation: LV.LEGMC.AQ
definition: Namespace for Latvia for reporting air quality information under Decision 2011/850/EC
status: valid
status modified: 2021-06-17
accepted date: 2021-06-17
in scheme: AQD - Namespace
surface area: 64589
in country: LV
longitude min: 20.05580041
longitude max: 29.17670943
latitude min: 54.61510692
latitude max: 58.97015697
population: 1968957
area: 50
population difference: 19689.57
area difference: 50

MD.AQD
type: Concept
notation: MD.AQD
definition: Namespace for Republic of Moldova for reporting air quality information under Decision 2011/850/EC
status: valid
status modified: 2021-06-17
accepted date: 2021-06-17
in scheme: AQD - Namespace
longitude min: 26.61933679
longitude max: 45.48828319
latitude min: 30.02465864
latitude max: 48.46711945

ME.EPA-ME.AQ
type: Concept
notation: ME.EPA-ME.AQ
definition: Namespace for Montenegro for reporting air quality information under Decision 2011/850/EC
status: valid
status modified: 2021-06-17
accepted date: 2021-06-17
in scheme: AQD - Namespace
surface area: 13812
in country: ME
longitude min: 17.45
longitude max: 21.3398
latitude min: 40.87755
latitude max: 44.52384
population: 622218
area: 50
population difference: 6222.18
area difference: 50

MK.MinEPP.AQ
type: Concept
notation: MK.MinEPP.AQ
definition: Namespace for Macedonia for reporting air quality information under Decision 2011/850/EC
status: valid
status modified: 2021-06-17
accepted date: 2021-06-17
in scheme: AQD - Namespace
surface area: 25713
in country: MK
longitude min: 19.46315
longitude max: 23.95237715
latitude min: 39.84272696
latitude max: 43.32025951
population: 2103721
area: 50
population difference: 21037.21
area difference: 50

MT.ERA.AQ
type: Concept
notation: MT.ERA.AQ
definition: Namespace for Malta for reporting air quality information under Decision 2011/850/EC
status: valid
status modified: 2021-06-17
accepted date: 2021-06-17
in scheme: AQD - Namespace
surface area: 316
preferred label: MT.MEPA.AQ
in country: MT
longitude min: 12.9324226
longitude max: 15.8267966
latitude min: 34.6029696
latitude max: 37.2852706
population: 519562
area: 3.16
population difference: 5195.62
area difference: 3.16

NL.RIVM.AQ
type: Concept
notation: NL.RIVM.AQ
definition: Namespace for Netherlands for reporting air quality information under Decision 2011/850/EC
status: valid
status modified: 2021-06-17
accepted date: 2021-06-17
in scheme: AQD - Namespace
surface area: 41526
in country: NL
longitude min: 2.314971144
longitude max: 8.092053257
latitude min: 49.80372102
latitude max: 54.51040335
population: 17811291
area: 50
population difference: 50000
area difference: 50

NO.NILU.AQD
type: Concept
notation: NO.NILU.AQD
definition: Namespace for Norway for reporting air quality information under Decision 2011/850/EC
status: valid
status modified: 2021-06-17
accepted date: 2021-06-17
in scheme: AQD - Namespace
surface area: 385252
in country: NO
longitude min: 3.992078078
longitude max: 32.29341841
latitude min: 57.07888418
latitude max: 81.65714427
population: 5210721
area: 50
population difference: 50000
area difference: 50

PL.CIEP.AQ
type: Concept
notation: PL.CIEP.AQ, mos.gov.pl
definition: Namespaces for Poland for reporting air quality information under Decision 2011/850/EC
status: valid
status modified: 2021-06-17
accepted date: 2021-06-17
in scheme: AQD - Namespace
surface area: 312685
in country: PL
longitude min: 13.07452111
longitude max: 25.02998579
latitude min: 48.02739533
latitude max: 55.85153596
population: 37967209
area: 50
population difference: 50000
area difference: 50

PT.APA.AQ
type: Concept
notation: PT.APA.AQ
definition: Namespace for Portugal for reporting air quality information under Decision 2011/850/EC
status: valid
status modified: 2021-06-17
accepted date: 2021-06-17
in scheme: AQD - Namespace
surface area: 92391
in country: PT
longitude min: -29
longitude max: -6.389087694
latitude min: 32
latitude max: 42.28046866
population: 10341330
area: 50
population difference: 50000
area difference: 50

RO.ANPM.AQ
type: Concept
notation: RO.ANPM.AQ
definition: Namespace for Romania for reporting air quality information under Decision 2011/850/EC
status: valid
status modified: 2021-06-17
accepted date: 2021-06-17
in scheme: AQD - Namespace
surface area: 238391
in country: RO
longitude min: 19.2201925
longitude max: 30.62654341
latitude min: 42.68844473
latitude max: 49.22088125
population: 19760314
area: 50
population difference: 50000
area difference: 50

RS.SEPA.AQ
type: Concept
notation: RS.SEPA.AQ
definition: Namespace for Serbia for reporting air quality information under Decision 2011/850/EC
status: valid
status modified: 2021-06-17
accepted date: 2021-06-17
in scheme: AQD - Namespace
surface area: 88361
in country: RS
longitude min: 17.82982
longitude max: 23.98601851
latitude min: 41.2452244
latitude max: 47.17172984
population: 7076372
area: 50
population difference: 50000
area difference: 50

SE.NV.AQ
type: Concept
notation: SE.NV.AQ
definition: Namespace for Sweden for reporting air quality information under Decision 2011/850/EC
status: valid
status modified: 2021-06-17
accepted date: 2021-06-17
in scheme: AQD - Namespace
surface area: 447435
in country: SE
longitude min: 11.02736861
longitude max: 24.15
latitude min: 55.36173737
latitude max: 69.10624726
population: 10379295
area: 50
population difference: 50000
area difference: 50

SI.ARSO.AQ
type: Concept
notation: SI.ARSO.AQ
definition: Namespace for Slovenia for reporting air quality information under Decision 2011/850/EC
status: valid
status modified: 2021-06-17
accepted date: 2021-06-17
in scheme: AQD - Namespace
surface area: 20273
in country: SI
longitude min: 13.36
longitude max: 16.56480838
latitude min: 45.45231639
latitude max: 46.85238597
population: 2064188
area: 50
population difference: 20641.88
area difference: 50

SK.SHMU.AQ
type: Concept
notation: SK.SHMU.AQ
definition: Namespace for Slovakia for reporting air quality information under Decision 2011/850/EC
status: valid
status modified: 2021-06-17
accepted date: 2021-06-17
in scheme: AQD - Namespace
surface area: 48845
in country: SK
longitude min: 15.87998294
longitude max: 23.55813765
latitude min: 46.75842886
latitude max: 50.571574
population: 5426252
area: 50
population difference: 50000
area difference: 50

TR.UHKIA.AQD
type: Concept
notation: TR.UHKIA.AQD
status: valid
status modified: 2021-06-17
accepted date: 2021-06-17
in scheme: AQD - Namespace
surface area: 783562
in country: TR
longitude min: 25.04335127
longitude max: 45.7939897
latitude min: 34.82153474
latitude max: 43.14148489
population: 78741053
area: 50
population difference: 50000
area difference: 50

UA.AQD
type: Concept
notation: UA.AQD
definition: Namespace for Ukraine for reporting air quality information under Decision 2011/850/EC
status: valid
status modified: 2021-06-17
accepted date: 2021-06-17
in scheme: AQD - Namespace
longitude min: 22.137059
longitude max: 40.2275801
latitude min: 44.184598
latitude max: 52.3791473

XK.EPA-HI-KOSOVO.AQ
type: Concept
notation: XK.EPA-HI-KOSOVO.AQ
definition: Namespace for Kosovo for reporting air quality information under Decision 2011/850/EC
status: valid
status modified: 2021-06-17
accepted date: 2021-06-17
in scheme: AQD - Namespace
in country: XK
longitude min: 19.038041
longitude max: 22.738977
latitude min: 40.870657
latitude max: 44.290976