Criteria for determining the minimum number of sampling points for fixed measurement for ozone when supplementary methods like modelling is used (according to Article 10)
type: ConceptScheme
notation: art10_O3_Model_minimum_spo
is part of: aq
registration status: Public draft
user modified: targajau
date modified: 2024-04-23 08:10:01.0
vocabulary type: Common
is numeric concept identifiers: true
is notations equal identifiers: true

Min requirement O3 with sup. area 0 to 50k and Pop 0 to 2 million
type: Concept
notation: 1
definition: Min requirement O3 with sup. area 0 to 50k and Pop 0 to 2 million
status: valid
status modified: 2024-04-17
accepted date: 2024-04-17
in scheme: Criteria for determining the minimum number of sampling points for fixed measurement for ozone when supplementary methods like modelling is used (according to Article 10)
related pollutant: http://dd.eionet.europa.eu/vocabulary/aq/pollutant/7
minimum population: 0
maximum population: 2000000
minimum SPO: 1
minimum area: 0
maximum area: 50000

Min requirement O3 with sup. area 0 to 50000 and Pop 18000001 to 20000000.
type: Concept
notation: 10
definition: Min requirement O3 with sup. area 0 to 50000 and Pop 18000001 to 20000000.
status: valid
status modified: 2024-04-17
accepted date: 2024-04-17
in scheme: Criteria for determining the minimum number of sampling points for fixed measurement for ozone when supplementary methods like modelling is used (according to Article 10)
related pollutant: http://dd.eionet.europa.eu/vocabulary/aq/pollutant/7
minimum population: 18000001
maximum population: 20000000
minimum SPO: 10
minimum area: 0
maximum area: 50000

Min requirement O3 with sup. area 450001 to 500000 and Pop 0 to 2000000.
type: Concept
notation: 100
definition: Min requirement O3 with sup. area 450001 to 500000 and Pop 0 to 2000000.
status: valid
status modified: 2024-04-17
accepted date: 2024-04-17
in scheme: Criteria for determining the minimum number of sampling points for fixed measurement for ozone when supplementary methods like modelling is used (according to Article 10)
related pollutant: http://dd.eionet.europa.eu/vocabulary/aq/pollutant/7
minimum population: 0
maximum population: 2000000
minimum SPO: 10
minimum area: 450001
maximum area: 500000

Min requirement O3 with sup. area 450001 to 500000 and Pop 2000001 to 4000000.
type: Concept
notation: 101
definition: Min requirement O3 with sup. area 450001 to 500000 and Pop 2000001 to 4000000.
status: valid
status modified: 2024-04-17
accepted date: 2024-04-17
in scheme: Criteria for determining the minimum number of sampling points for fixed measurement for ozone when supplementary methods like modelling is used (according to Article 10)
related pollutant: http://dd.eionet.europa.eu/vocabulary/aq/pollutant/7
minimum population: 2000001
maximum population: 4000000
minimum SPO: 10
minimum area: 450001
maximum area: 500000

Min requirement O3 with sup. area 450001 to 500000 and Pop 4000001 to 6000000.
type: Concept
notation: 102
definition: Min requirement O3 with sup. area 450001 to 500000 and Pop 4000001 to 6000000.
status: valid
status modified: 2024-04-17
accepted date: 2024-04-17
in scheme: Criteria for determining the minimum number of sampling points for fixed measurement for ozone when supplementary methods like modelling is used (according to Article 10)
related pollutant: http://dd.eionet.europa.eu/vocabulary/aq/pollutant/7
minimum population: 4000001
maximum population: 6000000
minimum SPO: 10
minimum area: 450001
maximum area: 500000

Min requirement O3 with sup. area 450001 to 500000 and Pop 6000001 to 8000000.
type: Concept
notation: 103
definition: Min requirement O3 with sup. area 450001 to 500000 and Pop 6000001 to 8000000.
status: valid
status modified: 2024-04-17
accepted date: 2024-04-17
in scheme: Criteria for determining the minimum number of sampling points for fixed measurement for ozone when supplementary methods like modelling is used (according to Article 10)
related pollutant: http://dd.eionet.europa.eu/vocabulary/aq/pollutant/7
minimum population: 6000001
maximum population: 8000000
minimum SPO: 10
minimum area: 450001
maximum area: 500000

Min requirement O3 with sup. area 450001 to 500000 and Pop 8000001 to 10000000.
type: Concept
notation: 104
definition: Min requirement O3 with sup. area 450001 to 500000 and Pop 8000001 to 10000000.
status: valid
status modified: 2024-04-17
accepted date: 2024-04-17
in scheme: Criteria for determining the minimum number of sampling points for fixed measurement for ozone when supplementary methods like modelling is used (according to Article 10)
related pollutant: http://dd.eionet.europa.eu/vocabulary/aq/pollutant/7
minimum population: 8000001
maximum population: 10000000
minimum SPO: 10
minimum area: 450001
maximum area: 500000

Min requirement O3 with sup. area 450001 to 500000 and Pop 10000001 to 12000000.
type: Concept
notation: 105
definition: Min requirement O3 with sup. area 450001 to 500000 and Pop 10000001 to 12000000.
status: valid
status modified: 2024-04-17
accepted date: 2024-04-17
in scheme: Criteria for determining the minimum number of sampling points for fixed measurement for ozone when supplementary methods like modelling is used (according to Article 10)
related pollutant: http://dd.eionet.europa.eu/vocabulary/aq/pollutant/7
minimum population: 10000001
maximum population: 12000000
minimum SPO: 10
minimum area: 450001
maximum area: 500000

Min requirement O3 with sup. area 450001 to 500000 and Pop 12000001 to 14000000.
type: Concept
notation: 106
definition: Min requirement O3 with sup. area 450001 to 500000 and Pop 12000001 to 14000000.
status: valid
status modified: 2024-04-17
accepted date: 2024-04-17
in scheme: Criteria for determining the minimum number of sampling points for fixed measurement for ozone when supplementary methods like modelling is used (according to Article 10)
related pollutant: http://dd.eionet.europa.eu/vocabulary/aq/pollutant/7
minimum population: 12000001
maximum population: 14000000
minimum SPO: 10
minimum area: 450001
maximum area: 500000

Min requirement O3 with sup. area 450001 to 500000 and Pop 14000001 to 16000000.
type: Concept
notation: 107
definition: Min requirement O3 with sup. area 450001 to 500000 and Pop 14000001 to 16000000.
status: valid
status modified: 2024-04-17
accepted date: 2024-04-17
in scheme: Criteria for determining the minimum number of sampling points for fixed measurement for ozone when supplementary methods like modelling is used (according to Article 10)
related pollutant: http://dd.eionet.europa.eu/vocabulary/aq/pollutant/7
minimum population: 14000001
maximum population: 16000000
minimum SPO: 10
minimum area: 450001
maximum area: 500000

Min requirement O3 with sup. area 450001 to 500000 and Pop 16000001 to 18000000.
type: Concept
notation: 108
definition: Min requirement O3 with sup. area 450001 to 500000 and Pop 16000001 to 18000000.
status: valid
status modified: 2024-04-17
accepted date: 2024-04-17
in scheme: Criteria for determining the minimum number of sampling points for fixed measurement for ozone when supplementary methods like modelling is used (according to Article 10)
related pollutant: http://dd.eionet.europa.eu/vocabulary/aq/pollutant/7
minimum population: 16000001
maximum population: 18000000
minimum SPO: 10
minimum area: 450001
maximum area: 500000

Min requirement O3 with sup. area 450001 to 500000 and Pop 18000001 to 20000000.
type: Concept
notation: 109
definition: Min requirement O3 with sup. area 450001 to 500000 and Pop 18000001 to 20000000.
status: valid
status modified: 2024-04-17
accepted date: 2024-04-17
in scheme: Criteria for determining the minimum number of sampling points for fixed measurement for ozone when supplementary methods like modelling is used (according to Article 10)
related pollutant: http://dd.eionet.europa.eu/vocabulary/aq/pollutant/7
minimum population: 18000001
maximum population: 20000000
minimum SPO: 10
minimum area: 450001
maximum area: 500000

Min requirement O3 with sup. area 0 to 50000 and Pop 20000001 to 22000000.
type: Concept
notation: 11
definition: Min requirement O3 with sup. area 0 to 50000 and Pop 20000001 to 22000000.
status: valid
status modified: 2024-04-17
accepted date: 2024-04-17
in scheme: Criteria for determining the minimum number of sampling points for fixed measurement for ozone when supplementary methods like modelling is used (according to Article 10)
related pollutant: http://dd.eionet.europa.eu/vocabulary/aq/pollutant/7
minimum population: 20000001
maximum population: 22000000
minimum SPO: 11
minimum area: 0
maximum area: 50000

Min requirement O3 with sup. area 450001 to 500000 and Pop 20000001 to 22000000.
type: Concept
notation: 110
definition: Min requirement O3 with sup. area 450001 to 500000 and Pop 20000001 to 22000000.
status: valid
status modified: 2024-04-17
accepted date: 2024-04-17
in scheme: Criteria for determining the minimum number of sampling points for fixed measurement for ozone when supplementary methods like modelling is used (according to Article 10)
related pollutant: http://dd.eionet.europa.eu/vocabulary/aq/pollutant/7
minimum population: 20000001
maximum population: 22000000
minimum SPO: 11
minimum area: 450001
maximum area: 500000

Min requirement O3 with sup. area 500001 to 550000 and Pop 0 to 2000000.
type: Concept
notation: 111
definition: Min requirement O3 with sup. area 500001 to 550000 and Pop 0 to 2000000.
status: valid
status modified: 2024-04-17
accepted date: 2024-04-17
in scheme: Criteria for determining the minimum number of sampling points for fixed measurement for ozone when supplementary methods like modelling is used (according to Article 10)
related pollutant: http://dd.eionet.europa.eu/vocabulary/aq/pollutant/7
minimum population: 0
maximum population: 2000000
minimum SPO: 11
minimum area: 500001
maximum area: 550000

Min requirement O3 with sup. area 500001 to 550000 and Pop 2000001 to 4000000.
type: Concept
notation: 112
definition: Min requirement O3 with sup. area 500001 to 550000 and Pop 2000001 to 4000000.
status: valid
status modified: 2024-04-17
accepted date: 2024-04-17
in scheme: Criteria for determining the minimum number of sampling points for fixed measurement for ozone when supplementary methods like modelling is used (according to Article 10)
related pollutant: http://dd.eionet.europa.eu/vocabulary/aq/pollutant/7
minimum population: 2000001
maximum population: 4000000
minimum SPO: 11
minimum area: 500001
maximum area: 550000

Min requirement O3 with sup. area 500001 to 550000 and Pop 4000001 to 6000000.
type: Concept
notation: 113
definition: Min requirement O3 with sup. area 500001 to 550000 and Pop 4000001 to 6000000.
status: valid
status modified: 2024-04-17
accepted date: 2024-04-17
in scheme: Criteria for determining the minimum number of sampling points for fixed measurement for ozone when supplementary methods like modelling is used (according to Article 10)
related pollutant: http://dd.eionet.europa.eu/vocabulary/aq/pollutant/7
minimum population: 4000001
maximum population: 6000000
minimum SPO: 11
minimum area: 500001
maximum area: 550000

Min requirement O3 with sup. area 500001 to 550000 and Pop 6000001 to 8000000.
type: Concept
notation: 114
definition: Min requirement O3 with sup. area 500001 to 550000 and Pop 6000001 to 8000000.
status: valid
status modified: 2024-04-17
accepted date: 2024-04-17
in scheme: Criteria for determining the minimum number of sampling points for fixed measurement for ozone when supplementary methods like modelling is used (according to Article 10)
related pollutant: http://dd.eionet.europa.eu/vocabulary/aq/pollutant/7
minimum population: 6000001
maximum population: 8000000
minimum SPO: 11
minimum area: 500001
maximum area: 550000

Min requirement O3 with sup. area 500001 to 550000 and Pop 8000001 to 10000000.
type: Concept
notation: 115
definition: Min requirement O3 with sup. area 500001 to 550000 and Pop 8000001 to 10000000.
status: valid
status modified: 2024-04-17
accepted date: 2024-04-17
in scheme: Criteria for determining the minimum number of sampling points for fixed measurement for ozone when supplementary methods like modelling is used (according to Article 10)
related pollutant: http://dd.eionet.europa.eu/vocabulary/aq/pollutant/7
minimum population: 8000001
maximum population: 10000000
minimum SPO: 11
minimum area: 500001
maximum area: 550000

Min requirement O3 with sup. area 500001 to 550000 and Pop 10000001 to 12000000.
type: Concept
notation: 116
definition: Min requirement O3 with sup. area 500001 to 550000 and Pop 10000001 to 12000000.
status: valid
status modified: 2024-04-17
accepted date: 2024-04-17
in scheme: Criteria for determining the minimum number of sampling points for fixed measurement for ozone when supplementary methods like modelling is used (according to Article 10)
related pollutant: http://dd.eionet.europa.eu/vocabulary/aq/pollutant/7
minimum population: 10000001
maximum population: 12000000
minimum SPO: 11
minimum area: 500001
maximum area: 550000

Min requirement O3 with sup. area 500001 to 550000 and Pop 12000001 to 14000000.
type: Concept
notation: 117
definition: Min requirement O3 with sup. area 500001 to 550000 and Pop 12000001 to 14000000.
status: valid
status modified: 2024-04-17
accepted date: 2024-04-17
in scheme: Criteria for determining the minimum number of sampling points for fixed measurement for ozone when supplementary methods like modelling is used (according to Article 10)
related pollutant: http://dd.eionet.europa.eu/vocabulary/aq/pollutant/7
minimum population: 12000001
maximum population: 14000000
minimum SPO: 11
minimum area: 500001
maximum area: 550000

Min requirement O3 with sup. area 500001 to 550000 and Pop 14000001 to 16000000.
type: Concept
notation: 118
definition: Min requirement O3 with sup. area 500001 to 550000 and Pop 14000001 to 16000000.
status: valid
status modified: 2024-04-17
accepted date: 2024-04-17
in scheme: Criteria for determining the minimum number of sampling points for fixed measurement for ozone when supplementary methods like modelling is used (according to Article 10)
related pollutant: http://dd.eionet.europa.eu/vocabulary/aq/pollutant/7
minimum population: 14000001
maximum population: 16000000
minimum SPO: 11
minimum area: 500001
maximum area: 550000

Min requirement O3 with sup. area 500001 to 550000 and Pop 16000001 to 18000000.
type: Concept
notation: 119
definition: Min requirement O3 with sup. area 500001 to 550000 and Pop 16000001 to 18000000.
status: valid
status modified: 2024-04-17
accepted date: 2024-04-17
in scheme: Criteria for determining the minimum number of sampling points for fixed measurement for ozone when supplementary methods like modelling is used (according to Article 10)
related pollutant: http://dd.eionet.europa.eu/vocabulary/aq/pollutant/7
minimum population: 16000001
maximum population: 18000000
minimum SPO: 11
minimum area: 500001
maximum area: 550000

Min requirement O3 with sup. area 50001 to 100000 and Pop 0 to 2000000.
type: Concept
notation: 12
definition: Min requirement O3 with sup. area 50001 to 100000 and Pop 0 to 2000000.
status: valid
status modified: 2024-04-17
accepted date: 2024-04-17
in scheme: Criteria for determining the minimum number of sampling points for fixed measurement for ozone when supplementary methods like modelling is used (according to Article 10)
related pollutant: http://dd.eionet.europa.eu/vocabulary/aq/pollutant/7
minimum population: 0
maximum population: 2000000
minimum SPO: 2
minimum area: 50001
maximum area: 100000

Min requirement O3 with sup. area 500001 to 550000 and Pop 18000001 to 20000000.
type: Concept
notation: 120
definition: Min requirement O3 with sup. area 500001 to 550000 and Pop 18000001 to 20000000.
status: valid
status modified: 2024-04-17
accepted date: 2024-04-17
in scheme: Criteria for determining the minimum number of sampling points for fixed measurement for ozone when supplementary methods like modelling is used (according to Article 10)
related pollutant: http://dd.eionet.europa.eu/vocabulary/aq/pollutant/7
minimum population: 18000001
maximum population: 20000000
minimum SPO: 11
minimum area: 500001
maximum area: 550000

Min requirement O3 with sup. area 500001 to 550000 and Pop 20000001 to 22000000.
type: Concept
notation: 121
definition: Min requirement O3 with sup. area 500001 to 550000 and Pop 20000001 to 22000000.
status: valid
status modified: 2024-04-17
accepted date: 2024-04-17
in scheme: Criteria for determining the minimum number of sampling points for fixed measurement for ozone when supplementary methods like modelling is used (according to Article 10)
related pollutant: http://dd.eionet.europa.eu/vocabulary/aq/pollutant/7
minimum population: 20000001
maximum population: 22000000
minimum SPO: 11
minimum area: 500001
maximum area: 550000

Min requirement O3 with sup. area 550001 to 600000 and Pop 0 to 22000000.
type: Concept
notation: 122
definition: Min requirement O3 with sup. area 550001 to 600000 and Pop 0 to 22000000.
status: valid
status modified: 2024-04-17
accepted date: 2024-04-17
in scheme: Criteria for determining the minimum number of sampling points for fixed measurement for ozone when supplementary methods like modelling is used (according to Article 10)
related pollutant: http://dd.eionet.europa.eu/vocabulary/aq/pollutant/7
minimum population: 0
maximum population: 22000000
minimum SPO: 12
minimum area: 550001
maximum area: 600000

Min requirement O3 with sup. area 600001 to 650000 and Pop 0 to 22000000.
type: Concept
notation: 123
definition: Min requirement O3 with sup. area 600001 to 650000 and Pop 0 to 22000000.
status: valid
status modified: 2024-04-17
accepted date: 2024-04-17
in scheme: Criteria for determining the minimum number of sampling points for fixed measurement for ozone when supplementary methods like modelling is used (according to Article 10)
related pollutant: http://dd.eionet.europa.eu/vocabulary/aq/pollutant/7
minimum population: 0
maximum population: 22000000
minimum SPO: 13
minimum area: 600001
maximum area: 650000

Min requirement O3 with sup. area 650001 to 700000 and Pop 0 to 22000000.
type: Concept
notation: 124
definition: Min requirement O3 with sup. area 650001 to 700000 and Pop 0 to 22000000.
status: valid
status modified: 2024-04-17
accepted date: 2024-04-17
in scheme: Criteria for determining the minimum number of sampling points for fixed measurement for ozone when supplementary methods like modelling is used (according to Article 10)
related pollutant: http://dd.eionet.europa.eu/vocabulary/aq/pollutant/7
minimum population: 0
maximum population: 22000000
minimum SPO: 14
minimum area: 650001
maximum area: 700000

Min requirement O3 with sup. area 700001 to 750000 and Pop 0 to 22000000.
type: Concept
notation: 125
definition: Min requirement O3 with sup. area 700001 to 750000 and Pop 0 to 22000000.
status: valid
status modified: 2024-04-17
accepted date: 2024-04-17
in scheme: Criteria for determining the minimum number of sampling points for fixed measurement for ozone when supplementary methods like modelling is used (according to Article 10)
related pollutant: http://dd.eionet.europa.eu/vocabulary/aq/pollutant/7
minimum population: 0
maximum population: 22000000
minimum SPO: 15
minimum area: 700001
maximum area: 750000

Min requirement O3 with sup. area 750001 to 800000 and Pop 0 to 22000000.
type: Concept
notation: 126
definition: Min requirement O3 with sup. area 750001 to 800000 and Pop 0 to 22000000.
status: valid
status modified: 2024-04-17
accepted date: 2024-04-17
in scheme: Criteria for determining the minimum number of sampling points for fixed measurement for ozone when supplementary methods like modelling is used (according to Article 10)
related pollutant: http://dd.eionet.europa.eu/vocabulary/aq/pollutant/7
minimum population: 0
maximum population: 22000000
minimum SPO: 16
minimum area: 750001
maximum area: 800000

Min requirement O3 with sup. area 800001 to 850000 and Pop 0 to 22000000.
type: Concept
notation: 127
definition: Min requirement O3 with sup. area 800001 to 850000 and Pop 0 to 22000000.
status: valid
status modified: 2024-04-17
accepted date: 2024-04-17
in scheme: Criteria for determining the minimum number of sampling points for fixed measurement for ozone when supplementary methods like modelling is used (according to Article 10)
related pollutant: http://dd.eionet.europa.eu/vocabulary/aq/pollutant/7
minimum population: 0
maximum population: 22000000
minimum SPO: 17
minimum area: 800001
maximum area: 850000

Min requirement O3 with sup. area 850001 to 900000 and Pop 0 to 22000000.
type: Concept
notation: 128
definition: Min requirement O3 with sup. area 850001 to 900000 and Pop 0 to 22000000.
status: valid
status modified: 2024-04-17
accepted date: 2024-04-17
in scheme: Criteria for determining the minimum number of sampling points for fixed measurement for ozone when supplementary methods like modelling is used (according to Article 10)
related pollutant: http://dd.eionet.europa.eu/vocabulary/aq/pollutant/7
minimum population: 0
maximum population: 22000000
minimum SPO: 18
minimum area: 850001
maximum area: 900000

Min requirement O3 with sup. area 900001 to 950000 and Pop 0 to 22000000.
type: Concept
notation: 129
definition: Min requirement O3 with sup. area 900001 to 950000 and Pop 0 to 22000000.
status: valid
status modified: 2024-04-17
accepted date: 2024-04-17
in scheme: Criteria for determining the minimum number of sampling points for fixed measurement for ozone when supplementary methods like modelling is used (according to Article 10)
related pollutant: http://dd.eionet.europa.eu/vocabulary/aq/pollutant/7
minimum population: 0
maximum population: 22000000
minimum SPO: 19
minimum area: 900001
maximum area: 950000

Min requirement O3 with sup. area 50001 to 100000 and Pop 2000001 to 4000000.
type: Concept
notation: 13
definition: Min requirement O3 with sup. area 50001 to 100000 and Pop 2000001 to 4000000.
status: valid
status modified: 2024-04-17
accepted date: 2024-04-17
in scheme: Criteria for determining the minimum number of sampling points for fixed measurement for ozone when supplementary methods like modelling is used (according to Article 10)
related pollutant: http://dd.eionet.europa.eu/vocabulary/aq/pollutant/7
minimum population: 2000001
maximum population: 4000000
minimum SPO: 2
minimum area: 50001
maximum area: 100000

Min requirement O3 with sup. area 950001 to 1000000 and Pop 0 to 22000000.
type: Concept
notation: 130
definition: Min requirement O3 with sup. area 950001 to 1000000 and Pop 0 to 22000000.
status: valid
status modified: 2024-04-17
accepted date: 2024-04-17
in scheme: Criteria for determining the minimum number of sampling points for fixed measurement for ozone when supplementary methods like modelling is used (according to Article 10)
related pollutant: http://dd.eionet.europa.eu/vocabulary/aq/pollutant/7
minimum population: 0
maximum population: 22000000
minimum SPO: 20
minimum area: 950001
maximum area: 1000000

Min requirement O3 with sup. area 1000001 to 1050000 and Pop 0 to 22000000.
type: Concept
notation: 131
definition: Min requirement O3 with sup. area 1000001 to 1050000 and Pop 0 to 22000000.
status: valid
status modified: 2024-04-17
accepted date: 2024-04-17
in scheme: Criteria for determining the minimum number of sampling points for fixed measurement for ozone when supplementary methods like modelling is used (according to Article 10)
related pollutant: http://dd.eionet.europa.eu/vocabulary/aq/pollutant/7
minimum population: 0
maximum population: 22000000
minimum SPO: 21
minimum area: 1000001
maximum area: 1050000

Min requirement O3 with sup. area 1050001 to 1100000 and Pop 0 to 22000000.
type: Concept
notation: 132
definition: Min requirement O3 with sup. area 1050001 to 1100000 and Pop 0 to 22000000.
status: valid
status modified: 2024-04-17
accepted date: 2024-04-17
in scheme: Criteria for determining the minimum number of sampling points for fixed measurement for ozone when supplementary methods like modelling is used (according to Article 10)
related pollutant: http://dd.eionet.europa.eu/vocabulary/aq/pollutant/7
minimum population: 0
maximum population: 22000000
minimum SPO: 22
minimum area: 1050001
maximum area: 1100000

Min requirement O3 with sup. area 1100001 to 1150000 and Pop 0 to 22000000.
type: Concept
notation: 133
definition: Min requirement O3 with sup. area 1100001 to 1150000 and Pop 0 to 22000000.
status: valid
status modified: 2024-04-17
accepted date: 2024-04-17
in scheme: Criteria for determining the minimum number of sampling points for fixed measurement for ozone when supplementary methods like modelling is used (according to Article 10)
related pollutant: http://dd.eionet.europa.eu/vocabulary/aq/pollutant/7
minimum population: 0
maximum population: 22000000
minimum SPO: 23
minimum area: 1100001
maximum area: 1150000

Min requirement O3 with sup. area 1150001 to 1200000 and Pop 0 to 22000000.
type: Concept
notation: 134
definition: Min requirement O3 with sup. area 1150001 to 1200000 and Pop 0 to 22000000.
status: valid
status modified: 2024-04-17
accepted date: 2024-04-17
in scheme: Criteria for determining the minimum number of sampling points for fixed measurement for ozone when supplementary methods like modelling is used (according to Article 10)
related pollutant: http://dd.eionet.europa.eu/vocabulary/aq/pollutant/7
minimum population: 0
maximum population: 22000000
minimum SPO: 24
minimum area: 1150001
maximum area: 1200000

Min requirement O3 with sup. area 1200001 to 1250000 and Pop 0 to 22000000.
type: Concept
notation: 135
definition: Min requirement O3 with sup. area 1200001 to 1250000 and Pop 0 to 22000000.
status: valid
status modified: 2024-04-17
accepted date: 2024-04-17
in scheme: Criteria for determining the minimum number of sampling points for fixed measurement for ozone when supplementary methods like modelling is used (according to Article 10)
related pollutant: http://dd.eionet.europa.eu/vocabulary/aq/pollutant/7
minimum population: 0
maximum population: 22000000
minimum SPO: 25
minimum area: 1200001
maximum area: 1250000

Min requirement O3 with sup. area 1250001 to 1300000 and Pop 0 to 22000000.
type: Concept
notation: 136
definition: Min requirement O3 with sup. area 1250001 to 1300000 and Pop 0 to 22000000.
status: valid
status modified: 2024-04-17
accepted date: 2024-04-17
in scheme: Criteria for determining the minimum number of sampling points for fixed measurement for ozone when supplementary methods like modelling is used (according to Article 10)
related pollutant: http://dd.eionet.europa.eu/vocabulary/aq/pollutant/7
minimum population: 0
maximum population: 22000000
minimum SPO: 26
minimum area: 1250001
maximum area: 1300000

Min requirement O3 with sup. area 1300001 to 1350000 and Pop 0 to 22000000.
type: Concept
notation: 137
definition: Min requirement O3 with sup. area 1300001 to 1350000 and Pop 0 to 22000000.
status: valid
status modified: 2024-04-17
accepted date: 2024-04-17
in scheme: Criteria for determining the minimum number of sampling points for fixed measurement for ozone when supplementary methods like modelling is used (according to Article 10)
related pollutant: http://dd.eionet.europa.eu/vocabulary/aq/pollutant/7
minimum population: 0
maximum population: 22000000
minimum SPO: 27
minimum area: 1300001
maximum area: 1350000

Min requirement O3 with sup. area 1350001 to 1400000 and Pop 0 to 22000000.
type: Concept
notation: 138
definition: Min requirement O3 with sup. area 1350001 to 1400000 and Pop 0 to 22000000.
status: valid
status modified: 2024-04-17
accepted date: 2024-04-17
in scheme: Criteria for determining the minimum number of sampling points for fixed measurement for ozone when supplementary methods like modelling is used (according to Article 10)
related pollutant: http://dd.eionet.europa.eu/vocabulary/aq/pollutant/7
minimum population: 0
maximum population: 22000000
minimum SPO: 28
minimum area: 1350001
maximum area: 1400000

Min requirement O3 with sup. area 1400001 to 1450000 and Pop 0 to 22000000.
type: Concept
notation: 139
definition: Min requirement O3 with sup. area 1400001 to 1450000 and Pop 0 to 22000000.
status: valid
status modified: 2024-04-17
accepted date: 2024-04-17
in scheme: Criteria for determining the minimum number of sampling points for fixed measurement for ozone when supplementary methods like modelling is used (according to Article 10)
related pollutant: http://dd.eionet.europa.eu/vocabulary/aq/pollutant/7
minimum population: 0
maximum population: 22000000
minimum SPO: 29
minimum area: 1400001
maximum area: 1450000

Min requirement O3 with sup. area 50001 to 100000 and Pop 4000001 to 6000000.
type: Concept
notation: 14
definition: Min requirement O3 with sup. area 50001 to 100000 and Pop 4000001 to 6000000.
status: valid
status modified: 2024-04-17
accepted date: 2024-04-17
in scheme: Criteria for determining the minimum number of sampling points for fixed measurement for ozone when supplementary methods like modelling is used (according to Article 10)
related pollutant: http://dd.eionet.europa.eu/vocabulary/aq/pollutant/7
minimum population: 4000001
maximum population: 6000000
minimum SPO: 3
minimum area: 50001
maximum area: 100000

Min requirement O3 with sup. area 1450001 to 1500000 and Pop 0 to 22000000.
type: Concept
notation: 140
definition: Min requirement O3 with sup. area 1450001 to 1500000 and Pop 0 to 22000000.
status: valid
status modified: 2024-04-17
accepted date: 2024-04-17
in scheme: Criteria for determining the minimum number of sampling points for fixed measurement for ozone when supplementary methods like modelling is used (according to Article 10)
related pollutant: http://dd.eionet.europa.eu/vocabulary/aq/pollutant/7
minimum population: 0
maximum population: 22000000
minimum SPO: 30
minimum area: 1450001
maximum area: 1500000

Min requirement O3 with sup. area 1500001 to 1550000 and Pop 0 to 22000000.
type: Concept
notation: 141
definition: Min requirement O3 with sup. area 1500001 to 1550000 and Pop 0 to 22000000.
status: valid
status modified: 2024-04-17
accepted date: 2024-04-17
in scheme: Criteria for determining the minimum number of sampling points for fixed measurement for ozone when supplementary methods like modelling is used (according to Article 10)
related pollutant: http://dd.eionet.europa.eu/vocabulary/aq/pollutant/7
minimum population: 0
maximum population: 22000000
minimum SPO: 31
minimum area: 1500001
maximum area: 1550000

Min requirement O3 with sup. area 1550001 to 1600000 and Pop 0 to 22000000.
type: Concept
notation: 142
definition: Min requirement O3 with sup. area 1550001 to 1600000 and Pop 0 to 22000000.
status: valid
status modified: 2024-04-17
accepted date: 2024-04-17
in scheme: Criteria for determining the minimum number of sampling points for fixed measurement for ozone when supplementary methods like modelling is used (according to Article 10)
related pollutant: http://dd.eionet.europa.eu/vocabulary/aq/pollutant/7
minimum population: 0
maximum population: 22000000
minimum SPO: 32
minimum area: 1550001
maximum area: 1600000

Min requirement O3 with sup. area 1600001 to 1650000 and Pop 0 to 22000000.
type: Concept
notation: 143
definition: Min requirement O3 with sup. area 1600001 to 1650000 and Pop 0 to 22000000.
status: valid
status modified: 2024-04-17
accepted date: 2024-04-17
in scheme: Criteria for determining the minimum number of sampling points for fixed measurement for ozone when supplementary methods like modelling is used (according to Article 10)
related pollutant: http://dd.eionet.europa.eu/vocabulary/aq/pollutant/7
minimum population: 0
maximum population: 22000000
minimum SPO: 33
minimum area: 1600001
maximum area: 1650000

Min requirement O3 with sup. area 1650001 to 1700000 and Pop 0 to 22000000.
type: Concept
notation: 144
definition: Min requirement O3 with sup. area 1650001 to 1700000 and Pop 0 to 22000000.
status: valid
status modified: 2024-04-17
accepted date: 2024-04-17
in scheme: Criteria for determining the minimum number of sampling points for fixed measurement for ozone when supplementary methods like modelling is used (according to Article 10)
related pollutant: http://dd.eionet.europa.eu/vocabulary/aq/pollutant/7
minimum population: 0
maximum population: 22000000
minimum SPO: 34
minimum area: 1650001
maximum area: 1700000

Min requirement O3 with sup. area 1700001 to 1750000 and Pop 0 to 22000000.
type: Concept
notation: 145
definition: Min requirement O3 with sup. area 1700001 to 1750000 and Pop 0 to 22000000.
status: valid
status modified: 2024-04-17
accepted date: 2024-04-17
in scheme: Criteria for determining the minimum number of sampling points for fixed measurement for ozone when supplementary methods like modelling is used (according to Article 10)
related pollutant: http://dd.eionet.europa.eu/vocabulary/aq/pollutant/7
minimum population: 0
maximum population: 22000000
minimum SPO: 35
minimum area: 1700001
maximum area: 1750000

Min requirement O3 with sup. area 1750001 to 1800000 and Pop 0 to 22000000.
type: Concept
notation: 146
definition: Min requirement O3 with sup. area 1750001 to 1800000 and Pop 0 to 22000000.
status: valid
status modified: 2024-04-17
accepted date: 2024-04-17
in scheme: Criteria for determining the minimum number of sampling points for fixed measurement for ozone when supplementary methods like modelling is used (according to Article 10)
related pollutant: http://dd.eionet.europa.eu/vocabulary/aq/pollutant/7
minimum population: 0
maximum population: 22000000
minimum SPO: 36
minimum area: 1750001
maximum area: 1800000

Min requirement O3 with sup. area 1800001 to 1850000 and Pop 0 to 22000000.
type: Concept
notation: 147
definition: Min requirement O3 with sup. area 1800001 to 1850000 and Pop 0 to 22000000.
status: valid
status modified: 2024-04-17
accepted date: 2024-04-17
in scheme: Criteria for determining the minimum number of sampling points for fixed measurement for ozone when supplementary methods like modelling is used (according to Article 10)
related pollutant: http://dd.eionet.europa.eu/vocabulary/aq/pollutant/7
minimum population: 0
maximum population: 22000000
minimum SPO: 37
minimum area: 1800001
maximum area: 1850000

Min requirement O3 with sup. area 1850001 to 1900000 and Pop 0 to 22000000.
type: Concept
notation: 148
definition: Min requirement O3 with sup. area 1850001 to 1900000 and Pop 0 to 22000000.
status: valid
status modified: 2024-04-17
accepted date: 2024-04-17
in scheme: Criteria for determining the minimum number of sampling points for fixed measurement for ozone when supplementary methods like modelling is used (according to Article 10)
related pollutant: http://dd.eionet.europa.eu/vocabulary/aq/pollutant/7
minimum population: 0
maximum population: 22000000
minimum SPO: 38
minimum area: 1850001
maximum area: 1900000

Min requirement O3 with sup. area 1900001 to 1950000 and Pop 0 to 22000000.
type: Concept
notation: 149
definition: Min requirement O3 with sup. area 1900001 to 1950000 and Pop 0 to 22000000.
status: valid
status modified: 2024-04-17
accepted date: 2024-04-17
in scheme: Criteria for determining the minimum number of sampling points for fixed measurement for ozone when supplementary methods like modelling is used (according to Article 10)
related pollutant: http://dd.eionet.europa.eu/vocabulary/aq/pollutant/7
minimum population: 0
maximum population: 22000000
minimum SPO: 39
minimum area: 1900001
maximum area: 1950000

Min requirement O3 with sup. area 50001 to 100000 and Pop 6000001 to 8000000.
type: Concept
notation: 15
definition: Min requirement O3 with sup. area 50001 to 100000 and Pop 6000001 to 8000000.
status: valid
status modified: 2024-04-17
accepted date: 2024-04-17
in scheme: Criteria for determining the minimum number of sampling points for fixed measurement for ozone when supplementary methods like modelling is used (according to Article 10)
related pollutant: http://dd.eionet.europa.eu/vocabulary/aq/pollutant/7
minimum population: 6000001
maximum population: 8000000
minimum SPO: 4
minimum area: 50001
maximum area: 100000

Min requirement O3 with sup. area 1950001 to 2000000 and Pop 0 to 22000000.
type: Concept
notation: 150
definition: Min requirement O3 with sup. area 1950001 to 2000000 and Pop 0 to 22000000.
status: valid
status modified: 2024-04-17
accepted date: 2024-04-17
in scheme: Criteria for determining the minimum number of sampling points for fixed measurement for ozone when supplementary methods like modelling is used (according to Article 10)
related pollutant: http://dd.eionet.europa.eu/vocabulary/aq/pollutant/7
minimum population: 0
maximum population: 22000000
minimum SPO: 40
minimum area: 1950001
maximum area: 2000000

Min requirement O3 with sup. area 50001 to 100000 and Pop 8000001 to 10000000.
type: Concept
notation: 16
definition: Min requirement O3 with sup. area 50001 to 100000 and Pop 8000001 to 10000000.
status: valid
status modified: 2024-04-17
accepted date: 2024-04-17
in scheme: Criteria for determining the minimum number of sampling points for fixed measurement for ozone when supplementary methods like modelling is used (according to Article 10)
related pollutant: http://dd.eionet.europa.eu/vocabulary/aq/pollutant/7
minimum population: 8000001
maximum population: 10000000
minimum SPO: 5
minimum area: 50001
maximum area: 100000

Min requirement O3 with sup. area 50001 to 100000 and Pop 10000001 to 12000000.
type: Concept
notation: 17
definition: Min requirement O3 with sup. area 50001 to 100000 and Pop 10000001 to 12000000.
status: valid
status modified: 2024-04-17
accepted date: 2024-04-17
in scheme: Criteria for determining the minimum number of sampling points for fixed measurement for ozone when supplementary methods like modelling is used (according to Article 10)
related pollutant: http://dd.eionet.europa.eu/vocabulary/aq/pollutant/7
minimum population: 10000001
maximum population: 12000000
minimum SPO: 6
minimum area: 50001
maximum area: 100000

Min requirement O3 with sup. area 50001 to 100000 and Pop 12000001 to 14000000.
type: Concept
notation: 18
definition: Min requirement O3 with sup. area 50001 to 100000 and Pop 12000001 to 14000000.
status: valid
status modified: 2024-04-17
accepted date: 2024-04-17
in scheme: Criteria for determining the minimum number of sampling points for fixed measurement for ozone when supplementary methods like modelling is used (according to Article 10)
related pollutant: http://dd.eionet.europa.eu/vocabulary/aq/pollutant/7
minimum population: 12000001
maximum population: 14000000
minimum SPO: 7
minimum area: 50001
maximum area: 100000

Min requirement O3 with sup. area 50001 to 100000 and Pop 14000001 to 16000000.
type: Concept
notation: 19
definition: Min requirement O3 with sup. area 50001 to 100000 and Pop 14000001 to 16000000.
status: valid
status modified: 2024-04-17
accepted date: 2024-04-17
in scheme: Criteria for determining the minimum number of sampling points for fixed measurement for ozone when supplementary methods like modelling is used (according to Article 10)
related pollutant: http://dd.eionet.europa.eu/vocabulary/aq/pollutant/7
minimum population: 14000001
maximum population: 16000000
minimum SPO: 8
minimum area: 50001
maximum area: 100000

Min requirement O3 with sup. area 0 to 50000 and Pop 2000001 to 4000000.
type: Concept
notation: 2
definition: Min requirement O3 with sup. area 0 to 50000 and Pop 2000001 to 4000000.
status: valid
status modified: 2024-04-17
accepted date: 2024-04-17
in scheme: Criteria for determining the minimum number of sampling points for fixed measurement for ozone when supplementary methods like modelling is used (according to Article 10)
related pollutant: http://dd.eionet.europa.eu/vocabulary/aq/pollutant/7
minimum population: 2000001
maximum population: 4000000
minimum SPO: 2
minimum area: 0
maximum area: 50000

Min requirement O3 with sup. area 50001 to 100000 and Pop 16000001 to 18000000.
type: Concept
notation: 20
definition: Min requirement O3 with sup. area 50001 to 100000 and Pop 16000001 to 18000000.
status: valid
status modified: 2024-04-17
accepted date: 2024-04-17
in scheme: Criteria for determining the minimum number of sampling points for fixed measurement for ozone when supplementary methods like modelling is used (according to Article 10)
related pollutant: http://dd.eionet.europa.eu/vocabulary/aq/pollutant/7
minimum population: 16000001
maximum population: 18000000
minimum SPO: 9
minimum area: 50001
maximum area: 100000

Min requirement O3 with sup. area 50001 to 100000 and Pop 18000001 to 20000000.
type: Concept
notation: 21
definition: Min requirement O3 with sup. area 50001 to 100000 and Pop 18000001 to 20000000.
status: valid
status modified: 2024-04-17
accepted date: 2024-04-17
in scheme: Criteria for determining the minimum number of sampling points for fixed measurement for ozone when supplementary methods like modelling is used (according to Article 10)
related pollutant: http://dd.eionet.europa.eu/vocabulary/aq/pollutant/7
minimum population: 18000001
maximum population: 20000000
minimum SPO: 10
minimum area: 50001
maximum area: 100000

Min requirement O3 with sup. area 50001 to 100000 and Pop 20000001 to 22000000.
type: Concept
notation: 22
definition: Min requirement O3 with sup. area 50001 to 100000 and Pop 20000001 to 22000000.
status: valid
status modified: 2024-04-17
accepted date: 2024-04-17
in scheme: Criteria for determining the minimum number of sampling points for fixed measurement for ozone when supplementary methods like modelling is used (according to Article 10)
related pollutant: http://dd.eionet.europa.eu/vocabulary/aq/pollutant/7
minimum population: 20000001
maximum population: 22000000
minimum SPO: 11
minimum area: 50001
maximum area: 100000

Min requirement O3 with sup. area 100001 to 150000 and Pop 0 to 2000000.
type: Concept
notation: 23
definition: Min requirement O3 with sup. area 100001 to 150000 and Pop 0 to 2000000.
status: valid
status modified: 2024-04-17
accepted date: 2024-04-17
in scheme: Criteria for determining the minimum number of sampling points for fixed measurement for ozone when supplementary methods like modelling is used (according to Article 10)
related pollutant: http://dd.eionet.europa.eu/vocabulary/aq/pollutant/7
minimum population: 0
maximum population: 2000000
minimum SPO: 3
minimum area: 100001
maximum area: 150000

Min requirement O3 with sup. area 100001 to 150000 and Pop 2000001 to 4000000.
type: Concept
notation: 24
definition: Min requirement O3 with sup. area 100001 to 150000 and Pop 2000001 to 4000000.
status: valid
status modified: 2024-04-17
accepted date: 2024-04-17
in scheme: Criteria for determining the minimum number of sampling points for fixed measurement for ozone when supplementary methods like modelling is used (according to Article 10)
related pollutant: http://dd.eionet.europa.eu/vocabulary/aq/pollutant/7
minimum population: 2000001
maximum population: 4000000
minimum SPO: 3
minimum area: 100001
maximum area: 150000

Min requirement O3 with sup. area 100001 to 150000 and Pop 4000001 to 6000000.
type: Concept
notation: 25
definition: Min requirement O3 with sup. area 100001 to 150000 and Pop 4000001 to 6000000.
status: valid
status modified: 2024-04-17
accepted date: 2024-04-17
in scheme: Criteria for determining the minimum number of sampling points for fixed measurement for ozone when supplementary methods like modelling is used (according to Article 10)
related pollutant: http://dd.eionet.europa.eu/vocabulary/aq/pollutant/7
minimum population: 4000001
maximum population: 6000000
minimum SPO: 3
minimum area: 100001
maximum area: 150000

Min requirement O3 with sup. area 100001 to 150000 and Pop 6000001 to 8000000.
type: Concept
notation: 26
definition: Min requirement O3 with sup. area 100001 to 150000 and Pop 6000001 to 8000000.
status: valid
status modified: 2024-04-17
accepted date: 2024-04-17
in scheme: Criteria for determining the minimum number of sampling points for fixed measurement for ozone when supplementary methods like modelling is used (according to Article 10)
related pollutant: http://dd.eionet.europa.eu/vocabulary/aq/pollutant/7
minimum population: 6000001
maximum population: 8000000
minimum SPO: 4
minimum area: 100001
maximum area: 150000

Min requirement O3 with sup. area 100001 to 150000 and Pop 8000001 to 10000000.
type: Concept
notation: 27
definition: Min requirement O3 with sup. area 100001 to 150000 and Pop 8000001 to 10000000.
status: valid
status modified: 2024-04-17
accepted date: 2024-04-17
in scheme: Criteria for determining the minimum number of sampling points for fixed measurement for ozone when supplementary methods like modelling is used (according to Article 10)
related pollutant: http://dd.eionet.europa.eu/vocabulary/aq/pollutant/7
minimum population: 8000001
maximum population: 10000000
minimum SPO: 5
minimum area: 100001
maximum area: 150000

Min requirement O3 with sup. area 100001 to 150000 and Pop 10000001 to 12000000.
type: Concept
notation: 28
definition: Min requirement O3 with sup. area 100001 to 150000 and Pop 10000001 to 12000000.
status: valid
status modified: 2024-04-17
accepted date: 2024-04-17
in scheme: Criteria for determining the minimum number of sampling points for fixed measurement for ozone when supplementary methods like modelling is used (according to Article 10)
related pollutant: http://dd.eionet.europa.eu/vocabulary/aq/pollutant/7
minimum population: 10000001
maximum population: 12000000
minimum SPO: 6
minimum area: 100001
maximum area: 150000

Min requirement O3 with sup. area 100001 to 150000 and Pop 12000001 to 14000000.
type: Concept
notation: 29
definition: Min requirement O3 with sup. area 100001 to 150000 and Pop 12000001 to 14000000.
status: valid
status modified: 2024-04-17
accepted date: 2024-04-17
in scheme: Criteria for determining the minimum number of sampling points for fixed measurement for ozone when supplementary methods like modelling is used (according to Article 10)
related pollutant: http://dd.eionet.europa.eu/vocabulary/aq/pollutant/7
minimum population: 12000001
maximum population: 14000000
minimum SPO: 7
minimum area: 100001
maximum area: 150000

Min requirement O3 with sup. area 0 to 50000 and Pop 4000001 to 6000000.
type: Concept
notation: 3
definition: Min requirement O3 with sup. area 0 to 50000 and Pop 4000001 to 6000000.
status: valid
status modified: 2024-04-17
accepted date: 2024-04-17
in scheme: Criteria for determining the minimum number of sampling points for fixed measurement for ozone when supplementary methods like modelling is used (according to Article 10)
related pollutant: http://dd.eionet.europa.eu/vocabulary/aq/pollutant/7
minimum population: 4000001
maximum population: 6000000
minimum SPO: 3
minimum area: 0
maximum area: 50000

Min requirement O3 with sup. area 100001 to 150000 and Pop 14000001 to 16000000.
type: Concept
notation: 30
definition: Min requirement O3 with sup. area 100001 to 150000 and Pop 14000001 to 16000000.
status: valid
status modified: 2024-04-17
accepted date: 2024-04-17
in scheme: Criteria for determining the minimum number of sampling points for fixed measurement for ozone when supplementary methods like modelling is used (according to Article 10)
related pollutant: http://dd.eionet.europa.eu/vocabulary/aq/pollutant/7
minimum population: 14000001
maximum population: 16000000
minimum SPO: 8
minimum area: 100001
maximum area: 150000

Min requirement O3 with sup. area 100001 to 150000 and Pop 16000001 to 18000000.
type: Concept
notation: 31
definition: Min requirement O3 with sup. area 100001 to 150000 and Pop 16000001 to 18000000.
status: valid
status modified: 2024-04-17
accepted date: 2024-04-17
in scheme: Criteria for determining the minimum number of sampling points for fixed measurement for ozone when supplementary methods like modelling is used (according to Article 10)
related pollutant: http://dd.eionet.europa.eu/vocabulary/aq/pollutant/7
minimum population: 16000001
maximum population: 18000000
minimum SPO: 9
minimum area: 100001
maximum area: 150000

Min requirement O3 with sup. area 100001 to 150000 and Pop 18000001 to 20000000.
type: Concept
notation: 32
definition: Min requirement O3 with sup. area 100001 to 150000 and Pop 18000001 to 20000000.
status: valid
status modified: 2024-04-17
accepted date: 2024-04-17
in scheme: Criteria for determining the minimum number of sampling points for fixed measurement for ozone when supplementary methods like modelling is used (according to Article 10)
related pollutant: http://dd.eionet.europa.eu/vocabulary/aq/pollutant/7
minimum population: 18000001
maximum population: 20000000
minimum SPO: 10
minimum area: 100001
maximum area: 150000

Min requirement O3 with sup. area 100001 to 150000 and Pop 20000001 to 22000000.
type: Concept
notation: 33
definition: Min requirement O3 with sup. area 100001 to 150000 and Pop 20000001 to 22000000.
status: valid
status modified: 2024-04-17
accepted date: 2024-04-17
in scheme: Criteria for determining the minimum number of sampling points for fixed measurement for ozone when supplementary methods like modelling is used (according to Article 10)
related pollutant: http://dd.eionet.europa.eu/vocabulary/aq/pollutant/7
minimum population: 20000001
maximum population: 22000000
minimum SPO: 11
minimum area: 100001
maximum area: 150000

Min requirement O3 with sup. area 150001 to 200000 and Pop 0 to 2000000.
type: Concept
notation: 34
definition: Min requirement O3 with sup. area 150001 to 200000 and Pop 0 to 2000000.
status: valid
status modified: 2024-04-17
accepted date: 2024-04-17
in scheme: Criteria for determining the minimum number of sampling points for fixed measurement for ozone when supplementary methods like modelling is used (according to Article 10)
related pollutant: http://dd.eionet.europa.eu/vocabulary/aq/pollutant/7
minimum population: 0
maximum population: 2000000
minimum SPO: 4
minimum area: 150001
maximum area: 200000

Min requirement O3 with sup. area 150001 to 200000 and Pop 2000001 to 4000000.
type: Concept
notation: 35
definition: Min requirement O3 with sup. area 150001 to 200000 and Pop 2000001 to 4000000.
status: valid
status modified: 2024-04-17
accepted date: 2024-04-17
in scheme: Criteria for determining the minimum number of sampling points for fixed measurement for ozone when supplementary methods like modelling is used (according to Article 10)
related pollutant: http://dd.eionet.europa.eu/vocabulary/aq/pollutant/7
minimum population: 2000001
maximum population: 4000000
minimum SPO: 4
minimum area: 150001
maximum area: 200000

Min requirement O3 with sup. area 150001 to 200000 and Pop 4000001 to 6000000.
type: Concept
notation: 36
definition: Min requirement O3 with sup. area 150001 to 200000 and Pop 4000001 to 6000000.
status: valid
status modified: 2024-04-17
accepted date: 2024-04-17
in scheme: Criteria for determining the minimum number of sampling points for fixed measurement for ozone when supplementary methods like modelling is used (according to Article 10)
related pollutant: http://dd.eionet.europa.eu/vocabulary/aq/pollutant/7
minimum population: 4000001
maximum population: 6000000
minimum SPO: 4
minimum area: 150001
maximum area: 200000

Min requirement O3 with sup. area 150001 to 200000 and Pop 6000001 to 8000000.
type: Concept
notation: 37
definition: Min requirement O3 with sup. area 150001 to 200000 and Pop 6000001 to 8000000.
status: valid
status modified: 2024-04-17
accepted date: 2024-04-17
in scheme: Criteria for determining the minimum number of sampling points for fixed measurement for ozone when supplementary methods like modelling is used (according to Article 10)
related pollutant: http://dd.eionet.europa.eu/vocabulary/aq/pollutant/7
minimum population: 6000001
maximum population: 8000000
minimum SPO: 4
minimum area: 150001
maximum area: 200000

Min requirement O3 with sup. area 150001 to 200000 and Pop 8000001 to 10000000.
type: Concept
notation: 38
definition: Min requirement O3 with sup. area 150001 to 200000 and Pop 8000001 to 10000000.
status: valid
status modified: 2024-04-17
accepted date: 2024-04-17
in scheme: Criteria for determining the minimum number of sampling points for fixed measurement for ozone when supplementary methods like modelling is used (according to Article 10)
related pollutant: http://dd.eionet.europa.eu/vocabulary/aq/pollutant/7
minimum population: 8000001
maximum population: 10000000
minimum SPO: 5
minimum area: 150001
maximum area: 200000

Min requirement O3 with sup. area 150001 to 200000 and Pop 10000001 to 12000000.
type: Concept
notation: 39
definition: Min requirement O3 with sup. area 150001 to 200000 and Pop 10000001 to 12000000.
status: valid
status modified: 2024-04-17
accepted date: 2024-04-17
in scheme: Criteria for determining the minimum number of sampling points for fixed measurement for ozone when supplementary methods like modelling is used (according to Article 10)
related pollutant: http://dd.eionet.europa.eu/vocabulary/aq/pollutant/7
minimum population: 10000001
maximum population: 12000000
minimum SPO: 6
minimum area: 150001
maximum area: 200000

Min requirement O3 with sup. area 0 to 50000 and Pop 6000001 to 8000000.
type: Concept
notation: 4
definition: Min requirement O3 with sup. area 0 to 50000 and Pop 6000001 to 8000000.
status: valid
status modified: 2024-04-17
accepted date: 2024-04-17
in scheme: Criteria for determining the minimum number of sampling points for fixed measurement for ozone when supplementary methods like modelling is used (according to Article 10)
related pollutant: http://dd.eionet.europa.eu/vocabulary/aq/pollutant/7
minimum population: 6000001
maximum population: 8000000
minimum SPO: 4
minimum area: 0
maximum area: 50000

Min requirement O3 with sup. area 150001 to 200000 and Pop 12000001 to 14000000.
type: Concept
notation: 40
definition: Min requirement O3 with sup. area 150001 to 200000 and Pop 12000001 to 14000000.
status: valid
status modified: 2024-04-17
accepted date: 2024-04-17
in scheme: Criteria for determining the minimum number of sampling points for fixed measurement for ozone when supplementary methods like modelling is used (according to Article 10)
related pollutant: http://dd.eionet.europa.eu/vocabulary/aq/pollutant/7
minimum population: 12000001
maximum population: 14000000
minimum SPO: 7
minimum area: 150001
maximum area: 200000

Min requirement O3 with sup. area 150001 to 200000 and Pop 14000001 to 16000000.
type: Concept
notation: 41
definition: Min requirement O3 with sup. area 150001 to 200000 and Pop 14000001 to 16000000.
status: valid
status modified: 2024-04-17
accepted date: 2024-04-17
in scheme: Criteria for determining the minimum number of sampling points for fixed measurement for ozone when supplementary methods like modelling is used (according to Article 10)
related pollutant: http://dd.eionet.europa.eu/vocabulary/aq/pollutant/7
minimum population: 14000001
maximum population: 16000000
minimum SPO: 8
minimum area: 150001
maximum area: 200000

Min requirement O3 with sup. area 150001 to 200000 and Pop 16000001 to 18000000.
type: Concept
notation: 42
definition: Min requirement O3 with sup. area 150001 to 200000 and Pop 16000001 to 18000000.
status: valid
status modified: 2024-04-17
accepted date: 2024-04-17
in scheme: Criteria for determining the minimum number of sampling points for fixed measurement for ozone when supplementary methods like modelling is used (according to Article 10)
related pollutant: http://dd.eionet.europa.eu/vocabulary/aq/pollutant/7
minimum population: 16000001
maximum population: 18000000
minimum SPO: 9
minimum area: 150001
maximum area: 200000

Min requirement O3 with sup. area 150001 to 200000 and Pop 18000001 to 20000000.
type: Concept
notation: 43
definition: Min requirement O3 with sup. area 150001 to 200000 and Pop 18000001 to 20000000.
status: valid
status modified: 2024-04-17
accepted date: 2024-04-17
in scheme: Criteria for determining the minimum number of sampling points for fixed measurement for ozone when supplementary methods like modelling is used (according to Article 10)
related pollutant: http://dd.eionet.europa.eu/vocabulary/aq/pollutant/7
minimum population: 18000001
maximum population: 20000000
minimum SPO: 10
minimum area: 150001
maximum area: 200000

Min requirement O3 with sup. area 150001 to 200000 and Pop 20000001 to 22000000.
type: Concept
notation: 44
definition: Min requirement O3 with sup. area 150001 to 200000 and Pop 20000001 to 22000000.
status: valid
status modified: 2024-04-17
accepted date: 2024-04-17
in scheme: Criteria for determining the minimum number of sampling points for fixed measurement for ozone when supplementary methods like modelling is used (according to Article 10)
related pollutant: http://dd.eionet.europa.eu/vocabulary/aq/pollutant/7
minimum population: 20000001
maximum population: 22000000
minimum SPO: 11
minimum area: 150001
maximum area: 200000

Min requirement O3 with sup. area 200001 to 250000 and Pop 0 to 2000000.
type: Concept
notation: 45
definition: Min requirement O3 with sup. area 200001 to 250000 and Pop 0 to 2000000.
status: valid
status modified: 2024-04-17
accepted date: 2024-04-17
in scheme: Criteria for determining the minimum number of sampling points for fixed measurement for ozone when supplementary methods like modelling is used (according to Article 10)
related pollutant: http://dd.eionet.europa.eu/vocabulary/aq/pollutant/7
minimum population: 0
maximum population: 2000000
minimum SPO: 5
minimum area: 200001
maximum area: 250000

Min requirement O3 with sup. area 200001 to 250000 and Pop 2000001 to 4000000.
type: Concept
notation: 46
definition: Min requirement O3 with sup. area 200001 to 250000 and Pop 2000001 to 4000000.
status: valid
status modified: 2024-04-17
accepted date: 2024-04-17
in scheme: Criteria for determining the minimum number of sampling points for fixed measurement for ozone when supplementary methods like modelling is used (according to Article 10)
related pollutant: http://dd.eionet.europa.eu/vocabulary/aq/pollutant/7
minimum population: 2000001
maximum population: 4000000
minimum SPO: 5
minimum area: 200001
maximum area: 250000

Min requirement O3 with sup. area 200001 to 250000 and Pop 4000001 to 6000000.
type: Concept
notation: 47
definition: Min requirement O3 with sup. area 200001 to 250000 and Pop 4000001 to 6000000.
status: valid
status modified: 2024-04-17
accepted date: 2024-04-17
in scheme: Criteria for determining the minimum number of sampling points for fixed measurement for ozone when supplementary methods like modelling is used (according to Article 10)
related pollutant: http://dd.eionet.europa.eu/vocabulary/aq/pollutant/7
minimum population: 4000001
maximum population: 6000000
minimum SPO: 5
minimum area: 200001
maximum area: 250000

Min requirement O3 with sup. area 200001 to 250000 and Pop 6000001 to 8000000.
type: Concept
notation: 48
definition: Min requirement O3 with sup. area 200001 to 250000 and Pop 6000001 to 8000000.
status: valid
status modified: 2024-04-17
accepted date: 2024-04-17
in scheme: Criteria for determining the minimum number of sampling points for fixed measurement for ozone when supplementary methods like modelling is used (according to Article 10)
related pollutant: http://dd.eionet.europa.eu/vocabulary/aq/pollutant/7
minimum population: 6000001
maximum population: 8000000
minimum SPO: 5
minimum area: 200001
maximum area: 250000

Min requirement O3 with sup. area 200001 to 250000 and Pop 8000001 to 10000000.
type: Concept
notation: 49
definition: Min requirement O3 with sup. area 200001 to 250000 and Pop 8000001 to 10000000.
status: valid
status modified: 2024-04-17
accepted date: 2024-04-17
in scheme: Criteria for determining the minimum number of sampling points for fixed measurement for ozone when supplementary methods like modelling is used (according to Article 10)
related pollutant: http://dd.eionet.europa.eu/vocabulary/aq/pollutant/7
minimum population: 8000001
maximum population: 10000000
minimum SPO: 5
minimum area: 200001
maximum area: 250000

Min requirement O3 with sup. area 0 to 50000 and Pop 8000001 to 10000000.
type: Concept
notation: 5
definition: Min requirement O3 with sup. area 0 to 50000 and Pop 8000001 to 10000000.
status: valid
status modified: 2024-04-17
accepted date: 2024-04-17
in scheme: Criteria for determining the minimum number of sampling points for fixed measurement for ozone when supplementary methods like modelling is used (according to Article 10)
related pollutant: http://dd.eionet.europa.eu/vocabulary/aq/pollutant/7
minimum population: 8000001
maximum population: 10000000
minimum SPO: 5
minimum area: 0
maximum area: 50000

Min requirement O3 with sup. area 200001 to 250000 and Pop 10000001 to 12000000.
type: Concept
notation: 50
definition: Min requirement O3 with sup. area 200001 to 250000 and Pop 10000001 to 12000000.
status: valid
status modified: 2024-04-17
accepted date: 2024-04-17
in scheme: Criteria for determining the minimum number of sampling points for fixed measurement for ozone when supplementary methods like modelling is used (according to Article 10)
related pollutant: http://dd.eionet.europa.eu/vocabulary/aq/pollutant/7
minimum population: 10000001
maximum population: 12000000
minimum SPO: 6
minimum area: 200001
maximum area: 250000

Min requirement O3 with sup. area 200001 to 250000 and Pop 12000001 to 14000000.
type: Concept
notation: 51
definition: Min requirement O3 with sup. area 200001 to 250000 and Pop 12000001 to 14000000.
status: valid
status modified: 2024-04-17
accepted date: 2024-04-17
in scheme: Criteria for determining the minimum number of sampling points for fixed measurement for ozone when supplementary methods like modelling is used (according to Article 10)
related pollutant: http://dd.eionet.europa.eu/vocabulary/aq/pollutant/7
minimum population: 12000001
maximum population: 14000000
minimum SPO: 7
minimum area: 200001
maximum area: 250000

Min requirement O3 with sup. area 200001 to 250000 and Pop 14000001 to 16000000.
type: Concept
notation: 52
definition: Min requirement O3 with sup. area 200001 to 250000 and Pop 14000001 to 16000000.
status: valid
status modified: 2024-04-17
accepted date: 2024-04-17
in scheme: Criteria for determining the minimum number of sampling points for fixed measurement for ozone when supplementary methods like modelling is used (according to Article 10)
related pollutant: http://dd.eionet.europa.eu/vocabulary/aq/pollutant/7
minimum population: 14000001
maximum population: 16000000
minimum SPO: 8
minimum area: 200001
maximum area: 250000

Min requirement O3 with sup. area 200001 to 250000 and Pop 16000001 to 18000000.
type: Concept
notation: 53
definition: Min requirement O3 with sup. area 200001 to 250000 and Pop 16000001 to 18000000.
status: valid
status modified: 2024-04-17
accepted date: 2024-04-17
in scheme: Criteria for determining the minimum number of sampling points for fixed measurement for ozone when supplementary methods like modelling is used (according to Article 10)
related pollutant: http://dd.eionet.europa.eu/vocabulary/aq/pollutant/7
minimum population: 16000001
maximum population: 18000000
minimum SPO: 9
minimum area: 200001
maximum area: 250000

Min requirement O3 with sup. area 200001 to 250000 and Pop 18000001 to 20000000.
type: Concept
notation: 54
definition: Min requirement O3 with sup. area 200001 to 250000 and Pop 18000001 to 20000000.
status: valid
status modified: 2024-04-17
accepted date: 2024-04-17
in scheme: Criteria for determining the minimum number of sampling points for fixed measurement for ozone when supplementary methods like modelling is used (according to Article 10)
related pollutant: http://dd.eionet.europa.eu/vocabulary/aq/pollutant/7
minimum population: 18000001
maximum population: 20000000
minimum SPO: 10
minimum area: 200001
maximum area: 250000

Min requirement O3 with sup. area 200001 to 250000 and Pop 20000001 to 22000000.
type: Concept
notation: 55
definition: Min requirement O3 with sup. area 200001 to 250000 and Pop 20000001 to 22000000.
status: valid
status modified: 2024-04-17
accepted date: 2024-04-17
in scheme: Criteria for determining the minimum number of sampling points for fixed measurement for ozone when supplementary methods like modelling is used (according to Article 10)
related pollutant: http://dd.eionet.europa.eu/vocabulary/aq/pollutant/7
minimum population: 20000001
maximum population: 22000000
minimum SPO: 11
minimum area: 200001
maximum area: 250000

Min requirement O3 with sup. area 250001 to 300000 and Pop 0 to 2000000.
type: Concept
notation: 56
definition: Min requirement O3 with sup. area 250001 to 300000 and Pop 0 to 2000000.
status: valid
status modified: 2024-04-17
accepted date: 2024-04-17
in scheme: Criteria for determining the minimum number of sampling points for fixed measurement for ozone when supplementary methods like modelling is used (according to Article 10)
related pollutant: http://dd.eionet.europa.eu/vocabulary/aq/pollutant/7
minimum population: 0
maximum population: 2000000
minimum SPO: 6
minimum area: 250001
maximum area: 300000

Min requirement O3 with sup. area 250001 to 300000 and Pop 2000001 to 4000000.
type: Concept
notation: 57
definition: Min requirement O3 with sup. area 250001 to 300000 and Pop 2000001 to 4000000.
status: valid
status modified: 2024-04-17
accepted date: 2024-04-17
in scheme: Criteria for determining the minimum number of sampling points for fixed measurement for ozone when supplementary methods like modelling is used (according to Article 10)
related pollutant: http://dd.eionet.europa.eu/vocabulary/aq/pollutant/7
minimum population: 2000001
maximum population: 4000000
minimum SPO: 6
minimum area: 250001
maximum area: 300000

Min requirement O3 with sup. area 250001 to 300000 and Pop 4000001 to 6000000.
type: Concept
notation: 58
definition: Min requirement O3 with sup. area 250001 to 300000 and Pop 4000001 to 6000000.
status: valid
status modified: 2024-04-17
accepted date: 2024-04-17
in scheme: Criteria for determining the minimum number of sampling points for fixed measurement for ozone when supplementary methods like modelling is used (according to Article 10)
related pollutant: http://dd.eionet.europa.eu/vocabulary/aq/pollutant/7
minimum population: 4000001
maximum population: 6000000
minimum SPO: 6
minimum area: 250001
maximum area: 300000

Min requirement O3 with sup. area 250001 to 300000 and Pop 6000001 to 8000000.
type: Concept
notation: 59
definition: Min requirement O3 with sup. area 250001 to 300000 and Pop 6000001 to 8000000.
status: valid
status modified: 2024-04-17
accepted date: 2024-04-17
in scheme: Criteria for determining the minimum number of sampling points for fixed measurement for ozone when supplementary methods like modelling is used (according to Article 10)
related pollutant: http://dd.eionet.europa.eu/vocabulary/aq/pollutant/7
minimum population: 6000001
maximum population: 8000000
minimum SPO: 6
minimum area: 250001
maximum area: 300000

Min requirement O3 with sup. area 0 to 50000 and Pop 10000001 to 12000000.
type: Concept
notation: 6
definition: Min requirement O3 with sup. area 0 to 50000 and Pop 10000001 to 12000000.
status: valid
status modified: 2024-04-17
accepted date: 2024-04-17
in scheme: Criteria for determining the minimum number of sampling points for fixed measurement for ozone when supplementary methods like modelling is used (according to Article 10)
related pollutant: http://dd.eionet.europa.eu/vocabulary/aq/pollutant/7
minimum population: 10000001
maximum population: 12000000
minimum SPO: 6
minimum area: 0
maximum area: 50000

Min requirement O3 with sup. area 250001 to 300000 and Pop 8000001 to 10000000.
type: Concept
notation: 60
definition: Min requirement O3 with sup. area 250001 to 300000 and Pop 8000001 to 10000000.
status: valid
status modified: 2024-04-17
accepted date: 2024-04-17
in scheme: Criteria for determining the minimum number of sampling points for fixed measurement for ozone when supplementary methods like modelling is used (according to Article 10)
related pollutant: http://dd.eionet.europa.eu/vocabulary/aq/pollutant/7
minimum population: 8000001
maximum population: 10000000
minimum SPO: 6
minimum area: 250001
maximum area: 300000

Min requirement O3 with sup. area 250001 to 300000 and Pop 10000001 to 12000000.
type: Concept
notation: 61
definition: Min requirement O3 with sup. area 250001 to 300000 and Pop 10000001 to 12000000.
status: valid
status modified: 2024-04-17
accepted date: 2024-04-17
in scheme: Criteria for determining the minimum number of sampling points for fixed measurement for ozone when supplementary methods like modelling is used (according to Article 10)
related pollutant: http://dd.eionet.europa.eu/vocabulary/aq/pollutant/7
minimum population: 10000001
maximum population: 12000000
minimum SPO: 6
minimum area: 250001
maximum area: 300000

Min requirement O3 with sup. area 250001 to 300000 and Pop 12000001 to 14000000.
type: Concept
notation: 62
definition: Min requirement O3 with sup. area 250001 to 300000 and Pop 12000001 to 14000000.
status: valid
status modified: 2024-04-17
accepted date: 2024-04-17
in scheme: Criteria for determining the minimum number of sampling points for fixed measurement for ozone when supplementary methods like modelling is used (according to Article 10)
related pollutant: http://dd.eionet.europa.eu/vocabulary/aq/pollutant/7
minimum population: 12000001
maximum population: 14000000
minimum SPO: 7
minimum area: 250001
maximum area: 300000

Min requirement O3 with sup. area 250001 to 300000 and Pop 14000001 to 16000000.
type: Concept
notation: 63
definition: Min requirement O3 with sup. area 250001 to 300000 and Pop 14000001 to 16000000.
status: valid
status modified: 2024-04-17
accepted date: 2024-04-17
in scheme: Criteria for determining the minimum number of sampling points for fixed measurement for ozone when supplementary methods like modelling is used (according to Article 10)
related pollutant: http://dd.eionet.europa.eu/vocabulary/aq/pollutant/7
minimum population: 14000001
maximum population: 16000000
minimum SPO: 8
minimum area: 250001
maximum area: 300000

Min requirement O3 with sup. area 250001 to 300000 and Pop 16000001 to 18000000.
type: Concept
notation: 64
definition: Min requirement O3 with sup. area 250001 to 300000 and Pop 16000001 to 18000000.
status: valid
status modified: 2024-04-17
accepted date: 2024-04-17
in scheme: Criteria for determining the minimum number of sampling points for fixed measurement for ozone when supplementary methods like modelling is used (according to Article 10)
related pollutant: http://dd.eionet.europa.eu/vocabulary/aq/pollutant/7
minimum population: 16000001
maximum population: 18000000
minimum SPO: 9
minimum area: 250001
maximum area: 300000

Min requirement O3 with sup. area 250001 to 300000 and Pop 18000001 to 20000000.
type: Concept
notation: 65
definition: Min requirement O3 with sup. area 250001 to 300000 and Pop 18000001 to 20000000.
status: valid
status modified: 2024-04-17
accepted date: 2024-04-17
in scheme: Criteria for determining the minimum number of sampling points for fixed measurement for ozone when supplementary methods like modelling is used (according to Article 10)
related pollutant: http://dd.eionet.europa.eu/vocabulary/aq/pollutant/7
minimum population: 18000001
maximum population: 20000000
minimum SPO: 10
minimum area: 250001
maximum area: 300000

Min requirement O3 with sup. area 250001 to 300000 and Pop 20000001 to 22000000.
type: Concept
notation: 66
definition: Min requirement O3 with sup. area 250001 to 300000 and Pop 20000001 to 22000000.
status: valid
status modified: 2024-04-17
accepted date: 2024-04-17
in scheme: Criteria for determining the minimum number of sampling points for fixed measurement for ozone when supplementary methods like modelling is used (according to Article 10)
related pollutant: http://dd.eionet.europa.eu/vocabulary/aq/pollutant/7
minimum population: 20000001
maximum population: 22000000
minimum SPO: 11
minimum area: 250001
maximum area: 300000

Min requirement O3 with sup. area 300001 to 350000 and Pop 0 to 2000000.
type: Concept
notation: 67
definition: Min requirement O3 with sup. area 300001 to 350000 and Pop 0 to 2000000.
status: valid
status modified: 2024-04-17
accepted date: 2024-04-17
in scheme: Criteria for determining the minimum number of sampling points for fixed measurement for ozone when supplementary methods like modelling is used (according to Article 10)
related pollutant: http://dd.eionet.europa.eu/vocabulary/aq/pollutant/7
minimum population: 0
maximum population: 2000000
minimum SPO: 7
minimum area: 300001
maximum area: 350000

Min requirement O3 with sup. area 300001 to 350000 and Pop 2000001 to 4000000.
type: Concept
notation: 68
definition: Min requirement O3 with sup. area 300001 to 350000 and Pop 2000001 to 4000000.
status: valid
status modified: 2024-04-17
accepted date: 2024-04-17
in scheme: Criteria for determining the minimum number of sampling points for fixed measurement for ozone when supplementary methods like modelling is used (according to Article 10)
related pollutant: http://dd.eionet.europa.eu/vocabulary/aq/pollutant/7
minimum population: 2000001
maximum population: 4000000
minimum SPO: 7
minimum area: 300001
maximum area: 350000

Min requirement O3 with sup. area 300001 to 350000 and Pop 4000001 to 6000000.
type: Concept
notation: 69
definition: Min requirement O3 with sup. area 300001 to 350000 and Pop 4000001 to 6000000.
status: valid
status modified: 2024-04-17
accepted date: 2024-04-17
in scheme: Criteria for determining the minimum number of sampling points for fixed measurement for ozone when supplementary methods like modelling is used (according to Article 10)
related pollutant: http://dd.eionet.europa.eu/vocabulary/aq/pollutant/7
minimum population: 4000001
maximum population: 6000000
minimum SPO: 7
minimum area: 300001
maximum area: 350000

Min requirement O3 with sup. area 0 to 50000 and Pop 12000001 to 14000000.
type: Concept
notation: 7
definition: Min requirement O3 with sup. area 0 to 50000 and Pop 12000001 to 14000000.
status: valid
status modified: 2024-04-17
accepted date: 2024-04-17
in scheme: Criteria for determining the minimum number of sampling points for fixed measurement for ozone when supplementary methods like modelling is used (according to Article 10)
related pollutant: http://dd.eionet.europa.eu/vocabulary/aq/pollutant/7
minimum population: 12000001
maximum population: 14000000
minimum SPO: 7
minimum area: 0
maximum area: 50000

Min requirement O3 with sup. area 300001 to 350000 and Pop 6000001 to 8000000.
type: Concept
notation: 70
definition: Min requirement O3 with sup. area 300001 to 350000 and Pop 6000001 to 8000000.
status: valid
status modified: 2024-04-17
accepted date: 2024-04-17
in scheme: Criteria for determining the minimum number of sampling points for fixed measurement for ozone when supplementary methods like modelling is used (according to Article 10)
related pollutant: http://dd.eionet.europa.eu/vocabulary/aq/pollutant/7
minimum population: 6000001
maximum population: 8000000
minimum SPO: 7
minimum area: 300001
maximum area: 350000

Min requirement O3 with sup. area 300001 to 350000 and Pop 8000001 to 10000000.
type: Concept
notation: 71
definition: Min requirement O3 with sup. area 300001 to 350000 and Pop 8000001 to 10000000.
status: valid
status modified: 2024-04-17
accepted date: 2024-04-17
in scheme: Criteria for determining the minimum number of sampling points for fixed measurement for ozone when supplementary methods like modelling is used (according to Article 10)
related pollutant: http://dd.eionet.europa.eu/vocabulary/aq/pollutant/7
minimum population: 8000001
maximum population: 10000000
minimum SPO: 7
minimum area: 300001
maximum area: 350000

Min requirement O3 with sup. area 300001 to 350000 and Pop 10000001 to 12000000.
type: Concept
notation: 72
definition: Min requirement O3 with sup. area 300001 to 350000 and Pop 10000001 to 12000000.
status: valid
status modified: 2024-04-17
accepted date: 2024-04-17
in scheme: Criteria for determining the minimum number of sampling points for fixed measurement for ozone when supplementary methods like modelling is used (according to Article 10)
related pollutant: http://dd.eionet.europa.eu/vocabulary/aq/pollutant/7
minimum population: 10000001
maximum population: 12000000
minimum SPO: 7
minimum area: 300001
maximum area: 350000

Min requirement O3 with sup. area 300001 to 350000 and Pop 12000001 to 14000000.
type: Concept
notation: 73
definition: Min requirement O3 with sup. area 300001 to 350000 and Pop 12000001 to 14000000.
status: valid
status modified: 2024-04-17
accepted date: 2024-04-17
in scheme: Criteria for determining the minimum number of sampling points for fixed measurement for ozone when supplementary methods like modelling is used (according to Article 10)
related pollutant: http://dd.eionet.europa.eu/vocabulary/aq/pollutant/7
minimum population: 12000001
maximum population: 14000000
minimum SPO: 7
minimum area: 300001
maximum area: 350000

Min requirement O3 with sup. area 300001 to 350000 and Pop 14000001 to 16000000.
type: Concept
notation: 74
definition: Min requirement O3 with sup. area 300001 to 350000 and Pop 14000001 to 16000000.
status: valid
status modified: 2024-04-17
accepted date: 2024-04-17
in scheme: Criteria for determining the minimum number of sampling points for fixed measurement for ozone when supplementary methods like modelling is used (according to Article 10)
related pollutant: http://dd.eionet.europa.eu/vocabulary/aq/pollutant/7
minimum population: 14000001
maximum population: 16000000
minimum SPO: 8
minimum area: 300001
maximum area: 350000

Min requirement O3 with sup. area 300001 to 350000 and Pop 16000001 to 18000000.
type: Concept
notation: 75
definition: Min requirement O3 with sup. area 300001 to 350000 and Pop 16000001 to 18000000.
status: valid
status modified: 2024-04-17
accepted date: 2024-04-17
in scheme: Criteria for determining the minimum number of sampling points for fixed measurement for ozone when supplementary methods like modelling is used (according to Article 10)
related pollutant: http://dd.eionet.europa.eu/vocabulary/aq/pollutant/7
minimum population: 16000001
maximum population: 18000000
minimum SPO: 9
minimum area: 300001
maximum area: 350000

Min requirement O3 with sup. area 300001 to 350000 and Pop 18000001 to 20000000.
type: Concept
notation: 76
definition: Min requirement O3 with sup. area 300001 to 350000 and Pop 18000001 to 20000000.
status: valid
status modified: 2024-04-17
accepted date: 2024-04-17
in scheme: Criteria for determining the minimum number of sampling points for fixed measurement for ozone when supplementary methods like modelling is used (according to Article 10)
related pollutant: http://dd.eionet.europa.eu/vocabulary/aq/pollutant/7
minimum population: 18000001
maximum population: 20000000
minimum SPO: 10
minimum area: 300001
maximum area: 350000

Min requirement O3 with sup. area 300001 to 350000 and Pop 20000001 to 22000000.
type: Concept
notation: 77
definition: Min requirement O3 with sup. area 300001 to 350000 and Pop 20000001 to 22000000.
status: valid
status modified: 2024-04-17
accepted date: 2024-04-17
in scheme: Criteria for determining the minimum number of sampling points for fixed measurement for ozone when supplementary methods like modelling is used (according to Article 10)
related pollutant: http://dd.eionet.europa.eu/vocabulary/aq/pollutant/7
minimum population: 20000001
maximum population: 22000000
minimum SPO: 11
minimum area: 300001
maximum area: 350000

Min requirement O3 with sup. area 350001 to 400000 and Pop 0 to 2000000.
type: Concept
notation: 78
definition: Min requirement O3 with sup. area 350001 to 400000 and Pop 0 to 2000000.
status: valid
status modified: 2024-04-17
accepted date: 2024-04-17
in scheme: Criteria for determining the minimum number of sampling points for fixed measurement for ozone when supplementary methods like modelling is used (according to Article 10)
related pollutant: http://dd.eionet.europa.eu/vocabulary/aq/pollutant/7
minimum population: 0
maximum population: 2000000
minimum SPO: 8
minimum area: 350001
maximum area: 400000

Min requirement O3 with sup. area 350001 to 400000 and Pop 2000001 to 4000000.
type: Concept
notation: 79
definition: Min requirement O3 with sup. area 350001 to 400000 and Pop 2000001 to 4000000.
status: valid
status modified: 2024-04-17
accepted date: 2024-04-17
in scheme: Criteria for determining the minimum number of sampling points for fixed measurement for ozone when supplementary methods like modelling is used (according to Article 10)
related pollutant: http://dd.eionet.europa.eu/vocabulary/aq/pollutant/7
minimum population: 2000001
maximum population: 4000000
minimum SPO: 8
minimum area: 350001
maximum area: 400000

Min requirement O3 with sup. area 0 to 50000 and Pop 14000001 to 16000000.
type: Concept
notation: 8
definition: Min requirement O3 with sup. area 0 to 50000 and Pop 14000001 to 16000000.
status: valid
status modified: 2024-04-17
accepted date: 2024-04-17
in scheme: Criteria for determining the minimum number of sampling points for fixed measurement for ozone when supplementary methods like modelling is used (according to Article 10)
related pollutant: http://dd.eionet.europa.eu/vocabulary/aq/pollutant/7
minimum population: 14000001
maximum population: 16000000
minimum SPO: 8
minimum area: 0
maximum area: 50000

Min requirement O3 with sup. area 350001 to 400000 and Pop 4000001 to 6000000.
type: Concept
notation: 80
definition: Min requirement O3 with sup. area 350001 to 400000 and Pop 4000001 to 6000000.
status: valid
status modified: 2024-04-17
accepted date: 2024-04-17
in scheme: Criteria for determining the minimum number of sampling points for fixed measurement for ozone when supplementary methods like modelling is used (according to Article 10)
related pollutant: http://dd.eionet.europa.eu/vocabulary/aq/pollutant/7
minimum population: 4000001
maximum population: 6000000
minimum SPO: 8
minimum area: 350001
maximum area: 400000

Min requirement O3 with sup. area 350001 to 400000 and Pop 6000001 to 8000000.
type: Concept
notation: 81
definition: Min requirement O3 with sup. area 350001 to 400000 and Pop 6000001 to 8000000.
status: valid
status modified: 2024-04-17
accepted date: 2024-04-17
in scheme: Criteria for determining the minimum number of sampling points for fixed measurement for ozone when supplementary methods like modelling is used (according to Article 10)
related pollutant: http://dd.eionet.europa.eu/vocabulary/aq/pollutant/7
minimum population: 6000001
maximum population: 8000000
minimum SPO: 8
minimum area: 350001
maximum area: 400000

Min requirement O3 with sup. area 350001 to 400000 and Pop 8000001 to 10000000.
type: Concept
notation: 82
definition: Min requirement O3 with sup. area 350001 to 400000 and Pop 8000001 to 10000000.
status: valid
status modified: 2024-04-17
accepted date: 2024-04-17
in scheme: Criteria for determining the minimum number of sampling points for fixed measurement for ozone when supplementary methods like modelling is used (according to Article 10)
related pollutant: http://dd.eionet.europa.eu/vocabulary/aq/pollutant/7
minimum population: 8000001
maximum population: 10000000
minimum SPO: 8
minimum area: 350001
maximum area: 400000

Min requirement O3 with sup. area 350001 to 400000 and Pop 10000001 to 12000000.
type: Concept
notation: 83
definition: Min requirement O3 with sup. area 350001 to 400000 and Pop 10000001 to 12000000.
status: valid
status modified: 2024-04-17
accepted date: 2024-04-17
in scheme: Criteria for determining the minimum number of sampling points for fixed measurement for ozone when supplementary methods like modelling is used (according to Article 10)
related pollutant: http://dd.eionet.europa.eu/vocabulary/aq/pollutant/7
minimum population: 10000001
maximum population: 12000000
minimum SPO: 8
minimum area: 350001
maximum area: 400000

Min requirement O3 with sup. area 350001 to 400000 and Pop 12000001 to 14000000.
type: Concept
notation: 84
definition: Min requirement O3 with sup. area 350001 to 400000 and Pop 12000001 to 14000000.
status: valid
status modified: 2024-04-17
accepted date: 2024-04-17
in scheme: Criteria for determining the minimum number of sampling points for fixed measurement for ozone when supplementary methods like modelling is used (according to Article 10)
related pollutant: http://dd.eionet.europa.eu/vocabulary/aq/pollutant/7
minimum population: 12000001
maximum population: 14000000
minimum SPO: 8
minimum area: 350001
maximum area: 400000

Min requirement O3 with sup. area 350001 to 400000 and Pop 14000001 to 16000000.
type: Concept
notation: 85
definition: Min requirement O3 with sup. area 350001 to 400000 and Pop 14000001 to 16000000.
status: valid
status modified: 2024-04-17
accepted date: 2024-04-17
in scheme: Criteria for determining the minimum number of sampling points for fixed measurement for ozone when supplementary methods like modelling is used (according to Article 10)
related pollutant: http://dd.eionet.europa.eu/vocabulary/aq/pollutant/7
minimum population: 14000001
maximum population: 16000000
minimum SPO: 8
minimum area: 350001
maximum area: 400000

Min requirement O3 with sup. area 350001 to 400000 and Pop 16000001 to 18000000.
type: Concept
notation: 86
definition: Min requirement O3 with sup. area 350001 to 400000 and Pop 16000001 to 18000000.
status: valid
status modified: 2024-04-17
accepted date: 2024-04-17
in scheme: Criteria for determining the minimum number of sampling points for fixed measurement for ozone when supplementary methods like modelling is used (according to Article 10)
related pollutant: http://dd.eionet.europa.eu/vocabulary/aq/pollutant/7
minimum population: 16000001
maximum population: 18000000
minimum SPO: 9
minimum area: 350001
maximum area: 400000

Min requirement O3 with sup. area 350001 to 400000 and Pop 18000001 to 20000000.
type: Concept
notation: 87
definition: Min requirement O3 with sup. area 350001 to 400000 and Pop 18000001 to 20000000.
status: valid
status modified: 2024-04-17
accepted date: 2024-04-17
in scheme: Criteria for determining the minimum number of sampling points for fixed measurement for ozone when supplementary methods like modelling is used (according to Article 10)
related pollutant: http://dd.eionet.europa.eu/vocabulary/aq/pollutant/7
minimum population: 18000001
maximum population: 20000000
minimum SPO: 10
minimum area: 350001
maximum area: 400000

Min requirement O3 with sup. area 350001 to 400000 and Pop 20000001 to 22000000.
type: Concept
notation: 88
definition: Min requirement O3 with sup. area 350001 to 400000 and Pop 20000001 to 22000000.
status: valid
status modified: 2024-04-17
accepted date: 2024-04-17
in scheme: Criteria for determining the minimum number of sampling points for fixed measurement for ozone when supplementary methods like modelling is used (according to Article 10)
related pollutant: http://dd.eionet.europa.eu/vocabulary/aq/pollutant/7
minimum population: 20000001
maximum population: 22000000
minimum SPO: 11
minimum area: 350001
maximum area: 400000

Min requirement O3 with sup. area 400001 to 450000 and Pop 0 to 2000000.
type: Concept
notation: 89
definition: Min requirement O3 with sup. area 400001 to 450000 and Pop 0 to 2000000.
status: valid
status modified: 2024-04-17
accepted date: 2024-04-17
in scheme: Criteria for determining the minimum number of sampling points for fixed measurement for ozone when supplementary methods like modelling is used (according to Article 10)
related pollutant: http://dd.eionet.europa.eu/vocabulary/aq/pollutant/7
minimum population: 0
maximum population: 2000000
minimum SPO: 9
minimum area: 400001
maximum area: 450000

Min requirement O3 with sup. area 0 to 50000 and Pop 16000001 to 18000000.
type: Concept
notation: 9
definition: Min requirement O3 with sup. area 0 to 50000 and Pop 16000001 to 18000000.
status: valid
status modified: 2024-04-17
accepted date: 2024-04-17
in scheme: Criteria for determining the minimum number of sampling points for fixed measurement for ozone when supplementary methods like modelling is used (according to Article 10)
related pollutant: http://dd.eionet.europa.eu/vocabulary/aq/pollutant/7
minimum population: 16000001
maximum population: 18000000
minimum SPO: 9
minimum area: 0
maximum area: 50000

Min requirement O3 with sup. area 400001 to 450000 and Pop 2000001 to 4000000.
type: Concept
notation: 90
definition: Min requirement O3 with sup. area 400001 to 450000 and Pop 2000001 to 4000000.
status: valid
status modified: 2024-04-17
accepted date: 2024-04-17
in scheme: Criteria for determining the minimum number of sampling points for fixed measurement for ozone when supplementary methods like modelling is used (according to Article 10)
related pollutant: http://dd.eionet.europa.eu/vocabulary/aq/pollutant/7
minimum population: 2000001
maximum population: 4000000
minimum SPO: 9
minimum area: 400001
maximum area: 450000

Min requirement O3 with sup. area 400001 to 450000 and Pop 4000001 to 6000000.
type: Concept
notation: 91
definition: Min requirement O3 with sup. area 400001 to 450000 and Pop 4000001 to 6000000.
status: valid
status modified: 2024-04-17
accepted date: 2024-04-17
in scheme: Criteria for determining the minimum number of sampling points for fixed measurement for ozone when supplementary methods like modelling is used (according to Article 10)
related pollutant: http://dd.eionet.europa.eu/vocabulary/aq/pollutant/7
minimum population: 4000001
maximum population: 6000000
minimum SPO: 9
minimum area: 400001
maximum area: 450000

Min requirement O3 with sup. area 400001 to 450000 and Pop 6000001 to 8000000.
type: Concept
notation: 92
definition: Min requirement O3 with sup. area 400001 to 450000 and Pop 6000001 to 8000000.
status: valid
status modified: 2024-04-17
accepted date: 2024-04-17
in scheme: Criteria for determining the minimum number of sampling points for fixed measurement for ozone when supplementary methods like modelling is used (according to Article 10)
related pollutant: http://dd.eionet.europa.eu/vocabulary/aq/pollutant/7
minimum population: 6000001
maximum population: 8000000
minimum SPO: 9
minimum area: 400001
maximum area: 450000

Min requirement O3 with sup. area 400001 to 450000 and Pop 8000001 to 10000000.
type: Concept
notation: 93
definition: Min requirement O3 with sup. area 400001 to 450000 and Pop 8000001 to 10000000.
status: valid
status modified: 2024-04-17
accepted date: 2024-04-17
in scheme: Criteria for determining the minimum number of sampling points for fixed measurement for ozone when supplementary methods like modelling is used (according to Article 10)
related pollutant: http://dd.eionet.europa.eu/vocabulary/aq/pollutant/7
minimum population: 8000001
maximum population: 10000000
minimum SPO: 9
minimum area: 400001
maximum area: 450000

Min requirement O3 with sup. area 400001 to 450000 and Pop 10000001 to 12000000.
type: Concept
notation: 94
definition: Min requirement O3 with sup. area 400001 to 450000 and Pop 10000001 to 12000000.
status: valid
status modified: 2024-04-17
accepted date: 2024-04-17
in scheme: Criteria for determining the minimum number of sampling points for fixed measurement for ozone when supplementary methods like modelling is used (according to Article 10)
related pollutant: http://dd.eionet.europa.eu/vocabulary/aq/pollutant/7
minimum population: 10000001
maximum population: 12000000
minimum SPO: 9
minimum area: 400001
maximum area: 450000

Min requirement O3 with sup. area 400001 to 450000 and Pop 12000001 to 14000000.
type: Concept
notation: 95
definition: Min requirement O3 with sup. area 400001 to 450000 and Pop 12000001 to 14000000.
status: valid
status modified: 2024-04-17
accepted date: 2024-04-17
in scheme: Criteria for determining the minimum number of sampling points for fixed measurement for ozone when supplementary methods like modelling is used (according to Article 10)
related pollutant: http://dd.eionet.europa.eu/vocabulary/aq/pollutant/7
minimum population: 12000001
maximum population: 14000000
minimum SPO: 9
minimum area: 400001
maximum area: 450000

Min requirement O3 with sup. area 400001 to 450000 and Pop 14000001 to 16000000.
type: Concept
notation: 96
definition: Min requirement O3 with sup. area 400001 to 450000 and Pop 14000001 to 16000000.
status: valid
status modified: 2024-04-17
accepted date: 2024-04-17
in scheme: Criteria for determining the minimum number of sampling points for fixed measurement for ozone when supplementary methods like modelling is used (according to Article 10)
related pollutant: http://dd.eionet.europa.eu/vocabulary/aq/pollutant/7
minimum population: 14000001
maximum population: 16000000
minimum SPO: 9
minimum area: 400001
maximum area: 450000

Min requirement O3 with sup. area 400001 to 450000 and Pop 16000001 to 18000000.
type: Concept
notation: 97
definition: Min requirement O3 with sup. area 400001 to 450000 and Pop 16000001 to 18000000.
status: valid
status modified: 2024-04-17
accepted date: 2024-04-17
in scheme: Criteria for determining the minimum number of sampling points for fixed measurement for ozone when supplementary methods like modelling is used (according to Article 10)
related pollutant: http://dd.eionet.europa.eu/vocabulary/aq/pollutant/7
minimum population: 16000001
maximum population: 18000000
minimum SPO: 9
minimum area: 400001
maximum area: 450000

Min requirement O3 with sup. area 400001 to 450000 and Pop 18000001 to 20000000.
type: Concept
notation: 98
definition: Min requirement O3 with sup. area 400001 to 450000 and Pop 18000001 to 20000000.
status: valid
status modified: 2024-04-17
accepted date: 2024-04-17
in scheme: Criteria for determining the minimum number of sampling points for fixed measurement for ozone when supplementary methods like modelling is used (according to Article 10)
related pollutant: http://dd.eionet.europa.eu/vocabulary/aq/pollutant/7
minimum population: 18000001
maximum population: 20000000
minimum SPO: 10
minimum area: 400001
maximum area: 450000

Min requirement O3 with sup. area 400001 to 450000 and Pop 20000001 to 22000000.
type: Concept
notation: 99
definition: Min requirement O3 with sup. area 400001 to 450000 and Pop 20000001 to 22000000.
status: valid
status modified: 2024-04-17
accepted date: 2024-04-17
in scheme: Criteria for determining the minimum number of sampling points for fixed measurement for ozone when supplementary methods like modelling is used (according to Article 10)
related pollutant: http://dd.eionet.europa.eu/vocabulary/aq/pollutant/7
minimum population: 20000001
maximum population: 22000000
minimum SPO: 11
minimum area: 400001
maximum area: 450000