Criteria for determining the minimum number of sampling points for fixed measurement
type: ConceptScheme
notation: anexV_IX_minimum_spo
is part of: aq
registration status: Public draft
user modified: targajau
date modified: 2024-09-12 12:52:25.0
vocabulary type: Common
is numeric concept identifiers: true
is notations equal identifiers: true

Minimum requirement for pollutant 1 for pop between 0 and 999999 when assessment is LAT-UAT - zone type is not considered
type: Concept
notation: 1
definition: Minimum requirement for pollutant 1 for pop between 0 and 999999 when assessment is LAT-UAT - zone type is not considered
status: valid
status modified: 2024-09-12
accepted date: 2024-09-12
in scheme: Criteria for determining the minimum number of sampling points for fixed measurement
related pollutant: http://dd.eionet.europa.eu/vocabulary/aq/pollutant/1
assessment threshold: LAT-UAT
minimum population: 0
maximum population: 999999
minimum SPO: 1

Minimum requirement for pollutant 1 for pop between 1000000 and 1999999 when assessment is LAT-UAT - zone type is not considered
type: Concept
notation: 2
definition: Minimum requirement for pollutant 1 for pop between 1000000 and 1999999 when assessment is LAT-UAT - zone type is not considered
status: valid
status modified: 2024-09-12
accepted date: 2024-09-12
in scheme: Criteria for determining the minimum number of sampling points for fixed measurement
related pollutant: http://dd.eionet.europa.eu/vocabulary/aq/pollutant/1
assessment threshold: LAT-UAT
minimum population: 1000000
maximum population: 1999999
minimum SPO: 2

Minimum requirement for pollutant 1 for pop between 2000000 and 4749999 when assessment is LAT-UAT - zone type is not considered
type: Concept
notation: 3
definition: Minimum requirement for pollutant 1 for pop between 2000000 and 4749999 when assessment is LAT-UAT - zone type is not considered
status: valid
status modified: 2024-09-12
accepted date: 2024-09-12
in scheme: Criteria for determining the minimum number of sampling points for fixed measurement
related pollutant: http://dd.eionet.europa.eu/vocabulary/aq/pollutant/1
assessment threshold: LAT-UAT
minimum population: 2000000
maximum population: 4749999
minimum SPO: 3

Minimum requirement for pollutant 1 for pop between 4750000 and 1000000000 when assessment is LAT-UAT - zone type is not considered
type: Concept
notation: 4
definition: Minimum requirement for pollutant 1 for pop between 4750000 and 1000000000 when assessment is LAT-UAT - zone type is not considered
status: valid
status modified: 2024-09-12
accepted date: 2024-09-12
in scheme: Criteria for determining the minimum number of sampling points for fixed measurement
related pollutant: http://dd.eionet.europa.eu/vocabulary/aq/pollutant/1
assessment threshold: LAT-UAT
minimum population: 4750000
maximum population: 1000000000
minimum SPO: 4

Minimum requirement for pollutant 1 for pop between 0 and 249999 when assessment is aboveUAT - zone type is not considered
type: Concept
notation: 5
definition: Minimum requirement for pollutant 1 for pop between 0 and 249999 when assessment is aboveUAT - zone type is not considered
status: valid
status modified: 2024-09-12
accepted date: 2024-09-12
in scheme: Criteria for determining the minimum number of sampling points for fixed measurement
related pollutant: http://dd.eionet.europa.eu/vocabulary/aq/pollutant/1
assessment threshold: aboveUAT
minimum population: 0
maximum population: 249999
minimum SPO: 1

Minimum requirement for pollutant 1 for pop between 250000 and 749999 when assessment is aboveUAT - zone type is not considered
type: Concept
notation: 6
definition: Minimum requirement for pollutant 1 for pop between 250000 and 749999 when assessment is aboveUAT - zone type is not considered
status: valid
status modified: 2024-09-12
accepted date: 2024-09-12
in scheme: Criteria for determining the minimum number of sampling points for fixed measurement
related pollutant: http://dd.eionet.europa.eu/vocabulary/aq/pollutant/1
assessment threshold: aboveUAT
minimum population: 250000
maximum population: 749999
minimum SPO: 2

Minimum requirement for pollutant 1 for pop between 750000 and 999999 when assessment is aboveUAT - zone type is not considered
type: Concept
notation: 7
definition: Minimum requirement for pollutant 1 for pop between 750000 and 999999 when assessment is aboveUAT - zone type is not considered
status: valid
status modified: 2024-09-12
accepted date: 2024-09-12
in scheme: Criteria for determining the minimum number of sampling points for fixed measurement
related pollutant: http://dd.eionet.europa.eu/vocabulary/aq/pollutant/1
assessment threshold: aboveUAT
minimum population: 750000
maximum population: 999999
minimum SPO: 3

Minimum requirement for pollutant 1 for pop between 1000000 and 1499999 when assessment is aboveUAT - zone type is not considered
type: Concept
notation: 8
definition: Minimum requirement for pollutant 1 for pop between 1000000 and 1499999 when assessment is aboveUAT - zone type is not considered
status: valid
status modified: 2024-09-12
accepted date: 2024-09-12
in scheme: Criteria for determining the minimum number of sampling points for fixed measurement
related pollutant: http://dd.eionet.europa.eu/vocabulary/aq/pollutant/1
assessment threshold: aboveUAT
minimum population: 1000000
maximum population: 1499999
minimum SPO: 4

Minimum requirement for pollutant 1 for pop between 1500000 and 1999999 when assessment is aboveUAT - zone type is not considered
type: Concept
notation: 9
definition: Minimum requirement for pollutant 1 for pop between 1500000 and 1999999 when assessment is aboveUAT - zone type is not considered
status: valid
status modified: 2024-09-12
accepted date: 2024-09-12
in scheme: Criteria for determining the minimum number of sampling points for fixed measurement
related pollutant: http://dd.eionet.europa.eu/vocabulary/aq/pollutant/1
assessment threshold: aboveUAT
minimum population: 1500000
maximum population: 1999999
minimum SPO: 5

Minimum requirement for pollutant 1 for pop between 2000000 and 2749999 when assessment is aboveUAT - zone type is not considered
type: Concept
notation: 10
definition: Minimum requirement for pollutant 1 for pop between 2000000 and 2749999 when assessment is aboveUAT - zone type is not considered
status: valid
status modified: 2024-09-12
accepted date: 2024-09-12
in scheme: Criteria for determining the minimum number of sampling points for fixed measurement
related pollutant: http://dd.eionet.europa.eu/vocabulary/aq/pollutant/1
assessment threshold: aboveUAT
minimum population: 2000000
maximum population: 2749999
minimum SPO: 6

Minimum requirement for pollutant 1 for pop between 2750000 and 3749999 when assessment is aboveUAT - zone type is not considered
type: Concept
notation: 11
definition: Minimum requirement for pollutant 1 for pop between 2750000 and 3749999 when assessment is aboveUAT - zone type is not considered
status: valid
status modified: 2024-09-12
accepted date: 2024-09-12
in scheme: Criteria for determining the minimum number of sampling points for fixed measurement
related pollutant: http://dd.eionet.europa.eu/vocabulary/aq/pollutant/1
assessment threshold: aboveUAT
minimum population: 2750000
maximum population: 3749999
minimum SPO: 7

Minimum requirement for pollutant 1 for pop between 3750000 and 4749999 when assessment is aboveUAT - zone type is not considered
type: Concept
notation: 12
definition: Minimum requirement for pollutant 1 for pop between 3750000 and 4749999 when assessment is aboveUAT - zone type is not considered
status: valid
status modified: 2024-09-12
accepted date: 2024-09-12
in scheme: Criteria for determining the minimum number of sampling points for fixed measurement
related pollutant: http://dd.eionet.europa.eu/vocabulary/aq/pollutant/1
assessment threshold: aboveUAT
minimum population: 3750000
maximum population: 4749999
minimum SPO: 8

Minimum requirement for pollutant 1 for pop between 4750000 and 5999999 when assessment is aboveUAT - zone type is not considered
type: Concept
notation: 13
definition: Minimum requirement for pollutant 1 for pop between 4750000 and 5999999 when assessment is aboveUAT - zone type is not considered
status: valid
status modified: 2024-09-12
accepted date: 2024-09-12
in scheme: Criteria for determining the minimum number of sampling points for fixed measurement
related pollutant: http://dd.eionet.europa.eu/vocabulary/aq/pollutant/1
assessment threshold: aboveUAT
minimum population: 4750000
maximum population: 5999999
minimum SPO: 9

Minimum requirement for pollutant 1 for pop between 6000000 and 1000000000 when assessment is aboveUAT - zone type is not considered
type: Concept
notation: 14
definition: Minimum requirement for pollutant 1 for pop between 6000000 and 1000000000 when assessment is aboveUAT - zone type is not considered
status: valid
status modified: 2024-09-12
accepted date: 2024-09-12
in scheme: Criteria for determining the minimum number of sampling points for fixed measurement
related pollutant: http://dd.eionet.europa.eu/vocabulary/aq/pollutant/1
assessment threshold: aboveUAT
minimum population: 6000000
maximum population: 1000000000
minimum SPO: 10

Minimum requirement for pollutant 10 for pop between 0 and 999999 when assessment is LAT-UAT - zone type is not considered
type: Concept
notation: 15
definition: Minimum requirement for pollutant 10 for pop between 0 and 999999 when assessment is LAT-UAT - zone type is not considered
status: valid
status modified: 2024-09-12
accepted date: 2024-09-12
in scheme: Criteria for determining the minimum number of sampling points for fixed measurement
related pollutant: http://dd.eionet.europa.eu/vocabulary/aq/pollutant/10
assessment threshold: LAT-UAT
minimum population: 0
maximum population: 999999
minimum SPO: 1

Minimum requirement for pollutant 10 for pop between 1000000 and 1999999 when assessment is LAT-UAT - zone type is not considered
type: Concept
notation: 16
definition: Minimum requirement for pollutant 10 for pop between 1000000 and 1999999 when assessment is LAT-UAT - zone type is not considered
status: valid
status modified: 2024-09-12
accepted date: 2024-09-12
in scheme: Criteria for determining the minimum number of sampling points for fixed measurement
related pollutant: http://dd.eionet.europa.eu/vocabulary/aq/pollutant/10
assessment threshold: LAT-UAT
minimum population: 1000000
maximum population: 1999999
minimum SPO: 2

Minimum requirement for pollutant 10 for pop between 2000000 and 4749999 when assessment is LAT-UAT - zone type is not considered
type: Concept
notation: 17
definition: Minimum requirement for pollutant 10 for pop between 2000000 and 4749999 when assessment is LAT-UAT - zone type is not considered
status: valid
status modified: 2024-09-12
accepted date: 2024-09-12
in scheme: Criteria for determining the minimum number of sampling points for fixed measurement
related pollutant: http://dd.eionet.europa.eu/vocabulary/aq/pollutant/10
assessment threshold: LAT-UAT
minimum population: 2000000
maximum population: 4749999
minimum SPO: 3

Minimum requirement for pollutant 10 for pop between 4750000 and 1000000000 when assessment is LAT-UAT - zone type is not considered
type: Concept
notation: 18
definition: Minimum requirement for pollutant 10 for pop between 4750000 and 1000000000 when assessment is LAT-UAT - zone type is not considered
status: valid
status modified: 2024-09-12
accepted date: 2024-09-12
in scheme: Criteria for determining the minimum number of sampling points for fixed measurement
related pollutant: http://dd.eionet.europa.eu/vocabulary/aq/pollutant/10
assessment threshold: LAT-UAT
minimum population: 4750000
maximum population: 1000000000
minimum SPO: 4

Minimum requirement for pollutant 10 for pop between 0 and 249999 when assessment is aboveUAT - zone type is not considered
type: Concept
notation: 19
definition: Minimum requirement for pollutant 10 for pop between 0 and 249999 when assessment is aboveUAT - zone type is not considered
status: valid
status modified: 2024-09-12
accepted date: 2024-09-12
in scheme: Criteria for determining the minimum number of sampling points for fixed measurement
related pollutant: http://dd.eionet.europa.eu/vocabulary/aq/pollutant/10
assessment threshold: aboveUAT
minimum population: 0
maximum population: 249999
minimum SPO: 1

Minimum requirement for pollutant 10 for pop between 250000 and 749999 when assessment is aboveUAT - zone type is not considered
type: Concept
notation: 20
definition: Minimum requirement for pollutant 10 for pop between 250000 and 749999 when assessment is aboveUAT - zone type is not considered
status: valid
status modified: 2024-09-12
accepted date: 2024-09-12
in scheme: Criteria for determining the minimum number of sampling points for fixed measurement
related pollutant: http://dd.eionet.europa.eu/vocabulary/aq/pollutant/10
assessment threshold: aboveUAT
minimum population: 250000
maximum population: 749999
minimum SPO: 2

Minimum requirement for pollutant 10 for pop between 750000 and 999999 when assessment is aboveUAT - zone type is not considered
type: Concept
notation: 21
definition: Minimum requirement for pollutant 10 for pop between 750000 and 999999 when assessment is aboveUAT - zone type is not considered
status: valid
status modified: 2024-09-12
accepted date: 2024-09-12
in scheme: Criteria for determining the minimum number of sampling points for fixed measurement
related pollutant: http://dd.eionet.europa.eu/vocabulary/aq/pollutant/10
assessment threshold: aboveUAT
minimum population: 750000
maximum population: 999999
minimum SPO: 3

Minimum requirement for pollutant 10 for pop between 1000000 and 1499999 when assessment is aboveUAT - zone type is not considered
type: Concept
notation: 22
definition: Minimum requirement for pollutant 10 for pop between 1000000 and 1499999 when assessment is aboveUAT - zone type is not considered
status: valid
status modified: 2024-09-12
accepted date: 2024-09-12
in scheme: Criteria for determining the minimum number of sampling points for fixed measurement
related pollutant: http://dd.eionet.europa.eu/vocabulary/aq/pollutant/10
assessment threshold: aboveUAT
minimum population: 1000000
maximum population: 1499999
minimum SPO: 4

Minimum requirement for pollutant 10 for pop between 1500000 and 1999999 when assessment is aboveUAT - zone type is not considered
type: Concept
notation: 23
definition: Minimum requirement for pollutant 10 for pop between 1500000 and 1999999 when assessment is aboveUAT - zone type is not considered
status: valid
status modified: 2024-09-12
accepted date: 2024-09-12
in scheme: Criteria for determining the minimum number of sampling points for fixed measurement
related pollutant: http://dd.eionet.europa.eu/vocabulary/aq/pollutant/10
assessment threshold: aboveUAT
minimum population: 1500000
maximum population: 1999999
minimum SPO: 5

Minimum requirement for pollutant 10 for pop between 2000000 and 2749999 when assessment is aboveUAT - zone type is not considered
type: Concept
notation: 24
definition: Minimum requirement for pollutant 10 for pop between 2000000 and 2749999 when assessment is aboveUAT - zone type is not considered
status: valid
status modified: 2024-09-12
accepted date: 2024-09-12
in scheme: Criteria for determining the minimum number of sampling points for fixed measurement
related pollutant: http://dd.eionet.europa.eu/vocabulary/aq/pollutant/10
assessment threshold: aboveUAT
minimum population: 2000000
maximum population: 2749999
minimum SPO: 6

Minimum requirement for pollutant 10 for pop between 2750000 and 3749999 when assessment is aboveUAT - zone type is not considered
type: Concept
notation: 25
definition: Minimum requirement for pollutant 10 for pop between 2750000 and 3749999 when assessment is aboveUAT - zone type is not considered
status: valid
status modified: 2024-09-12
accepted date: 2024-09-12
in scheme: Criteria for determining the minimum number of sampling points for fixed measurement
related pollutant: http://dd.eionet.europa.eu/vocabulary/aq/pollutant/10
assessment threshold: aboveUAT
minimum population: 2750000
maximum population: 3749999
minimum SPO: 7

Minimum requirement for pollutant 10 for pop between 3750000 and 4749999 when assessment is aboveUAT - zone type is not considered
type: Concept
notation: 26
definition: Minimum requirement for pollutant 10 for pop between 3750000 and 4749999 when assessment is aboveUAT - zone type is not considered
status: valid
status modified: 2024-09-12
accepted date: 2024-09-12
in scheme: Criteria for determining the minimum number of sampling points for fixed measurement
related pollutant: http://dd.eionet.europa.eu/vocabulary/aq/pollutant/10
assessment threshold: aboveUAT
minimum population: 3750000
maximum population: 4749999
minimum SPO: 8

Minimum requirement for pollutant 10 for pop between 4750000 and 5999999 when assessment is aboveUAT - zone type is not considered
type: Concept
notation: 27
definition: Minimum requirement for pollutant 10 for pop between 4750000 and 5999999 when assessment is aboveUAT - zone type is not considered
status: valid
status modified: 2024-09-12
accepted date: 2024-09-12
in scheme: Criteria for determining the minimum number of sampling points for fixed measurement
related pollutant: http://dd.eionet.europa.eu/vocabulary/aq/pollutant/10
assessment threshold: aboveUAT
minimum population: 4750000
maximum population: 5999999
minimum SPO: 9

Minimum requirement for pollutant 10 for pop between 6000000 and 1000000000 when assessment is aboveUAT - zone type is not considered
type: Concept
notation: 28
definition: Minimum requirement for pollutant 10 for pop between 6000000 and 1000000000 when assessment is aboveUAT - zone type is not considered
status: valid
status modified: 2024-09-12
accepted date: 2024-09-12
in scheme: Criteria for determining the minimum number of sampling points for fixed measurement
related pollutant: http://dd.eionet.europa.eu/vocabulary/aq/pollutant/10
assessment threshold: aboveUAT
minimum population: 6000000
maximum population: 1000000000
minimum SPO: 10

Minimum requirement for pollutant 20 for pop between 0 and 999999 when assessment is LAT-UAT - zone type is not considered
type: Concept
notation: 29
definition: Minimum requirement for pollutant 20 for pop between 0 and 999999 when assessment is LAT-UAT - zone type is not considered
status: valid
status modified: 2024-09-12
accepted date: 2024-09-12
in scheme: Criteria for determining the minimum number of sampling points for fixed measurement
related pollutant: http://dd.eionet.europa.eu/vocabulary/aq/pollutant/20
assessment threshold: LAT-UAT
minimum population: 0
maximum population: 999999
minimum SPO: 1

Minimum requirement for pollutant 20 for pop between 1000000 and 1999999 when assessment is LAT-UAT - zone type is not considered
type: Concept
notation: 30
definition: Minimum requirement for pollutant 20 for pop between 1000000 and 1999999 when assessment is LAT-UAT - zone type is not considered
status: valid
status modified: 2024-09-12
accepted date: 2024-09-12
in scheme: Criteria for determining the minimum number of sampling points for fixed measurement
related pollutant: http://dd.eionet.europa.eu/vocabulary/aq/pollutant/20
assessment threshold: LAT-UAT
minimum population: 1000000
maximum population: 1999999
minimum SPO: 2

Minimum requirement for pollutant 20 for pop between 2000000 and 4749999 when assessment is LAT-UAT - zone type is not considered
type: Concept
notation: 31
definition: Minimum requirement for pollutant 20 for pop between 2000000 and 4749999 when assessment is LAT-UAT - zone type is not considered
status: valid
status modified: 2024-09-12
accepted date: 2024-09-12
in scheme: Criteria for determining the minimum number of sampling points for fixed measurement
related pollutant: http://dd.eionet.europa.eu/vocabulary/aq/pollutant/20
assessment threshold: LAT-UAT
minimum population: 2000000
maximum population: 4749999
minimum SPO: 3

Minimum requirement for pollutant 20 for pop between 4750000 and 1000000000 when assessment is LAT-UAT - zone type is not considered
type: Concept
notation: 32
definition: Minimum requirement for pollutant 20 for pop between 4750000 and 1000000000 when assessment is LAT-UAT - zone type is not considered
status: valid
status modified: 2024-09-12
accepted date: 2024-09-12
in scheme: Criteria for determining the minimum number of sampling points for fixed measurement
related pollutant: http://dd.eionet.europa.eu/vocabulary/aq/pollutant/20
assessment threshold: LAT-UAT
minimum population: 4750000
maximum population: 1000000000
minimum SPO: 4

Minimum requirement for pollutant 20 for pop between 0 and 249999 when assessment is aboveUAT - zone type is not considered
type: Concept
notation: 33
definition: Minimum requirement for pollutant 20 for pop between 0 and 249999 when assessment is aboveUAT - zone type is not considered
status: valid
status modified: 2024-09-12
accepted date: 2024-09-12
in scheme: Criteria for determining the minimum number of sampling points for fixed measurement
related pollutant: http://dd.eionet.europa.eu/vocabulary/aq/pollutant/20
assessment threshold: aboveUAT
minimum population: 0
maximum population: 249999
minimum SPO: 1

Minimum requirement for pollutant 20 for pop between 250000 and 749999 when assessment is aboveUAT - zone type is not considered
type: Concept
notation: 34
definition: Minimum requirement for pollutant 20 for pop between 250000 and 749999 when assessment is aboveUAT - zone type is not considered
status: valid
status modified: 2024-09-12
accepted date: 2024-09-12
in scheme: Criteria for determining the minimum number of sampling points for fixed measurement
related pollutant: http://dd.eionet.europa.eu/vocabulary/aq/pollutant/20
assessment threshold: aboveUAT
minimum population: 250000
maximum population: 749999
minimum SPO: 2

Minimum requirement for pollutant 20 for pop between 750000 and 999999 when assessment is aboveUAT - zone type is not considered
type: Concept
notation: 35
definition: Minimum requirement for pollutant 20 for pop between 750000 and 999999 when assessment is aboveUAT - zone type is not considered
status: valid
status modified: 2024-09-12
accepted date: 2024-09-12
in scheme: Criteria for determining the minimum number of sampling points for fixed measurement
related pollutant: http://dd.eionet.europa.eu/vocabulary/aq/pollutant/20
assessment threshold: aboveUAT
minimum population: 750000
maximum population: 999999
minimum SPO: 3

Minimum requirement for pollutant 20 for pop between 1000000 and 1499999 when assessment is aboveUAT - zone type is not considered
type: Concept
notation: 36
definition: Minimum requirement for pollutant 20 for pop between 1000000 and 1499999 when assessment is aboveUAT - zone type is not considered
status: valid
status modified: 2024-09-12
accepted date: 2024-09-12
in scheme: Criteria for determining the minimum number of sampling points for fixed measurement
related pollutant: http://dd.eionet.europa.eu/vocabulary/aq/pollutant/20
assessment threshold: aboveUAT
minimum population: 1000000
maximum population: 1499999
minimum SPO: 4

Minimum requirement for pollutant 20 for pop between 1500000 and 1999999 when assessment is aboveUAT - zone type is not considered
type: Concept
notation: 37
definition: Minimum requirement for pollutant 20 for pop between 1500000 and 1999999 when assessment is aboveUAT - zone type is not considered
status: valid
status modified: 2024-09-12
accepted date: 2024-09-12
in scheme: Criteria for determining the minimum number of sampling points for fixed measurement
related pollutant: http://dd.eionet.europa.eu/vocabulary/aq/pollutant/20
assessment threshold: aboveUAT
minimum population: 1500000
maximum population: 1999999
minimum SPO: 5

Minimum requirement for pollutant 20 for pop between 2000000 and 2749999 when assessment is aboveUAT - zone type is not considered
type: Concept
notation: 38
definition: Minimum requirement for pollutant 20 for pop between 2000000 and 2749999 when assessment is aboveUAT - zone type is not considered
status: valid
status modified: 2024-09-12
accepted date: 2024-09-12
in scheme: Criteria for determining the minimum number of sampling points for fixed measurement
related pollutant: http://dd.eionet.europa.eu/vocabulary/aq/pollutant/20
assessment threshold: aboveUAT
minimum population: 2000000
maximum population: 2749999
minimum SPO: 6

Minimum requirement for pollutant 20 for pop between 2750000 and 3749999 when assessment is aboveUAT - zone type is not considered
type: Concept
notation: 39
definition: Minimum requirement for pollutant 20 for pop between 2750000 and 3749999 when assessment is aboveUAT - zone type is not considered
status: valid
status modified: 2024-09-12
accepted date: 2024-09-12
in scheme: Criteria for determining the minimum number of sampling points for fixed measurement
related pollutant: http://dd.eionet.europa.eu/vocabulary/aq/pollutant/20
assessment threshold: aboveUAT
minimum population: 2750000
maximum population: 3749999
minimum SPO: 7

Minimum requirement for pollutant 20 for pop between 3750000 and 4749999 when assessment is aboveUAT - zone type is not considered
type: Concept
notation: 40
definition: Minimum requirement for pollutant 20 for pop between 3750000 and 4749999 when assessment is aboveUAT - zone type is not considered
status: valid
status modified: 2024-09-12
accepted date: 2024-09-12
in scheme: Criteria for determining the minimum number of sampling points for fixed measurement
related pollutant: http://dd.eionet.europa.eu/vocabulary/aq/pollutant/20
assessment threshold: aboveUAT
minimum population: 3750000
maximum population: 4749999
minimum SPO: 8

Minimum requirement for pollutant 20 for pop between 4750000 and 5999999 when assessment is aboveUAT - zone type is not considered
type: Concept
notation: 41
definition: Minimum requirement for pollutant 20 for pop between 4750000 and 5999999 when assessment is aboveUAT - zone type is not considered
status: valid
status modified: 2024-09-12
accepted date: 2024-09-12
in scheme: Criteria for determining the minimum number of sampling points for fixed measurement
related pollutant: http://dd.eionet.europa.eu/vocabulary/aq/pollutant/20
assessment threshold: aboveUAT
minimum population: 4750000
maximum population: 5999999
minimum SPO: 9

Minimum requirement for pollutant 20 for pop between 6000000 and 1000000000 when assessment is aboveUAT - zone type is not considered
type: Concept
notation: 42
definition: Minimum requirement for pollutant 20 for pop between 6000000 and 1000000000 when assessment is aboveUAT - zone type is not considered
status: valid
status modified: 2024-09-12
accepted date: 2024-09-12
in scheme: Criteria for determining the minimum number of sampling points for fixed measurement
related pollutant: http://dd.eionet.europa.eu/vocabulary/aq/pollutant/20
assessment threshold: aboveUAT
minimum population: 6000000
maximum population: 1000000000
minimum SPO: 10

Minimum requirement for pollutant 5 for pop between 0 and 249999 when assessment is LAT-UAT - zone type is not considered
type: Concept
notation: 43
definition: Minimum requirement for pollutant 5 for pop between 0 and 249999 when assessment is LAT-UAT - zone type is not considered
status: valid
status modified: 2024-09-12
accepted date: 2024-09-12
in scheme: Criteria for determining the minimum number of sampling points for fixed measurement
related pollutant: http://dd.eionet.europa.eu/vocabulary/aq/pollutant/5
assessment threshold: LAT-UAT
minimum population: 0
maximum population: 249999
minimum SPO: 1

Minimum requirement for pollutant 5 for pop between 250000 and 999999 when assessment is LAT-UAT - zone type is not considered
type: Concept
notation: 44
definition: Minimum requirement for pollutant 5 for pop between 250000 and 999999 when assessment is LAT-UAT - zone type is not considered
status: valid
status modified: 2024-09-12
accepted date: 2024-09-12
in scheme: Criteria for determining the minimum number of sampling points for fixed measurement
related pollutant: http://dd.eionet.europa.eu/vocabulary/aq/pollutant/5
assessment threshold: LAT-UAT
minimum population: 250000
maximum population: 999999
minimum SPO: 2

Minimum requirement for pollutant 5 for pop between 1000000 and 1999999 when assessment is LAT-UAT - zone type is not considered
type: Concept
notation: 45
definition: Minimum requirement for pollutant 5 for pop between 1000000 and 1999999 when assessment is LAT-UAT - zone type is not considered
status: valid
status modified: 2024-09-12
accepted date: 2024-09-12
in scheme: Criteria for determining the minimum number of sampling points for fixed measurement
related pollutant: http://dd.eionet.europa.eu/vocabulary/aq/pollutant/5
assessment threshold: LAT-UAT
minimum population: 1000000
maximum population: 1999999
minimum SPO: 3

Minimum requirement for pollutant 5 for pop between 2000000 and 3749999 when assessment is LAT-UAT - zone type is not considered
type: Concept
notation: 46
definition: Minimum requirement for pollutant 5 for pop between 2000000 and 3749999 when assessment is LAT-UAT - zone type is not considered
status: valid
status modified: 2024-09-12
accepted date: 2024-09-12
in scheme: Criteria for determining the minimum number of sampling points for fixed measurement
related pollutant: http://dd.eionet.europa.eu/vocabulary/aq/pollutant/5
assessment threshold: LAT-UAT
minimum population: 2000000
maximum population: 3749999
minimum SPO: 4

Minimum requirement for pollutant 5 for pop between 3750000 and 5999999 when assessment is LAT-UAT - zone type is not considered
type: Concept
notation: 47
definition: Minimum requirement for pollutant 5 for pop between 3750000 and 5999999 when assessment is LAT-UAT - zone type is not considered
status: valid
status modified: 2024-09-12
accepted date: 2024-09-12
in scheme: Criteria for determining the minimum number of sampling points for fixed measurement
related pollutant: http://dd.eionet.europa.eu/vocabulary/aq/pollutant/5
assessment threshold: LAT-UAT
minimum population: 3750000
maximum population: 5999999
minimum SPO: 6

Minimum requirement for pollutant 5 for pop between 6000000 and 1000000000 when assessment is LAT-UAT - zone type is not considered
type: Concept
notation: 48
definition: Minimum requirement for pollutant 5 for pop between 6000000 and 1000000000 when assessment is LAT-UAT - zone type is not considered
status: valid
status modified: 2024-09-12
accepted date: 2024-09-12
in scheme: Criteria for determining the minimum number of sampling points for fixed measurement
related pollutant: http://dd.eionet.europa.eu/vocabulary/aq/pollutant/5
assessment threshold: LAT-UAT
minimum population: 6000000
maximum population: 1000000000
minimum SPO: 7

Minimum requirement for pollutant 5 for pop between 0 and 249999 when assessment is aboveUAT - zone type is not considered
type: Concept
notation: 49
definition: Minimum requirement for pollutant 5 for pop between 0 and 249999 when assessment is aboveUAT - zone type is not considered
status: valid
status modified: 2024-09-12
accepted date: 2024-09-12
in scheme: Criteria for determining the minimum number of sampling points for fixed measurement
related pollutant: http://dd.eionet.europa.eu/vocabulary/aq/pollutant/5
assessment threshold: aboveUAT
minimum population: 0
maximum population: 249999
minimum SPO: 2

Minimum requirement for pollutant 5 for pop between 250000 and 749999 when assessment is aboveUAT - zone type is not considered
type: Concept
notation: 50
definition: Minimum requirement for pollutant 5 for pop between 250000 and 749999 when assessment is aboveUAT - zone type is not considered
status: valid
status modified: 2024-09-12
accepted date: 2024-09-12
in scheme: Criteria for determining the minimum number of sampling points for fixed measurement
related pollutant: http://dd.eionet.europa.eu/vocabulary/aq/pollutant/5
assessment threshold: aboveUAT
minimum population: 250000
maximum population: 749999
minimum SPO: 3

Minimum requirement for pollutant 5 for pop between 750000 and 999999 when assessment is aboveUAT - zone type is not considered
type: Concept
notation: 51
definition: Minimum requirement for pollutant 5 for pop between 750000 and 999999 when assessment is aboveUAT - zone type is not considered
status: valid
status modified: 2024-09-12
accepted date: 2024-09-12
in scheme: Criteria for determining the minimum number of sampling points for fixed measurement
related pollutant: http://dd.eionet.europa.eu/vocabulary/aq/pollutant/5
assessment threshold: aboveUAT
minimum population: 750000
maximum population: 999999
minimum SPO: 4

Minimum requirement for pollutant 5 for pop between 1000000 and 1499999 when assessment is aboveUAT - zone type is not considered
type: Concept
notation: 52
definition: Minimum requirement for pollutant 5 for pop between 1000000 and 1499999 when assessment is aboveUAT - zone type is not considered
status: valid
status modified: 2024-09-12
accepted date: 2024-09-12
in scheme: Criteria for determining the minimum number of sampling points for fixed measurement
related pollutant: http://dd.eionet.europa.eu/vocabulary/aq/pollutant/5
assessment threshold: aboveUAT
minimum population: 1000000
maximum population: 1499999
minimum SPO: 6

Minimum requirement for pollutant 5 for pop between 1500000 and 1999999 when assessment is aboveUAT - zone type is not considered
type: Concept
notation: 53
definition: Minimum requirement for pollutant 5 for pop between 1500000 and 1999999 when assessment is aboveUAT - zone type is not considered
status: valid
status modified: 2024-09-12
accepted date: 2024-09-12
in scheme: Criteria for determining the minimum number of sampling points for fixed measurement
related pollutant: http://dd.eionet.europa.eu/vocabulary/aq/pollutant/5
assessment threshold: aboveUAT
minimum population: 1500000
maximum population: 1999999
minimum SPO: 7

Minimum requirement for pollutant 5 for pop between 2000000 and 2749999 when assessment is aboveUAT - zone type is not considered
type: Concept
notation: 54
definition: Minimum requirement for pollutant 5 for pop between 2000000 and 2749999 when assessment is aboveUAT - zone type is not considered
status: valid
status modified: 2024-09-12
accepted date: 2024-09-12
in scheme: Criteria for determining the minimum number of sampling points for fixed measurement
related pollutant: http://dd.eionet.europa.eu/vocabulary/aq/pollutant/5
assessment threshold: aboveUAT
minimum population: 2000000
maximum population: 2749999
minimum SPO: 8

Minimum requirement for pollutant 5 for pop between 2750000 and 3749999 when assessment is aboveUAT - zone type is not considered
type: Concept
notation: 55
definition: Minimum requirement for pollutant 5 for pop between 2750000 and 3749999 when assessment is aboveUAT - zone type is not considered
status: valid
status modified: 2024-09-12
accepted date: 2024-09-12
in scheme: Criteria for determining the minimum number of sampling points for fixed measurement
related pollutant: http://dd.eionet.europa.eu/vocabulary/aq/pollutant/5
assessment threshold: aboveUAT
minimum population: 2750000
maximum population: 3749999
minimum SPO: 10

Minimum requirement for pollutant 5 for pop between 3750000 and 4749999 when assessment is aboveUAT - zone type is not considered
type: Concept
notation: 56
definition: Minimum requirement for pollutant 5 for pop between 3750000 and 4749999 when assessment is aboveUAT - zone type is not considered
status: valid
status modified: 2024-09-12
accepted date: 2024-09-12
in scheme: Criteria for determining the minimum number of sampling points for fixed measurement
related pollutant: http://dd.eionet.europa.eu/vocabulary/aq/pollutant/5
assessment threshold: aboveUAT
minimum population: 3750000
maximum population: 4749999
minimum SPO: 11

Minimum requirement for pollutant 5 for pop between 4750000 and 5999999 when assessment is aboveUAT - zone type is not considered
type: Concept
notation: 57
definition: Minimum requirement for pollutant 5 for pop between 4750000 and 5999999 when assessment is aboveUAT - zone type is not considered
status: valid
status modified: 2024-09-12
accepted date: 2024-09-12
in scheme: Criteria for determining the minimum number of sampling points for fixed measurement
related pollutant: http://dd.eionet.europa.eu/vocabulary/aq/pollutant/5
assessment threshold: aboveUAT
minimum population: 4750000
maximum population: 5999999
minimum SPO: 13

Minimum requirement for pollutant 5 for pop between 6000000 and 1000000000 when assessment is aboveUAT - zone type is not considered
type: Concept
notation: 58
definition: Minimum requirement for pollutant 5 for pop between 6000000 and 1000000000 when assessment is aboveUAT - zone type is not considered
status: valid
status modified: 2024-09-12
accepted date: 2024-09-12
in scheme: Criteria for determining the minimum number of sampling points for fixed measurement
related pollutant: http://dd.eionet.europa.eu/vocabulary/aq/pollutant/5
assessment threshold: aboveUAT
minimum population: 6000000
maximum population: 1000000000
minimum SPO: 15

Minimum requirement for pollutant 5012 for pop between 0 and 999999 when assessment is LAT-UAT - zone type is not considered
type: Concept
notation: 59
definition: Minimum requirement for pollutant 5012 for pop between 0 and 999999 when assessment is LAT-UAT - zone type is not considered
status: valid
status modified: 2024-09-12
accepted date: 2024-09-12
in scheme: Criteria for determining the minimum number of sampling points for fixed measurement
related pollutant: http://dd.eionet.europa.eu/vocabulary/aq/pollutant/5012
assessment threshold: LAT-UAT
minimum population: 0
maximum population: 999999
minimum SPO: 1

Minimum requirement for pollutant 5012 for pop between 999999 and 1999999 when assessment is LAT-UAT - zone type is not considered
type: Concept
notation: 60
definition: Minimum requirement for pollutant 5012 for pop between 999999 and 1999999 when assessment is LAT-UAT - zone type is not considered
status: valid
status modified: 2024-09-12
accepted date: 2024-09-12
in scheme: Criteria for determining the minimum number of sampling points for fixed measurement
related pollutant: http://dd.eionet.europa.eu/vocabulary/aq/pollutant/5012
assessment threshold: LAT-UAT
minimum population: 999999
maximum population: 1999999
minimum SPO: 2

Minimum requirement for pollutant 5012 for pop between 1999999 and 4749999 when assessment is LAT-UAT - zone type is not considered
type: Concept
notation: 61
definition: Minimum requirement for pollutant 5012 for pop between 1999999 and 4749999 when assessment is LAT-UAT - zone type is not considered
status: valid
status modified: 2024-09-12
accepted date: 2024-09-12
in scheme: Criteria for determining the minimum number of sampling points for fixed measurement
related pollutant: http://dd.eionet.europa.eu/vocabulary/aq/pollutant/5012
assessment threshold: LAT-UAT
minimum population: 1999999
maximum population: 4749999
minimum SPO: 3

Minimum requirement for pollutant 5012 for pop between 4749999 and 1000000000 when assessment is LAT-UAT - zone type is not considered
type: Concept
notation: 62
definition: Minimum requirement for pollutant 5012 for pop between 4749999 and 1000000000 when assessment is LAT-UAT - zone type is not considered
status: valid
status modified: 2024-09-12
accepted date: 2024-09-12
in scheme: Criteria for determining the minimum number of sampling points for fixed measurement
related pollutant: http://dd.eionet.europa.eu/vocabulary/aq/pollutant/5012
assessment threshold: LAT-UAT
minimum population: 4749999
maximum population: 1000000000
minimum SPO: 4

Minimum requirement for pollutant 5012 for pop between 0 and 249999 when assessment is aboveUAT - zone type is not considered
type: Concept
notation: 63
definition: Minimum requirement for pollutant 5012 for pop between 0 and 249999 when assessment is aboveUAT - zone type is not considered
status: valid
status modified: 2024-09-12
accepted date: 2024-09-12
in scheme: Criteria for determining the minimum number of sampling points for fixed measurement
related pollutant: http://dd.eionet.europa.eu/vocabulary/aq/pollutant/5012
assessment threshold: aboveUAT
minimum population: 0
maximum population: 249999
minimum SPO: 1

Minimum requirement for pollutant 5012 for pop between 249999 and 749999 when assessment is aboveUAT - zone type is not considered
type: Concept
notation: 64
definition: Minimum requirement for pollutant 5012 for pop between 249999 and 749999 when assessment is aboveUAT - zone type is not considered
status: valid
status modified: 2024-09-12
accepted date: 2024-09-12
in scheme: Criteria for determining the minimum number of sampling points for fixed measurement
related pollutant: http://dd.eionet.europa.eu/vocabulary/aq/pollutant/5012
assessment threshold: aboveUAT
minimum population: 249999
maximum population: 749999
minimum SPO: 2

Minimum requirement for pollutant 5012 for pop between 749999 and 999999 when assessment is aboveUAT - zone type is not considered
type: Concept
notation: 65
definition: Minimum requirement for pollutant 5012 for pop between 749999 and 999999 when assessment is aboveUAT - zone type is not considered
status: valid
status modified: 2024-09-12
accepted date: 2024-09-12
in scheme: Criteria for determining the minimum number of sampling points for fixed measurement
related pollutant: http://dd.eionet.europa.eu/vocabulary/aq/pollutant/5012
assessment threshold: aboveUAT
minimum population: 749999
maximum population: 999999
minimum SPO: 3

Minimum requirement for pollutant 5012 for pop between 999999 and 1499999 when assessment is aboveUAT - zone type is not considered
type: Concept
notation: 66
definition: Minimum requirement for pollutant 5012 for pop between 999999 and 1499999 when assessment is aboveUAT - zone type is not considered
status: valid
status modified: 2024-09-12
accepted date: 2024-09-12
in scheme: Criteria for determining the minimum number of sampling points for fixed measurement
related pollutant: http://dd.eionet.europa.eu/vocabulary/aq/pollutant/5012
assessment threshold: aboveUAT
minimum population: 999999
maximum population: 1499999
minimum SPO: 4

Minimum requirement for pollutant 5012 for pop between 1499999 and 1999999 when assessment is aboveUAT - zone type is not considered
type: Concept
notation: 67
definition: Minimum requirement for pollutant 5012 for pop between 1499999 and 1999999 when assessment is aboveUAT - zone type is not considered
status: valid
status modified: 2024-09-12
accepted date: 2024-09-12
in scheme: Criteria for determining the minimum number of sampling points for fixed measurement
related pollutant: http://dd.eionet.europa.eu/vocabulary/aq/pollutant/5012
assessment threshold: aboveUAT
minimum population: 1499999
maximum population: 1999999
minimum SPO: 5

Minimum requirement for pollutant 5012 for pop between 1999999 and 2749999 when assessment is aboveUAT - zone type is not considered
type: Concept
notation: 68
definition: Minimum requirement for pollutant 5012 for pop between 1999999 and 2749999 when assessment is aboveUAT - zone type is not considered
status: valid
status modified: 2024-09-12
accepted date: 2024-09-12
in scheme: Criteria for determining the minimum number of sampling points for fixed measurement
related pollutant: http://dd.eionet.europa.eu/vocabulary/aq/pollutant/5012
assessment threshold: aboveUAT
minimum population: 1999999
maximum population: 2749999
minimum SPO: 6

Minimum requirement for pollutant 5012 for pop between 2749999 and 3749999 when assessment is aboveUAT - zone type is not considered
type: Concept
notation: 69
definition: Minimum requirement for pollutant 5012 for pop between 2749999 and 3749999 when assessment is aboveUAT - zone type is not considered
status: valid
status modified: 2024-09-12
accepted date: 2024-09-12
in scheme: Criteria for determining the minimum number of sampling points for fixed measurement
related pollutant: http://dd.eionet.europa.eu/vocabulary/aq/pollutant/5012
assessment threshold: aboveUAT
minimum population: 2749999
maximum population: 3749999
minimum SPO: 7

Minimum requirement for pollutant 5012 for pop between 3749999 and 4749999 when assessment is aboveUAT - zone type is not considered
type: Concept
notation: 70
definition: Minimum requirement for pollutant 5012 for pop between 3749999 and 4749999 when assessment is aboveUAT - zone type is not considered
status: valid
status modified: 2024-09-12
accepted date: 2024-09-12
in scheme: Criteria for determining the minimum number of sampling points for fixed measurement
related pollutant: http://dd.eionet.europa.eu/vocabulary/aq/pollutant/5012
assessment threshold: aboveUAT
minimum population: 3749999
maximum population: 4749999
minimum SPO: 8

Minimum requirement for pollutant 5012 for pop between 4749999 and 5999999 when assessment is aboveUAT - zone type is not considered
type: Concept
notation: 71
definition: Minimum requirement for pollutant 5012 for pop between 4749999 and 5999999 when assessment is aboveUAT - zone type is not considered
status: valid
status modified: 2024-09-12
accepted date: 2024-09-12
in scheme: Criteria for determining the minimum number of sampling points for fixed measurement
related pollutant: http://dd.eionet.europa.eu/vocabulary/aq/pollutant/5012
assessment threshold: aboveUAT
minimum population: 4749999
maximum population: 5999999
minimum SPO: 9

Minimum requirement for pollutant 5012 for pop between 5999999 and 1000000000 when assessment is aboveUAT - zone type is not considered
type: Concept
notation: 72
definition: Minimum requirement for pollutant 5012 for pop between 5999999 and 1000000000 when assessment is aboveUAT - zone type is not considered
status: valid
status modified: 2024-09-12
accepted date: 2024-09-12
in scheme: Criteria for determining the minimum number of sampling points for fixed measurement
related pollutant: http://dd.eionet.europa.eu/vocabulary/aq/pollutant/5012
assessment threshold: aboveUAT
minimum population: 5999999
maximum population: 1000000000
minimum SPO: 10

Minimum requirement for pollutant 5014 for pop between 0 and 3749999 when assessment is LAT-UAT - zone type is not considered
type: Concept
notation: 73
definition: Minimum requirement for pollutant 5014 for pop between 0 and 3749999 when assessment is LAT-UAT - zone type is not considered
status: valid
status modified: 2024-09-12
accepted date: 2024-09-12
in scheme: Criteria for determining the minimum number of sampling points for fixed measurement
related pollutant: http://dd.eionet.europa.eu/vocabulary/aq/pollutant/5014
assessment threshold: LAT-UAT
minimum population: 0
maximum population: 3749999
minimum SPO: 1

Minimum requirement for pollutant 5014 for pop between 3750000 and 1000000000 when assessment is LAT-UAT - zone type is not considered
type: Concept
notation: 74
definition: Minimum requirement for pollutant 5014 for pop between 3750000 and 1000000000 when assessment is LAT-UAT - zone type is not considered
status: valid
status modified: 2024-09-12
accepted date: 2024-09-12
in scheme: Criteria for determining the minimum number of sampling points for fixed measurement
related pollutant: http://dd.eionet.europa.eu/vocabulary/aq/pollutant/5014
assessment threshold: LAT-UAT
minimum population: 3750000
maximum population: 1000000000
minimum SPO: 2

Minimum requirement for pollutant 5014 for pop between 0 and 749999 when assessment is aboveUAT - zone type is not considered
type: Concept
notation: 75
definition: Minimum requirement for pollutant 5014 for pop between 0 and 749999 when assessment is aboveUAT - zone type is not considered
status: valid
status modified: 2024-09-12
accepted date: 2024-09-12
in scheme: Criteria for determining the minimum number of sampling points for fixed measurement
related pollutant: http://dd.eionet.europa.eu/vocabulary/aq/pollutant/5014
assessment threshold: aboveUAT
minimum population: 0
maximum population: 749999
minimum SPO: 1

Minimum requirement for pollutant 5014 for pop between 750000 and 3749999 when assessment is aboveUAT - zone type is not considered
type: Concept
notation: 76
definition: Minimum requirement for pollutant 5014 for pop between 750000 and 3749999 when assessment is aboveUAT - zone type is not considered
status: valid
status modified: 2024-09-12
accepted date: 2024-09-12
in scheme: Criteria for determining the minimum number of sampling points for fixed measurement
related pollutant: http://dd.eionet.europa.eu/vocabulary/aq/pollutant/5014
assessment threshold: aboveUAT
minimum population: 750000
maximum population: 3749999
minimum SPO: 2

Minimum requirement for pollutant 5014 for pop between 3750000 and 4749999 when assessment is aboveUAT - zone type is not considered
type: Concept
notation: 77
definition: Minimum requirement for pollutant 5014 for pop between 3750000 and 4749999 when assessment is aboveUAT - zone type is not considered
status: valid
status modified: 2024-09-12
accepted date: 2024-09-12
in scheme: Criteria for determining the minimum number of sampling points for fixed measurement
related pollutant: http://dd.eionet.europa.eu/vocabulary/aq/pollutant/5014
assessment threshold: aboveUAT
minimum population: 3750000
maximum population: 4749999
minimum SPO: 3

Minimum requirement for pollutant 5014 for pop between 4750000 and 5999999 when assessment is aboveUAT - zone type is not considered
type: Concept
notation: 78
definition: Minimum requirement for pollutant 5014 for pop between 4750000 and 5999999 when assessment is aboveUAT - zone type is not considered
status: valid
status modified: 2024-09-12
accepted date: 2024-09-12
in scheme: Criteria for determining the minimum number of sampling points for fixed measurement
related pollutant: http://dd.eionet.europa.eu/vocabulary/aq/pollutant/5014
assessment threshold: aboveUAT
minimum population: 4750000
maximum population: 5999999
minimum SPO: 4

Minimum requirement for pollutant 5014 for pop between 6000000 and 1000000000 when assessment is aboveUAT - zone type is not considered
type: Concept
notation: 79
definition: Minimum requirement for pollutant 5014 for pop between 6000000 and 1000000000 when assessment is aboveUAT - zone type is not considered
status: valid
status modified: 2024-09-12
accepted date: 2024-09-12
in scheme: Criteria for determining the minimum number of sampling points for fixed measurement
related pollutant: http://dd.eionet.europa.eu/vocabulary/aq/pollutant/5014
assessment threshold: aboveUAT
minimum population: 6000000
maximum population: 1000000000
minimum SPO: 5

Minimum requirement for pollutant 5015 for pop between 0 and 3749999 when assessment is LAT-UAT - zone type is not considered
type: Concept
notation: 80
definition: Minimum requirement for pollutant 5015 for pop between 0 and 3749999 when assessment is LAT-UAT - zone type is not considered
status: valid
status modified: 2024-09-12
accepted date: 2024-09-12
in scheme: Criteria for determining the minimum number of sampling points for fixed measurement
related pollutant: http://dd.eionet.europa.eu/vocabulary/aq/pollutant/5015
assessment threshold: LAT-UAT
minimum population: 0
maximum population: 3749999
minimum SPO: 1

Minimum requirement for pollutant 5015 for pop between 3750000 and 1000000000 when assessment is LAT-UAT - zone type is not considered
type: Concept
notation: 81
definition: Minimum requirement for pollutant 5015 for pop between 3750000 and 1000000000 when assessment is LAT-UAT - zone type is not considered
status: valid
status modified: 2024-09-12
accepted date: 2024-09-12
in scheme: Criteria for determining the minimum number of sampling points for fixed measurement
related pollutant: http://dd.eionet.europa.eu/vocabulary/aq/pollutant/5015
assessment threshold: LAT-UAT
minimum population: 3750000
maximum population: 1000000000
minimum SPO: 2

Minimum requirement for pollutant 5015 for pop between 0 and 749999 when assessment is aboveUAT - zone type is not considered
type: Concept
notation: 82
definition: Minimum requirement for pollutant 5015 for pop between 0 and 749999 when assessment is aboveUAT - zone type is not considered
status: valid
status modified: 2024-09-12
accepted date: 2024-09-12
in scheme: Criteria for determining the minimum number of sampling points for fixed measurement
related pollutant: http://dd.eionet.europa.eu/vocabulary/aq/pollutant/5015
assessment threshold: aboveUAT
minimum population: 0
maximum population: 749999
minimum SPO: 1

Minimum requirement for pollutant 5015 for pop between 750000 and 3749999 when assessment is aboveUAT - zone type is not considered
type: Concept
notation: 83
definition: Minimum requirement for pollutant 5015 for pop between 750000 and 3749999 when assessment is aboveUAT - zone type is not considered
status: valid
status modified: 2024-09-12
accepted date: 2024-09-12
in scheme: Criteria for determining the minimum number of sampling points for fixed measurement
related pollutant: http://dd.eionet.europa.eu/vocabulary/aq/pollutant/5015
assessment threshold: aboveUAT
minimum population: 750000
maximum population: 3749999
minimum SPO: 2

Minimum requirement for pollutant 5015 for pop between 3750000 and 4749999 when assessment is aboveUAT - zone type is not considered
type: Concept
notation: 84
definition: Minimum requirement for pollutant 5015 for pop between 3750000 and 4749999 when assessment is aboveUAT - zone type is not considered
status: valid
status modified: 2024-09-12
accepted date: 2024-09-12
in scheme: Criteria for determining the minimum number of sampling points for fixed measurement
related pollutant: http://dd.eionet.europa.eu/vocabulary/aq/pollutant/5015
assessment threshold: aboveUAT
minimum population: 3750000
maximum population: 4749999
minimum SPO: 3

Minimum requirement for pollutant 5015 for pop between 4750000 and 5999999 when assessment is aboveUAT - zone type is not considered
type: Concept
notation: 85
definition: Minimum requirement for pollutant 5015 for pop between 4750000 and 5999999 when assessment is aboveUAT - zone type is not considered
status: valid
status modified: 2024-09-12
accepted date: 2024-09-12
in scheme: Criteria for determining the minimum number of sampling points for fixed measurement
related pollutant: http://dd.eionet.europa.eu/vocabulary/aq/pollutant/5015
assessment threshold: aboveUAT
minimum population: 4750000
maximum population: 5999999
minimum SPO: 4

Minimum requirement for pollutant 5015 for pop between 6000000 and 1000000000 when assessment is aboveUAT - zone type is not considered
type: Concept
notation: 86
definition: Minimum requirement for pollutant 5015 for pop between 6000000 and 1000000000 when assessment is aboveUAT - zone type is not considered
status: valid
status modified: 2024-09-12
accepted date: 2024-09-12
in scheme: Criteria for determining the minimum number of sampling points for fixed measurement
related pollutant: http://dd.eionet.europa.eu/vocabulary/aq/pollutant/5015
assessment threshold: aboveUAT
minimum population: 6000000
maximum population: 1000000000
minimum SPO: 5

Minimum requirement for pollutant 5018 for pop between 0 and 3749999 when assessment is LAT-UAT - zone type is not considered
type: Concept
notation: 87
definition: Minimum requirement for pollutant 5018 for pop between 0 and 3749999 when assessment is LAT-UAT - zone type is not considered
status: valid
status modified: 2024-09-12
accepted date: 2024-09-12
in scheme: Criteria for determining the minimum number of sampling points for fixed measurement
related pollutant: http://dd.eionet.europa.eu/vocabulary/aq/pollutant/5018
assessment threshold: LAT-UAT
minimum population: 0
maximum population: 3749999
minimum SPO: 1

Minimum requirement for pollutant 5018 for pop between 3750000 and 1000000000 when assessment is LAT-UAT - zone type is not considered
type: Concept
notation: 88
definition: Minimum requirement for pollutant 5018 for pop between 3750000 and 1000000000 when assessment is LAT-UAT - zone type is not considered
status: valid
status modified: 2024-09-12
accepted date: 2024-09-12
in scheme: Criteria for determining the minimum number of sampling points for fixed measurement
related pollutant: http://dd.eionet.europa.eu/vocabulary/aq/pollutant/5018
assessment threshold: LAT-UAT
minimum population: 3750000
maximum population: 1000000000
minimum SPO: 2

Minimum requirement for pollutant 5018 for pop between 0 and 749999 when assessment is aboveUAT - zone type is not considered
type: Concept
notation: 89
definition: Minimum requirement for pollutant 5018 for pop between 0 and 749999 when assessment is aboveUAT - zone type is not considered
status: valid
status modified: 2024-09-12
accepted date: 2024-09-12
in scheme: Criteria for determining the minimum number of sampling points for fixed measurement
related pollutant: http://dd.eionet.europa.eu/vocabulary/aq/pollutant/5018
assessment threshold: aboveUAT
minimum population: 0
maximum population: 749999
minimum SPO: 1

Minimum requirement for pollutant 5018 for pop between 750000 and 3749999 when assessment is aboveUAT - zone type is not considered
type: Concept
notation: 90
definition: Minimum requirement for pollutant 5018 for pop between 750000 and 3749999 when assessment is aboveUAT - zone type is not considered
status: valid
status modified: 2024-09-12
accepted date: 2024-09-12
in scheme: Criteria for determining the minimum number of sampling points for fixed measurement
related pollutant: http://dd.eionet.europa.eu/vocabulary/aq/pollutant/5018
assessment threshold: aboveUAT
minimum population: 750000
maximum population: 3749999
minimum SPO: 2

Minimum requirement for pollutant 5018 for pop between 3750000 and 4749999 when assessment is aboveUAT - zone type is not considered
type: Concept
notation: 91
definition: Minimum requirement for pollutant 5018 for pop between 3750000 and 4749999 when assessment is aboveUAT - zone type is not considered
status: valid
status modified: 2024-09-12
accepted date: 2024-09-12
in scheme: Criteria for determining the minimum number of sampling points for fixed measurement
related pollutant: http://dd.eionet.europa.eu/vocabulary/aq/pollutant/5018
assessment threshold: aboveUAT
minimum population: 3750000
maximum population: 4749999
minimum SPO: 3

Minimum requirement for pollutant 5018 for pop between 4750000 and 5999999 when assessment is aboveUAT - zone type is not considered
type: Concept
notation: 92
definition: Minimum requirement for pollutant 5018 for pop between 4750000 and 5999999 when assessment is aboveUAT - zone type is not considered
status: valid
status modified: 2024-09-12
accepted date: 2024-09-12
in scheme: Criteria for determining the minimum number of sampling points for fixed measurement
related pollutant: http://dd.eionet.europa.eu/vocabulary/aq/pollutant/5018
assessment threshold: aboveUAT
minimum population: 4750000
maximum population: 5999999
minimum SPO: 4

Minimum requirement for pollutant 5018 for pop between 6000000 and 1000000000 when assessment is aboveUAT - zone type is not considered
type: Concept
notation: 93
definition: Minimum requirement for pollutant 5018 for pop between 6000000 and 1000000000 when assessment is aboveUAT - zone type is not considered
status: valid
status modified: 2024-09-12
accepted date: 2024-09-12
in scheme: Criteria for determining the minimum number of sampling points for fixed measurement
related pollutant: http://dd.eionet.europa.eu/vocabulary/aq/pollutant/5018
assessment threshold: aboveUAT
minimum population: 6000000
maximum population: 1000000000
minimum SPO: 5

Minimum requirement for pollutant 5029 for pop between 0 and 3749999 when assessment is LAT-UAT - zone type is not considered
type: Concept
notation: 94
definition: Minimum requirement for pollutant 5029 for pop between 0 and 3749999 when assessment is LAT-UAT - zone type is not considered
status: valid
status modified: 2024-09-12
accepted date: 2024-09-12
in scheme: Criteria for determining the minimum number of sampling points for fixed measurement
related pollutant: http://dd.eionet.europa.eu/vocabulary/aq/pollutant/5029
assessment threshold: LAT-UAT
minimum population: 0
maximum population: 3749999
minimum SPO: 1

Minimum requirement for pollutant 5029 for pop between 3750000 and 1000000000 when assessment is LAT-UAT - zone type is not considered
type: Concept
notation: 95
definition: Minimum requirement for pollutant 5029 for pop between 3750000 and 1000000000 when assessment is LAT-UAT - zone type is not considered
status: valid
status modified: 2024-09-12
accepted date: 2024-09-12
in scheme: Criteria for determining the minimum number of sampling points for fixed measurement
related pollutant: http://dd.eionet.europa.eu/vocabulary/aq/pollutant/5029
assessment threshold: LAT-UAT
minimum population: 3750000
maximum population: 1000000000
minimum SPO: 2

Minimum requirement for pollutant 5029 for pop between 0 and 749999 when assessment is aboveUAT - zone type is not considered
type: Concept
notation: 96
definition: Minimum requirement for pollutant 5029 for pop between 0 and 749999 when assessment is aboveUAT - zone type is not considered
status: valid
status modified: 2024-09-12
accepted date: 2024-09-12
in scheme: Criteria for determining the minimum number of sampling points for fixed measurement
related pollutant: http://dd.eionet.europa.eu/vocabulary/aq/pollutant/5029
assessment threshold: aboveUAT
minimum population: 0
maximum population: 749999
minimum SPO: 1

Minimum requirement for pollutant 5029 for pop between 750000 and 1999999 when assessment is aboveUAT - zone type is not considered
type: Concept
notation: 97
definition: Minimum requirement for pollutant 5029 for pop between 750000 and 1999999 when assessment is aboveUAT - zone type is not considered
status: valid
status modified: 2024-09-12
accepted date: 2024-09-12
in scheme: Criteria for determining the minimum number of sampling points for fixed measurement
related pollutant: http://dd.eionet.europa.eu/vocabulary/aq/pollutant/5029
assessment threshold: aboveUAT
minimum population: 750000
maximum population: 1999999
minimum SPO: 2

Minimum requirement for pollutant 5029 for pop between 2000000 and 3749999 when assessment is aboveUAT - zone type is not considered
type: Concept
notation: 98
definition: Minimum requirement for pollutant 5029 for pop between 2000000 and 3749999 when assessment is aboveUAT - zone type is not considered
status: valid
status modified: 2024-09-12
accepted date: 2024-09-12
in scheme: Criteria for determining the minimum number of sampling points for fixed measurement
related pollutant: http://dd.eionet.europa.eu/vocabulary/aq/pollutant/5029
assessment threshold: aboveUAT
minimum population: 2000000
maximum population: 3749999
minimum SPO: 3

Minimum requirement for pollutant 5029 for pop between 3750000 and 4749999 when assessment is aboveUAT - zone type is not considered
type: Concept
notation: 99
definition: Minimum requirement for pollutant 5029 for pop between 3750000 and 4749999 when assessment is aboveUAT - zone type is not considered
status: valid
status modified: 2024-09-12
accepted date: 2024-09-12
in scheme: Criteria for determining the minimum number of sampling points for fixed measurement
related pollutant: http://dd.eionet.europa.eu/vocabulary/aq/pollutant/5029
assessment threshold: aboveUAT
minimum population: 3750000
maximum population: 4749999
minimum SPO: 4

Minimum requirement for pollutant 5029 for pop between 4750000 and 1000000000 when assessment is aboveUAT - zone type is not considered
type: Concept
notation: 100
definition: Minimum requirement for pollutant 5029 for pop between 4750000 and 1000000000 when assessment is aboveUAT - zone type is not considered
status: valid
status modified: 2024-09-12
accepted date: 2024-09-12
in scheme: Criteria for determining the minimum number of sampling points for fixed measurement
related pollutant: http://dd.eionet.europa.eu/vocabulary/aq/pollutant/5029
assessment threshold: aboveUAT
minimum population: 4750000
maximum population: 1000000000
minimum SPO: 5

Minimum requirement for pollutant 6001 for pop between 0 and 249999 when assessment is LAT-UAT - zone type is not considered
type: Concept
notation: 101
definition: Minimum requirement for pollutant 6001 for pop between 0 and 249999 when assessment is LAT-UAT - zone type is not considered
status: valid
status modified: 2024-09-12
accepted date: 2024-09-12
in scheme: Criteria for determining the minimum number of sampling points for fixed measurement
related pollutant: http://dd.eionet.europa.eu/vocabulary/aq/pollutant/6001
assessment threshold: LAT-UAT
minimum population: 0
maximum population: 249999
minimum SPO: 1

Minimum requirement for pollutant 6001 for pop between 250000 and 999999 when assessment is LAT-UAT - zone type is not considered
type: Concept
notation: 102
definition: Minimum requirement for pollutant 6001 for pop between 250000 and 999999 when assessment is LAT-UAT - zone type is not considered
status: valid
status modified: 2024-09-12
accepted date: 2024-09-12
in scheme: Criteria for determining the minimum number of sampling points for fixed measurement
related pollutant: http://dd.eionet.europa.eu/vocabulary/aq/pollutant/6001
assessment threshold: LAT-UAT
minimum population: 250000
maximum population: 999999
minimum SPO: 2

Minimum requirement for pollutant 6001 for pop between 1000000 and 1999999 when assessment is LAT-UAT - zone type is not considered
type: Concept
notation: 103
definition: Minimum requirement for pollutant 6001 for pop between 1000000 and 1999999 when assessment is LAT-UAT - zone type is not considered
status: valid
status modified: 2024-09-12
accepted date: 2024-09-12
in scheme: Criteria for determining the minimum number of sampling points for fixed measurement
related pollutant: http://dd.eionet.europa.eu/vocabulary/aq/pollutant/6001
assessment threshold: LAT-UAT
minimum population: 1000000
maximum population: 1999999
minimum SPO: 3

Minimum requirement for pollutant 6001 for pop between 2000000 and 3749999 when assessment is LAT-UAT - zone type is not considered
type: Concept
notation: 104
definition: Minimum requirement for pollutant 6001 for pop between 2000000 and 3749999 when assessment is LAT-UAT - zone type is not considered
status: valid
status modified: 2024-09-12
accepted date: 2024-09-12
in scheme: Criteria for determining the minimum number of sampling points for fixed measurement
related pollutant: http://dd.eionet.europa.eu/vocabulary/aq/pollutant/6001
assessment threshold: LAT-UAT
minimum population: 2000000
maximum population: 3749999
minimum SPO: 4

Minimum requirement for pollutant 6001 for pop between 3750000 and 5999999 when assessment is LAT-UAT - zone type is not considered
type: Concept
notation: 105
definition: Minimum requirement for pollutant 6001 for pop between 3750000 and 5999999 when assessment is LAT-UAT - zone type is not considered
status: valid
status modified: 2024-09-12
accepted date: 2024-09-12
in scheme: Criteria for determining the minimum number of sampling points for fixed measurement
related pollutant: http://dd.eionet.europa.eu/vocabulary/aq/pollutant/6001
assessment threshold: LAT-UAT
minimum population: 3750000
maximum population: 5999999
minimum SPO: 6

Minimum requirement for pollutant 6001 for pop between 6000000 and 1000000000 when assessment is LAT-UAT - zone type is not considered
type: Concept
notation: 106
definition: Minimum requirement for pollutant 6001 for pop between 6000000 and 1000000000 when assessment is LAT-UAT - zone type is not considered
status: valid
status modified: 2024-09-12
accepted date: 2024-09-12
in scheme: Criteria for determining the minimum number of sampling points for fixed measurement
related pollutant: http://dd.eionet.europa.eu/vocabulary/aq/pollutant/6001
assessment threshold: LAT-UAT
minimum population: 6000000
maximum population: 1000000000
minimum SPO: 7

Minimum requirement for pollutant 6001 for pop between 0 and 249999 when assessment is aboveUAT - zone type is not considered
type: Concept
notation: 107
definition: Minimum requirement for pollutant 6001 for pop between 0 and 249999 when assessment is aboveUAT - zone type is not considered
status: valid
status modified: 2024-09-12
accepted date: 2024-09-12
in scheme: Criteria for determining the minimum number of sampling points for fixed measurement
related pollutant: http://dd.eionet.europa.eu/vocabulary/aq/pollutant/6001
assessment threshold: aboveUAT
minimum population: 0
maximum population: 249999
minimum SPO: 2

Minimum requirement for pollutant 6001 for pop between 250000 and 749999 when assessment is aboveUAT - zone type is not considered
type: Concept
notation: 108
definition: Minimum requirement for pollutant 6001 for pop between 250000 and 749999 when assessment is aboveUAT - zone type is not considered
status: valid
status modified: 2024-09-12
accepted date: 2024-09-12
in scheme: Criteria for determining the minimum number of sampling points for fixed measurement
related pollutant: http://dd.eionet.europa.eu/vocabulary/aq/pollutant/6001
assessment threshold: aboveUAT
minimum population: 250000
maximum population: 749999
minimum SPO: 3

Minimum requirement for pollutant 6001 for pop between 750000 and 999999 when assessment is aboveUAT - zone type is not considered
type: Concept
notation: 109
definition: Minimum requirement for pollutant 6001 for pop between 750000 and 999999 when assessment is aboveUAT - zone type is not considered
status: valid
status modified: 2024-09-12
accepted date: 2024-09-12
in scheme: Criteria for determining the minimum number of sampling points for fixed measurement
related pollutant: http://dd.eionet.europa.eu/vocabulary/aq/pollutant/6001
assessment threshold: aboveUAT
minimum population: 750000
maximum population: 999999
minimum SPO: 4

Minimum requirement for pollutant 6001 for pop between 1000000 and 1499999 when assessment is aboveUAT - zone type is not considered
type: Concept
notation: 110
definition: Minimum requirement for pollutant 6001 for pop between 1000000 and 1499999 when assessment is aboveUAT - zone type is not considered
status: valid
status modified: 2024-09-12
accepted date: 2024-09-12
in scheme: Criteria for determining the minimum number of sampling points for fixed measurement
related pollutant: http://dd.eionet.europa.eu/vocabulary/aq/pollutant/6001
assessment threshold: aboveUAT
minimum population: 1000000
maximum population: 1499999
minimum SPO: 6

Minimum requirement for pollutant 6001 for pop between 1500000 and 1999999 when assessment is aboveUAT - zone type is not considered
type: Concept
notation: 111
definition: Minimum requirement for pollutant 6001 for pop between 1500000 and 1999999 when assessment is aboveUAT - zone type is not considered
status: valid
status modified: 2024-09-12
accepted date: 2024-09-12
in scheme: Criteria for determining the minimum number of sampling points for fixed measurement
related pollutant: http://dd.eionet.europa.eu/vocabulary/aq/pollutant/6001
assessment threshold: aboveUAT
minimum population: 1500000
maximum population: 1999999
minimum SPO: 7

Minimum requirement for pollutant 6001 for pop between 2000000 and 2749999 when assessment is aboveUAT - zone type is not considered
type: Concept
notation: 112
definition: Minimum requirement for pollutant 6001 for pop between 2000000 and 2749999 when assessment is aboveUAT - zone type is not considered
status: valid
status modified: 2024-09-12
accepted date: 2024-09-12
in scheme: Criteria for determining the minimum number of sampling points for fixed measurement
related pollutant: http://dd.eionet.europa.eu/vocabulary/aq/pollutant/6001
assessment threshold: aboveUAT
minimum population: 2000000
maximum population: 2749999
minimum SPO: 8

Minimum requirement for pollutant 6001 for pop between 2750000 and 3749999 when assessment is aboveUAT - zone type is not considered
type: Concept
notation: 113
definition: Minimum requirement for pollutant 6001 for pop between 2750000 and 3749999 when assessment is aboveUAT - zone type is not considered
status: valid
status modified: 2024-09-12
accepted date: 2024-09-12
in scheme: Criteria for determining the minimum number of sampling points for fixed measurement
related pollutant: http://dd.eionet.europa.eu/vocabulary/aq/pollutant/6001
assessment threshold: aboveUAT
minimum population: 2750000
maximum population: 3749999
minimum SPO: 10

Minimum requirement for pollutant 6001 for pop between 3750000 and 4749999 when assessment is aboveUAT - zone type is not considered
type: Concept
notation: 114
definition: Minimum requirement for pollutant 6001 for pop between 3750000 and 4749999 when assessment is aboveUAT - zone type is not considered
status: valid
status modified: 2024-09-12
accepted date: 2024-09-12
in scheme: Criteria for determining the minimum number of sampling points for fixed measurement
related pollutant: http://dd.eionet.europa.eu/vocabulary/aq/pollutant/6001
assessment threshold: aboveUAT
minimum population: 3750000
maximum population: 4749999
minimum SPO: 11

Minimum requirement for pollutant 6001 for pop between 4750000 and 5999999 when assessment is aboveUAT - zone type is not considered
type: Concept
notation: 115
definition: Minimum requirement for pollutant 6001 for pop between 4750000 and 5999999 when assessment is aboveUAT - zone type is not considered
status: valid
status modified: 2024-09-12
accepted date: 2024-09-12
in scheme: Criteria for determining the minimum number of sampling points for fixed measurement
related pollutant: http://dd.eionet.europa.eu/vocabulary/aq/pollutant/6001
minimum population: 4750000
maximum population: 5999999
minimum SPO: 13

Minimum requirement for pollutant 6001 for pop between 6000000 and 1000000000 when assessment is aboveUAT - zone type is not considered
type: Concept
notation: 116
definition: Minimum requirement for pollutant 6001 for pop between 6000000 and 1000000000 when assessment is aboveUAT - zone type is not considered
status: valid
status modified: 2024-09-12
accepted date: 2024-09-12
in scheme: Criteria for determining the minimum number of sampling points for fixed measurement
related pollutant: http://dd.eionet.europa.eu/vocabulary/aq/pollutant/6001
minimum population: 6000000
maximum population: 1000000000
minimum SPO: 15

Minimum requirement for pollutant 7 for pop between 0 and 249999 when assessment is - zone type is agg
type: Concept
notation: 117
definition: Minimum requirement for pollutant 7 for pop between 0 and 249999 when assessment is - zone type is agg
status: valid
status modified: 2024-09-12
accepted date: 2024-09-12
in scheme: Criteria for determining the minimum number of sampling points for fixed measurement
related pollutant: http://dd.eionet.europa.eu/vocabulary/aq/pollutant/7
minimum population: 0
maximum population: 249999
aq zonetype: agg
minimum SPO: 0

Minimum requirement for pollutant 7 for pop between 0 and 249999 when assessment is - zone type is noagg
type: Concept
notation: 118
definition: Minimum requirement for pollutant 7 for pop between 0 and 249999 when assessment is - zone type is noagg
status: valid
status modified: 2024-09-12
accepted date: 2024-09-12
in scheme: Criteria for determining the minimum number of sampling points for fixed measurement
related pollutant: http://dd.eionet.europa.eu/vocabulary/aq/pollutant/7
minimum population: 0
maximum population: 249999
aq zonetype: noagg
minimum SPO: 1

Minimum requirement for pollutant 7 for pop between 249999 and 499999 when assessment is - zone type is agg
type: Concept
notation: 119
definition: Minimum requirement for pollutant 7 for pop between 249999 and 499999 when assessment is - zone type is agg
status: valid
status modified: 2024-09-12
accepted date: 2024-09-12
in scheme: Criteria for determining the minimum number of sampling points for fixed measurement
related pollutant: http://dd.eionet.europa.eu/vocabulary/aq/pollutant/7
minimum population: 249999
maximum population: 499999
aq zonetype: agg
minimum SPO: 1

Minimum requirement for pollutant 7 for pop between 249999 and 999999 when assessment is - zone type is agg
type: Concept
notation: 120
definition: Minimum requirement for pollutant 7 for pop between 249999 and 999999 when assessment is - zone type is agg
status: valid
status modified: 2024-09-12
accepted date: 2024-09-12
in scheme: Criteria for determining the minimum number of sampling points for fixed measurement
related pollutant: http://dd.eionet.europa.eu/vocabulary/aq/pollutant/7
minimum population: 249999
maximum population: 999999
aq zonetype: noagg
minimum SPO: 2

Minimum requirement for pollutant 7 for pop between 499999 and 999999 when assessment is - zone type is noagg
type: Concept
notation: 121
definition: Minimum requirement for pollutant 7 for pop between 499999 and 999999 when assessment is - zone type is noagg
status: valid
status modified: 2024-09-12
accepted date: 2024-09-12
in scheme: Criteria for determining the minimum number of sampling points for fixed measurement
related pollutant: http://dd.eionet.europa.eu/vocabulary/aq/pollutant/7
minimum population: 499999
maximum population: 999999
aq zonetype: agg
minimum SPO: 2

Minimum requirement for pollutant 7 for pop between 999999 and 1499999 when assessment is - zone type is noagg
type: Concept
notation: 122
definition: Minimum requirement for pollutant 7 for pop between 999999 and 1499999 when assessment is - zone type is noagg
status: valid
status modified: 2024-09-12
accepted date: 2024-09-12
in scheme: Criteria for determining the minimum number of sampling points for fixed measurement
related pollutant: http://dd.eionet.europa.eu/vocabulary/aq/pollutant/7
minimum population: 999999
maximum population: 1499999
aq zonetype: noagg
minimum SPO: 3

Minimum requirement for pollutant 7 for pop between 999999 and 1999999 when assessment is - zone type is agg
type: Concept
notation: 123
definition: Minimum requirement for pollutant 7 for pop between 999999 and 1999999 when assessment is - zone type is agg
status: valid
status modified: 2024-09-12
accepted date: 2024-09-12
in scheme: Criteria for determining the minimum number of sampling points for fixed measurement
related pollutant: http://dd.eionet.europa.eu/vocabulary/aq/pollutant/7
minimum population: 999999
maximum population: 1999999
aq zonetype: agg
minimum SPO: 3

Minimum requirement for pollutant 7 for pop between 1499999 and 1999999 when assessment is - zone type is noagg
type: Concept
notation: 124
definition: Minimum requirement for pollutant 7 for pop between 1499999 and 1999999 when assessment is - zone type is noagg
status: valid
status modified: 2024-09-12
accepted date: 2024-09-12
in scheme: Criteria for determining the minimum number of sampling points for fixed measurement
related pollutant: http://dd.eionet.europa.eu/vocabulary/aq/pollutant/7
minimum population: 1499999
maximum population: 1999999
aq zonetype: noagg
minimum SPO: 4

Minimum requirement for pollutant 7 for pop between 1999999 and 2749999 when assessment is - zone type is agg
type: Concept
notation: 125
definition: Minimum requirement for pollutant 7 for pop between 1999999 and 2749999 when assessment is - zone type is agg
status: valid
status modified: 2024-09-12
accepted date: 2024-09-12
in scheme: Criteria for determining the minimum number of sampling points for fixed measurement
related pollutant: http://dd.eionet.europa.eu/vocabulary/aq/pollutant/7
minimum population: 1999999
maximum population: 2749999
aq zonetype: agg
minimum SPO: 4

Minimum requirement for pollutant 7 for pop between 1999999 and 2749999 when assessment is - zone type is noagg
type: Concept
notation: 126
definition: Minimum requirement for pollutant 7 for pop between 1999999 and 2749999 when assessment is - zone type is noagg
status: valid
status modified: 2024-09-12
accepted date: 2024-09-12
in scheme: Criteria for determining the minimum number of sampling points for fixed measurement
related pollutant: http://dd.eionet.europa.eu/vocabulary/aq/pollutant/7
minimum population: 1999999
maximum population: 2749999
aq zonetype: noagg
minimum SPO: 5

Minimum requirement for pollutant 7 for pop between (3+2)749999 and 2749999 when assessment is - zone type is agg
type: Concept
notation: 127
definition: Minimum requirement for pollutant 7 for pop between (3+2)749999 and 2749999 when assessment is - zone type is agg
status: valid
status modified: 2024-09-12
accepted date: 2024-09-12
in scheme: Criteria for determining the minimum number of sampling points for fixed measurement
related pollutant: http://dd.eionet.europa.eu/vocabulary/aq/pollutant/7
minimum population: 2749999
maximum population: 5749999
aq zonetype: agg
minimum SPO: 5

Minimum requirement for pollutant 7 for pop between (3+2)749999 and 2749999 when assessment is - zone type is noagg
type: Concept
notation: 128
definition: Minimum requirement for pollutant 7 for pop between (3+2)749999 and 2749999 when assessment is - zone type is noagg
status: valid
status modified: 2024-09-12
accepted date: 2024-09-12
in scheme: Criteria for determining the minimum number of sampling points for fixed measurement
related pollutant: http://dd.eionet.europa.eu/vocabulary/aq/pollutant/7
minimum population: 2749999
maximum population: 5749999
aq zonetype: noagg
minimum SPO: 6

Minimum requirement for pollutant 7 for pop between (3+4)749999 and 5749999 when assessment is - zone type is agg
type: Concept
notation: 129
definition: Minimum requirement for pollutant 7 for pop between (3+4)749999 and 5749999 when assessment is - zone type is agg
status: valid
status modified: 2024-09-12
accepted date: 2024-09-12
in scheme: Criteria for determining the minimum number of sampling points for fixed measurement
related pollutant: http://dd.eionet.europa.eu/vocabulary/aq/pollutant/7
minimum population: 5749999
maximum population: 7749999
aq zonetype: agg
minimum SPO: 6

Minimum requirement for pollutant 7 for pop between (3+4)749999 and 5749999 when assessment is - zone type is noagg
type: Concept
notation: 130
definition: Minimum requirement for pollutant 7 for pop between (3+4)749999 and 5749999 when assessment is - zone type is noagg
status: valid
status modified: 2024-09-12
accepted date: 2024-09-12
in scheme: Criteria for determining the minimum number of sampling points for fixed measurement
related pollutant: http://dd.eionet.europa.eu/vocabulary/aq/pollutant/7
minimum population: 5749999
maximum population: 7749999
aq zonetype: noagg
minimum SPO: 7

Minimum requirement for pollutant 7 for pop between (3+6)749999 and 7749999 when assessment is - zone type is agg
type: Concept
notation: 131
definition: Minimum requirement for pollutant 7 for pop between (3+6)749999 and 7749999 when assessment is - zone type is agg
status: valid
status modified: 2024-09-12
accepted date: 2024-09-12
in scheme: Criteria for determining the minimum number of sampling points for fixed measurement
related pollutant: http://dd.eionet.europa.eu/vocabulary/aq/pollutant/7
minimum population: 7749999
maximum population: 9749999
aq zonetype: agg
minimum SPO: 7

Minimum requirement for pollutant 7 for pop between (3+6)749999 and 7749999 when assessment is - zone type is noagg
type: Concept
notation: 132
definition: Minimum requirement for pollutant 7 for pop between (3+6)749999 and 7749999 when assessment is - zone type is noagg
status: valid
status modified: 2024-09-12
accepted date: 2024-09-12
in scheme: Criteria for determining the minimum number of sampling points for fixed measurement
related pollutant: http://dd.eionet.europa.eu/vocabulary/aq/pollutant/7
minimum population: 7749999
maximum population: 9749999
aq zonetype: noagg
minimum SPO: 8

Minimum requirement for pollutant 7 for pop between (3+8)749999 and 9749999 when assessment is - zone type is agg
type: Concept
notation: 133
definition: Minimum requirement for pollutant 7 for pop between (3+8)749999 and 9749999 when assessment is - zone type is agg
status: valid
status modified: 2024-09-12
accepted date: 2024-09-12
in scheme: Criteria for determining the minimum number of sampling points for fixed measurement
related pollutant: http://dd.eionet.europa.eu/vocabulary/aq/pollutant/7
minimum population: 9749999
maximum population: 11749999
aq zonetype: agg
minimum SPO: 8

Minimum requirement for pollutant 7 for pop between (3+8)749999 and 9749999 when assessment is - zone type is noagg
type: Concept
notation: 134
definition: Minimum requirement for pollutant 7 for pop between (3+8)749999 and 9749999 when assessment is - zone type is noagg
status: valid
status modified: 2024-09-12
accepted date: 2024-09-12
in scheme: Criteria for determining the minimum number of sampling points for fixed measurement
related pollutant: http://dd.eionet.europa.eu/vocabulary/aq/pollutant/7
minimum population: 9749999
maximum population: 11749999
aq zonetype: noagg
minimum SPO: 9

Minimum requirement for pollutant 7 for pop between (3+10)749999 and 11749999 when assessment is - zone type is agg
type: Concept
notation: 135
definition: Minimum requirement for pollutant 7 for pop between (3+10)749999 and 11749999 when assessment is - zone type is agg
status: valid
status modified: 2024-09-12
accepted date: 2024-09-12
in scheme: Criteria for determining the minimum number of sampling points for fixed measurement
related pollutant: http://dd.eionet.europa.eu/vocabulary/aq/pollutant/7
assessment threshold: aboveLTO
minimum population: 11749999
maximum population: 13749999
aq zonetype: agg
minimum SPO: 9

Minimum requirement for pollutant 7 for pop between 9749999 and 11749999 when assessment is - zone type is noagg
type: Concept
notation: 136
definition: Minimum requirement for pollutant 7 for pop between 9749999 and 11749999 when assessment is - zone type is noagg
status: valid
status modified: 2024-09-12
accepted date: 2024-09-12
in scheme: Criteria for determining the minimum number of sampling points for fixed measurement
related pollutant: http://dd.eionet.europa.eu/vocabulary/aq/pollutant/7
assessment threshold: aboveLTO
minimum population: 11749999
maximum population: 13749999
aq zonetype: noagg
minimum SPO: 10

Minimum requirement for pollutant 8 for pop between 0 and 999999 when assessment is LAT-UAT - zone type is not considered
type: Concept
notation: 137
definition: Minimum requirement for pollutant 8 for pop between 0 and 999999 when assessment is LAT-UAT - zone type is not considered
status: valid
status modified: 2024-09-12
accepted date: 2024-09-12
in scheme: Criteria for determining the minimum number of sampling points for fixed measurement
related pollutant: http://dd.eionet.europa.eu/vocabulary/aq/pollutant/8
assessment threshold: LAT-UAT
minimum population: 0
maximum population: 999999
minimum SPO: 1

Minimum requirement for pollutant 8 for pop between 1000000 and 1999999 when assessment is LAT-UAT - zone type is not considered
type: Concept
notation: 138
definition: Minimum requirement for pollutant 8 for pop between 1000000 and 1999999 when assessment is LAT-UAT - zone type is not considered
status: valid
status modified: 2024-09-12
accepted date: 2024-09-12
in scheme: Criteria for determining the minimum number of sampling points for fixed measurement
related pollutant: http://dd.eionet.europa.eu/vocabulary/aq/pollutant/8
assessment threshold: LAT-UAT
minimum population: 1000000
maximum population: 1999999
minimum SPO: 2

Minimum requirement for pollutant 8 for pop between 2000000 and 4749999 when assessment is LAT-UAT - zone type is not considered
type: Concept
notation: 139
definition: Minimum requirement for pollutant 8 for pop between 2000000 and 4749999 when assessment is LAT-UAT - zone type is not considered
status: valid
status modified: 2024-09-12
accepted date: 2024-09-12
in scheme: Criteria for determining the minimum number of sampling points for fixed measurement
related pollutant: http://dd.eionet.europa.eu/vocabulary/aq/pollutant/8
assessment threshold: LAT-UAT
minimum population: 2000000
maximum population: 4749999
minimum SPO: 3

Minimum requirement for pollutant 8 for pop between 4750000 and 1000000000 when assessment is LAT-UAT - zone type is not considered
type: Concept
notation: 140
definition: Minimum requirement for pollutant 8 for pop between 4750000 and 1000000000 when assessment is LAT-UAT - zone type is not considered
status: valid
status modified: 2024-09-12
accepted date: 2024-09-12
in scheme: Criteria for determining the minimum number of sampling points for fixed measurement
related pollutant: http://dd.eionet.europa.eu/vocabulary/aq/pollutant/8
assessment threshold: LAT-UAT
minimum population: 4750000
maximum population: 1000000000
minimum SPO: 4

Minimum requirement for pollutant 8 for pop between 0 and 249999 when assessment is aboveUAT - zone type is not considered
type: Concept
notation: 141
definition: Minimum requirement for pollutant 8 for pop between 0 and 249999 when assessment is aboveUAT - zone type is not considered
status: valid
status modified: 2024-09-12
accepted date: 2024-09-12
in scheme: Criteria for determining the minimum number of sampling points for fixed measurement
related pollutant: http://dd.eionet.europa.eu/vocabulary/aq/pollutant/8
assessment threshold: aboveUAT
minimum population: 0
maximum population: 249999
minimum SPO: 1

Minimum requirement for pollutant 8 for pop between 250000 and 749999 when assessment is aboveUAT - zone type is not considered
type: Concept
notation: 142
definition: Minimum requirement for pollutant 8 for pop between 250000 and 749999 when assessment is aboveUAT - zone type is not considered
status: valid
status modified: 2024-09-12
accepted date: 2024-09-12
in scheme: Criteria for determining the minimum number of sampling points for fixed measurement
related pollutant: http://dd.eionet.europa.eu/vocabulary/aq/pollutant/8
assessment threshold: aboveUAT
minimum population: 250000
maximum population: 749999
minimum SPO: 2

Minimum requirement for pollutant 8 for pop between 750000 and 999999 when assessment is aboveUAT - zone type is not considered
type: Concept
notation: 143
definition: Minimum requirement for pollutant 8 for pop between 750000 and 999999 when assessment is aboveUAT - zone type is not considered
status: valid
status modified: 2024-09-12
accepted date: 2024-09-12
in scheme: Criteria for determining the minimum number of sampling points for fixed measurement
related pollutant: http://dd.eionet.europa.eu/vocabulary/aq/pollutant/8
assessment threshold: aboveUAT
minimum population: 750000
maximum population: 999999
minimum SPO: 3

Minimum requirement for pollutant 8 for pop between 1000000 and 1499999 when assessment is aboveUAT - zone type is not considered
type: Concept
notation: 144
definition: Minimum requirement for pollutant 8 for pop between 1000000 and 1499999 when assessment is aboveUAT - zone type is not considered
status: valid
status modified: 2024-09-12
accepted date: 2024-09-12
in scheme: Criteria for determining the minimum number of sampling points for fixed measurement
related pollutant: http://dd.eionet.europa.eu/vocabulary/aq/pollutant/8
assessment threshold: aboveUAT
minimum population: 1000000
maximum population: 1499999
minimum SPO: 4

Minimum requirement for pollutant 8 for pop between 1500000 and 1999999 when assessment is aboveUAT - zone type is not considered
type: Concept
notation: 145
definition: Minimum requirement for pollutant 8 for pop between 1500000 and 1999999 when assessment is aboveUAT - zone type is not considered
status: valid
status modified: 2024-09-12
accepted date: 2024-09-12
in scheme: Criteria for determining the minimum number of sampling points for fixed measurement
related pollutant: http://dd.eionet.europa.eu/vocabulary/aq/pollutant/8
assessment threshold: aboveUAT
minimum population: 1500000
maximum population: 1999999
minimum SPO: 5

Minimum requirement for pollutant 8 for pop between 2000000 and 2749999 when assessment is aboveUAT - zone type is not considered
type: Concept
notation: 146
definition: Minimum requirement for pollutant 8 for pop between 2000000 and 2749999 when assessment is aboveUAT - zone type is not considered
status: valid
status modified: 2024-09-12
accepted date: 2024-09-12
in scheme: Criteria for determining the minimum number of sampling points for fixed measurement
related pollutant: http://dd.eionet.europa.eu/vocabulary/aq/pollutant/8
assessment threshold: aboveUAT
minimum population: 2000000
maximum population: 2749999
minimum SPO: 6

Minimum requirement for pollutant 8 for pop between 2750000 and 3749999 when assessment is aboveUAT - zone type is not considered
type: Concept
notation: 147
definition: Minimum requirement for pollutant 8 for pop between 2750000 and 3749999 when assessment is aboveUAT - zone type is not considered
status: valid
status modified: 2024-09-12
accepted date: 2024-09-12
in scheme: Criteria for determining the minimum number of sampling points for fixed measurement
related pollutant: http://dd.eionet.europa.eu/vocabulary/aq/pollutant/8
assessment threshold: aboveUAT
minimum population: 2750000
maximum population: 3749999
minimum SPO: 7

Minimum requirement for pollutant 8 for pop between 3750000 and 4749999 when assessment is aboveUAT - zone type is not considered
type: Concept
notation: 148
definition: Minimum requirement for pollutant 8 for pop between 3750000 and 4749999 when assessment is aboveUAT - zone type is not considered
status: valid
status modified: 2024-09-12
accepted date: 2024-09-12
in scheme: Criteria for determining the minimum number of sampling points for fixed measurement
related pollutant: http://dd.eionet.europa.eu/vocabulary/aq/pollutant/8
assessment threshold: aboveUAT
minimum population: 3750000
maximum population: 4749999
minimum SPO: 8

Minimum requirement for pollutant 8 for pop between 4750000 and 5999999 when assessment is aboveUAT - zone type is not considered
type: Concept
notation: 149
definition: Minimum requirement for pollutant 8 for pop between 4750000 and 5999999 when assessment is aboveUAT - zone type is not considered
status: valid
status modified: 2024-09-12
accepted date: 2024-09-12
in scheme: Criteria for determining the minimum number of sampling points for fixed measurement
related pollutant: http://dd.eionet.europa.eu/vocabulary/aq/pollutant/8
assessment threshold: aboveUAT
minimum population: 4750000
maximum population: 5999999
minimum SPO: 9

Minimum requirement for pollutant 8 for pop between 6000000 and 1000000000 when assessment is aboveUAT - zone type is not considered
type: Concept
notation: 150
definition: Minimum requirement for pollutant 8 for pop between 6000000 and 1000000000 when assessment is aboveUAT - zone type is not considered
status: valid
status modified: 2024-09-12
accepted date: 2024-09-12
in scheme: Criteria for determining the minimum number of sampling points for fixed measurement
related pollutant: http://dd.eionet.europa.eu/vocabulary/aq/pollutant/8
assessment threshold: aboveUAT
minimum population: 6000000
maximum population: 1000000000
minimum SPO: 10

Minimum requirement for pollutant 9 for pop between 0 and 999999 when assessment is LAT-UAT - zone type is not considered
type: Concept
notation: 151
definition: Minimum requirement for pollutant 9 for pop between 0 and 999999 when assessment is LAT-UAT - zone type is not considered
status: valid
status modified: 2024-09-12
accepted date: 2024-09-12
in scheme: Criteria for determining the minimum number of sampling points for fixed measurement
related pollutant: http://dd.eionet.europa.eu/vocabulary/aq/pollutant/9
assessment threshold: LAT-UAT
minimum population: 0
maximum population: 999999
minimum SPO: 1

Minimum requirement for pollutant 9 for pop between 1000000 and 1999999 when assessment is LAT-UAT - zone type is not considered
type: Concept
notation: 152
definition: Minimum requirement for pollutant 9 for pop between 1000000 and 1999999 when assessment is LAT-UAT - zone type is not considered
status: valid
status modified: 2024-09-12
accepted date: 2024-09-12
in scheme: Criteria for determining the minimum number of sampling points for fixed measurement
related pollutant: http://dd.eionet.europa.eu/vocabulary/aq/pollutant/9
assessment threshold: LAT-UAT
minimum population: 1000000
maximum population: 1999999
minimum SPO: 2

Minimum requirement for pollutant 9 for pop between 2000000 and 4749999 when assessment is LAT-UAT - zone type is not considered
type: Concept
notation: 153
definition: Minimum requirement for pollutant 9 for pop between 2000000 and 4749999 when assessment is LAT-UAT - zone type is not considered
status: valid
status modified: 2024-09-12
accepted date: 2024-09-12
in scheme: Criteria for determining the minimum number of sampling points for fixed measurement
related pollutant: http://dd.eionet.europa.eu/vocabulary/aq/pollutant/9
assessment threshold: LAT-UAT
minimum population: 2000000
maximum population: 4749999
minimum SPO: 3

Minimum requirement for pollutant 9 for pop between 4750000 and 1000000000 when assessment is LAT-UAT - zone type is not considered
type: Concept
notation: 154
definition: Minimum requirement for pollutant 9 for pop between 4750000 and 1000000000 when assessment is LAT-UAT - zone type is not considered
status: valid
status modified: 2024-09-12
accepted date: 2024-09-12
in scheme: Criteria for determining the minimum number of sampling points for fixed measurement
related pollutant: http://dd.eionet.europa.eu/vocabulary/aq/pollutant/9
assessment threshold: LAT-UAT
minimum population: 4750000
maximum population: 1000000000
minimum SPO: 4

Minimum requirement for pollutant 9 for pop between 0 and 249999 when assessment is aboveUAT - zone type is not considered
type: Concept
notation: 155
definition: Minimum requirement for pollutant 9 for pop between 0 and 249999 when assessment is aboveUAT - zone type is not considered
status: valid
status modified: 2024-09-12
accepted date: 2024-09-12
in scheme: Criteria for determining the minimum number of sampling points for fixed measurement
related pollutant: http://dd.eionet.europa.eu/vocabulary/aq/pollutant/9
assessment threshold: aboveUAT
minimum population: 0
maximum population: 249999
minimum SPO: 1

Minimum requirement for pollutant 9 for pop between 250000 and 749999 when assessment is aboveUAT - zone type is not considered
type: Concept
notation: 156
definition: Minimum requirement for pollutant 9 for pop between 250000 and 749999 when assessment is aboveUAT - zone type is not considered
status: valid
status modified: 2024-09-12
accepted date: 2024-09-12
in scheme: Criteria for determining the minimum number of sampling points for fixed measurement
related pollutant: http://dd.eionet.europa.eu/vocabulary/aq/pollutant/9
assessment threshold: aboveUAT
minimum population: 250000
maximum population: 749999
minimum SPO: 2

Minimum requirement for pollutant 9 for pop between 750000 and 999999 when assessment is aboveUAT - zone type is not considered
type: Concept
notation: 157
definition: Minimum requirement for pollutant 9 for pop between 750000 and 999999 when assessment is aboveUAT - zone type is not considered
status: valid
status modified: 2024-09-12
accepted date: 2024-09-12
in scheme: Criteria for determining the minimum number of sampling points for fixed measurement
related pollutant: http://dd.eionet.europa.eu/vocabulary/aq/pollutant/9
assessment threshold: aboveUAT
minimum population: 750000
maximum population: 999999
minimum SPO: 3

Minimum requirement for pollutant 9 for pop between 1000000 and 1499999 when assessment is aboveUAT - zone type is not considered
type: Concept
notation: 158
definition: Minimum requirement for pollutant 9 for pop between 1000000 and 1499999 when assessment is aboveUAT - zone type is not considered
status: valid
status modified: 2024-09-12
accepted date: 2024-09-12
in scheme: Criteria for determining the minimum number of sampling points for fixed measurement
related pollutant: http://dd.eionet.europa.eu/vocabulary/aq/pollutant/9
assessment threshold: aboveUAT
minimum population: 1000000
maximum population: 1499999
minimum SPO: 4

Minimum requirement for pollutant 9 for pop between 1500000 and 1999999 when assessment is aboveUAT - zone type is not considered
type: Concept
notation: 159
definition: Minimum requirement for pollutant 9 for pop between 1500000 and 1999999 when assessment is aboveUAT - zone type is not considered
status: valid
status modified: 2024-09-12
accepted date: 2024-09-12
in scheme: Criteria for determining the minimum number of sampling points for fixed measurement
related pollutant: http://dd.eionet.europa.eu/vocabulary/aq/pollutant/9
assessment threshold: aboveUAT
minimum population: 1500000
maximum population: 1999999
minimum SPO: 5

Minimum requirement for pollutant 9 for pop between 2000000 and 2749999 when assessment is aboveUAT - zone type is not considered
type: Concept
notation: 160
definition: Minimum requirement for pollutant 9 for pop between 2000000 and 2749999 when assessment is aboveUAT - zone type is not considered
status: valid
status modified: 2024-09-12
accepted date: 2024-09-12
in scheme: Criteria for determining the minimum number of sampling points for fixed measurement
related pollutant: http://dd.eionet.europa.eu/vocabulary/aq/pollutant/9
assessment threshold: aboveUAT
minimum population: 2000000
maximum population: 2749999
minimum SPO: 6

Minimum requirement for pollutant 9 for pop between 2750000 and 3749999 when assessment is aboveUAT - zone type is not considered
type: Concept
notation: 161
definition: Minimum requirement for pollutant 9 for pop between 2750000 and 3749999 when assessment is aboveUAT - zone type is not considered
status: valid
status modified: 2024-09-12
accepted date: 2024-09-12
in scheme: Criteria for determining the minimum number of sampling points for fixed measurement
related pollutant: http://dd.eionet.europa.eu/vocabulary/aq/pollutant/9
assessment threshold: aboveUAT
minimum population: 2750000
maximum population: 3749999
minimum SPO: 7

Minimum requirement for pollutant 9 for pop between 3750000 and 4749999 when assessment is aboveUAT - zone type is not considered
type: Concept
notation: 162
definition: Minimum requirement for pollutant 9 for pop between 3750000 and 4749999 when assessment is aboveUAT - zone type is not considered
status: valid
status modified: 2024-09-12
accepted date: 2024-09-12
in scheme: Criteria for determining the minimum number of sampling points for fixed measurement
related pollutant: http://dd.eionet.europa.eu/vocabulary/aq/pollutant/9
assessment threshold: aboveUAT
minimum population: 3750000
maximum population: 4749999
minimum SPO: 8

Minimum requirement for pollutant 7 for pop between (3+12)749999 and 11749999 when assessment is - zone type is noagg
type: Concept
notation: 163
definition: Minimum requirement for pollutant 7 for pop between (3+12)749999 and 11749999 when assessment is - zone type is noagg
status: valid
status modified: 2024-09-12
accepted date: 2024-09-12
in scheme: Criteria for determining the minimum number of sampling points for fixed measurement
related pollutant: http://dd.eionet.europa.eu/vocabulary/aq/pollutant/7
assessment threshold: aboveLTO
minimum population: 13749999
maximum population: 15749999
aq zonetype: noagg
minimum SPO: 11

Minimum requirement for pollutant 7 for pop between (3+12)749999 and 11749999 when assessment is - zone type is agg
type: Concept
notation: 164
definition: Minimum requirement for pollutant 7 for pop between (3+12)749999 and 11749999 when assessment is - zone type is agg
status: valid
status modified: 2024-09-12
accepted date: 2024-09-12
in scheme: Criteria for determining the minimum number of sampling points for fixed measurement
related pollutant: http://dd.eionet.europa.eu/vocabulary/aq/pollutant/7
assessment threshold: aboveLTO
minimum population: 13749999
maximum population: 15749999
aq zonetype: agg
minimum SPO: 10