Environmental Noise - END
type: Collection
notation: noise
has part: Aircraft reduction measure value
has part: Area type value
has part: Competent Authority Role Value
has part: Consultation means value
has part: Evaluation mechanism value
has part: Exposure type in agglomeration value
has part: Exposure type value
has part: Industrial reduction measure value
has part: ISO 639-3 language codes sub-set
has part: Level value
has part: Noise indicator - exposure data - most exposed façade including agglomeration
has part: Noise indicator range value
has part: Noise indicator value
has part: Noise level indicator value
has part: Noise source type value
has part: Noise source value
has part: Prioritisation criteria value
has part: Rail reduction measure value
has part: Reporting level value
has part: Road reduction measure value
has part: Stakeholders type value
has part: Status value
has part: Submission process value
has part: Submission value

Aircraft reduction measure value
type: ConceptScheme
notation: AirportMeasureValue
is part of: Environmental Noise - END
registration status: Public draft
user modified: blanenur
date modified: 2022-12-12 14:30:40.0
vocabulary type: Common
is numeric concept identifiers: false
is notations equal identifiers: true

Buffer zones
type: Concept
notation: bufferZones
definition: Buffer zones Applicable to data flows: Noise Action Plan Agglomeration (DF7_10), Noise Action Plan Major Airport (DF7_10)
status: valid
status modified: 2021-02-13
accepted date: 2021-02-13
in scheme: Aircraft reduction measure value
broad match: Land use planning

Building insulation
type: Concept
notation: buildingInsulationMeasure
definition: Building insulation such as window insulation or other insulation. Applicable to data flows: Noise Action Plan Agglomeration (DF7_10), Noise Action Plan Major Airport (DF7_10)
status: valid
status modified: 2021-02-13
accepted date: 2021-02-13
in scheme: Aircraft reduction measure value
broad match: Measures at the path
narrow match: Window insulation
narrow match: Other insulation

Change in emission levels
type: Concept
notation: changeInEmissionLevels
definition: Change in emission levels such as quiet airplanes Applicable to data flows: Noise Action Plan Agglomeration (DF7_10), Noise Action Plan Major Airport (DF7_10)
status: valid
status modified: 2021-02-13
accepted date: 2021-02-13
in scheme: Aircraft reduction measure value
broad match: Measures at the source
narrow match: Quiet airplanes

Closed infrastructure
type: Concept
notation: closedInfrastructure
definition: Closed infrastructure such as closure of a route, closure of a runway or closure of an airport. Applicable to data flows: Noise Action Plan Agglomeration (DF7_10), Noise Action Plan Major Airport (DF7_10)
status: valid
status modified: 2021-02-13
accepted date: 2021-02-13
in scheme: Aircraft reduction measure value
broad match: Infrastructure change
narrow match: Closure of route
narrow match: Closure of runway
narrow match: Closure of airport

Closure of airport
type: Concept
notation: closureAirport
definition: Communication Applicable to data flows: Noise Action Plan Agglomeration (DF7_10), Noise Action Plan Major Airport (DF7_10)
status: valid
status modified: 2021-02-13
accepted date: 2021-02-13
in scheme: Aircraft reduction measure value
broad match: Closed infrastructure

Closure of route
type: Concept
notation: closureRoute
definition: Closure of route Applicable to data flows: Noise Action Plan Agglomeration (DF7_10), Noise Action Plan Major Airport (DF7_10)
status: valid
status modified: 2021-02-13
accepted date: 2021-02-13
in scheme: Aircraft reduction measure value
broad match: Closed infrastructure

Closure of runway
type: Concept
notation: closureRunway
definition: Community engagement Applicable to data flows: Noise Action Plan Agglomeration (DF7_10), Noise Action Plan Major Airport (DF7_10)
status: valid
status modified: 2021-02-13
accepted date: 2021-02-13
in scheme: Aircraft reduction measure value
broad match: Closed infrastructure

Communication
type: Concept
notation: communication
definition: Comunication measures such as information dissemination or complaint management. Applicable to data flows: Noise Action Plan Agglomeration (DF7_10), Noise Action Plan Major Airport (DF7_10)
status: valid
status modified: 2021-02-13
accepted date: 2021-02-13
in scheme: Aircraft reduction measure value
broad match: Community engagement
narrow match: Information dissemination
narrow match: Complaint management

Community engagement
type: Concept
notation: communityEngagement
definition: Community engagement such as communication measures or measures for behavioural change. Applicable to data flows: Noise Action Plan Agglomeration (DF7_10), Noise Action Plan Major Airport (DF7_10)
status: valid
status modified: 2021-02-13
accepted date: 2021-02-13
in scheme: Aircraft reduction measure value
narrow match: Measures for behavioural changes
narrow match: Communication

Complaint management
type: Concept
notation: complaintManagement
definition: Complaint management Applicable to data flows: Noise Action Plan Agglomeration (DF7_10), Noise Action Plan Major Airport (DF7_10)
status: valid
status modified: 2021-02-13
accepted date: 2021-02-13
in scheme: Aircraft reduction measure value
broad match: Communication

Curfew hours
type: Concept
notation: curfewHours
definition: Airport and air traffic curfew hours Applicable to data flows: Noise Action Plan Agglomeration (DF7_10), Noise Action Plan Major Airport (DF7_10)
status: valid
status modified: 2021-02-13
accepted date: 2021-02-13
in scheme: Aircraft reduction measure value
broad match: Time restriction on source operations

Education and awareness raising activities
type: Concept
notation: educationAwarenessActivities
definition: Education and awareness raising activities Applicable to data flows: Noise Action Plan Agglomeration (DF7_10), Noise Action Plan Major Airport (DF7_10)
status: valid
status modified: 2021-02-13
accepted date: 2021-02-13
in scheme: Aircraft reduction measure value
broad match: Measures for behavioural changes

Availability of green areas
type: Concept
notation: greenArea
definition: Availability of green areas Applicable to data flows: Noise Action Plan Agglomeration (DF7_10), Noise Action Plan Major Airport (DF7_10)
status: valid
status modified: 2021-02-13
accepted date: 2021-02-13
in scheme: Aircraft reduction measure value
broad match: Noise quality areas

Green noise barriers and maintenance
type: Concept
notation: greenNoiseBarrier
definition: Green noise barriers and maintenance Applicable to data flows: Noise Action Plan Agglomeration (DF7_10), Noise Action Plan Major Airport (DF7_10)
status: valid
status modified: 2021-02-13
accepted date: 2021-02-13
in scheme: Aircraft reduction measure value
broad match: Noise barriers

Information dissemination
type: Concept
notation: informationDissemination
definition: Information dissemination Applicable to data flows: Noise Action Plan Agglomeration (DF7_10), Noise Action Plan Major Airport (DF7_10)
status: valid
status modified: 2021-02-13
accepted date: 2021-02-13
in scheme: Aircraft reduction measure value
broad match: Communication

Infrastructure change
type: Concept
notation: infrastructureChange
definition: Infrastructure change such as new infrastructure or closed infrastructure. Applicable to data flows: Noise Action Plan Agglomeration (DF7_10), Noise Action Plan Major Airport (DF7_10)
status: valid
status modified: 2021-02-13
accepted date: 2021-02-13
in scheme: Aircraft reduction measure value
narrow match: New infrastructure
narrow match: Closed infrastructure

Land use planning
type: Concept
notation: landUsePlanning
definition: Land use planning such as planning and ordinance measures, sensitive area planning or buffer zones. Applicable to data flows: Noise Action Plan Agglomeration (DF7_10), Noise Action Plan Major Airport (DF7_10)
status: valid
status modified: 2021-02-13
accepted date: 2021-02-13
in scheme: Aircraft reduction measure value
broad match: Urban planning
narrow match: Planning measures and ordinances between receivers and aircraft sources
narrow match: Reduced noise for sensitive areas
narrow match: Buffer zones

Management of air traffic routes
type: Concept
notation: managementAirTrafficRoutes
definition: Management of air traffic routes Applicable to data flows: Noise Action Plan Agglomeration (DF7_10), Noise Action Plan Major Airport (DF7_10)
status: valid
status modified: 2021-02-13
accepted date: 2021-02-13
in scheme: Aircraft reduction measure value
broad match: Management of air traffic operations

Management of air traffic operations
type: Concept
notation: managementOfAirTrafficOperations
definition: Management of air traffic operations such as management of air traffic routes, management of take offs and landings or managememnt of runway ground operations. Applicable to data flows: Noise Action Plan Agglomeration (DF7_10), Noise Action Plan Major Airport (DF7_10)
status: valid
status modified: 2021-02-13
accepted date: 2021-02-13
in scheme: Aircraft reduction measure value
broad match: Measures at the source
narrow match: Management of take-off and landing approaches
narrow match: Management of air traffic routes
narrow match: Management of runway and ground operations

Management of runway and ground operations
type: Concept
notation: managementRunwayGroundOperations
definition: Management of runway and ground operations Applicable to data flows: Noise Action Plan Agglomeration (DF7_10), Noise Action Plan Major Airport (DF7_10)
status: valid
status modified: 2021-02-13
accepted date: 2021-02-13
in scheme: Aircraft reduction measure value
broad match: Management of air traffic operations

Management of take-off and landing approaches
type: Concept
notation: managementTakeoffLanding
definition: Management of take-off and landing approaches Applicable to data flows: Noise Action Plan Agglomeration (DF7_10), Noise Action Plan Major Airport (DF7_10)
status: valid
status modified: 2021-02-13
accepted date: 2021-02-13
in scheme: Aircraft reduction measure value
broad match: Management of air traffic operations

Measures at the path
type: Concept
notation: measureAtPath
definition: Measures at the path such as noise barrier measures or building insulation measures. Applicable to data flows: Noise Action Plan Agglomeration (DF7_10), Noise Action Plan Major Airport (DF7_10)
status: valid
status modified: 2021-02-13
accepted date: 2021-02-13
in scheme: Aircraft reduction measure value
narrow match: Building insulation
narrow match: Noise barriers

Measures at the source
type: Concept
notation: measureAtSource
definition: Measures at the source such as change in emission levels, time restriction or management of air traffic operations. Applicable to data flows: Noise Action Plan Agglomeration (DF7_10), Noise Action Plan Major Airport (DF7_10)
status: valid
status modified: 2021-02-13
accepted date: 2021-02-13
in scheme: Aircraft reduction measure value
narrow match: Management of air traffic operations
narrow match: Time restriction on source operations
narrow match: Change in emission levels

Measures for behavioural changes
type: Concept
notation: measuresForBehaviouralChange
definition: Measures for behavioural changes such as education awareness activities or promoting other modes of transport. Applicable to data flows: Noise Action Plan Agglomeration (DF7_10), Noise Action Plan Major Airport (DF7_10)
status: valid
status modified: 2021-02-13
accepted date: 2021-02-13
in scheme: Aircraft reduction measure value
broad match: Community engagement
narrow match: Promoting other modes of transport
narrow match: Education and awareness raising activities

New infrastructure
type: Concept
notation: newInfrastructure
definition: New infrastructure such as new route or new runway. Applicable to data flows: Noise Action Plan Agglomeration (DF7_10), Noise Action Plan Major Airport (DF7_10)
status: valid
status modified: 2021-02-13
accepted date: 2021-02-13
in scheme: Aircraft reduction measure value
broad match: Infrastructure change
narrow match: New air traffic route
narrow match: New runway

New air traffic route
type: Concept
notation: newRoute
definition: New air traffic route Applicable to data flows: Noise Action Plan Agglomeration (DF7_10), Noise Action Plan Major Airport (DF7_10)
status: valid
status modified: 2021-02-13
accepted date: 2021-02-13
in scheme: Aircraft reduction measure value
broad match: New infrastructure

New runway
type: Concept
notation: newRunway
definition: New runway Applicable to data flows: Noise Action Plan Agglomeration (DF7_10), Noise Action Plan Major Airport (DF7_10)
status: valid
status modified: 2021-02-13
accepted date: 2021-02-13
in scheme: Aircraft reduction measure value
broad match: New infrastructure

No measure
type: Concept
notation: noMeasure
definition: No noise reduction measure. Applicable to data flows: Noise Action Plan Agglomeration (DF7_10), Noise Action Plan Major Airport (DF7_10)
status: valid
status modified: 2022-12-12
accepted date: 2022-12-12
in scheme: Aircraft reduction measure value

Noise barriers and maintenance
type: Concept
notation: noiseBarrier
definition: Noise barriers and maintenance Applicable to data flows: Noise Action Plan Agglomeration (DF7_10), Noise Action Plan Major Airport (DF7_10)
status: valid
status modified: 2021-02-13
accepted date: 2021-02-13
in scheme: Aircraft reduction measure value
broad match: Noise barriers

Noise barriers
type: Concept
notation: noiseBarrierMeasure
definition: Noise barriers such as noise barriers or green noise barriers. Applicable to data flows: Noise Action Plan Agglomeration (DF7_10), Noise Action Plan Major Airport (DF7_10)
status: valid
status modified: 2021-02-13
accepted date: 2021-02-13
in scheme: Aircraft reduction measure value
broad match: Measures at the path
narrow match: Green noise barriers and maintenance
narrow match: Noise barriers and maintenance

Noise quality areas
type: Concept
notation: noiseQualityArea
definition: Noise quality areas such as quiet areas, green areas and soundscape measures. Applicable to data flows: Noise Action Plan Agglomeration (DF7_10), Noise Action Plan Major Airport (DF7_10)
status: valid
status modified: 2021-02-13
accepted date: 2021-02-13
in scheme: Aircraft reduction measure value
broad match: Urban planning
narrow match: Soundscape measures
narrow match: Availability of quiet areas
narrow match: Availability of green areas

Other insulation
type: Concept
notation: otherInsulation
definition: Other insulation Applicable to data flows: Noise Action Plan Agglomeration (DF7_10), Noise Action Plan Major Airport (DF7_10)
status: valid
status modified: 2021-02-13
accepted date: 2021-02-13
in scheme: Aircraft reduction measure value
broad match: Building insulation

Planning measures and ordinances between receivers and aircraft sources
type: Concept
notation: planningAndOrdinance
definition: Planning measures and ordinances between receivers and aircraft sources Applicable to data flows: Noise Action Plan Agglomeration (DF7_10), Noise Action Plan Major Airport (DF7_10)
status: valid
status modified: 2021-02-13
accepted date: 2021-02-13
in scheme: Aircraft reduction measure value
broad match: Land use planning

Promoting other modes of transport
type: Concept
notation: promotingOtherModes
definition: Promoting other modes of transport Applicable to data flows: Noise Action Plan Agglomeration (DF7_10), Noise Action Plan Major Airport (DF7_10)
status: valid
status modified: 2021-02-13
accepted date: 2021-02-13
in scheme: Aircraft reduction measure value
broad match: Measures for behavioural changes

Quiet airplanes
type: Concept
notation: quietAirplanes
definition: Quiet airplanes Applicable to data flows: Noise Action Plan Agglomeration (DF7_10), Noise Action Plan Major Airport (DF7_10)
status: valid
status modified: 2021-02-13
accepted date: 2021-02-13
in scheme: Aircraft reduction measure value
broad match: Change in emission levels

Availability of quiet areas
type: Concept
notation: quietArea
definition: Availability of quiet areas Applicable to data flows: Noise Action Plan Agglomeration (DF7_10), Noise Action Plan Major Airport (DF7_10)
status: valid
status modified: 2021-02-13
accepted date: 2021-02-13
in scheme: Aircraft reduction measure value
broad match: Noise quality areas

Respite and noise sharing
type: Concept
notation: respiteAndNoiseSharing
definition: Respite and noise sharing Applicable to data flows: Noise Action Plan Agglomeration (DF7_10), Noise Action Plan Major Airport (DF7_10)
status: valid
status modified: 2021-02-13
accepted date: 2021-02-13
in scheme: Aircraft reduction measure value
broad match: Time restriction on source operations

Reduced noise for sensitive areas
type: Concept
notation: sensitiveAreaPlanning
definition: Reduced noise for sensitive areas Applicable to data flows: Noise Action Plan Agglomeration (DF7_10), Noise Action Plan Major Airport (DF7_10)
status: valid
status modified: 2021-02-13
accepted date: 2021-02-13
in scheme: Aircraft reduction measure value
broad match: Land use planning

Soundscape measures
type: Concept
notation: soundscape
definition: Soundscape measures Applicable to data flows: Noise Action Plan Agglomeration (DF7_10), Noise Action Plan Major Airport (DF7_10)
status: valid
status modified: 2021-02-13
accepted date: 2021-02-13
in scheme: Aircraft reduction measure value
broad match: Noise quality areas

Time restriction on source operations
type: Concept
notation: timeRestriction
definition: Time restriction such as curfew hours or respite and noise sharing. Applicable to data flows: Noise Action Plan Agglomeration (DF7_10), Noise Action Plan Major Airport (DF7_10)
status: valid
status modified: 2021-02-13
accepted date: 2021-02-13
in scheme: Aircraft reduction measure value
broad match: Measures at the source
narrow match: Curfew hours
narrow match: Respite and noise sharing

Urban planning
type: Concept
notation: urbanPlanning
definition: Urban planning such as land use planning or noise quality areas. Applicable to data flows: Noise Action Plan Agglomeration (DF7_10), Noise Action Plan Major Airport (DF7_10)
status: valid
status modified: 2021-02-13
accepted date: 2021-02-13
in scheme: Aircraft reduction measure value
narrow match: Noise quality areas
narrow match: Land use planning

Window insulation
type: Concept
notation: windowInsulation
definition: Window insulation Applicable to data flows: Noise Action Plan Agglomeration (DF7_10), Noise Action Plan Major Airport (DF7_10)
status: valid
status modified: 2021-02-13
accepted date: 2021-02-13
in scheme: Aircraft reduction measure value
broad match: Building insulation

Area type value
type: ConceptScheme
notation: AreaTypeValue
is part of: Environmental Noise - END
registration status: Public draft
user modified: blanenur
date modified: 2021-01-26 15:08:08.0
vocabulary type: Common
is numeric concept identifiers: false
is notations equal identifiers: true

Hospital area
type: Concept
notation: hospital
definition: Hospital area in which the limit value is applied. Applicable to data flows: Noise Limit Value (DF3)
status: valid
status modified: 2020-12-15
in scheme: Area type value

Other types of areas
type: Concept
notation: otherArea
definition: Other types of areas in which the limit value is applied. For example: different land use areas, land cover areas, and other areas. Applicable to data flows: Noise Limit Value (DF3)
status: valid
status modified: 2020-12-15
in scheme: Area type value

Existing infrastructure in residential area
type: Concept
notation: residentialExistingInfrastructure
definition: Existing infrastructure in residential area in which the limit value is applied Applicable to data flows: Noise Limit Value (DF3)
status: valid
status modified: 2020-12-15
in scheme: Area type value

New infrastructure in residential area
type: Concept
notation: residentialNewInfrastructure
definition: New infrastructure in residential area in which the limit value is applied. Applicable to data flows: Noise Limit Value (DF3)
status: valid
status modified: 2020-12-15
in scheme: Area type value

School area
type: Concept
notation: school
definition: School areas in which the limit value is applied. Applicable to data flows: Noise Limit Value (DF3)
status: valid
status modified: 2020-12-15
in scheme: Area type value

Competent Authority Role Value
type: ConceptScheme
notation: CompetentAuthorityRoleValue
is part of: Environmental Noise - END
registration status: Public draft
user modified: blanenur
date modified: 2021-03-20 20:13:08.0
vocabulary type: Common
is numeric concept identifiers: false
is notations equal identifiers: true

Action plan collection
type: Concept
notation: actionPlanCollection
definition: Competent authority responsible for the collection of the noise action plan. Applicable to data flows: Competent Authority (DF2)
status: valid
status modified: 2020-12-11
in scheme: Competent Authority Role Value

Action plan development
type: Concept
notation: actionPlanDevelopment
definition: Competent authority responsible for the development of the noise action plan (may include action plan approval if there is not a different competent authority developing the role). Applicable to data flows: Competent Authority (DF2)
status: valid
status modified: 2020-12-11
in scheme: Competent Authority Role Value

Mapping Collection
type: Concept
notation: mappingCollection
definition: Competent authority responsible for the collection of the strategic noise mapping Applicable to data flows: Competent Authority (DF2)
status: valid
status modified: 2020-12-11
in scheme: Competent Authority Role Value

Mapping development
type: Concept
notation: mappingDevelopment
definition: Competent authority responsible for the development of the strategic noise mapping (may include strategic noise mapping approval if there is not a different competent authority developing the role). Applicable to data flows: Competent Authority (DF2)
status: valid
status modified: 2020-12-11
in scheme: Competent Authority Role Value

Mapping approval
type: Concept
notation: mappingApproval
definition: Competent authority responsible for the approval of the strategic noise mapping. Applicable to data flows: Competent Authority (DF2)
status: valid
status modified: 2021-03-20
in scheme: Competent Authority Role Value

Action plan approval
type: Concept
notation: actionPlanApproval
definition: Competent authority responsible for the approval of the noise action plan Applicable to data flows: Competent Authority (DF2)
status: valid
status modified: 2021-03-20
in scheme: Competent Authority Role Value

Consultation means value
type: ConceptScheme
notation: ConsultationMeansValue
is part of: Environmental Noise - END
registration status: Public draft
user modified: lihtedar
date modified: 2022-11-23 13:52:42.0
vocabulary type: Common
is numeric concept identifiers: false
is notations equal identifiers: true

Advertisement
type: Concept
notation: advertisement
definition: Advertisement/s conducted as part of the public consultation process. Applicable to data flows: Noise Action Plan Agglomeration (DF7_10), Noise Action Plan Major Airport (DF7_10), Noise Action Plan Major Railway (DF7_10), Noise Action Plan Major Road (DF7_10)
status: valid
status modified: 2021-02-01
in scheme: Consultation means value

Focus group
type: Concept
notation: focusGroup
definition: Focus group conducted as part of the public consultation process. Applicable to data flows: Noise Action Plan Agglomeration (DF7_10), Noise Action Plan Major Airport (DF7_10), Noise Action Plan Major Railway (DF7_10), Noise Action Plan Major Road (DF7_10)
status: valid
status modified: 2021-02-01
in scheme: Consultation means value

Information campaign
type: Concept
notation: informationCampaign
definition: Information campaign conducted as part pf the public consultation process. Applicable to data flows: Noise Action Plan Agglomeration (DF7_10), Noise Action Plan Major Airport (DF7_10), Noise Action Plan Major Railway (DF7_10), Noise Action Plan Major Road (DF7_10)
status: valid
status modified: 2021-02-01
in scheme: Consultation means value

Meeting
type: Concept
notation: meeting
definition: Meeting conducted as part of the public consultation process. Applicable to data flows: Noise Action Plan Agglomeration (DF7_10), Noise Action Plan Major Airport (DF7_10), Noise Action Plan Major Railway (DF7_10), Noise Action Plan Major Road (DF7_10)
status: valid
status modified: 2021-02-01
in scheme: Consultation means value

Public event
type: Concept
notation: publicEvent
definition: Public event conducted as part of the public consultation process. Applicable to data flows: Noise Action Plan Agglomeration (DF7_10), Noise Action Plan Major Airport (DF7_10), Noise Action Plan Major Railway (DF7_10), Noise Action Plan Major Road (DF7_10)
status: valid
status modified: 2021-02-01
in scheme: Consultation means value

Survey
type: Concept
notation: survey
definition: Survey conducted as part of the public consultation process. Applicable to data flows: Noise Action Plan Agglomeration (DF7_10), Noise Action Plan Major Airport (DF7_10), Noise Action Plan Major Railway (DF7_10), Noise Action Plan Major Road (DF7_10)
status: valid
status modified: 2021-02-01
in scheme: Consultation means value

Workshop
type: Concept
notation: workshop
definition: Workshop conducted as part of the public consultation process. Applicable to data flows: Noise Action Plan Agglomeration (DF7_10), Noise Action Plan Major Airport (DF7_10), Noise Action Plan Major Railway (DF7_10), Noise Action Plan Major Road (DF7_10)
status: valid
status modified: 2021-02-01
in scheme: Consultation means value

Evaluation mechanism value
type: ConceptScheme
notation: EvaluationMechanismValue
is part of: Environmental Noise - END
registration status: Public draft
user modified: blanenur
date modified: 2021-03-20 19:50:09.0
vocabulary type: Common
is numeric concept identifiers: false
is notations equal identifiers: true

Calculation
type: Concept
notation: calculation
definition: Noise calculations are envisaged to be used for evaluating the implementation and the results of the action plan. Applicable to data flows: Noise Action Plan Agglomeration (DF7_10), Noise Action Plan Major Airport (DF7_10), Noise Action Plan Major Railway (DF7_10), Noise Action Plan Major Road (DF7_10)
status: valid
status modified: 2021-02-01
in scheme: Evaluation mechanism value

Measurements
type: Concept
notation: measurements
definition: Noise measurements are envisaged to be used for evaluating the implementation and the results of the action plan. Applicable to data flows: Noise Action Plan Agglomeration (DF7_10), Noise Action Plan Major Airport (DF7_10), Noise Action Plan Major Railway (DF7_10), Noise Action Plan Major Road (DF7_10)
status: valid
status modified: 2021-02-01
in scheme: Evaluation mechanism value

Survey / enquiry
type: Concept
notation: survey_enquiry
definition: A survey/enquiry is envisaged to be used for evaluating the implementation and the results of the action plan Applicable to data flows: Noise Action Plan Agglomeration (DF7_10), Noise Action Plan Major Airport (DF7_10), Noise Action Plan Major Railway (DF7_10), Noise Action Plan Major Road (DF7_10)
status: valid
status modified: 2021-02-01
in scheme: Evaluation mechanism value

Exposure type in agglomeration value
type: ConceptScheme
notation: ExposureTypeInAgglomerationValue
is part of: Environmental Noise - END
registration status: Public draft
user modified: blanenur
date modified: 2021-02-09 21:03:28.0
vocabulary type: Common
is numeric concept identifiers: false
is notations equal identifiers: true

Exposure at the most exposed façade
type: Concept
notation: mostExposedFacade
definition: Exposure at the most exposed façade inside agglomeration. Applicable to data flows: Strategic Noise Map - Noise Exposure (DF4_8)
status: valid
status modified: 2021-02-01
in scheme: Exposure type in agglomeration value

Exposure at dwellings with quiet façade
type: Concept
notation: withQuietFacade
definition: Exposure at dwellings with quiet façade inside agglomeration. Applicable to data flows: Strategic Noise Map - Noise Exposure (DF4_8)
status: valid
status modified: 2021-02-01
in scheme: Exposure type in agglomeration value

Exposure at dwellings with special insulation
type: Concept
notation: withSpecialInsulation
definition: Exposure at dwellings with special insulation inside agglomeration. Applicable to data flows: Strategic Noise Map - Noise Exposure (DF4_8)
status: valid
status modified: 2021-02-01
in scheme: Exposure type in agglomeration value

Exposure type value
type: ConceptScheme
notation: ExposureTypeValue
is part of: Environmental Noise - END
registration status: Public draft
user modified: blanenur
date modified: 2021-02-09 21:04:00.0
vocabulary type: Common
is numeric concept identifiers: false
is notations equal identifiers: true

Exposure at the most exposed façade outside agglomeration
type: Concept
notation: mostExposedFacade
definition: Exposure at the most exposed façade outside agglomeration. Applicable to data flows: Strategic Noise Map - Noise Exposure (DF4_8)
status: valid
status modified: 2021-02-01
in scheme: Exposure type value

Exposure at the most exposed façade including agglomeration
type: Concept
notation: mostExposedFacadeIncludingAgglomeration
definition: Exposure at the most exposed façade including agglomeration. Applicable to data flows: Strategic Noise Map - Noise Exposure (DF4_8)
status: valid
status modified: 2021-02-01
in scheme: Exposure type value

Exposure at dwellings with quiet façade
type: Concept
notation: withQuietFacade
definition: Exposure at dwellings with quiet façade outside agglomeration. Applicable to data flows: Strategic Noise Map - Noise Exposure (DF4_8)
status: valid
status modified: 2021-02-01
in scheme: Exposure type value

Exposure at dwellings with special insulation
type: Concept
notation: withSpecialInsulation
definition: Exposure at dwellings with special insulation outside agglomeration. Applicable to data flows: Strategic Noise Map - Noise Exposure (DF4_8)
status: valid
status modified: 2021-02-01
in scheme: Exposure type value

Industrial reduction measure value
type: ConceptScheme
notation: IndustryMeasureValue
is part of: Environmental Noise - END
registration status: Public draft
user modified: blanenur
date modified: 2022-12-12 14:09:08.0
vocabulary type: Common
is numeric concept identifiers: false
is notations equal identifiers: true

Buffer zones
type: Concept
notation: bufferZones
definition: Buffer zones Applicable to data flows: Noise Action Plan Agglomeration (DF7_10)
status: valid
status modified: 2021-02-13
accepted date: 2021-02-13
in scheme: Industrial reduction measure value
broad match: Land use planning

Building insulation
type: Concept
notation: buildingInsulationMeasure
definition: Building insulation such as window insulation or other insulation. Applicable to data flows: Noise Action Plan Agglomeration (DF7_10)
status: valid
status modified: 2021-02-13
accepted date: 2021-02-13
in scheme: Industrial reduction measure value
broad match: Measures at the path
narrow match: Window insulation
narrow match: Other insulation

Change in emission levels
type: Concept
notation: changeinEmissionLevels
definition: Change in emission levels such as quiet operations. Applicable to data flows: Noise Action Plan Agglomeration (DF7_10)
status: valid
status modified: 2021-02-13
accepted date: 2021-02-13
in scheme: Industrial reduction measure value
broad match: Measures at the source
narrow match: Quiet operations

Closed infrastructure
type: Concept
notation: closedInfrastructure
definition: Closed infrastructure such as closure of industry. Applicable to data flows: Noise Action Plan Agglomeration (DF7_10)
status: valid
status modified: 2021-02-13
accepted date: 2021-02-13
in scheme: Industrial reduction measure value
broad match: Infrastructure change
narrow match: Closure of industry

Closure of industry
type: Concept
notation: closureIndustry
definition: Closure of industry Applicable to data flows: Noise Action Plan Agglomeration (DF7_10)
status: valid
status modified: 2021-02-13
accepted date: 2021-02-13
in scheme: Industrial reduction measure value
broad match: Closed infrastructure

Communication munication
type: Concept
notation: communication
definition: Communication munication such as information dissemination or compaint management. Applicable to data flows: Noise Action Plan Agglomeration (DF7_10)
status: valid
status modified: 2021-02-13
accepted date: 2021-02-13
in scheme: Industrial reduction measure value
broad match: Community engagement
narrow match: Information dissemination
narrow match: Complaint management

Community engagement
type: Concept
notation: communityEngagement
definition: Community engagement such as communication measures or measures for behavioural change. Applicable to data flows: Noise Action Plan Agglomeration (DF7_10)
status: valid
status modified: 2021-02-13
accepted date: 2021-02-13
in scheme: Industrial reduction measure value
narrow match: Measures for behavioural changes
narrow match: Communication munication

Complaint management
type: Concept
notation: complaintManagement
definition: Complaint management Applicable to data flows: Noise Action Plan Agglomeration (DF7_10)
status: valid
status modified: 2021-02-13
accepted date: 2021-02-13
in scheme: Industrial reduction measure value
broad match: Communication munication

Education and awareness raising activities
type: Concept
notation: educationAwarenessActivities
definition: Education and awareness raising activities Applicable to data flows: Noise Action Plan Agglomeration (DF7_10)
status: valid
status modified: 2021-02-13
accepted date: 2021-02-13
in scheme: Industrial reduction measure value
broad match: Measures for behavioural changes

Enclosure in industry
type: Concept
notation: enclosure
definition: Enclosure of machinery, or industy. Applicable to data flows: Noise Action Plan Agglomeration (DF7_10)
status: valid
status modified: 2021-02-13
accepted date: 2021-02-13
in scheme: Industrial reduction measure value
broad match: Noise barriers

Availability of green areas
type: Concept
notation: greenArea
definition: Availability of green areas Applicable to data flows: Noise Action Plan Agglomeration (DF7_10)
status: valid
status modified: 2021-02-13
accepted date: 2021-02-13
in scheme: Industrial reduction measure value
broad match: Noise quality areas

Green noise barriers and maintenance
type: Concept
notation: greenNoiseBarrier
definition: Green noise barriers and maintenance Applicable to data flows: Noise Action Plan Agglomeration (DF7_10)
status: valid
status modified: 2021-02-13
accepted date: 2021-02-13
in scheme: Industrial reduction measure value
broad match: Noise barriers

Information dissemination
type: Concept
notation: informationDissemination
definition: Information dissemination Applicable to data flows: Noise Action Plan Agglomeration (DF7_10)
status: valid
status modified: 2021-02-13
accepted date: 2021-02-13
in scheme: Industrial reduction measure value
broad match: Communication munication

Infrastructure change
type: Concept
notation: infrastructureChange
definition: Infrastructure change such as new infrastructure or closed infrastructure. Applicable to data flows: Noise Action Plan Agglomeration (DF7_10)
status: valid
status modified: 2021-02-13
accepted date: 2021-02-13
in scheme: Industrial reduction measure value
narrow match: New infrastructure
narrow match: Closed infrastructure

Land use planning
type: Concept
notation: landUsePlanning
definition: Land use planning such as planning and ordinance measures, sensitive area planning or buffer zones. Applicable to data flows: Noise Action Plan Agglomeration (DF7_10)
status: valid
status modified: 2021-02-13
accepted date: 2021-02-13
in scheme: Industrial reduction measure value
broad match: Urban planning
narrow match: Buffer zones
narrow match: Reduced noise for sensitive areas
narrow match: Planning measures and ordinances between receivers and industry noise

Measures at the path
type: Concept
notation: measureAtPath
definition: Measures at the path such as noise barriers or building insulation. Applicable to data flows: Noise Action Plan Agglomeration (DF7_10)
status: valid
status modified: 2021-02-13
accepted date: 2021-02-13
in scheme: Industrial reduction measure value
narrow match: Noise barriers
narrow match: Building insulation

Measures at the source
type: Concept
notation: measureAtSource
definition: Measures at the source such as change in emission levels or time restriction. Applicable to data flows: Noise Action Plan Agglomeration (DF7_10)
status: valid
status modified: 2021-02-13
accepted date: 2021-02-13
in scheme: Industrial reduction measure value
narrow match: Time restrictions on source operations
narrow match: Change in emission levels

Measures for behavioural changes
type: Concept
notation: measuresForBehaviouralChange
definition: Measures for behavioural changes such as education awareness activities. Applicable to data flows: Noise Action Plan Agglomeration (DF7_10)
status: valid
status modified: 2021-02-13
accepted date: 2021-02-13
in scheme: Industrial reduction measure value
broad match: Community engagement
narrow match: Education and awareness raising activities

New infrastructure
type: Concept
notation: newInfrastructure
definition: New infrastructure such as relocation of industry. Applicable to data flows: Noise Action Plan Agglomeration (DF7_10)
status: valid
status modified: 2021-02-13
accepted date: 2021-02-13
in scheme: Industrial reduction measure value
broad match: Infrastructure change
narrow match: Industry relocation

No measure
type: Concept
notation: noMeasure
definition: No noise reduction measure. Applicable to data flows: Noise Action Plan Agglomeration (DF7_10)
status: valid
status modified: 2022-12-12
accepted date: 2022-12-12
in scheme: Industrial reduction measure value

Noise barriers and maintenance
type: Concept
notation: noiseBarrier
definition: Noise barriers and maintenance Applicable to data flows: Noise Action Plan Agglomeration (DF7_10)
status: valid
status modified: 2021-02-13
accepted date: 2021-02-13
in scheme: Industrial reduction measure value
broad match: Noise barriers

Noise barriers
type: Concept
notation: noiseBarrierMeasure
definition: Noise barriers such as noise barriers, green noise barrers or enclosures. Applicable to data flows: Noise Action Plan Agglomeration (DF7_10)
status: valid
status modified: 2021-02-13
accepted date: 2021-02-13
in scheme: Industrial reduction measure value
broad match: Measures at the path
narrow match: Noise barriers and maintenance
narrow match: Enclosure in industry
narrow match: Green noise barriers and maintenance

Noise quality areas
type: Concept
notation: noiseQualityArea
definition: Noise quality areas such as quiet area, green area or soundscape measures. Applicable to data flows: Noise Action Plan Agglomeration (DF7_10)
status: valid
status modified: 2021-02-13
accepted date: 2021-02-13
in scheme: Industrial reduction measure value
broad match: Urban planning
narrow match: Availability of quiet areas
narrow match: Soundscape measures
narrow match: Availability of green areas

Time restriction for operations
type: Concept
notation: operatingTimeRestriction
definition: Time restrictions for all or certain operations Applicable to data flows: Noise Action Plan Agglomeration (DF7_10)
status: valid
status modified: 2021-02-13
accepted date: 2021-02-13
in scheme: Industrial reduction measure value
broad match: Time restrictions on source operations

Other insulation
type: Concept
notation: otherInsulation
definition: Other insulation Applicable to data flows: Noise Action Plan Agglomeration (DF7_10)
status: valid
status modified: 2021-02-13
accepted date: 2021-02-13
in scheme: Industrial reduction measure value
broad match: Building insulation

Planning measures and ordinances between receivers and industry noise
type: Concept
notation: planningAndOrdinance
definition: Planning measures and ordinances between receivers and industry noise Applicable to data flows: Noise Action Plan Agglomeration (DF7_10)
status: valid
status modified: 2021-02-13
accepted date: 2021-02-13
in scheme: Industrial reduction measure value
broad match: Land use planning

Availability of quiet areas
type: Concept
notation: quietArea
definition: Availability of quiet areas Applicable to data flows: Noise Action Plan Agglomeration (DF7_10)
status: valid
status modified: 2021-02-13
accepted date: 2021-02-13
in scheme: Industrial reduction measure value
broad match: Noise quality areas

Quiet operations
type: Concept
notation: quietOperations
definition: Change in emission levels Applicable to data flows: Noise Action Plan Agglomeration (DF7_10)
status: valid
status modified: 2021-02-13
accepted date: 2021-02-13
in scheme: Industrial reduction measure value
broad match: Change in emission levels

Industry relocation
type: Concept
notation: relocationIndustry
definition: Industry relocation Applicable to data flows: Noise Action Plan Agglomeration (DF7_10)
status: valid
status modified: 2021-02-13
accepted date: 2021-02-13
in scheme: Industrial reduction measure value
broad match: New infrastructure

Reduced noise for sensitive areas
type: Concept
notation: sensitiveAreaPlanning
definition: Reduced noise for sensitive areas Applicable to data flows: Noise Action Plan Agglomeration (DF7_10)
status: valid
status modified: 2021-02-13
accepted date: 2021-02-13
in scheme: Industrial reduction measure value
broad match: Land use planning

Soundscape measures
type: Concept
notation: soundscape
definition: Soundscape measures Applicable to data flows: Noise Action Plan Agglomeration (DF7_10)
status: valid
status modified: 2021-02-13
accepted date: 2021-02-13
in scheme: Industrial reduction measure value
broad match: Noise quality areas

Time restrictions on source operations
type: Concept
notation: timeRestriction
definition: Time restriction such as operation time restrictions. Applicable to data flows: Noise Action Plan Agglomeration (DF7_10)
status: valid
status modified: 2021-02-13
accepted date: 2021-02-13
in scheme: Industrial reduction measure value
broad match: Measures at the source
narrow match: Time restriction for operations

Urban planning
type: Concept
notation: urbanPlanning
definition: Urban planning such as land use planning or noise quality area. Applicable to data flows: Noise Action Plan Agglomeration (DF7_10)
status: valid
status modified: 2021-02-13
accepted date: 2021-02-13
in scheme: Industrial reduction measure value
narrow match: Land use planning
narrow match: Noise quality areas

Window insulation
type: Concept
notation: windowInsulation
definition: Window insulation Applicable to data flows: Noise Action Plan Agglomeration (DF7_10)
status: valid
status modified: 2021-02-13
accepted date: 2021-02-13
in scheme: Industrial reduction measure value
broad match: Building insulation

ISO 639-3 language codes sub-set
type: ConceptScheme
notation: iso639-3
is part of: Environmental Noise - END
registration status: Public draft
user modified: lihtedar
date modified: 2023-10-06 15:56:36.0
vocabulary type: Common
is numeric concept identifiers: false
is notations equal identifiers: true

Bulgarian
type: Concept
notation: bul
status: valid
status modified: 2021-02-05
accepted date: 2021-02-05
in scheme: ISO 639-3 language codes sub-set

Czech
type: Concept
notation: ces
status: valid
status modified: 2021-02-05
accepted date: 2021-02-05
in scheme: ISO 639-3 language codes sub-set

Danish
type: Concept
notation: dan
status: valid
status modified: 2021-02-05
accepted date: 2021-02-05
in scheme: ISO 639-3 language codes sub-set

German
type: Concept
notation: deu
status: valid
status modified: 2021-02-05
accepted date: 2021-02-05
in scheme: ISO 639-3 language codes sub-set

Modern Greek (1453-)
type: Concept
notation: ell
status: valid
status modified: 2021-02-05
accepted date: 2021-02-05
in scheme: ISO 639-3 language codes sub-set

English
type: Concept
notation: eng
status: valid
status modified: 2021-02-05
accepted date: 2021-02-05
in scheme: ISO 639-3 language codes sub-set

Estonian
type: Concept
notation: est
status: valid
status modified: 2021-02-05
accepted date: 2021-02-05
in scheme: ISO 639-3 language codes sub-set

Finnish
type: Concept
notation: fin
status: valid
status modified: 2021-02-05
accepted date: 2021-02-05
in scheme: ISO 639-3 language codes sub-set

French
type: Concept
notation: fra
status: valid
status modified: 2021-02-05
accepted date: 2021-02-05
in scheme: ISO 639-3 language codes sub-set

Irish
type: Concept
notation: gle
status: valid
status modified: 2021-02-05
accepted date: 2021-02-05
in scheme: ISO 639-3 language codes sub-set

Croatian
type: Concept
notation: hrv
status: valid
status modified: 2021-02-05
accepted date: 2021-02-05
in scheme: ISO 639-3 language codes sub-set

Hungarian
type: Concept
notation: hun
status: valid
status modified: 2021-02-05
accepted date: 2021-02-05
in scheme: ISO 639-3 language codes sub-set

Italian
type: Concept
notation: ita
status: valid
status modified: 2021-02-05
accepted date: 2021-02-05
in scheme: ISO 639-3 language codes sub-set

Latvian
type: Concept
notation: lav
status: valid
status modified: 2021-02-05
accepted date: 2021-02-05
in scheme: ISO 639-3 language codes sub-set

Lithuanian
type: Concept
notation: lit
status: valid
status modified: 2021-02-05
accepted date: 2021-02-05
in scheme: ISO 639-3 language codes sub-set

Maltese
type: Concept
notation: mlt
status: valid
status modified: 2021-02-05
accepted date: 2021-02-05
in scheme: ISO 639-3 language codes sub-set

Dutch
type: Concept
notation: nld
status: valid
status modified: 2021-02-05
accepted date: 2021-02-05
in scheme: ISO 639-3 language codes sub-set

Polish
type: Concept
notation: pol
status: valid
status modified: 2021-02-05
accepted date: 2021-02-05
in scheme: ISO 639-3 language codes sub-set

Portuguese
type: Concept
notation: por
status: valid
status modified: 2021-02-05
accepted date: 2021-02-05
in scheme: ISO 639-3 language codes sub-set

Romanian
type: Concept
notation: ron
status: valid
status modified: 2021-02-05
accepted date: 2021-02-05
in scheme: ISO 639-3 language codes sub-set

Slovak
type: Concept
notation: slk
status: valid
status modified: 2021-02-05
accepted date: 2021-02-05
in scheme: ISO 639-3 language codes sub-set

Slovenian
type: Concept
notation: slv
status: valid
status modified: 2021-02-05
accepted date: 2021-02-05
in scheme: ISO 639-3 language codes sub-set

Spanish
type: Concept
notation: spa
status: valid
status modified: 2021-02-05
accepted date: 2021-02-05
in scheme: ISO 639-3 language codes sub-set

Swedish
type: Concept
notation: swe
status: valid
status modified: 2021-02-05
accepted date: 2021-02-05
in scheme: ISO 639-3 language codes sub-set

Norwegian
type: Concept
notation: nor
status: valid
status modified: 2023-10-06
accepted date: 2023-10-06
in scheme: ISO 639-3 language codes sub-set

Level value
type: ConceptScheme
notation: LevelValue
is part of: Environmental Noise - END
registration status: Public draft
user modified: lihtedar
date modified: 2022-08-02 14:39:38.0
vocabulary type: Common
is numeric concept identifiers: false
is notations equal identifiers: true

LAU level
type: Concept
notation: LAU
definition: Reporting level value at LAU level. Applicable to data flows: Competent authorities (DF2), Noise Control Programme (DF6_9)
status: valid
status modified: 2021-03-20
in scheme: Level value

NUTS1 level
type: Concept
notation: NUTS1
definition: Reporting level value at NUTS1 level. Applicable to data flows: Competent authorities (DF2), Noise Control Programme (DF6_9)
status: valid
status modified: 2021-03-20
in scheme: Level value

NUTS2 level
type: Concept
notation: NUTS2
definition: Reporting level value at NUTS2 level. Applicable to data flows: Competent authorities (DF2), Noise Control Programme (DF6_9)
status: valid
status modified: 2021-03-20
in scheme: Level value

NUTS3 level
type: Concept
notation: NUTS3
definition: Reporting level value at NUTS3 level. Applicable to data flows: Competent authorities (DF2), Noise Control Programme (DF6_9)
status: valid
status modified: 2021-03-20
in scheme: Level value

Country level
type: Concept
notation: country
definition: Reporting level value at country level. Applicable to data flows: Competent authorities (DF2), Noise Control Programme (DF6_9)
status: valid
status modified: 2021-03-20
in scheme: Level value

Entity level
type: Concept
notation: entity
definition: Reporting level value at entity level. Entity means agglomeration or road (including major road) or railway (including major railway) or airport (including major airport). Applicable to data flows: Competent authorities (DF2), Noise Control Programme (DF6_9)
status: valid
status modified: 2021-03-20
in scheme: Level value

Noise indicator - exposure data - most exposed façade including agglomeration
type: ConceptScheme
notation: NoiseIndicatorIncludingAgglomerationValue
is part of: Environmental Noise - END
registration status: Public draft
user modified: lihtedar
date modified: 2022-05-05 14:17:35.0
vocabulary type: Common
is numeric concept identifiers: false
is notations equal identifiers: true

Noise indicator Lden equal to or higher than 55 dB
type: Concept
notation: LdenEqualHigher55
definition: Lden noise level value at which exposure values are reported for major airports, major railways and major roads at the most exposed facade including agglomerations: noise value equal to or higher than 55 dB. Applicable to data flows: Strategic Noise Map - Noise Exposure (DF4_8)
status: valid
status modified: 2022-05-05
accepted date: 2022-05-05
in scheme: Noise indicator - exposure data - most exposed façade including agglomeration

Noise indicator Lden equal to or higher than 65 dB
type: Concept
notation: LdenEqualHigher65
definition: Lden noise level value at which exposure values are reported for major airports, major railways and major roads at the most exposed facade including agglomerations: noise value equal to or higher than 65 dB. Applicable to data flows: Strategic Noise Map - Noise Exposure (DF4_8)
status: valid
status modified: 2022-05-05
accepted date: 2022-05-05
in scheme: Noise indicator - exposure data - most exposed façade including agglomeration

Noise indicator Lden equal to or higher than 75 dB
type: Concept
notation: LdenEqualHigher75
definition: Lden noise level value at which exposure values are reported for major airports, major railways and major roads at the most exposed facade including agglomerations: noise value equal to or higher than 75 dB. Applicable to data flows: Strategic Noise Map - Noise Exposure (DF4_8)
status: valid
status modified: 2022-05-05
accepted date: 2022-05-05
in scheme: Noise indicator - exposure data - most exposed façade including agglomeration

Noise indicator range value
type: ConceptScheme
notation: NoiseIndicatorRangeValue
is part of: Environmental Noise - END
registration status: Public draft
user modified: blanenur
date modified: 2021-03-20 19:59:56.0
vocabulary type: Common
is numeric concept identifiers: false
is notations equal identifiers: true

Lden range from 40 to 44 dB
type: Concept
notation: Lden4044
definition: Lden noise range value at which exposure values are reported: noise range from 40 to 44 dB. Applicable to data flows: Strategic Noise Map - Noise Exposure (DF4_8), Strategic Noise Map - Noise Contour (DF4_8), Noise Action Plan Agglomeration (DF7_10), Noise Action Plan Major Airport (DF7_10), Noise Action Plan Major Railway (DF7_10), Noise Action Plan Major Road (DF7_10)
status: valid
status modified: 2021-02-01
in scheme: Noise indicator range value

Lden range from 45 to 49 dB
type: Concept
notation: Lden4549
definition: Lden noise range value at which exposure values are reported: noise range from 45 to 49 dB. Applicable to data flows: Strategic Noise Map - Noise Exposure (DF4_8), Strategic Noise Map - Noise Contour (DF4_8), Noise Action Plan Agglomeration (DF7_10), Noise Action Plan Major Airport (DF7_10), Noise Action Plan Major Railway (DF7_10), Noise Action Plan Major Road (DF7_10)
status: valid
status modified: 2021-02-01
in scheme: Noise indicator range value

Lden range from 50 to 54 dB
type: Concept
notation: Lden5054
definition: Lden noise range value at which exposure values are reported: noise range from 50 to 54 dB. Applicable to data flows: Strategic Noise Map - Noise Exposure (DF4_8), Strategic Noise Map - Noise Contour (DF4_8), Noise Action Plan Agglomeration (DF7_10), Noise Action Plan Major Airport (DF7_10), Noise Action Plan Major Railway (DF7_10), Noise Action Plan Major Road (DF7_10)
status: valid
status modified: 2021-02-01
in scheme: Noise indicator range value

Lden range from 55 to 59 dB
type: Concept
notation: Lden5559
definition: Lden noise range value at which exposure values are reported: noise range from 55 to 59 dB. Applicable to data flows: Strategic Noise Map - Noise Exposure (DF4_8), Strategic Noise Map - Noise Contour (DF4_8), Noise Action Plan Agglomeration (DF7_10), Noise Action Plan Major Airport (DF7_10), Noise Action Plan Major Railway (DF7_10), Noise Action Plan Major Road (DF7_10)
status: valid
status modified: 2021-02-01
in scheme: Noise indicator range value

Lden range from 60 to 64 dB
type: Concept
notation: Lden6064
definition: Lden noise range value at which exposure values are reported: noise range from 60 to 64 dB. Applicable to data flows: Strategic Noise Map - Noise Exposure (DF4_8), Strategic Noise Map - Noise Contour (DF4_8), Noise Action Plan Agglomeration (DF7_10), Noise Action Plan Major Airport (DF7_10), Noise Action Plan Major Railway (DF7_10), Noise Action Plan Major Road (DF7_10)
status: valid
status modified: 2021-02-01
in scheme: Noise indicator range value

Lden range from 65 to 69 dB
type: Concept
notation: Lden6569
definition: Lden noise range value at which exposure values are reported: noise range from 65 to 69 dB. Applicable to data flows: Strategic Noise Map - Noise Exposure (DF4_8), Strategic Noise Map - Noise Contour (DF4_8), Noise Action Plan Agglomeration (DF7_10), Noise Action Plan Major Airport (DF7_10), Noise Action Plan Major Railway (DF7_10), Noise Action Plan Major Road (DF7_10)
status: valid
status modified: 2021-02-01
in scheme: Noise indicator range value

Lden range from 70 to 74 dB
type: Concept
notation: Lden7074
definition: Lden noise range value at which exposure values are reported: noise range from 70 to 74 dB. Applicable to data flows: Strategic Noise Map - Noise Exposure (DF4_8), Strategic Noise Map - Noise Contour (DF4_8), Noise Action Plan Agglomeration (DF7_10), Noise Action Plan Major Airport (DF7_10), Noise Action Plan Major Railway (DF7_10), Noise Action Plan Major Road (DF7_10)
status: valid
status modified: 2021-02-01
in scheme: Noise indicator range value

Lden value equal or greater than 75 dB
type: Concept
notation: LdenGreaterThan75
definition: Lden noise level value at which exposure values are reported: noise value equal or greater than 75 dB. Applicable to data flows: Strategic Noise Map - Noise Exposure (DF4_8), Strategic Noise Map - Noise Contour (DF4_8), Noise Action Plan Agglomeration (DF7_10), Noise Action Plan Major Airport (DF7_10), Noise Action Plan Major Railway (DF7_10), Noise Action Plan Major Road (DF7_10)
status: valid
status modified: 2021-02-01
in scheme: Noise indicator range value

Lden value lower than 40 dB
type: Concept
notation: LdenLowerThan40
definition: Lden noise level value at which exposure values are reported: noise value lower than 40 dB. Applicable to data flows: Strategic Noise Map - Noise Exposure (DF4_8), Strategic Noise Map - Noise Contour (DF4_8), Noise Action Plan Agglomeration (DF7_10), Noise Action Plan Major Airport (DF7_10), Noise Action Plan Major Railway (DF7_10), Noise Action Plan Major Road (DF7_10)
status: valid
status modified: 2021-02-01
in scheme: Noise indicator range value

Lnight range from 40 to 44 dB
type: Concept
notation: Lnight4044
definition: Lnight noise range value at which exposure values are reported: noise range from 40 to 44 dB. Applicable to data flows: Strategic Noise Map - Noise Exposure (DF4_8), Strategic Noise Map - Noise Contour (DF4_8), Noise Action Plan Agglomeration (DF7_10), Noise Action Plan Major Airport (DF7_10), Noise Action Plan Major Railway (DF7_10), Noise Action Plan Major Road (DF7_10)
status: valid
status modified: 2021-02-01
in scheme: Noise indicator range value

Lnight range from 45 to 49 dB
type: Concept
notation: Lnight4549
definition: Lnight noise range value at which exposure values are reported: noise range from 45 to 49 dB. Applicable to data flows: Strategic Noise Map - Noise Exposure (DF4_8), Strategic Noise Map - Noise Contour (DF4_8), Noise Action Plan Agglomeration (DF7_10), Noise Action Plan Major Airport (DF7_10), Noise Action Plan Major Railway (DF7_10), Noise Action Plan Major Road (DF7_10)
status: valid
status modified: 2021-02-01
in scheme: Noise indicator range value

Lnight range from 50 to 54 dB
type: Concept
notation: Lnight5054
definition: Lnight noise range value at which exposure values are reported: noise range from 50 to 54 dB. Applicable to data flows: Strategic Noise Map - Noise Exposure (DF4_8), Strategic Noise Map - Noise Contour (DF4_8), Noise Action Plan Agglomeration (DF7_10), Noise Action Plan Major Airport (DF7_10), Noise Action Plan Major Railway (DF7_10), Noise Action Plan Major Road (DF7_10)
status: valid
status modified: 2021-02-01
in scheme: Noise indicator range value

Lnight range from 55 to 59 dB
type: Concept
notation: Lnight5559
definition: Lnight noise range value at which exposure values are reported: noise range from 55 to 59 dB. Applicable to data flows: Strategic Noise Map - Noise Exposure (DF4_8), Strategic Noise Map - Noise Contour (DF4_8), Noise Action Plan Agglomeration (DF7_10), Noise Action Plan Major Airport (DF7_10), Noise Action Plan Major Railway (DF7_10), Noise Action Plan Major Road (DF7_10)
status: valid
status modified: 2021-02-01
in scheme: Noise indicator range value

Lnight range from 60 to 64 dB
type: Concept
notation: Lnight6064
definition: Lnight noise range value at which exposure values are reported: noise range from 60 to 64 dB. Applicable to data flows: Strategic Noise Map - Noise Exposure (DF4_8), Strategic Noise Map - Noise Contour (DF4_8), Noise Action Plan Agglomeration (DF7_10), Noise Action Plan Major Airport (DF7_10), Noise Action Plan Major Railway (DF7_10), Noise Action Plan Major Road (DF7_10)
status: valid
status modified: 2021-02-01
in scheme: Noise indicator range value

Lnight range from 65 to 69 dB
type: Concept
notation: Lnight6569
definition: Lnight noise range value at which exposure values are reported: noise range from 65 to 69 dB. Applicable to data flows: Strategic Noise Map - Noise Exposure (DF4_8), Strategic Noise Map - Noise Contour (DF4_8), Noise Action Plan Agglomeration (DF7_10), Noise Action Plan Major Airport (DF7_10), Noise Action Plan Major Railway (DF7_10), Noise Action Plan Major Road (DF7_10)
status: valid
status modified: 2021-02-01
in scheme: Noise indicator range value

Lden value equal or greater than 70 dB
type: Concept
notation: LnightGreaterThan70
definition: Lnight noise level value at which exposure values are reported: noise value equal or greater than 70 dB. Applicable to data flows: Strategic Noise Map - Noise Exposure (DF4_8), Strategic Noise Map - Noise Contour (DF4_8), Noise Action Plan Agglomeration (DF7_10), Noise Action Plan Major Airport (DF7_10), Noise Action Plan Major Railway (DF7_10), Noise Action Plan Major Road (DF7_10)
status: valid
status modified: 2021-02-01
in scheme: Noise indicator range value

Lnight value lower than 40 dB
type: Concept
notation: LnightLowerThan40
definition: Lnight noise level value at which exposure values are reported: noise value lower than 40 dB. Applicable to data flows: Strategic Noise Map - Noise Exposure (DF4_8), Strategic Noise Map - Noise Contour (DF4_8), Noise Action Plan Agglomeration (DF7_10), Noise Action Plan Major Airport (DF7_10), Noise Action Plan Major Railway (DF7_10), Noise Action Plan Major Road (DF7_10)
status: valid
status modified: 2021-02-01
in scheme: Noise indicator range value

Noise indicator value
type: ConceptScheme
notation: NoiseIndicatorValue
is part of: Environmental Noise - END
registration status: Public draft
user modified: blanenur
date modified: 2021-05-17 15:13:36.0
vocabulary type: Common
is numeric concept identifiers: false
is notations equal identifiers: true

Lden value equal to 40 dB
type: Concept
notation: Lden40
definition: Lden noise level value at which exposure values are reported: noise value equal to 40 dB. Applicable to data flows: Strategic Noise Map - Noise Exposure (DF4_8), Strategic Noise Map - Noise Contour (DF4_8)
status: valid
status modified: 2021-02-01
in scheme: Noise indicator value

Lden value equal to 45 dB
type: Concept
notation: Lden45
definition: Lden noise level value at which exposure values are reported: noise value equal to 45 dB. Applicable to data flows: Strategic Noise Map - Noise Exposure (DF4_8), Strategic Noise Map - Noise Contour (DF4_8)
status: valid
status modified: 2021-02-01
in scheme: Noise indicator value

Lden value equal to 50 dB
type: Concept
notation: Lden50
definition: Lden noise level value at which exposure values are reported: noise value equal to 50 dB. Applicable to data flows: Strategic Noise Map - Noise Exposure (DF4_8), Strategic Noise Map - Noise Contour (DF4_8)
status: valid
status modified: 2021-02-01
in scheme: Noise indicator value

Lden value equal to 55 dB
type: Concept
notation: Lden55
definition: Lden noise level value at which exposure values are reported: noise value equal to 55 dB. Applicable to data flows: Strategic Noise Map - Noise Exposure (DF4_8), Strategic Noise Map - Noise Contour (DF4_8)
status: valid
status modified: 2021-02-01
in scheme: Noise indicator value

Lden value equal to 60 dB
type: Concept
notation: Lden60
definition: Lden noise level value at which exposure values are reported: noise value equal to 60 dB. Applicable to data flows: Strategic Noise Map - Noise Exposure (DF4_8), Strategic Noise Map - Noise Contour (DF4_8)
status: valid
status modified: 2021-02-01
in scheme: Noise indicator value

Lden value equal to 65 dB
type: Concept
notation: Lden65
definition: Lden noise level value at which exposure values are reported: noise value equal to 65 dB. Applicable to data flows: Strategic Noise Map - Noise Exposure (DF4_8), Strategic Noise Map - Noise Contour (DF4_8)
status: valid
status modified: 2021-02-01
in scheme: Noise indicator value

Lden value equal to 70 dB
type: Concept
notation: Lden70
definition: Lden noise level value at which exposure values are reported: noise value equal to70 dB. Applicable to data flows: Strategic Noise Map - Noise Exposure (DF4_8), Strategic Noise Map - Noise Contour (DF4_8)
status: valid
status modified: 2021-02-01
in scheme: Noise indicator value

Lden value equal to 75 dB
type: Concept
notation: Lden75
definition: Lden noise level value at which exposure values are reported: noise value equal to 75 dB. Applicable to data flows: Strategic Noise Map - Noise Exposure (DF4_8), Strategic Noise Map - Noise Contour (DF4_8)
status: valid
status modified: 2021-02-01
in scheme: Noise indicator value

Lnight value equal to 40 dB
type: Concept
notation: Lnight40
definition: Lnight noise level value at which exposure values are reported: noise value equal to 40 dB. Applicable to data flows: Strategic Noise Map - Noise Exposure (DF4_8), Strategic Noise Map - Noise Contour (DF4_8)
status: valid
status modified: 2021-02-01
in scheme: Noise indicator value

Lnight value equal to 45 dB
type: Concept
notation: Lnight45
definition: Lnight noise level value at which exposure values are reported: noise value equal to 45 dB. Applicable to data flows: Strategic Noise Map - Noise Exposure (DF4_8), Strategic Noise Map - Noise Contour (DF4_8)
status: valid
status modified: 2021-02-01
in scheme: Noise indicator value

Lnight value equal to 50 dB
type: Concept
notation: Lnight50
definition: Lnight noise level value at which exposure values are reported: noise value equal to 50 dB. Applicable to data flows: Strategic Noise Map - Noise Exposure (DF4_8), Strategic Noise Map - Noise Contour (DF4_8)
status: valid
status modified: 2021-02-01
in scheme: Noise indicator value

Lnight value equal to 55 dB
type: Concept
notation: Lnight55
definition: Lnight noise level value at which exposure values are reported: noise value equal to 55 dB. Applicable to data flows: Strategic Noise Map - Noise Exposure (DF4_8), Strategic Noise Map - Noise Contour (DF4_8)
status: valid
status modified: 2021-02-01
in scheme: Noise indicator value

Lnight value equal to 60 dB
type: Concept
notation: Lnight60
definition: Lnight noise level value at which exposure values are reported: noise value equal to 60 dB. Applicable to data flows: Strategic Noise Map - Noise Exposure (DF4_8), Strategic Noise Map - Noise Contour (DF4_8)
status: valid
status modified: 2021-02-01
in scheme: Noise indicator value

Lnight value equal to 65 dB
type: Concept
notation: Lnight65
definition: Lnight noise level value at which exposure values are reported: noise value equal to 65 dB. Applicable to data flows: Strategic Noise Map - Noise Exposure (DF4_8), Strategic Noise Map - Noise Contour (DF4_8)
status: valid
status modified: 2021-02-01
in scheme: Noise indicator value

Lnight value equal to 70 dB
type: Concept
notation: Lnight70
definition: Lnight noise level value at which exposure values are reported: noise value equal to 70 dB. Applicable to data flows: Strategic Noise Map - Noise Exposure (DF4_8), Strategic Noise Map - Noise Contour (DF4_8)
status: valid
status modified: 2021-02-01
in scheme: Noise indicator value

Noise level indicator value
type: ConceptScheme
notation: NoiseLevelIndicatorValue
is part of: Environmental Noise - END
registration status: Public draft
user modified: blanenur
date modified: 2021-02-01 13:06:10.0
vocabulary type: Common
is numeric concept identifiers: false
is notations equal identifiers: true

Noise indicator Lday
type: Concept
notation: Lday
definition: Noise indicator Lday as defined in END Applicable to data flows: Noise Limit Value (DF3)
status: valid
status modified: 2020-12-15
in scheme: Noise level indicator value

Noise indicator Lden
type: Concept
notation: Lden
definition: Noise indicator Lden as defined in END Applicable to data flows: Noise Limit Value (DF3)
status: valid
status modified: 2020-12-15
in scheme: Noise level indicator value

Noise indicator Levening
type: Concept
notation: Levening
definition: Noise indicator Levening as defined in END Applicable to data flows: Noise Limit Value (DF3)
status: valid
status modified: 2020-12-15
in scheme: Noise level indicator value

Noise indicator Lnight
type: Concept
notation: Lnight
definition: Noise indicator Lnight as defined in END Applicable to data flows: Noise Limit Value (DF3)
status: valid
status modified: 2020-12-15
in scheme: Noise level indicator value

Noise source type value
type: ConceptScheme
notation: NoiseSourceTypeValue
is part of: Environmental Noise - END
registration status: Public draft
user modified: blanenur
date modified: 2021-02-09 21:06:16.0
vocabulary type: Common
is numeric concept identifiers: false
is notations equal identifiers: true

Aircraft noise inside agglomeration
type: Concept
notation: airportsInAgglomeration
definition: Related to air traffic inside the boundary of the agglomeration, including major airports and other airports. Applicable to data flows: Strategic Noise Map - Noise Contour (DF4_8)
status: valid
status modified: 2021-02-01
in scheme: Noise source type value

Noise from all sources inside agglomeration
type: Concept
notation: allSourcesInAgglomeration
definition: Related to all END noise sources inside the boundary of the agglomeration (roads, railways, airports, industries). Applicable to data flows: Strategic Noise Map - Noise Contour (DF4_8)
status: valid
status modified: 2021-02-01
in scheme: Noise source type value

Industrial noise inside agglomeration
type: Concept
notation: industryInAgglomeration
definition: Related to industrial sites inside the boundary of the agglomeration. Applicable to data flows: Strategic Noise Map - Noise Contour (DF4_8)
status: valid
status modified: 2021-02-01
in scheme: Noise source type value

Major Airports including agglomerations
type: Concept
notation: majorAirportsIncludingAgglomeration
definition: Related to major airports including agglomerations (inside and outside the boundary of the agglomerations). Applicable to data flows: Strategic Noise Map - Noise Contour (DF4_8)
status: valid
status modified: 2021-02-01
in scheme: Noise source type value

Major railways including agglomerations
type: Concept
notation: majorRailwaysIncludingAgglomeration
definition: Related to major railways including agglomerations (inside and outside the boundary of the agglomerations). Applicable to data flows: Strategic Noise Map - Noise Contour (DF4_8)
status: valid
status modified: 2021-02-01
in scheme: Noise source type value

Major roads including agglomerations
type: Concept
notation: majorRoadsIncludingAgglomeration
definition: Related to major roads including agglomerations (inside and outside the boundary of the agglomerations). Applicable to data flows: Strategic Noise Map - Noise Contour (DF4_8)
status: valid
status modified: 2021-02-01
in scheme: Noise source type value

Railway noise inside agglomeration
type: Concept
notation: railwaysInAgglomeration
definition: Related to railway traffic inside the boundary of the agglomeration, including major railways and any other rail infrastructure (including light rail). Applicable to data flows: Strategic Noise Map - Noise Contour (DF4_8)
status: valid
status modified: 2021-02-01
in scheme: Noise source type value

Road noise inside agglomeration
type: Concept
notation: roadsInAgglomeration
definition: Related to road traffic inside the boundary of the agglomeration, including major roads and other roads. Applicable to data flows: Strategic Noise Map - Noise Contour (DF4_8)
status: valid
status modified: 2021-02-01
in scheme: Noise source type value

Noise source value
type: ConceptScheme
notation: NoiseSourceValue
is part of: Environmental Noise - END
registration status: Public draft
user modified: blanenur
date modified: 2023-12-19 18:12:12.0
vocabulary type: Common
is numeric concept identifiers: false
is notations equal identifiers: true

Aircraft noise inside agglomeration
type: Concept
notation: agglomerationAir
definition: Related to air traffic inside the boundary of the agglomeration, including major airports and other airports. Applicable to data flows: Agglomeration Source (DF1_5), Competent Authority (DF2), Noise Limit Value (DF3), Strategic Noise Map - Noise Exposure (DF4_8), Noise Action Plan Agglomeration (DF7_10), Quiet Area (DF7_10)
status: valid
status modified: 2020-12-15
in scheme: Noise source value
narrow match: C1

Noise from all sources inside agglomeration
type: Concept
notation: agglomerationAllSources
definition: Related to all END noise sources inside the boundary of the agglomeration (roads, railways, airports, industries). Applicable to data flows: Competent Authority (DF2), Noise Limit Value (DF3), Strategic Noise Map - Noise Exposure (DF4_8), Quiet Area (DF7_10)
status: valid
status modified: 2020-12-15
in scheme: Noise source value

Industrial noise inside agglomeration
type: Concept
notation: agglomerationIndustry
definition: Related to industrial sites inside the boundary of the agglomeration. Applicable to data flows: Agglomeration Source (DF1_5), Competent Authority (DF2), Noise Limit Value (DF3), Strategic Noise Map - Noise Exposure (DF4_8), Noise Action Plan Agglomeration (DF7_10), Quiet Area (DF7_10)
status: valid
status modified: 2020-12-15
in scheme: Noise source value

Noise from major airports inside agglomeration
type: Concept
notation: agglomerationMajorAirport
definition: Related to major airports inside the boundary of the agglomeration. Applicable to data flows: Agglomeration Source (DF1_5), Competent Authority (DF2), Strategic Noise Map - Noise Exposure (DF4_8), Noise Action Plan Agglomeration (DF7_10), Quiet Area (DF7_10)
status: valid
status modified: 2020-12-15
in scheme: Noise source value

Noise from major railways inside agglomeration
type: Concept
notation: agglomerationMajorRailway
definition: Related to major railways inside the boundary of the agglomeration. Applicable to in data flows: Agglomeration Source (DF1_5), Competent Authority (DF2), Strategic Noise Map - Noise Exposure (DF4_8), Noise Action Plan Agglomeration (DF7_10), Quiet Area (DF7_10)
status: valid
status modified: 2020-12-15
in scheme: Noise source value

Noise from major roads inside agglomeration
type: Concept
notation: agglomerationMajorRoad
definition: Related to major roads inside the boundary of the agglomeration. Applicable to data flows: Agglomeration Source (DF1_5), Competent Authority (DF2), Strategic Noise Map - Noise Exposure (DF4_8), Noise Action Plan Agglomeration (DF7_10), Quiet Area (DF7_10)
status: valid
status modified: 2020-12-15
in scheme: Noise source value

Railway noise inside agglomeration
type: Concept
notation: agglomerationRailway
definition: Related to railway traffic inside the boundary of the agglomeration, including major railways and any other rail infrastructure (including light rail). Applicable to data flows: Agglomeration Source (DF1_5), Competent Authority (DF2), Noise Limit Value (DF3), Strategic Noise Map - Noise Exposure (DF4_8), Noise Action Plan Agglomeration (DF7_10), Quiet Area (DF7_10)
status: valid
status modified: 2020-12-15
in scheme: Noise source value

Road noise inside agglomeration
type: Concept
notation: agglomerationRoad
definition: Related to road traffic inside the boundary of the agglomeration, including major roads and other roads. Applicable to data flows: Agglomeration Source (DF1_5), Competent Authority (DF2), Noise Limit Value (DF3), Strategic Noise Map - Noise Exposure (DF4_8), Noise Action Plan Agglomeration (DF7_10), Quiet Area (DF7_10)
status: valid
status modified: 2020-12-15
in scheme: Noise source value

All noise sources inside and outside agglomerations
type: Concept
notation: allSources
definition: Related to all END noise sources, inside and outside agglomerations (roads, railways, airports, industries, major roads, major railways, major airports). Applicable to data flows: Noise Limit Value (DF3)
status: valid
status modified: 2020-12-15
in scheme: Noise source value

Major airports outside agglomerations
type: Concept
notation: majorAirport
definition: Related to major airports outside agglomerations. Applicable to data flows: Noise Limit Value (DF3), Quiet Areas (DF7_10)
status: valid
status modified: 2020-12-15
in scheme: Noise source value

Major sources outside agglomerations
type: Concept
notation: majorAllSources
definition: Related to all END major sources oustide agglomerations (major roads, major railways, major airports). Applicable to data flows: Noise Limit Value (DF3), Quiet Area (DF7_10)
status: valid
status modified: 2020-12-15
in scheme: Noise source value

Major railways outside agglomerations
type: Concept
notation: majorRailway
definition: Related to major railways outside agglomerations. Applicable to data flows: Noise Limit Value (DF3), Quiet Areas (DF7_10)
status: valid
status modified: 2020-12-15
in scheme: Noise source value

Major roads outside agglomerations
type: Concept
notation: majorRoad
definition: Related to major roads outside agglomerations. Applicable to data flows: Noise Limit Value (DF3), Quiet Areas (DF7_10)
status: valid
status modified: 2020-12-15
in scheme: Noise source value

Prioritisation criteria value
type: ConceptScheme
notation: PrioritisationCriteriaValue
is part of: Environmental Noise - END
registration status: Public draft
user modified: blanenur
date modified: 2021-03-20 19:48:43.0
vocabulary type: Common
is numeric concept identifiers: false
is notations equal identifiers: true

Cost-benefit analysis
type: Concept
notation: cost-benefits
definition: Cost-benefit analysis is used as criteria to set noise reduction priorities of the action plan. Applicable to data flows: Noise Action Plan Agglomeration (DF7_10), Noise Action Plan Major Airport (DF7_10), Noise Action Plan Major Railway (DF7_10), Noise Action Plan Major Road (DF7_10)
status: valid
status modified: 2021-02-01
in scheme: Prioritisation criteria value

Noise level at which noise exposure is calculated
type: Concept
notation: levelOfNoiseExposure
definition: Level of noise exposure is used as criteria to set noise reduction priorities of the action plan. Applicable to data flows: Noise Action Plan Agglomeration (DF7_10), Noise Action Plan Major Airport (DF7_10), Noise Action Plan Major Railway (DF7_10), Noise Action Plan Major Road (DF7_10)
status: valid
status modified: 2021-02-01
in scheme: Prioritisation criteria value

Number of people exposed
type: Concept
notation: numberOfExposedPeople
definition: Number of people exposed is used as criteria to set noise reduction priorities of the action plan. Applicable to data flows: Noise Action Plan Agglomeration (DF7_10), Noise Action Plan Major Airport (DF7_10), Noise Action Plan Major Railway (DF7_10), Noise Action Plan Major Road (DF7_10)
status: valid
status modified: 2021-02-01
in scheme: Prioritisation criteria value

Rail reduction measure value
type: ConceptScheme
notation: RailMeasureValue
is part of: Environmental Noise - END
registration status: Public draft
user modified: blanenur
date modified: 2022-12-12 13:35:52.0
vocabulary type: Common
is numeric concept identifiers: false
is notations equal identifiers: true

Bans and re-routing of freight vehicles
type: Concept
notation: bansReroutingFreight
definition: bansReroutingFreight Applicable to data flows: Noise Action Plan Agglomeration (DF7_10), Noise Action Plan Major Rail (DF7_10)
status: valid
status modified: 2021-02-13
accepted date: 2021-02-13
in scheme: Rail reduction measure value
broad match: Other traffic management measures

Bans and re-routing of passenger vehicles
type: Concept
notation: bansReroutingPassenger
definition: Bans and re-routing of passenger vehicles Applicable to data flows: Noise Action Plan Agglomeration (DF7_10), Noise Action Plan Major Rail (DF7_10)
status: valid
status modified: 2021-02-13
accepted date: 2021-02-13
in scheme: Rail reduction measure value
broad match: Other traffic management measures

Buffer zones
type: Concept
notation: bufferZones
definition: Buffer zones Applicable to data flows: Noise Action Plan Agglomeration (DF7_10), Noise Action Plan Major Rail (DF7_10)
status: valid
status modified: 2021-02-13
accepted date: 2021-02-13
in scheme: Rail reduction measure value
broad match: Land use planning

Building insulation
type: Concept
notation: buildingInsulationMeasure
definition: Building insulation such as wondow insulation or other types of insulation. Applicable to data flows: Noise Action Plan Agglomeration (DF7_10), Noise Action Plan Major Rail (DF7_10)
status: valid
status modified: 2021-02-13
accepted date: 2021-02-13
in scheme: Rail reduction measure value
broad match: Measures at the path
narrow match: Window insulation
narrow match: Other insulation

Change in emission levels
type: Concept
notation: changeInEmissionLevels
definition: Change in emission levels such as rail track measures, retrofitting wheels, low noise brakes, quiet engines and nenewal of the fleet. Applicable to data flows: Noise Action Plan Agglomeration (DF7_10), Noise Action Plan Major Rail (DF7_10)
status: valid
status modified: 2021-02-13
accepted date: 2021-02-13
in scheme: Rail reduction measure value
broad match: Measures at the source
narrow match: Rail track measures
narrow match: Quiet engines
narrow match: Retrofitting wheels or wheel components
narrow match: Low-noise brakes
narrow match: Renewal railway fleet

Closed infrastructure
type: Concept
notation: closedInfrastructure
definition: Closed infrastructure such as the closure of a railway route or the closure of a station. Applicable to data flows: Noise Action Plan Agglomeration (DF7_10), Noise Action Plan Major Rail (DF7_10)
status: valid
status modified: 2021-02-13
accepted date: 2021-02-13
in scheme: Rail reduction measure value
broad match: Infrastructure change
narrow match: Closure of station
narrow match: Closure of railway route

Closure of railway route
type: Concept
notation: closureRailwayRoute
definition: Closure of railway route Applicable to data flows: Noise Action Plan Agglomeration (DF7_10), Noise Action Plan Major Rail (DF7_10)
status: valid
status modified: 2021-02-13
accepted date: 2021-02-13
in scheme: Rail reduction measure value
broad match: Closed infrastructure

Closure of station
type: Concept
notation: closureStation
definition: Closure of station Applicable to data flows: Noise Action Plan Agglomeration (DF7_10), Noise Action Plan Major Rail (DF7_10)
status: valid
status modified: 2021-02-13
accepted date: 2021-02-13
in scheme: Rail reduction measure value
broad match: Closed infrastructure

Communication
type: Concept
notation: communication
definition: Communication measures such as information dissemination or complaint management. Applicable to data flows: Noise Action Plan Agglomeration (DF7_10), Noise Action Plan Major Rail (DF7_10)
status: valid
status modified: 2021-02-13
accepted date: 2021-02-13
in scheme: Rail reduction measure value
broad match: Community engagement
narrow match: Information dissemination
narrow match: Complaint management

Community engagement
type: Concept
notation: communityEngagement
definition: Community engagement such as communication measures or measures for behavioural change. Applicable to data flows: Noise Action Plan Agglomeration (DF7_10), Noise Action Plan Major Rail (DF7_10)
status: valid
status modified: 2021-02-13
accepted date: 2021-02-13
in scheme: Rail reduction measure value
narrow match: Communication
narrow match: Measures for behavioural changes

Complaint management
type: Concept
notation: complaintManagement
definition: Complaint management Applicable to data flows: Noise Action Plan Agglomeration (DF7_10), Noise Action Plan Major Rail (DF7_10)
status: valid
status modified: 2021-02-13
accepted date: 2021-02-13
in scheme: Rail reduction measure value
broad match: Communication

Education and awareness raising activities
type: Concept
notation: educationAwarenessActivities
definition: Education and awareness raising activities Applicable to data flows: Noise Action Plan Agglomeration (DF7_10), Noise Action Plan Major Rail (DF7_10)
status: valid
status modified: 2021-02-13
accepted date: 2021-02-13
in scheme: Rail reduction measure value
broad match: Measures for behavioural changes

Availability of green areas
type: Concept
notation: greenArea
definition: Availability of green areas Applicable to data flows: Noise Action Plan Agglomeration (DF7_10), Noise Action Plan Major Rail (DF7_10)
status: valid
status modified: 2021-02-13
accepted date: 2021-02-13
in scheme: Rail reduction measure value
broad match: Noise quality areas

Green noise barriers and maintenance
type: Concept
notation: greenNoiseBarrier
definition: Green noise barriers and maintenance Applicable to data flows: Noise Action Plan Agglomeration (DF7_10), Noise Action Plan Major Rail (DF7_10)
status: valid
status modified: 2021-02-13
accepted date: 2021-02-13
in scheme: Rail reduction measure value
broad match: Noise barriers

Information dissemination
type: Concept
notation: informationDissemination
definition: Information dissemination Applicable to data flows: Noise Action Plan Agglomeration (DF7_10), Noise Action Plan Major Rail (DF7_10)
status: valid
status modified: 2021-02-13
accepted date: 2021-02-13
in scheme: Rail reduction measure value
broad match: Communication

Infrastructure change
type: Concept
notation: infrastructureChange
definition: Infrastructure change such as new intrastructure or a close infrastructure. Applicable to data flows: Noise Action Plan Agglomeration (DF7_10), Noise Action Plan Major Rail (DF7_10)
status: valid
status modified: 2021-02-13
accepted date: 2021-02-13
in scheme: Rail reduction measure value
narrow match: Closed infrastructure
narrow match: New infrastructure

Land use planning
type: Concept
notation: landUsePlanning
definition: Land use planning such as planning and ordinance, sensitive area planning or buffer zones. Applicable to data flows: Noise Action Plan Agglomeration (DF7_10), Noise Action Plan Major Rail (DF7_10)
status: valid
status modified: 2021-02-13
accepted date: 2021-02-13
in scheme: Rail reduction measure value
broad match: Urban planning
narrow match: Reduced noise for sensitive areas
narrow match: Buffer zones
narrow match: Planning measures and ordinances between receivers and railway sources

Low-noise brakes
type: Concept
notation: lowNoiseBrakes
definition: Low noise brakes Applicable to data flows: Noise Action Plan Agglomeration (DF7_10), Noise Action Plan Major Rail (DF7_10)
status: valid
status modified: 2021-02-13
accepted date: 2021-02-13
in scheme: Rail reduction measure value
broad match: Change in emission levels

Measures at the path
type: Concept
notation: measureAtPath
definition: Measures at the path such as noise barrier measures or building insulation measures. Applicable to data flows: Noise Action Plan Agglomeration (DF7_10), Noise Action Plan Major Rail (DF7_10)
status: valid
status modified: 2021-02-13
accepted date: 2021-02-13
in scheme: Rail reduction measure value
narrow match: Noise barriers
narrow match: Building insulation

Measures at the source
type: Concept
notation: measureAtSource
definition: Measures at the source such as change in emission levels, time restriction, speed reduction measure or other traffic management measure. Applicable to data flows: Noise Action Plan Agglomeration (DF7_10), Noise Action Plan Major Rail (DF7_10)
status: valid
status modified: 2021-02-13
accepted date: 2021-02-13
in scheme: Rail reduction measure value
narrow match: Speed reduction measures
narrow match: Other traffic management measures
narrow match: Change in emission levels
narrow match: Time restriction on source operations

Measures for behavioural changes
type: Concept
notation: measuresForBehaviouralChange
definition: Measures for behavioural changes such as education awareness activities or promoting other modes of transport. Applicable to data flows: Noise Action Plan Agglomeration (DF7_10), Noise Action Plan Major Rail (DF7_10)
status: valid
status modified: 2021-02-13
accepted date: 2021-02-13
in scheme: Rail reduction measure value
broad match: Community engagement
narrow match: Promoting use of railway transport
narrow match: Education and awareness raising activities

New rail by-pass / new viaduct
type: Concept
notation: newBypassViaduct
definition: New rail by-pass / new viaduct Applicable to data flows: Noise Action Plan Agglomeration (DF7_10), Noise Action Plan Major Rail (DF7_10)
status: valid
status modified: 2021-02-13
accepted date: 2021-02-13
in scheme: Rail reduction measure value
broad match: New infrastructure

New infrastructure
type: Concept
notation: newInfrastructure
definition: New infrastructure such as a new route, a new bypass/viaduct or new tunnel. Applicable to data flows: Noise Action Plan Agglomeration (DF7_10), Noise Action Plan Major Rail (DF7_10)
status: valid
status modified: 2021-02-13
accepted date: 2021-02-13
in scheme: Rail reduction measure value
broad match: Infrastructure change
narrow match: New rail by-pass / new viaduct
narrow match: New route
narrow match: New tunnel

New route
type: Concept
notation: newRoute
definition: New route Applicable to data flows: Noise Action Plan Agglomeration (DF7_10), Noise Action Plan Major Rail (DF7_10)
status: valid
status modified: 2021-02-13
accepted date: 2021-02-13
in scheme: Rail reduction measure value
broad match: New infrastructure

New tunnel
type: Concept
notation: newTunnel
definition: New tunnel Applicable to data flows: Noise Action Plan Agglomeration (DF7_10), Noise Action Plan Major Rail (DF7_10)
status: valid
status modified: 2021-02-13
accepted date: 2021-02-13
in scheme: Rail reduction measure value
broad match: New infrastructure

Noise barriers and maintenance
type: Concept
notation: noiseBarrier
definition: Noise barriers and maintenance Applicable to data flows: Noise Action Plan Agglomeration (DF7_10), Noise Action Plan Major Rail (DF7_10)
status: valid
status modified: 2021-02-13
accepted date: 2021-02-13
in scheme: Rail reduction measure value
broad match: Noise barriers

Noise barriers
type: Concept
notation: noiseBarrierMeasure
definition: Noise barriers such as noise barriers or green noise barriers. Applicable to data flows: Noise Action Plan Agglomeration (DF7_10), Noise Action Plan Major Rail (DF7_10)
status: valid
status modified: 2021-02-13
accepted date: 2021-02-13
in scheme: Rail reduction measure value
broad match: Measures at the path
narrow match: Noise barriers and maintenance
narrow match: Green noise barriers and maintenance

Noise quality areas
type: Concept
notation: noiseQualityArea
definition: Noise quality areas such as quiet area, green area or soundscape measures. Applicable to data flows: Noise Action Plan Agglomeration (DF7_10), Noise Action Plan Major Rail (DF7_10)
status: valid
status modified: 2021-02-13
accepted date: 2021-02-13
in scheme: Rail reduction measure value
broad match: Urban planning
narrow match: Availability of quiet areas
narrow match: Soundscape measures
narrow match: Availability of green areas

Other insulation
type: Concept
notation: otherInsulation
definition: Other insulation Applicable to data flows: Noise Action Plan Agglomeration (DF7_10), Noise Action Plan Major Rail (DF7_10)
status: valid
status modified: 2021-02-13
accepted date: 2021-02-13
in scheme: Rail reduction measure value
broad match: Building insulation

Other traffic management measures
type: Concept
notation: otherTrafficManagementMeasure
definition: Other traffic management measures such as reduction of rail tracks, track access charges, bans and rerouting of freight and bans or rerouting of passenger. Applicable to data flows: Noise Action Plan Agglomeration (DF7_10), Noise Action Plan Major Rail (DF7_10)
status: valid
status modified: 2021-02-13
accepted date: 2021-02-13
in scheme: Rail reduction measure value
broad match: Measures at the source
narrow match: Change/reduction in rail tracks
narrow match: Bans and re-routing of passenger vehicles
narrow match: Bans and re-routing of freight vehicles
narrow match: Track access charges

Planning measures and ordinances between receivers and railway sources
type: Concept
notation: planningAndOrdinance
definition: Planning measures and ordinances between receivers and railway sources Applicable to data flows: Noise Action Plan Agglomeration (DF7_10), Noise Action Plan Major Rail (DF7_10)
status: valid
status modified: 2021-02-13
accepted date: 2021-02-13
in scheme: Rail reduction measure value
broad match: Land use planning

Promoting use of railway transport
type: Concept
notation: promotingOtherModes
definition: Promoting use of railway transport Applicable to data flows: Noise Action Plan Agglomeration (DF7_10), Noise Action Plan Major Rail (DF7_10)
status: valid
status modified: 2021-02-13
accepted date: 2021-02-13
in scheme: Rail reduction measure value
broad match: Measures for behavioural changes

Availability of quiet areas
type: Concept
notation: quietArea
definition: Availability of quiet areas Applicable to data flows: Noise Action Plan Agglomeration (DF7_10), Noise Action Plan Major Rail (DF7_10)
status: valid
status modified: 2021-02-13
accepted date: 2021-02-13
in scheme: Rail reduction measure value
broad match: Noise quality areas

Quiet engines
type: Concept
notation: quietEngines
definition: Quiet engines Applicable to data flows: Noise Action Plan Agglomeration (DF7_10), Noise Action Plan Major Rail (DF7_10)
status: valid
status modified: 2021-02-13
accepted date: 2021-02-13
in scheme: Rail reduction measure value
broad match: Change in emission levels

Rail track measures
type: Concept
notation: railTrack
definition: Rail track measures Applicable to data flows: Noise Action Plan Agglomeration (DF7_10), Noise Action Plan Major Rail (DF7_10)
status: valid
status modified: 2021-02-13
accepted date: 2021-02-13
in scheme: Rail reduction measure value
broad match: Change in emission levels

Change/reduction in rail tracks
type: Concept
notation: reductionRailTracks
definition: Change/reduction in rail tracks Applicable to data flows: Noise Action Plan Agglomeration (DF7_10), Noise Action Plan Major Rail (DF7_10)
status: valid
status modified: 2021-02-13
accepted date: 2021-02-13
in scheme: Rail reduction measure value
broad match: Other traffic management measures

Renewal railway fleet
type: Concept
notation: renewalFleet
definition: Renewal of the fleet Applicable to data flows: Noise Action Plan Agglomeration (DF7_10), Noise Action Plan Major Rail (DF7_10)
status: valid
status modified: 2021-02-13
accepted date: 2021-02-13
in scheme: Rail reduction measure value
broad match: Change in emission levels

Retrofitting wheels or wheel components
type: Concept
notation: retrofittingWheels
definition: Retrofitting of the wheels Applicable to data flows: Noise Action Plan Agglomeration (DF7_10), Noise Action Plan Major Rail (DF7_10)
status: valid
status modified: 2021-02-13
accepted date: 2021-02-13
in scheme: Rail reduction measure value
broad match: Change in emission levels

Reduced noise for sensitive areas
type: Concept
notation: sensitiveAreaPlanning
definition: Reduced noise for sensitive areas Applicable to data flows: Noise Action Plan Agglomeration (DF7_10), Noise Action Plan Major Rail (DF7_10)
status: valid
status modified: 2021-02-13
accepted date: 2021-02-13
in scheme: Rail reduction measure value
broad match: Land use planning

Soundscape measures
type: Concept
notation: soundscape
definition: Soundscape measures Applicable to data flows: Noise Action Plan Agglomeration (DF7_10), Noise Action Plan Major Rail (DF7_10)
status: valid
status modified: 2021-02-13
accepted date: 2021-02-13
in scheme: Rail reduction measure value
broad match: Noise quality areas

Reduction of rail speeds and traffic signalling
type: Concept
notation: speedReduction
definition: Reduction of rail speeds and traffic signalling Applicable to data flows: Noise Action Plan Agglomeration (DF7_10), Noise Action Plan Major Rail (DF7_10)
status: valid
status modified: 2021-02-13
accepted date: 2021-02-13
in scheme: Rail reduction measure value
broad match: Speed reduction measures

Speed reduction measures
type: Concept
notation: speedReductionMeasure
definition: Speed reduction measures such as speed reduction or traffic clamed zones. Applicable to data flows: Noise Action Plan Agglomeration (DF7_10), Noise Action Plan Major Rail (DF7_10)
status: valid
status modified: 2021-02-13
accepted date: 2021-02-13
in scheme: Rail reduction measure value
broad match: Measures at the source
narrow match: Designation of traffic-calmed zones from rail
narrow match: Reduction of rail speeds and traffic signalling

Time restriction on source operations
type: Concept
notation: timeRestriction
definition: Time restriction on source operations such as time restriction freight or time restriction passenger. Applicable to data flows: Noise Action Plan Agglomeration (DF7_10), Noise Action Plan Major Rail (DF7_10)
status: valid
status modified: 2021-02-13
accepted date: 2021-02-13
in scheme: Rail reduction measure value
broad match: Measures at the source
narrow match: Time restriction for freight vehicles
narrow match: Time restriction for passenger vehicles

Time restriction for freight vehicles
type: Concept
notation: timeRestrictionFreight
definition: Time restriction for freight vehicles Applicable to data flows: Noise Action Plan Agglomeration (DF7_10), Noise Action Plan Major Rail (DF7_10)
status: valid
status modified: 2021-02-13
accepted date: 2021-02-13
in scheme: Rail reduction measure value
broad match: Time restriction on source operations

Time restriction for passenger vehicles
type: Concept
notation: timeRestrictionPassenger
definition: Time restriction for passenger vehicles Applicable to data flows: Noise Action Plan Agglomeration (DF7_10), Noise Action Plan Major Rail (DF7_10)
status: valid
status modified: 2021-02-13
accepted date: 2021-02-13
in scheme: Rail reduction measure value
broad match: Time restriction on source operations

Track access charges
type: Concept
notation: trackAccessCharges
definition: trackAccessCharges Applicable to data flows: Noise Action Plan Agglomeration (DF7_10), Noise Action Plan Major Rail (DF7_10)
status: valid
status modified: 2021-02-13
accepted date: 2021-02-13
in scheme: Rail reduction measure value
broad match: Other traffic management measures

Designation of traffic-calmed zones from rail
type: Concept
notation: trafficCalmedZones
definition: Designation of traffic-calmed zones from rail Applicable to data flows: Noise Action Plan Agglomeration (DF7_10), Noise Action Plan Major Rail (DF7_10)
status: valid
status modified: 2021-02-13
accepted date: 2021-02-13
in scheme: Rail reduction measure value
broad match: Speed reduction measures

Urban planning
type: Concept
notation: urbanPlanning
definition: Urban planning such as land use planning or noise quality area. Applicable to data flows: Noise Action Plan Agglomeration (DF7_10), Noise Action Plan Major Rail (DF7_10)
status: valid
status modified: 2021-02-13
accepted date: 2021-02-13
in scheme: Rail reduction measure value
narrow match: Land use planning
narrow match: Noise quality areas

Window insulation
type: Concept
notation: windowInsulation
definition: Window insulation Applicable to data flows: Noise Action Plan Agglomeration (DF7_10), Noise Action Plan Major Rail (DF7_10)
status: valid
status modified: 2021-02-13
accepted date: 2021-02-13
in scheme: Rail reduction measure value
broad match: Building insulation

No measure
type: Concept
notation: noMeasure
definition: No noise reduction measure. Applicable to data flows: Noise Action Plan Agglomeration (DF7_10), Noise Action Plan Major Rail (DF7_10)
status: valid
status modified: 2022-12-12
accepted date: 2022-12-12
in scheme: Rail reduction measure value

Reporting level value
type: ConceptScheme
notation: ReportingLevelValue
is part of: Environmental Noise - END
registration status: Public draft
user modified: blanenur
date modified: 2024-05-13 15:37:05.0
vocabulary type: Common
is numeric concept identifiers: false
is notations equal identifiers: true

LAU level
type: Concept
notation: LAU
definition: Exposure values reported at LAU level. Applicable to data flows: Strategic Noise Map - Noise Exposure (DF4_8)
status: valid
status modified: 2021-02-01
in scheme: Reporting level value

NUTS1 level
type: Concept
notation: NUTS1
definition: Exposure values reported at NUTS 1 level. Applicable to data flows: Strategic Noise Map - Noise Exposure (DF4_8), Noise action plan (DF7_10): Major road, Noise Action Plan (DF7_10): Major railway.
status: valid
status modified: 2021-02-01
in scheme: Reporting level value

NUTS2 level
type: Concept
notation: NUTS2
definition: Exposure values reported at NUTS 2 level. Applicable to data flows: Strategic Noise Map - Noise Exposure (DF4_8), Noise action plan (DF7_10): Major road, Noise Action Plan (DF7_10): Major railway.
status: valid
status modified: 2021-02-01
in scheme: Reporting level value

NUTS3 level
type: Concept
notation: NUTS3
definition: Exposure values reported at NUTS 3 level. Applicable to data flows: Strategic Noise Map - Noise Exposure (DF4_8), Noise action plan (DF7_10): Major road, Noise Action Plan (DF7_10): Major railway.
status: valid
status modified: 2021-02-01
in scheme: Reporting level value

Country level
type: Concept
notation: country
definition: Exposure values reported at country level. Applicable to data flows: Strategic Noise Map - Noise Exposure (DF4_8)
status: valid
status modified: 2021-02-01
in scheme: Reporting level value

Road reduction measure value
type: ConceptScheme
notation: RoadMeasureValue
is part of: Environmental Noise - END
registration status: Public draft
user modified: blanenur
date modified: 2024-01-22 11:38:20.0
vocabulary type: Common
is numeric concept identifiers: false
is notations equal identifiers: true

Bans and re-routing of heavy vehicles
type: Concept
notation: bansReroutingHGV
definition: Bans and re-routing of heavy vehicles Applicable to data flows: Noise Action Plan Agglomeration (DF7_10), Noise Action Plan Major Road (DF7_10)
status: valid
status modified: 2021-02-13
accepted date: 2021-02-13
in scheme: Road reduction measure value
broad match: Other traffic management measures

Bans and re-routing of passenger vehicles
type: Concept
notation: bansReroutingPassenger
definition: Bans and re-routing of passenger vehicles Applicable to data flows: Noise Action Plan Agglomeration (DF7_10), Noise Action Plan Major Road (DF7_10)
status: valid
status modified: 2021-02-13
accepted date: 2021-02-13
in scheme: Road reduction measure value
broad match: Other traffic management measures

Buffer zones
type: Concept
notation: bufferZones
definition: Buffer zones Applicable to data flows: Noise Action Plan Agglomeration (DF7_10), Noise Action Plan Major Road (DF7_10)
status: valid
status modified: 2021-02-13
accepted date: 2021-02-13
in scheme: Road reduction measure value
broad match: Land use planning

Building insulation
type: Concept
notation: buildingInsulationMeasure
definition: Building insulation such as window insulation or other building insulation types. Applicable to data flows: Noise Action Plan Agglomeration (DF7_10), Noise Action Plan Major Road (DF7_10)
status: valid
status modified: 2021-02-13
accepted date: 2021-02-13
in scheme: Road reduction measure value
broad match: Measures at the path
narrow match: Other insulation
narrow match: Window insulation

Change in emission levels
type: Concept
notation: changeInEmissionLevels
definition: Change in emission levels such as road surface, low noise tyres, quiet engines, exhaust or quiet public transport measures. Applicable to data flows: Noise Action Plan Agglomeration (DF7_10), Noise Action Plan Major Road (DF7_10)
status: valid
status modified: 2021-02-13
accepted date: 2021-02-13
in scheme: Road reduction measure value
broad match: Measures at the source
narrow match: Quiet engines
narrow match: Measures at the exhaust
narrow match: Road surface measures
narrow match: Renewal to quieter public transport fleet including components
narrow match: Low-noise tyres

Closed infrastructure
type: Concept
notation: closedInfrastructure
definition: Closed infrastructure such as closure of a road. Applicable to data flows: Noise Action Plan Agglomeration (DF7_10), Noise Action Plan Major Road (DF7_10)
status: valid
status modified: 2021-02-13
accepted date: 2021-02-13
in scheme: Road reduction measure value
broad match: Infrastructure change
narrow match: Closure of roads

Closure of roads
type: Concept
notation: closureRoad
definition: Closure of roads Applicable to data flows: Noise Action Plan Agglomeration (DF7_10), Noise Action Plan Major Road (DF7_10)
status: valid
status modified: 2021-02-13
accepted date: 2021-02-13
in scheme: Road reduction measure value
broad match: Closed infrastructure

Communication
type: Concept
notation: communication
definition: Communication measures such as information dissemination or complaint management. Applicable to data flows: Noise Action Plan Agglomeration (DF7_10), Noise Action Plan Major Road (DF7_10)
status: valid
status modified: 2021-02-13
accepted date: 2021-02-13
in scheme: Road reduction measure value
broad match: Community engagement
narrow match: Information dissemination
narrow match: Complaint management

Community engagement
type: Concept
notation: communityEngagement
definition: Community engagement such as communication measures or measures for behavioural change. Applicable to data flows: Noise Action Plan Agglomeration (DF7_10), Noise Action Plan Major Road (DF7_10)
status: valid
status modified: 2021-02-13
accepted date: 2021-02-13
in scheme: Road reduction measure value
narrow match: Communication
narrow match: Measures for behavioural changes

Complaint management
type: Concept
notation: complaintManagement
definition: Complaint management Applicable to data flows: Noise Action Plan Agglomeration (DF7_10), Noise Action Plan Major Road (DF7_10)
status: valid
status modified: 2021-02-13
accepted date: 2021-02-13
in scheme: Road reduction measure value
broad match: Communication

Congestion charges
type: Concept
notation: congestionCharges
definition: Congestion charges Applicable to data flows: Noise Action Plan Agglomeration (DF7_10), Noise Action Plan Major Road (DF7_10)
status: valid
status modified: 2021-02-13
accepted date: 2021-02-13
in scheme: Road reduction measure value
broad match: Other traffic management measures

Enhacing infrastructure for cycling and walking
type: Concept
notation: cyclingWalkingIncrease
definition: Enhacing infrastructure for cycling and walking Applicable to data flows: Noise Action Plan Agglomeration (DF7_10), Noise Action Plan Major Road (DF7_10)
status: valid
status modified: 2021-02-13
accepted date: 2021-02-13
in scheme: Road reduction measure value
broad match: Other traffic management measures

Education and awareness raising activities
type: Concept
notation: educationAwarenessActivities
definition: Education and awareness raising activities Applicable to data flows: Noise Action Plan Agglomeration (DF7_10), Noise Action Plan Major Road (DF7_10)
status: valid
status modified: 2021-02-13
accepted date: 2021-02-13
in scheme: Road reduction measure value
broad match: Measures for behavioural changes

Measures at the exhaust
type: Concept
notation: exhaust
definition: Measures at the exhaust Applicable to data flows: Noise Action Plan Agglomeration (DF7_10), Noise Action Plan Major Road (DF7_10)
status: valid
status modified: 2021-02-13
accepted date: 2021-02-13
in scheme: Road reduction measure value
broad match: Change in emission levels

Availability of green areas
type: Concept
notation: greenArea
definition: Availability of green areas Applicable to data flows: Noise Action Plan Agglomeration (DF7_10), Noise Action Plan Major Road (DF7_10)
status: valid
status modified: 2021-02-13
accepted date: 2021-02-13
in scheme: Road reduction measure value
broad match: Noise quality areas

Green noise barriers and maintenance
type: Concept
notation: greenNoiseBarrier
definition: Green noise barriers and maintenance Applicable to data flows: Noise Action Plan Agglomeration (DF7_10), Noise Action Plan Major Road (DF7_10)
status: valid
status modified: 2021-02-13
accepted date: 2021-02-13
in scheme: Road reduction measure value
broad match: Noise barriers

Information dissemination
type: Concept
notation: informationDissemination
definition: Information dissemination Applicable to data flows: Noise Action Plan Agglomeration (DF7_10), Noise Action Plan Major Road (DF7_10)
status: valid
status modified: 2021-02-13
accepted date: 2021-02-13
in scheme: Road reduction measure value
broad match: Communication

Infrastructure change
type: Concept
notation: infrastructureChange
definition: Infrastructure change such as new infrastrucutre or closed infrastructure. Applicable to data flows: Noise Action Plan Agglomeration (DF7_10), Noise Action Plan Major Road (DF7_10)
status: valid
status modified: 2021-02-13
accepted date: 2021-02-13
in scheme: Road reduction measure value
narrow match: Closed infrastructure
narrow match: New infrastructure

Land use planning
type: Concept
notation: landUsePlanning
definition: Land use planning such as planning and ordinance measures, sensitive area planning or buffer zones. Applicable to data flows: Noise Action Plan Agglomeration (DF7_10), Noise Action Plan Major Road (DF7_10)
status: valid
status modified: 2021-02-13
accepted date: 2021-02-13
in scheme: Road reduction measure value
broad match: Urban planning
narrow match: Reduced noise for sensitive areas
narrow match: Planning measures and ordinances between receivers and road sources
narrow match: Buffer zones

Low-noise tyres
type: Concept
notation: lowNoiseTyres
definition: Low-noise tyres Applicable to data flows: Noise Action Plan Agglomeration (DF7_10), Noise Action Plan Major Road (DF7_10)
status: valid
status modified: 2021-02-13
accepted date: 2021-02-13
in scheme: Road reduction measure value
broad match: Change in emission levels

Measures at the path
type: Concept
notation: measureAtPath
definition: Measures at the path such as noise barrier measure or building insulation measure Applicable to data flows: Noise Action Plan Agglomeration (DF7_10), Noise Action Plan Major Road (DF7_10)
status: valid
status modified: 2021-02-13
accepted date: 2021-02-13
in scheme: Road reduction measure value
narrow match: Noise barriers
narrow match: Building insulation

Measures at the source
type: Concept
notation: measureAtSource
definition: Measures at the source such as change in emission levels, time restriction, speed reduction measures or other traffic management measures. Applicable to data flows: Noise Action Plan Agglomeration (DF7_10), Noise Action Plan Major Road (DF7_10)
status: valid
status modified: 2021-02-13
accepted date: 2021-02-13
in scheme: Road reduction measure value
narrow match: Time restriction on source operations
narrow match: Speed reduction measures
narrow match: Change in emission levels
narrow match: Other traffic management measures

Measures for behavioural changes
type: Concept
notation: measuresForBehaviouralChange
definition: Measures for behavioural change such as promoting quiet mobility, promoting public transport, promoting car sharing or education awareness activities. Applicable to data flows: Noise Action Plan Agglomeration (DF7_10), Noise Action Plan Major Road (DF7_10)
status: valid
status modified: 2021-02-13
accepted date: 2021-02-13
in scheme: Road reduction measure value
broad match: Community engagement
narrow match: Promoting public transport
narrow match: Promoting quiet mobility
narrow match: Promoting car sharing
narrow match: Education and awareness raising activities

New bypass bridge road
type: Concept
notation: newBypassBridgeRoad
definition: New bypass or bridge for road Applicable to data flows: Noise Action Plan Agglomeration (DF7_10), Noise Action Plan Major Road (DF7_10)
status: valid
status modified: 2022-12-12
accepted date: 2022-12-12
in scheme: Road reduction measure value
broad match: New infrastructure

New infrastructure
type: Concept
notation: newInfrastructure
definition: New infrastructure such as new bypass or bridge or new tunnel. Applicable to data flows: Noise Action Plan Agglomeration (DF7_10), Noise Action Plan Major Road (DF7_10)
status: valid
status modified: 2021-02-13
accepted date: 2021-02-13
in scheme: Road reduction measure value
broad match: Infrastructure change
narrow match: New tunnel
narrow match: New bypass bridge road

New tunnel
type: Concept
notation: newTunnel
definition: New tunnel Applicable to data flows: Noise Action Plan Agglomeration (DF7_10), Noise Action Plan Major Road (DF7_10)
status: valid
status modified: 2021-02-13
accepted date: 2021-02-13
in scheme: Road reduction measure value
broad match: New infrastructure

No measure
type: Concept
notation: noMeasure
definition: No noise reduction measure. Applicable to data flows: Noise Action Plan Agglomeration (DF7_10), Noise Action Plan Major Road (DF7_10)
status: valid
status modified: 2022-12-12
accepted date: 2022-12-12
in scheme: Road reduction measure value

Noise barriers and maintenance
type: Concept
notation: noiseBarrier
definition: Noise barriers and maintenance Applicable to data flows: Noise Action Plan Agglomeration (DF7_10), Noise Action Plan Major Road (DF7_10)
status: valid
status modified: 2021-02-13
accepted date: 2021-02-13
in scheme: Road reduction measure value
broad match: Noise barriers

Noise barriers
type: Concept
notation: noiseBarrierMeasure
definition: Noise barrier measure such as noise barrier and green noise barrier. Applicable to data flows: Noise Action Plan Agglomeration (DF7_10), Noise Action Plan Major Road (DF7_10)
status: valid
status modified: 2021-02-13
accepted date: 2021-02-13
in scheme: Road reduction measure value
broad match: Measures at the path
narrow match: Green noise barriers and maintenance
narrow match: Noise barriers and maintenance

Noise quality areas
type: Concept
notation: noiseQualityArea
definition: Noise quality areas such as a quiet area, a green area, or soundscape measures. Applicable to data flows: Noise Action Plan Agglomeration (DF7_10), Noise Action Plan Major Road (DF7_10)
status: valid
status modified: 2021-02-13
accepted date: 2021-02-13
in scheme: Road reduction measure value
broad match: Urban planning
narrow match: Soundscape measures
narrow match: Availability of green areas
narrow match: Availability of quiet areas

Other insulation
type: Concept
notation: otherInsulation
definition: Other insulation Applicable to data flows: Noise Action Plan Agglomeration (DF7_10), Noise Action Plan Major Road (DF7_10)
status: valid
status modified: 2021-02-13
accepted date: 2021-02-13
in scheme: Road reduction measure value
broad match: Building insulation

Other traffic management measures
type: Concept
notation: otherTrafficManagementMeasure
definition: Other traffic management measures such as public transport increase, cycling/walking increase, smart mobility, reduction of traffic flows, bans or rerouting of passenger, bans or rerouting of HGV, parking management or congestion charges. Applicable to data flows: Noise Action Plan Agglomeration (DF7_10), Noise Action Plan Major Road (DF7_10)
status: valid
status modified: 2021-02-13
accepted date: 2021-02-13
in scheme: Road reduction measure value
broad match: Measures at the source
narrow match: Parking management
narrow match: Change/reduction in traffic lanes
narrow match: Smart mobility
narrow match: Enhancing public transport vehicles and infrastructures
narrow match: Bans and re-routing of passenger vehicles
narrow match: Bans and re-routing of heavy vehicles
narrow match: Congestion charges
narrow match: Enhacing infrastructure for cycling and walking

Parking management
type: Concept
notation: parkingManagement
definition: Parking management Applicable to data flows: Noise Action Plan Agglomeration (DF7_10), Noise Action Plan Major Road (DF7_10)
status: valid
status modified: 2021-02-13
accepted date: 2021-02-13
in scheme: Road reduction measure value
broad match: Other traffic management measures

Physical measures for traffic calming
type: Concept
notation: physicalTrafficCalming
definition: Physical measures for traffic calming Applicable to data flows: Noise Action Plan Agglomeration (DF7_10), Noise Action Plan Major Road (DF7_10)
status: valid
status modified: 2021-02-13
accepted date: 2021-02-13
in scheme: Road reduction measure value
broad match: Speed reduction measures

Planning measures and ordinances between receivers and road sources
type: Concept
notation: planningAndOrdinance
definition: Planning measures and ordinances between receivers and road sources Applicable to data flows: Noise Action Plan Agglomeration (DF7_10), Noise Action Plan Major Road (DF7_10)
status: valid
status modified: 2021-02-13
accepted date: 2021-02-13
in scheme: Road reduction measure value
broad match: Land use planning

Promoting car sharing
type: Concept
notation: promotingCarSharing
definition: Promoting car sharing Applicable to data flows: Noise Action Plan Agglomeration (DF7_10), Noise Action Plan Major Road (DF7_10)
status: valid
status modified: 2021-02-13
accepted date: 2021-02-13
in scheme: Road reduction measure value
broad match: Measures for behavioural changes

Promoting public transport
type: Concept
notation: promotingPublicTransport
definition: Promoting public transport Applicable to data flows: Noise Action Plan Agglomeration (DF7_10), Noise Action Plan Major Road (DF7_10)
status: valid
status modified: 2021-02-13
accepted date: 2021-02-13
in scheme: Road reduction measure value
broad match: Measures for behavioural changes

Promoting quiet mobility
type: Concept
notation: promotingQuietMobility
definition: Promoting quiet mobility Applicable to data flows: Noise Action Plan Agglomeration (DF7_10), Noise Action Plan Major Road (DF7_10)
status: valid
status modified: 2021-02-13
accepted date: 2021-02-13
in scheme: Road reduction measure value
broad match: Measures for behavioural changes

Enhancing public transport vehicles and infrastructures
type: Concept
notation: publicTransportIncrease
definition: Enhancing public transport vehicles and infrastructures Applicable to data flows: Noise Action Plan Agglomeration (DF7_10), Noise Action Plan Major Road (DF7_10)
status: valid
status modified: 2021-02-13
accepted date: 2021-02-13
in scheme: Road reduction measure value
broad match: Other traffic management measures

Availability of quiet areas
type: Concept
notation: quietArea
definition: Availability of quiet areas Applicable to data flows: Noise Action Plan Agglomeration (DF7_10), Noise Action Plan Major Road (DF7_10)
status: valid
status modified: 2021-02-13
accepted date: 2021-02-13
in scheme: Road reduction measure value
broad match: Noise quality areas

Quiet engines
type: Concept
notation: quietEngines
definition: Quiet engines Applicable to data flows: Noise Action Plan Agglomeration (DF7_10), Noise Action Plan Major Road (DF7_10)
status: valid
status modified: 2021-02-13
accepted date: 2021-02-13
in scheme: Road reduction measure value
broad match: Change in emission levels

Renewal to quieter public transport fleet including components
type: Concept
notation: quietPublicTransport
definition: Renewal to quieter public transport fleet including components Applicable to data flows: Noise Action Plan Agglomeration (DF7_10), Noise Action Plan Major Road (DF7_10)
status: valid
status modified: 2021-02-13
accepted date: 2021-02-13
in scheme: Road reduction measure value
broad match: Change in emission levels

Change/reduction in traffic lanes
type: Concept
notation: reductionTrafficFlows
definition: Change/reduction in traffic lanes Applicable to data flows: Noise Action Plan Agglomeration (DF7_10), Noise Action Plan Major Road (DF7_10)
status: valid
status modified: 2021-02-13
accepted date: 2021-02-13
in scheme: Road reduction measure value
broad match: Other traffic management measures

Road surface measures
type: Concept
notation: roadSurface
definition: Road surface measures Applicable to data flows: Noise Action Plan Agglomeration (DF7_10), Noise Action Plan Major Road (DF7_10)
status: valid
status modified: 2021-02-13
accepted date: 2021-02-13
in scheme: Road reduction measure value
broad match: Change in emission levels

Roundabouts and junctions
type: Concept
notation: roundaboutJunctions
definition: Roundabouts and junctions Applicable to data flows: Noise Action Plan Agglomeration (DF7_10), Noise Action Plan Major Road (DF7_10)
status: valid
status modified: 2021-02-13
accepted date: 2021-02-13
in scheme: Road reduction measure value
broad match: Speed reduction measures

Reduced noise for sensitive areas
type: Concept
notation: sensitiveAreaPlanning
definition: Reduced noise for sensitive areas Applicable to data flows: Noise Action Plan Agglomeration (DF7_10), Noise Action Plan Major Road (DF7_10)
status: valid
status modified: 2021-02-13
accepted date: 2021-02-13
in scheme: Road reduction measure value
broad match: Land use planning

Smart mobility
type: Concept
notation: smartMobility
definition: Smart mobility Applicable to data flows: Noise Action Plan Agglomeration (DF7_10), Noise Action Plan Major Road (DF7_10)
status: valid
status modified: 2021-02-13
accepted date: 2021-02-13
in scheme: Road reduction measure value
broad match: Other traffic management measures

Soundscape measures
type: Concept
notation: soundscape
definition: Soundscape measures Applicable to data flows: Noise Action Plan Agglomeration (DF7_10), Noise Action Plan Major Road (DF7_10)
status: valid
status modified: 2021-02-13
accepted date: 2021-02-13
in scheme: Road reduction measure value
broad match: Noise quality areas

Reduction of driving speeds and traffic signalling
type: Concept
notation: speedReduction
definition: Reduction of driving speeds and traffic signalling Applicable to data flows: Noise Action Plan Agglomeration (DF7_10), Noise Action Plan Major Road (DF7_10)
status: valid
status modified: 2021-02-13
accepted date: 2021-02-13
in scheme: Road reduction measure value
broad match: Speed reduction measures

Speed reduction measures
type: Concept
notation: speedReductionMeasure
definition: Speed reduction measures such as speed reduction, roundabout and junction, phyisical traffic calming or traffic calmed zones. Applicable to data flows: Noise Action Plan Agglomeration (DF7_10), Noise Action Plan Major Road (DF7_10)
status: valid
status modified: 2021-02-13
accepted date: 2021-02-13
in scheme: Road reduction measure value
broad match: Measures at the source
narrow match: Physical measures for traffic calming
narrow match: Roundabouts and junctions
narrow match: Reduction of driving speeds and traffic signalling
narrow match: Designation of traffic-calmed zones from road

Time restriction on source operations
type: Concept
notation: timeRestriction
definition: Time restriction such as time restriction for HGV or time restriction for passenger vehicles. Applicable to data flows: Noise Action Plan Agglomeration (DF7_10), Noise Action Plan Major Road (DF7_10)
status: valid
status modified: 2021-02-13
accepted date: 2021-02-13
in scheme: Road reduction measure value
broad match: Measures at the source
narrow match: Time restriction for passenger vehicles
narrow match: Time restriction for heavy vehicles

Time restriction for heavy vehicles
type: Concept
notation: timeRestrictionHGV
definition: Time restriction for heavy vehicles Applicable to data flows: Noise Action Plan Agglomeration (DF7_10), Noise Action Plan Major Road (DF7_10)
status: valid
status modified: 2021-02-13
accepted date: 2021-02-13
in scheme: Road reduction measure value
broad match: Time restriction on source operations

Time restriction for passenger vehicles
type: Concept
notation: timeRestrictionPassenger
definition: Time restriction for passenger vehicles Applicable to data flows: Noise Action Plan Agglomeration (DF7_10), Noise Action Plan Major Road (DF7_10)
status: valid
status modified: 2021-02-13
accepted date: 2021-02-13
in scheme: Road reduction measure value
broad match: Time restriction on source operations

Designation of traffic-calmed zones from road
type: Concept
notation: trafficCalmedZones
definition: Designation of traffic-calmed zones from road Applicable to data flows: Noise Action Plan Agglomeration (DF7_10), Noise Action Plan Major Road (DF7_10)
status: valid
status modified: 2021-02-13
accepted date: 2021-02-13
in scheme: Road reduction measure value
broad match: Speed reduction measures

Urban planning
type: Concept
notation: urbanPlanning
definition: Urban planning such as land use panning or noise quality area. Applicable to data flows: Noise Action Plan Agglomeration (DF7_10), Noise Action Plan Major Road (DF7_10)
status: valid
status modified: 2021-02-13
accepted date: 2021-02-13
in scheme: Road reduction measure value
narrow match: Noise quality areas
narrow match: Land use planning

Window insulation
type: Concept
notation: windowInsulation
definition: Window insulation Applicable to data flows: Noise Action Plan Agglomeration (DF7_10), Noise Action Plan Major Road (DF7_10)
status: valid
status modified: 2021-02-13
accepted date: 2021-02-13
in scheme: Road reduction measure value
broad match: Building insulation

Stakeholders type value
type: ConceptScheme
notation: StakeholdersTypeValue
is part of: Environmental Noise - END
registration status: Public draft
user modified: blanenur
date modified: 2021-03-20 19:46:40.0
vocabulary type: Common
is numeric concept identifiers: false
is notations equal identifiers: true

Non-governmental organizations
type: Concept
notation: NGOs
definition: Participation of non-governmental organizations in the public consultation. Applicable to data flows: Noise Action Plan Agglomeration (DF7_10), Noise Action Plan Major Airport (DF7_10), Noise Action Plan Major Railway (DF7_10), Noise Action Plan Major Road (DF7_10)
status: valid
status modified: 2021-02-01
in scheme: Stakeholders type value

Citizens
type: Concept
notation: citizens
definition: Participation of citizens in the public consultation. Applicable to data flows: Noise Action Plan Agglomeration (DF7_10), Noise Action Plan Major Airport (DF7_10), Noise Action Plan Major Railway (DF7_10), Noise Action Plan Major Road (DF7_10)
status: valid
status modified: 2021-02-01
in scheme: Stakeholders type value

Governmental bodies
type: Concept
notation: governmentBodies
definition: Participation of governmental bodies in the public consultation. Applicable to data flows: Noise Action Plan Agglomeration (DF7_10), Noise Action Plan Major Airport (DF7_10), Noise Action Plan Major Railway (DF7_10), Noise Action Plan Major Road (DF7_10)
status: valid
status modified: 2021-02-01
in scheme: Stakeholders type value

Private sector
type: Concept
notation: privateSector
definition: Participation of private sector in the public consultation. Applicable to data flows: Noise Action Plan Agglomeration (DF7_10), Noise Action Plan Major Airport (DF7_10), Noise Action Plan Major Railway (DF7_10), Noise Action Plan Major Road (DF7_10)
status: valid
status modified: 2021-02-01
in scheme: Stakeholders type value

Status value
type: ConceptScheme
notation: StatusValue
is part of: Environmental Noise - END
registration status: Public draft
user modified: blanenur
date modified: 2021-02-01 13:08:16.0
vocabulary type: Common
is numeric concept identifiers: false
is notations equal identifiers: true

Limit value in force
type: Concept
notation: inForce
definition: Limit value in force. Applicable to data flows: Noise Limit Value (DF3)
status: valid
status modified: 2020-12-15
in scheme: Status value

Limit value in preparation
type: Concept
notation: inPreparation
definition: Limit value in preparation Applicable to data flows: Noise Limit Value (DF3)
status: valid
status modified: 2020-12-15
in scheme: Status value

Submission process value
type: ConceptScheme
notation: SubmissionProcessValue
is part of: Environmental Noise - END
registration status: Public draft
user modified: lihtedar
date modified: 2025-05-16 14:33:31.0
vocabulary type: Common
is numeric concept identifiers: false
is notations equal identifiers: false

First submission after deadline
type: Concept
notation: firstSubmissionAfterDeadline
definition: First submission of data after the deadline of the reporting obligation specified in the Environmental Noise Directive
status: valid
status modified: 2025-05-16
accepted date: 2025-05-16
in scheme: Submission process value

First submission before deadline
type: Concept
notation: firstSubmissionBeforeDeadline
definition: First submission of data before the deadline of the reporting obligation specified in the Environmental Noise Directive
status: valid
status modified: 2025-05-16
accepted date: 2025-05-16
in scheme: Submission process value

Resubmission after deadline
type: Concept
notation: resubmissionAfterDeadline
definition: Resubmission of data after the deadline of the reporting obligation specified in the Environmental Noise Directive
status: valid
status modified: 2025-05-16
accepted date: 2025-05-16
in scheme: Submission process value

Resubmission before deadline
type: Concept
notation: resubmissionBeforeDeadline
definition: Resubmission of data before the deadline of the reporting obligation specified in the Environmental Noise Directive
status: valid
status modified: 2025-05-16
accepted date: 2025-05-16
in scheme: Submission process value

Submission value
type: ConceptScheme
notation: SubmissionValue
is part of: Environmental Noise - END
registration status: Public draft
user modified: blanenur
date modified: 2025-05-22 15:44:51.0
vocabulary type: Common
is numeric concept identifiers: false
is notations equal identifiers: false

Included in resubmission no change
type: Concept
notation: includedInResubmissionNoChange
definition: Data is included in the submission but there is no change from the previous submission
status: valid
status modified: 2025-05-16
accepted date: 2025-05-16
in scheme: Submission value

Included in resubmission update
type: Concept
notation: includedInResubmissionUpdate
definition: Update from the previous submission
status: valid
status modified: 2025-05-16
accepted date: 2025-05-16
in scheme: Submission value

Included in submission
type: Concept
notation: includedInSubmission
definition: Data included in the submission
status: valid
status modified: 2025-05-16
accepted date: 2025-05-16
in scheme: Submission value

Not applicable
type: Concept
notation: notApplicable
definition: Not applicable considering the Environmental Noise Directive
status: valid
status modified: 2025-05-16
accepted date: 2025-05-16
in scheme: Submission value

Not included
type: Concept
notation: notIncluded
definition: Data not included in the submission/resubmission
status: valid
status modified: 2025-05-16
accepted date: 2025-05-16
in scheme: Submission value