Industrial Emission Portal Regulation and Industrial Emission Directive
type: Collection
notation: IEPR_IED
has part: This code list allows details of authorisations given by reporting countries to change operating conditions under Article 51 of 2010/75/EU
has part: Baseline report value
has part: BATAEL values as defined into the EC BAT-Tool
has part: BAT Conclusion value
has part: Type of combustion plant according to categories included in Article 72 of Directive 2010/75/EU
has part: Type of competent authority for Production Installation to be used in the IED Implementation dataflow
has part: The status of an entity with regards to its completion and use
has part: Strict ISO-3166 of countries that will report to IEPR and IED
has part: Energy use as input to use to report energy use for Production Installation according to IEPR CID
has part: Categories of fuel input according to Article 72 of Directive 2010/75/EU
has part: List of activities defined in Annex I of the IEPR to be reported as main activity and other activities for Production Installation and as main activity for Production Facility
has part: Code list for substances to be reported under the IEPR Regulation following its Annex II
has part: Installation type value
has part: Substances to be reported to Combustion Plant inventory according to Art 72 of the Industrial Emissions Directive
has part: Medium which receives a pollutant release or off-site transfer
has part: Classification of the method used to derive the release or off-site transfer value
has part: Further classification of the methods use to measure or calculate releases and off-site transfers
has part: Months according to the Gregorian calendar
has part: NACEValue
has part: Categories of fuel input to further distinguish gaseous fuels as required by Article 72 of Directive 2010/75/EU and to distinguish gaseous fuel as energy use as required by IEPR
has part: List of other reporting programme to which a Production Installation might be covered
has part: Categories of fuel input to further distinguish solid fuels as required by Article 72 of Directive 2010/75/EU and to distinguish solid fuels as energy use as required by IEPR
has part: The type of Production Installation Part
has part: Unit to be used to report Production Volume under the IEPR
has part: Unit to be used to report raw material according to the definition set in the IEPR CID
has part: This code list contains the potential options under which a confidentiality claim for data can be made
has part: Values of specific conditions type
has part: Stack height classification
has part: Various units that can be used to report attributes to the IEPR and the Large Combustion Plants
has part: Type of waste that is subject to an off-site transfer
has part: Final treatment to the waste reported in an off-site transfer

This code list allows details of authorisations given by reporting countries to change operating conditions under Article 51 of 2010/75/EU
type: ConceptScheme
notation: Article51Value
is part of: Industrial Emission Portal Regulation and Industrial Emission Directive
registration status: Public draft
user modified: antogfed
date modified: 2026-05-07 19:24:05.0
vocabulary type: Common
is numeric concept identifiers: false
is notations equal identifiers: false

Article 50 - 1
type: Concept
notation: Art50-1
definition: Article 50(1): This value should be selected if the derogation relates to Article 50(1) which requires that the total organic carbon content of slag and bottom ashes is less than 3 % or their loss on ignition is less than 5 % of the dry weight of the material. Conditions different from those laid down in Article 50(1), (2) and (3) and, as regards the temperature, paragraph 4 of that Article and specified in the permit for certain categories of waste or for certain thermal processes, may be authorised by the competent authority provided the other requirements of this Chapter are met. Member States may lay down rules governing these authorisations.
status: valid
status modified: 2026-05-06
accepted date: 2026-05-06
in scheme: This code list allows details of authorisations given by reporting countries to change operating conditions under Article 51 of 2010/75/EU

Article 50(1) and Article 50(2) apply.
type: Concept
notation: Art50-1-2
definition: This code list option should be chosen where the derogations offered under both Article 50(1) and 50(2) are applied.
status: valid
status modified: 2026-05-06
accepted date: 2026-05-06
in scheme: This code list allows details of authorisations given by reporting countries to change operating conditions under Article 51 of 2010/75/EU

Article 50(1), Article 50(2) and Article 50(3) apply.
type: Concept
notation: Art50-1-2-3
definition: This code list option should be chosen where the derogations offered under Article 50(1), Article 50(2) and Article 50(3) are applied.
status: valid
status modified: 2026-05-06
accepted date: 2026-05-06
in scheme: This code list allows details of authorisations given by reporting countries to change operating conditions under Article 51 of 2010/75/EU

Article 50(1) and 50(3) apply.
type: Concept
notation: Art50-1-3
definition: This code list option should be chosen where the derogations offered under both Article 50(1) and 50(3) are applied.
status: valid
status modified: 2026-05-06
accepted date: 2026-05-06
in scheme: This code list allows details of authorisations given by reporting countries to change operating conditions under Article 51 of 2010/75/EU

Article 50 - 2
type: Concept
notation: Art50-2
definition: Article 50(2): This value should be selected if the derogation relates to Article 50(2) which specifies the minimum requirement residence time and temperature of the waste gases from the combustion process. For waste incineration plants, the change of the operating conditions shall not cause more residues or residues with a higher content of organic polluting substances compared to those residues which could be expected under the conditions laid down in Article 50(1), (2) and (3).
status: valid
status modified: 2026-05-06
accepted date: 2026-05-06
in scheme: This code list allows details of authorisations given by reporting countries to change operating conditions under Article 51 of 2010/75/EU

Article 50(2) and Article 50(3) apply.
type: Concept
notation: Art50-2-3
definition: This code list option should be chosen where the derogations offered under both Article 50(2) and 50(3) are applied.
status: valid
status modified: 2026-05-06
accepted date: 2026-05-06
in scheme: This code list allows details of authorisations given by reporting countries to change operating conditions under Article 51 of 2010/75/EU

Article 50 - 3
type: Concept
notation: Art50-3
definition: Article 50(3): This value should be selected if the derogation relates to Article 50(3) which requires each combustion chamber to be equipped with at least one auxiliary burner. Emissions of total organic carbon and carbon monoxide from waste co-incineration plants, authorised to change operating conditions according to paragraph 1 shall also comply with the emission limit values set out in Part 3 of Annex VI.
status: valid
status modified: 2026-05-06
accepted date: 2026-05-06
in scheme: This code list allows details of authorisations given by reporting countries to change operating conditions under Article 51 of 2010/75/EU

Art51-1
type: Concept
notation: Article 51 - 1
definition: This indicates situations where a member state has allowed a derogation in line with the requirements of Article 51(1) of Directive 2010/75/EU. Conditions different from those laid down in Article 50(1), (2) and (3) and, as regards the temperature, paragraph 4 of that Article and specified in the permit for certain categories of waste or for certain thermal processes, may be authorised by the competent authority provided the other requirements of this Chapter are met. Member States may lay down rules governing these authorisations.
status: invalid
status modified: 2026-05-06
accepted date: 2026-05-06
in scheme: This code list allows details of authorisations given by reporting countries to change operating conditions under Article 51 of 2010/75/EU

Baseline report value
type: ConceptScheme
notation: BaselineReportValue
is part of: Industrial Emission Portal Regulation and Industrial Emission Directive
registration status: Public draft
user modified: antogfed
date modified: 2026-05-07 19:24:26.0
vocabulary type: Common
is numeric concept identifiers: false
is notations equal identifiers: false

No Report
type: Concept
notation: NOREPORT
definition: Baseline report not prepared and submitted to the competent authority.
status: valid
status modified: 2026-05-06
accepted date: 2026-05-06
in scheme: Baseline report value

Not Required
type: Concept
notation: NOTREQUIRED
definition: Baeline report not required as the activity does not involve the use, production or release of relevant hazardous substances and/or does not have the possibility of soil and groundwater contamination at the site of the installation.
status: valid
status modified: 2026-05-06
accepted date: 2026-05-06
in scheme: Baseline report value

Report
type: Concept
notation: REPORT
definition: Baseline report prepared and submitted to the competent authority.
status: valid
status modified: 2026-05-06
accepted date: 2026-05-06
in scheme: Baseline report value

BATAEL values as defined into the EC BAT-Tool
type: ConceptScheme
notation: BATAELValue
is part of: Industrial Emission Portal Regulation and Industrial Emission Directive
registration status: Public draft
user modified: antogfed
date modified: 2026-05-07 19:24:53.0
vocabulary type: Common
is numeric concept identifiers: false
is notations equal identifiers: false

Production of Chlor-alkali - Cl2 - BAT13-I
type: Concept
notation: CAK-Cl2-BAT13-I
definition: 4, Chemical industry: 4,2 Production of inorganic chemicals, such as: (a) gases, such as ammonia, chlorine or hydrogen chloride, fluorine or hydrogen fluoride, carbon oxides, sulphur compounds, nitrogen oxides, hydrogen, sulphur dioxide, carbonyl chloride; (c) bases, such as ammonium hydroxide, potassium hydroxide, sodium hydroxide; Reducing free chlorine to water. The BAT-AEL emission level is 0,05 - 0,2 mg/l.
status: valid
status modified: 2026-05-06
accepted date: 2026-05-06
in scheme: BATAEL values as defined into the EC BAT-Tool

Production of Chlor-alkali - Cl2 - BAT8-I
type: Concept
notation: CAK-Cl2-BAT8-I
definition: 4, Chemical industry: 4,2 Production of inorganic chemicals, such as: (a) gases, such as ammonia, chlorine or hydrogen chloride, fluorine or hydrogen fluoride, carbon oxides, sulphur compounds, nitrogen oxides, hydrogen, sulphur dioxide, carbonyl chloride; (c) bases, such as ammonium hydroxide, potassium hydroxide, sodium hydroxide; Chlorine absorption unit; features (i)-(xv) (see list); Reducing chlorine and chlorine dioxide emissions to air. The BAT-AEL emission level is 0,2 - 1 mg/Nm3.
status: valid
status modified: 2026-05-06
accepted date: 2026-05-06
in scheme: BATAEL values as defined into the EC BAT-Tool

Production of Cement, Lime and Magnesium Oxide - CO - BAT48
type: Concept
notation: CLM-CO-BAT48
definition: 3, Mineral industry: 3,1 Production of cement, lime and magnesium oxide: (b) production of lime in kilns with a production capacity exceeding 50�tonnes per day; PFRK, OSK, LRK, PRK; Reducing carbon monoxide (CO) emissions to air. The BAT-AEL emission level is < 500 mg/Nm3.
status: valid
status modified: 2026-05-06
accepted date: 2026-05-06
in scheme: BATAEL values as defined into the EC BAT-Tool

Production of Cement, Lime and Magnesium Oxide - CO - BAT63
type: Concept
notation: CLM-CO-BAT63
definition: 3, Mineral industry: 3,1 Production of cement, lime and magnesium oxide: (c) production of magnesium oxide in kilns with a production capacity exceeding 50�tonnes per day; Techniques (a)-(c) (see table); Reducing carbon monoxide (CO) emissions to air. The BAT-AEL emission level is < 50 - 1000 mg/Nm3.
status: valid
status modified: 2026-05-06
accepted date: 2026-05-06
in scheme: BATAEL values as defined into the EC BAT-Tool

Production of Cement, Lime and Magnesium Oxide - Dust - BAT16
type: Concept
notation: CLM-Dust-BAT16
definition: 3, Mineral industry: 3,1 Production of cement, lime and magnesium oxide: (a) production of cement clinker in rotary kilns with a production capacity exceeding 500�tonnes per day or in other kilns with a production capacity exceeding 50�tonnes per day; Dry flue-gas cleaning with a filter (usually fabric filter); Reducing dust emissions to air. The BAT-AEL emission level is < 10 mg/Nm3.
status: valid
status modified: 2026-05-06
accepted date: 2026-05-06
in scheme: BATAEL values as defined into the EC BAT-Tool

Production of Cement, Lime and Magnesium Oxide - Dust - BAT17
type: Concept
notation: CLM-Dust-BAT17
definition: 3, Mineral industry: 3,1 Production of cement, lime and magnesium oxide: (a) production of cement clinker in rotary kilns with a production capacity exceeding 500�tonnes per day or in other kilns with a production capacity exceeding 50�tonnes per day; ESPs, fabric filters, hybrid filters; Reducing dust emissions to air. The BAT-AEL emission level is < 10 - 20 mg/Nm3.
status: valid
status modified: 2026-05-06
accepted date: 2026-05-06
in scheme: BATAEL values as defined into the EC BAT-Tool

Production of Cement, Lime and Magnesium Oxide - Dust - BAT18
type: Concept
notation: CLM-Dust-BAT18
definition: 3, Mineral industry: 3,1 Production of cement, lime and magnesium oxide: (a) production of cement clinker in rotary kilns with a production capacity exceeding 500�tonnes per day or in other kilns with a production capacity exceeding 50�tonnes per day; ESPs, fabric filters, hybrid filters; Reducing dust emissions to air. The BAT-AEL emission level is < 10 - 20 mg/Nm3.
status: valid
status modified: 2026-05-06
accepted date: 2026-05-06
in scheme: BATAEL values as defined into the EC BAT-Tool

Production of Cement, Lime and Magnesium Oxide - Dust - BAT42-I
type: Concept
notation: CLM-Dust-BAT42-I
definition: 3, Mineral industry: 3,1 Production of cement, lime and magnesium oxide: (b) production of lime in kilns with a production capacity exceeding 50�tonnes per day; Fabric filter; Reducing dust emissions to air. The BAT-AEL emission level is < 10 mg/Nm3.
status: valid
status modified: 2026-05-06
accepted date: 2026-05-06
in scheme: BATAEL values as defined into the EC BAT-Tool

Production of Cement, Lime and Magnesium Oxide - Dust - BAT42-II
type: Concept
notation: CLM-Dust-BAT42-II
definition: 3, Mineral industry: 3,1 Production of cement, lime and magnesium oxide: (b) production of lime in kilns with a production capacity exceeding 50�tonnes per day; Wet scrubber; Reducing dust emissions to air. The BAT-AEL emission level is < 10 - 20 mg/Nm3.
status: valid
status modified: 2026-05-06
accepted date: 2026-05-06
in scheme: BATAEL values as defined into the EC BAT-Tool

Production of Cement, Lime and Magnesium Oxide - Dust - BAT43-I
type: Concept
notation: CLM-Dust-BAT43-I
definition: 3, Mineral industry: 3,1 Production of cement, lime and magnesium oxide: (b) production of lime in kilns with a production capacity exceeding 50�tonnes per day; Fabric filter; Reducing dust emissions to air. The BAT-AEL emission level is < 10 mg/Nm3.
status: valid
status modified: 2026-05-06
accepted date: 2026-05-06
in scheme: BATAEL values as defined into the EC BAT-Tool

Production of Cement, Lime and Magnesium Oxide - Dust - BAT43-II
type: Concept
notation: CLM-Dust-BAT43-II
definition: 3, Mineral industry: 3,1 Production of cement, lime and magnesium oxide: (b) production of lime in kilns with a production capacity exceeding 50�tonnes per day; ESP or other filters; Reducing dust emissions to air. The BAT-AEL emission level is < 20 mg/Nm3.
status: valid
status modified: 2026-05-06
accepted date: 2026-05-06
in scheme: BATAEL values as defined into the EC BAT-Tool

Production of Cement, Lime and Magnesium Oxide - Dust - BAT59
type: Concept
notation: CLM-Dust-BAT59
definition: 3, Mineral industry: 3,1 Production of cement, lime and magnesium oxide: (c) production of magnesium oxide in kilns with a production capacity exceeding 50�tonnes per day; Fabric filters, centrifugal separators/ cyclones, wet dust separators; Reducing dust emissions to air. The BAT-AEL emission level is < 10 mg/Nm3.
status: valid
status modified: 2026-05-06
accepted date: 2026-05-06
in scheme: BATAEL values as defined into the EC BAT-Tool

Production of Cement, Lime and Magnesium Oxide - Dust - BAT60
type: Concept
notation: CLM-Dust-BAT60
definition: 3, Mineral industry: 3,1 Production of cement, lime and magnesium oxide: (c) production of magnesium oxide in kilns with a production capacity exceeding 50�tonnes per day; ESPs, fabric filters, centrifugal separators / cyclones, wet dust separators; Reducing dust emissions to air. The BAT-AEL emission level is < 20 - 35 mg/Nm3.
status: valid
status modified: 2026-05-06
accepted date: 2026-05-06
in scheme: BATAEL values as defined into the EC BAT-Tool

Production of Cement, Lime and Magnesium Oxide - HCl - BAT25
type: Concept
notation: CLM-HCl-BAT25
definition: 3, Mineral industry: 3,1 Production of cement, lime and magnesium oxide: (a) production of cement clinker in rotary kilns with a production capacity exceeding 500�tonnes per day or in other kilns with a production capacity exceeding 50�tonnes per day; Primary techniques (a)-(b) (see table); Reducing hydrogen chloride (HCl) emissions to air. The BAT-AEL emission level is < 10 mg/Nm3.
status: valid
status modified: 2026-05-06
accepted date: 2026-05-06
in scheme: BATAEL values as defined into the EC BAT-Tool

Production of Cement, Lime and Magnesium Oxide - HCl - BAT51-I
type: Concept
notation: CLM-HCl-BAT51-I
definition: 3, Mineral industry: 3,1 Production of cement, lime and magnesium oxide: (b) production of lime in kilns with a production capacity exceeding 50�tonnes per day; Primary techniques (a)-(b) (see table), when using waste; Reducing hydrogen chloride (HCl) emissions to air. The BAT-AEL emission level is < 10 mg/Nm3.
status: valid
status modified: 2026-05-06
accepted date: 2026-05-06
in scheme: BATAEL values as defined into the EC BAT-Tool

Production of Cement, Lime and Magnesium Oxide - HF - BAT26
type: Concept
notation: CLM-HF-BAT26
definition: 3, Mineral industry: 3,1 Production of cement, lime and magnesium oxide: (a) production of cement clinker in rotary kilns with a production capacity exceeding 500�tonnes per day or in other kilns with a production capacity exceeding 50�tonnes per day; Primary techniques (a)-(b) (see table); Reducing hydrogen fluoride (HF) emissions to air. The BAT-AEL emission level is < 1 mg/Nm3.
status: valid
status modified: 2026-05-06
accepted date: 2026-05-06
in scheme: BATAEL values as defined into the EC BAT-Tool

Production of Cement, Lime and Magnesium Oxide - HF - BAT51-II
type: Concept
notation: CLM-HF-BAT51-II
definition: 3, Mineral industry: 3,1 Production of cement, lime and magnesium oxide: (b) production of lime in kilns with a production capacity exceeding 50�tonnes per day; Primary techniques (a)-(b) (see table), when using waste; Reducing hydrogen fluoride (HF) emissions to air. The BAT-AEL emission level is < 1 mg/Nm3.
status: valid
status modified: 2026-05-06
accepted date: 2026-05-06
in scheme: BATAEL values as defined into the EC BAT-Tool

Production of Cement, Lime and Magnesium Oxide - Hg - BAT28-I
type: Concept
notation: CLM-Hg-BAT28-I
definition: 3, Mineral industry: 3,1 Production of cement, lime and magnesium oxide: (a) production of cement clinker in rotary kilns with a production capacity exceeding 500�tonnes per day or in other kilns with a production capacity exceeding 50�tonnes per day; Techniques (a)-(c) (see table); Reducing mercury emissions to air. The BAT-AEL emission level is < 0,05 mg/Nm3.
status: valid
status modified: 2026-05-06
accepted date: 2026-05-06
in scheme: BATAEL values as defined into the EC BAT-Tool

Production of Cement, Lime and Magnesium Oxide - Hg - BAT53-I
type: Concept
notation: CLM-Hg-BAT53-I
definition: 3, Mineral industry: 3,1 Production of cement, lime and magnesium oxide: (b) production of lime in kilns with a production capacity exceeding 50�tonnes per day; Techniques (a)-(d) (see table), when using wastes; Reducing metals emissions to air. The BAT-AEL emission level is < 0,05 mg/Nm3.
status: valid
status modified: 2026-05-06
accepted date: 2026-05-06
in scheme: BATAEL values as defined into the EC BAT-Tool

Production of Cement, Lime and Magnesium Oxide - Metals - BAT28-II
type: Concept
notation: CLM-Metals-BAT28-II
definition: 3, Mineral industry: 3,1 Production of cement, lime and magnesium oxide: (a) production of cement clinker in rotary kilns with a production capacity exceeding 500�tonnes per day or in other kilns with a production capacity exceeding 50�tonnes per day; Techniques (a)-(c) (see table); Reducing metals emissions to air. The BAT-AEL emission level is < 0,05 mg/Nm3.
status: valid
status modified: 2026-05-06
accepted date: 2026-05-06
in scheme: BATAEL values as defined into the EC BAT-Tool

Production of Cement, Lime and Magnesium Oxide - Metals - BAT28-III
type: Concept
notation: CLM-Metals-BAT28-III
definition: 3, Mineral industry: 3,1 Production of cement, lime and magnesium oxide: (a) production of cement clinker in rotary kilns with a production capacity exceeding 500�tonnes per day or in other kilns with a production capacity exceeding 50�tonnes per day; Techniques (a)-(c) (see table); Reducing metals emissions to air. The BAT-AEL emission level is < 0,5 mg/Nm3.
status: valid
status modified: 2026-05-06
accepted date: 2026-05-06
in scheme: BATAEL values as defined into the EC BAT-Tool

Production of Cement, Lime and Magnesium Oxide - Metals - BAT53-II
type: Concept
notation: CLM-Metals-BAT53-II
definition: 3, Mineral industry: 3,1 Production of cement, lime and magnesium oxide: (b) production of lime in kilns with a production capacity exceeding 50�tonnes per day; Techniques (a)-(d) (see table), when using wastes; Reducing metals emissions to air. The BAT-AEL emission level is < 0,05 mg/Nm3.
status: valid
status modified: 2026-05-06
accepted date: 2026-05-06
in scheme: BATAEL values as defined into the EC BAT-Tool

Production of Cement, Lime and Magnesium Oxide - Metals - BAT53-III
type: Concept
notation: CLM-Metals-BAT53-III
definition: 3, Mineral industry: 3,1 Production of cement, lime and magnesium oxide: (b) production of lime in kilns with a production capacity exceeding 50�tonnes per day; Techniques (a)-(d) (see table), when using wastes; Reducing metals emissions to air. The BAT-AEL emission level is < 0,5 mg/Nm3.
status: valid
status modified: 2026-05-06
accepted date: 2026-05-06
in scheme: BATAEL values as defined into the EC BAT-Tool

Production of Cement, Lime and Magnesium Oxide - NH3 - BAT20
type: Concept
notation: CLM-NH3-BAT20
definition: 3, Mineral industry: 3,1 Production of cement, lime and magnesium oxide: (a) production of cement clinker in rotary kilns with a production capacity exceeding 500�tonnes per day or in other kilns with a production capacity exceeding 50�tonnes per day; SNCR; techniques (a)-(c) (see table); Reducing ammonia slip emissions to air. The BAT-AEL emission level is < 30 - 50 mg/Nm3.
status: valid
status modified: 2026-05-06
accepted date: 2026-05-06
in scheme: BATAEL values as defined into the EC BAT-Tool

Production of Cement, Lime and Magnesium Oxide - NH3 - BAT46
type: Concept
notation: CLM-NH3-BAT46
definition: 3, Mineral industry: 3,1 Production of cement, lime and magnesium oxide: (b) production of lime in kilns with a production capacity exceeding 50�tonnes per day; SNCR; Reducing ammonia slip emissions to air. The BAT-AEL emission level is < 30 mg/Nm3.
status: valid
status modified: 2026-05-06
accepted date: 2026-05-06
in scheme: BATAEL values as defined into the EC BAT-Tool

Production of Cement, Lime and Magnesium Oxide - NO2 - BAT19-I
type: Concept
notation: CLM-NO2-BAT19-I
definition: 3, Mineral industry: 3,1 Production of cement, lime and magnesium oxide: (a) production of cement clinker in rotary kilns with a production capacity exceeding 500�tonnes per day or in other kilns with a production capacity exceeding 50�tonnes per day; Preheater kilns; Reducing nitrogen oxides (NOx) emissions to air. The BAT-AEL emission level is < 200 - 450 mg/Nm3.
status: valid
status modified: 2026-05-06
accepted date: 2026-05-06
in scheme: BATAEL values as defined into the EC BAT-Tool

Production of Cement, Lime and Magnesium Oxide - NO2 - BAT19-II
type: Concept
notation: CLM-NO2-BAT19-II
definition: 3, Mineral industry: 3,1 Production of cement, lime and magnesium oxide: (a) production of cement clinker in rotary kilns with a production capacity exceeding 500�tonnes per day or in other kilns with a production capacity exceeding 50�tonnes per day; Lepol and long rotary kilns; Reducing nitrogen oxides (NOx) emissions to air. The BAT-AEL emission level is 400 - 800 mg/Nm3.
status: valid
status modified: 2026-05-06
accepted date: 2026-05-06
in scheme: BATAEL values as defined into the EC BAT-Tool

Production of Cement, Lime and Magnesium Oxide - NO2 - BAT45-I
type: Concept
notation: CLM-NO2-BAT45-I
definition: 3, Mineral industry: 3,1 Production of cement, lime and magnesium oxide: (b) production of lime in kilns with a production capacity exceeding 50�tonnes per day; PFRK, ASK, MFSK, OSK; Reducing nitrogen oxides (NOx) emissions to air. The BAT-AEL emission level is 100 - 350 mg/Nm3.
status: valid
status modified: 2026-05-06
accepted date: 2026-05-06
in scheme: BATAEL values as defined into the EC BAT-Tool

Production of Cement, Lime and Magnesium Oxide - NO2 - BAT45-II
type: Concept
notation: CLM-NO2-BAT45-II
definition: 3, Mineral industry: 3,1 Production of cement, lime and magnesium oxide: (b) production of lime in kilns with a production capacity exceeding 50�tonnes per day; LRK, PRK; Reducing nitrogen oxides (NOx) emissions to air. The BAT-AEL emission level is < 200 - 500 mg/Nm3.
status: valid
status modified: 2026-05-06
accepted date: 2026-05-06
in scheme: BATAEL values as defined into the EC BAT-Tool

Production of Cement, Lime and Magnesium Oxide - NO2 - BAT62
type: Concept
notation: CLM-NO2-BAT62
definition: 3, Mineral industry: 3,1 Production of cement, lime and magnesium oxide: (c) production of magnesium oxide in kilns with a production capacity exceeding 50�tonnes per day; Techniques (a)-(b) (see table); Reducing nitrogen oxides (NOx) emissions to air. The BAT-AEL emission level is < 500 - 1500 mg/Nm3.
status: valid
status modified: 2026-05-06
accepted date: 2026-05-06
in scheme: BATAEL values as defined into the EC BAT-Tool

Production of Cement, Lime and Magnesium Oxide - PCDD.F - BAT27
type: Concept
notation: CLM-PCDD.F-BAT27
definition: 3, Mineral industry: 3,1 Production of cement, lime and magnesium oxide: (a) production of cement clinker in rotary kilns with a production capacity exceeding 500�tonnes per day or in other kilns with a production capacity exceeding 50�tonnes per day; Techniques (a)-(f) (see table); Reducing PCDD/F emissions to air. The BAT-AEL emission level is < 0,05 - 0,1 ng/Nm3.
status: valid
status modified: 2026-05-06
accepted date: 2026-05-06
in scheme: BATAEL values as defined into the EC BAT-Tool

Production of Cement, Lime and Magnesium Oxide - PCDD.F - BAT52
type: Concept
notation: CLM-PCDD.F-BAT52
definition: 3, Mineral industry: 3,1 Production of cement, lime and magnesium oxide: (b) production of lime in kilns with a production capacity exceeding 50�tonnes per day; Primary techniques (a)-(c) (see table); Reducing PCDD/F emissions to air. The BAT-AEL emission level is < 0,05 - 0,1 ng/Nm3.
status: valid
status modified: 2026-05-06
accepted date: 2026-05-06
in scheme: BATAEL values as defined into the EC BAT-Tool

Production of Cement, Lime and Magnesium Oxide - SO2 - BAT21
type: Concept
notation: CLM-SO2-BAT21
definition: 3, Mineral industry: 3,1 Production of cement, lime and magnesium oxide: (a) production of cement clinker in rotary kilns with a production capacity exceeding 500�tonnes per day or in other kilns with a production capacity exceeding 50�tonnes per day; Absorbent addition, wet scrubber; Reducing sulphur oxides (SOx) emissions to air. The BAT-AEL emission level is < 50 - 400 mg/Nm3.
status: valid
status modified: 2026-05-06
accepted date: 2026-05-06
in scheme: BATAEL values as defined into the EC BAT-Tool

Production of Cement, Lime and Magnesium Oxide - SO2 - BAT47-I
type: Concept
notation: CLM-SO2-BAT47-I
definition: 3, Mineral industry: 3,1 Production of cement, lime and magnesium oxide: (b) production of lime in kilns with a production capacity exceeding 50�tonnes per day; PFRK, ASK, MFSK, OSK, PRK; Reducing SOX emissions to air. The BAT-AEL emission level is < 50 - 200 mg/Nm3.
status: valid
status modified: 2026-05-06
accepted date: 2026-05-06
in scheme: BATAEL values as defined into the EC BAT-Tool

Production of Cement, Lime and Magnesium Oxide - SO2 - BAT47-II
type: Concept
notation: CLM-SO2-BAT47-II
definition: 3, Mineral industry: 3,1 Production of cement, lime and magnesium oxide: (b) production of lime in kilns with a production capacity exceeding 50�tonnes per day; LRK; Reducing SOX emissions to air. The BAT-AEL emission level is < 50 - 400 mg/Nm3.
status: valid
status modified: 2026-05-06
accepted date: 2026-05-06
in scheme: BATAEL values as defined into the EC BAT-Tool

Production of Cement, Lime and Magnesium Oxide - SO2 - BAT65
type: Concept
notation: CLM-SO2-BAT65
definition: 3, Mineral industry: 3,1 Production of cement, lime and magnesium oxide: (c) production of magnesium oxide in kilns with a production capacity exceeding 50�tonnes per day; Primary and secondary techniques (a)-(d) (see table); Reducing sulphur oxides (SOx) emissions to air. The BAT-AEL emission level is < 50 - 400 mg/Nm3.
status: valid
status modified: 2026-05-06
accepted date: 2026-05-06
in scheme: BATAEL values as defined into the EC BAT-Tool

Production of Cement, Lime and Magnesium Oxide - TOC - BAT50-I
type: Concept
notation: CLM-TOC-BAT50-I
definition: 3, Mineral industry: 3,1 Production of cement, lime and magnesium oxide: (b) production of lime in kilns with a production capacity exceeding 50�tonnes per day; LRK, PRK; Reducing total organic carbon (TOC) emissions to air. The BAT-AEL emission level is < 10 mg/Nm3.
status: valid
status modified: 2026-05-06
accepted date: 2026-05-06
in scheme: BATAEL values as defined into the EC BAT-Tool

Production of Cement, Lime and Magnesium Oxide - TOC - BAT50-II
type: Concept
notation: CLM-TOC-BAT50-II
definition: 3, Mineral industry: 3,1 Production of cement, lime and magnesium oxide: (b) production of lime in kilns with a production capacity exceeding 50�tonnes per day; ASK, MFSK, PFRK; Reducing total organic carbon (TOC) emissions to air. The BAT-AEL emission level is < 30 mg/Nm3.
status: valid
status modified: 2026-05-06
accepted date: 2026-05-06
in scheme: BATAEL values as defined into the EC BAT-Tool

Common Waste Water and Waste Gas Treatment/ Management Systems in the Chemical Sector - AOX - BAT10-XIII
type: Concept
notation: CWW-AOX-BAT10-XIII
definition: 4, Chemical industry: 4.1, Production of organic chemicals; 4.2, Production of inorganic chemicals; 4.3, Production of phosphorous-, nitrogen- or potassium-based fertilisers; 4.4, Production of plant protection products or of biocides; 4.5, Production of pharmaceutical products including intermediates; 4.6. Production of explosives. Reducing adsorbable organically bound halogens (AOX) to water. The BAT-AEL emission level is 0,2 - 1 mg/l.
status: valid
status modified: 2026-05-06
accepted date: 2026-05-06
in scheme: BATAEL values as defined into the EC BAT-Tool

Common Waste Water and Waste Gas Treatment/ Management Systems in the Chemical Sector - AOX - BAT10-XIV
type: Concept
notation: CWW-AOX-BAT10-XIV
definition: 6, Other activities: 6,11 Independently operated treatment of waste water not covered by Directive 91/271/EEC and discharged by an installation undertaking activities covered under Section 4. of Annex I Reducing adsorbable organically bound halogens (AOX) to water. The BAT-AEL emission level is 0,2 - 1 mg/l.
status: valid
status modified: 2026-05-06
accepted date: 2026-05-06
in scheme: BATAEL values as defined into the EC BAT-Tool

Common Waste Water and Waste Gas Treatment/ Management Systems in the Chemical Sector - COD - BAT10-III
type: Concept
notation: CWW-COD-BAT10-III
definition: 4, Chemical industry: 4.1, Production of organic chemicals; 4.2, Production of inorganic chemicals; 4.3, Production of phosphorous-, nitrogen- or potassium-based fertilisers; 4.4, Production of plant protection products or of biocides; 4.5, Production of pharmaceutical products including intermediates; 4.6. Production of explosives. Reducing chemical oxygen demand (COD) to water. The BAT-AEL emission level is < 30 - 100 mg/l.
status: valid
status modified: 2026-05-06
accepted date: 2026-05-06
in scheme: BATAEL values as defined into the EC BAT-Tool

Common Waste Water and Waste Gas Treatment/ Management Systems in the Chemical Sector - COD - BAT10-IV
type: Concept
notation: CWW-COD-BAT10-IV
definition: 6, Other activities: 6,11 Independently operated treatment of waste water not covered by Directive 91/271/EEC and discharged by an installation undertaking activities covered under Section 4. of Annex I Reducing chemical oxygen demand (COD) to water. The BAT-AEL emission level is < 30 - 100 mg/l.
status: valid
status modified: 2026-05-06
accepted date: 2026-05-06
in scheme: BATAEL values as defined into the EC BAT-Tool

Common Waste Water and Waste Gas Treatment/ Management Systems in the Chemical Sector - Cr - BAT10-XV
type: Concept
notation: CWW-Cr-BAT10-XV
definition: 4, Chemical industry: 4.1, Production of organic chemicals; 4.2, Production of inorganic chemicals; 4.3, Production of phosphorous-, nitrogen- or potassium-based fertilisers; 4.4, Production of plant protection products or of biocides; 4.5, Production of pharmaceutical products including intermediates; 4.6. Production of explosives. Reducing chromium to water. The BAT-AEL emission level is 5 - 25 ?g/l.
status: valid
status modified: 2026-05-06
accepted date: 2026-05-06
in scheme: BATAEL values as defined into the EC BAT-Tool

Common Waste Water and Waste Gas Treatment/ Management Systems in the Chemical Sector - Cr - BAT10-XVI
type: Concept
notation: CWW-Cr-BAT10-XVI
definition: 6, Other activities: 6,11 Independently operated treatment of waste water not covered by Directive 91/271/EEC and discharged by an installation undertaking activities covered under Section 4. of Annex I Reducing chromium to water. The BAT-AEL emission level is 5 - 25 ?g/l.
status: valid
status modified: 2026-05-06
accepted date: 2026-05-06
in scheme: BATAEL values as defined into the EC BAT-Tool

Common Waste Water and Waste Gas Treatment/ Management Systems in the Chemical Sector - Cu - BAT10-XVII
type: Concept
notation: CWW-Cu-BAT10-XVII
definition: 4, Chemical industry: 4.1, Production of organic chemicals; 4.2, Production of inorganic chemicals; 4.3, Production of phosphorous-, nitrogen- or potassium-based fertilisers; 4.4, Production of plant protection products or of biocides; 4.5, Production of pharmaceutical products including intermediates; 4.6. Production of explosives. Reducing copper to water. The BAT-AEL emission level is 5 - 50 ?g/l.
status: valid
status modified: 2026-05-06
accepted date: 2026-05-06
in scheme: BATAEL values as defined into the EC BAT-Tool

Common Waste Water and Waste Gas Treatment/ Management Systems in the Chemical Sector - Cu - BAT10-XVIII
type: Concept
notation: CWW-Cu-BAT10-XVIII
definition: 6, Other activities: 6,11 Independently operated treatment of waste water not covered by Directive 91/271/EEC and discharged by an installation undertaking activities covered under Section 4. of Annex I Reducing copper to water. The BAT-AEL emission level is 5 - 50 ?g/l.
status: valid
status modified: 2026-05-06
accepted date: 2026-05-06
in scheme: BATAEL values as defined into the EC BAT-Tool

Common Waste Water and Waste Gas Treatment/ Management Systems in the Chemical Sector - InorgN - BAT10-IX
type: Concept
notation: CWW-InorgN-BAT10-IX
definition: 4, Chemical industry: 4.1, Production of organic chemicals; 4.2, Production of inorganic chemicals; 4.3, Production of phosphorous-, nitrogen- or potassium-based fertilisers; 4.4, Production of plant protection products or of biocides; 4.5, Production of pharmaceutical products including intermediates; 4.6. Production of explosives. Reducing total inorganic nitrogen (N inorg) to water. The BAT-AEL emission level is 5 - 20 mg/l.
status: valid
status modified: 2026-05-06
accepted date: 2026-05-06
in scheme: BATAEL values as defined into the EC BAT-Tool

Common Waste Water and Waste Gas Treatment/ Management Systems in the Chemical Sector - InorgN - BAT10-X
type: Concept
notation: CWW-InorgN-BAT10-X
definition: 6, Other activities: 6,11 Independently operated treatment of waste water not covered by Directive 91/271/EEC and discharged by an installation undertaking activities covered under Section 4. of Annex I Reducing total inorganic nitrogen (N inorg) to water. The BAT-AEL emission level is 5 - 20 mg/l.
status: valid
status modified: 2026-05-06
accepted date: 2026-05-06
in scheme: BATAEL values as defined into the EC BAT-Tool

Common Waste Water and Waste Gas Treatment/ Management Systems in the Chemical Sector - Ni - BAT10-XIX
type: Concept
notation: CWW-Ni-BAT10-XIX
definition: 4, Chemical industry: 4.1, Production of organic chemicals; 4.2, Production of inorganic chemicals; 4.3, Production of phosphorous-, nitrogen- or potassium-based fertilisers; 4.4, Production of plant protection products or of biocides; 4.5, Production of pharmaceutical products including intermediates; 4.6. Production of explosives. Reducing nickel to water. The BAT-AEL emission level is 5 - 50 ?g/l.
status: valid
status modified: 2026-05-06
accepted date: 2026-05-06
in scheme: BATAEL values as defined into the EC BAT-Tool

Common Waste Water and Waste Gas Treatment/ Management Systems in the Chemical Sector - Ni - BAT10-XX
type: Concept
notation: CWW-Ni-BAT10-XX
definition: 6, Other activities: 6,11 Independently operated treatment of waste water not covered by Directive 91/271/EEC and discharged by an installation undertaking activities covered under Section 4. of Annex I Reducing nickel to water. The BAT-AEL emission level is 5 - 50 ?g/l.
status: valid
status modified: 2026-05-06
accepted date: 2026-05-06
in scheme: BATAEL values as defined into the EC BAT-Tool

Common Waste Water and Waste Gas Treatment/ Management Systems in the Chemical Sector - TN - BAT10-VII
type: Concept
notation: CWW-TN-BAT10-VII
definition: 4, Chemical industry: 4.1, Production of organic chemicals; 4.2, Production of inorganic chemicals; 4.3, Production of phosphorous-, nitrogen- or potassium-based fertilisers; 4.4, Production of plant protection products or of biocides; 4.5, Production of pharmaceutical products including intermediates; 4.6. Production of explosives. Reducing total nitrogen (TN) to water. The BAT-AEL emission level is 5 - 25 mg/l.
status: valid
status modified: 2026-05-06
accepted date: 2026-05-06
in scheme: BATAEL values as defined into the EC BAT-Tool

Common Waste Water and Waste Gas Treatment/ Management Systems in the Chemical Sector - TN - BAT10-VIII
type: Concept
notation: CWW-TN-BAT10-VIII
definition: 6, Other activities: 6,11 Independently operated treatment of waste water not covered by Directive 91/271/EEC and discharged by an installation undertaking activities covered under Section 4. of Annex I Reducing total nitrogen (TN) to water. The BAT-AEL emission level is 5 - 25 mg/l.
status: valid
status modified: 2026-05-06
accepted date: 2026-05-06
in scheme: BATAEL values as defined into the EC BAT-Tool

Common Waste Water and Waste Gas Treatment/ Management Systems in the Chemical Sector - TOC - BAT10-I
type: Concept
notation: CWW-TOC-BAT10-I
definition: 4, Chemical industry: 4.1, Production of organic chemicals; 4.2, Production of inorganic chemicals; 4.3, Production of phosphorous-, nitrogen- or potassium-based fertilisers; 4.4, Production of plant protection products or of biocides; 4.5, Production of pharmaceutical products including intermediates; 4.6. Production of explosives. Reducing total organic carbon (TOC) to water. The BAT-AEL emission level is < 10 - 33 mg/l.
status: valid
status modified: 2026-05-06
accepted date: 2026-05-06
in scheme: BATAEL values as defined into the EC BAT-Tool

Common Waste Water and Waste Gas Treatment/ Management Systems in the Chemical Sector - TOC - BAT10-II
type: Concept
notation: CWW-TOC-BAT10-II
definition: 6, Other activities: 6,11 Independently operated treatment of waste water not covered by Directive 91/271/EEC and discharged by an installation undertaking activities covered under Section 4. of Annex I Reducing total organic carbon (TOC) to water. The BAT-AEL emission level is < 10 - 33 mg/l.
status: valid
status modified: 2026-05-06
accepted date: 2026-05-06
in scheme: BATAEL values as defined into the EC BAT-Tool

Common Waste Water and Waste Gas Treatment/ Management Systems in the Chemical Sector - TP - BAT10-XI
type: Concept
notation: CWW-TP-BAT10-XI
definition: 4, Chemical industry: 4.1, Production of organic chemicals; 4.2, Production of inorganic chemicals; 4.3, Production of phosphorous-, nitrogen- or potassium-based fertilisers; 4.4, Production of plant protection products or of biocides; 4.5, Production of pharmaceutical products including intermediates; 4.6. Production of explosives. Reducing total phosphorus (TP) to water. The BAT-AEL emission level is 0,5 - 3 mg/l.
status: valid
status modified: 2026-05-06
accepted date: 2026-05-06
in scheme: BATAEL values as defined into the EC BAT-Tool

Common Waste Water and Waste Gas Treatment/ Management Systems in the Chemical Sector - TP - BAT10-XII
type: Concept
notation: CWW-TP-BAT10-XII
definition: 6, Other activities: 6,11 Independently operated treatment of waste water not covered by Directive 91/271/EEC and discharged by an installation undertaking activities covered under Section 4. of Annex I Reducing total phosphorus (TP) to water. The BAT-AEL emission level is 0,5 - 3 mg/l.
status: valid
status modified: 2026-05-06
accepted date: 2026-05-06
in scheme: BATAEL values as defined into the EC BAT-Tool

Common Waste Water and Waste Gas Treatment/ Management Systems in the Chemical Sector - TSS - BAT10-V
type: Concept
notation: CWW-TSS-BAT10-V
definition: 4, Chemical industry: 4.1, Production of organic chemicals; 4.2, Production of inorganic chemicals; 4.3, Production of phosphorous-, nitrogen- or potassium-based fertilisers; 4.4, Production of plant protection products or of biocides; 4.5, Production of pharmaceutical products including intermediates; 4.6. Production of explosives. Reducing total suspended solids (TSS) to water. The BAT-AEL emission level is 5 - 35 mg/l.
status: valid
status modified: 2026-05-06
accepted date: 2026-05-06
in scheme: BATAEL values as defined into the EC BAT-Tool

Common Waste Water and Waste Gas Treatment/ Management Systems in the Chemical Sector - TSS - BAT10-VI
type: Concept
notation: CWW-TSS-BAT10-VI
definition: 6, Other activities: 6,11 Independently operated treatment of waste water not covered by Directive 91/271/EEC and discharged by an installation undertaking activities covered under Section 4. of Annex I Reducing total suspended solids (TSS) to water. The BAT-AEL emission level is 5 - 35 mg/l.
status: valid
status modified: 2026-05-06
accepted date: 2026-05-06
in scheme: BATAEL values as defined into the EC BAT-Tool

Common Waste Water and Waste Gas Treatment/ Management Systems in the Chemical Sector - Zn - BAT10-XXI
type: Concept
notation: CWW-Zn-BAT10-XXI
definition: 4, Chemical industry: 4.1, Production of organic chemicals; 4.2, Production of inorganic chemicals; 4.3, Production of phosphorous-, nitrogen- or potassium-based fertilisers; 4.4, Production of plant protection products or of biocides; 4.5, Production of pharmaceutical products including intermediates; 4.6. Production of explosives. Reducing zinc to water. The BAT-AEL emission level is 20 - 300 ?g/l.
status: valid
status modified: 2026-05-06
accepted date: 2026-05-06
in scheme: BATAEL values as defined into the EC BAT-Tool

Common Waste Water and Waste Gas Treatment/ Management Systems in the Chemical Sector - Zn - BAT10-XXII
type: Concept
notation: CWW-Zn-BAT10-XXII
definition: 6, Other activities: 6,11 Independently operated treatment of waste water not covered by Directive 91/271/EEC and discharged by an installation undertaking activities covered under Section 4. of Annex I Reducing zinc to water. The BAT-AEL emission level is 20 - 300 ?g/l.
status: valid
status modified: 2026-05-06
accepted date: 2026-05-06
in scheme: BATAEL values as defined into the EC BAT-Tool

Food, Drink and Milk Industries - COD - BAT12-I
type: Concept
notation: FDM-COD-BAT12-I
definition: Other activities reducing chemical oxygen demand (COD) to water. The BAT-AEL emission level is 25�100 mg/l.
status: valid
status modified: 2026-05-06
accepted date: 2026-05-06
in scheme: BATAEL values as defined into the EC BAT-Tool

Food, Drink and Milk Industries - Dust - BAT17-I
type: Concept
notation: FDM-Dust-BAT17-I
definition: Other activities reducing dust emissions to air. The BAT-AEL emission level is < 2�10 mg/Nm3.
status: valid
status modified: 2026-05-06
accepted date: 2026-05-06
in scheme: BATAEL values as defined into the EC BAT-Tool

Food, Drink and Milk Industries - Dust - BAT17-II
type: Concept
notation: FDM-Dust-BAT17-II
definition: Other activities reducing dust emissions to air. The BAT-AEL emission level is < 2�5 mg/Nm3.
status: valid
status modified: 2026-05-06
accepted date: 2026-05-06
in scheme: BATAEL values as defined into the EC BAT-Tool

Food, Drink and Milk Industries - Dust - BAT17-III
type: Concept
notation: FDM-Dust-BAT17-III
definition: Other activities reducing dust emissions to air. The BAT-AEL emission level is < 2�20 mg/Nm3.
status: valid
status modified: 2026-05-06
accepted date: 2026-05-06
in scheme: BATAEL values as defined into the EC BAT-Tool

Food, Drink and Milk Industries - Dust - BAT20-I
type: Concept
notation: FDM-Dust-BAT20-I
definition: Other activities reducing dust emissions to air. The BAT-AEL emission level is < 2�10 mg/Nm3.
status: valid
status modified: 2026-05-06
accepted date: 2026-05-06
in scheme: BATAEL values as defined into the EC BAT-Tool

Food, Drink and Milk Industries - Dust - BAT20-II
type: Concept
notation: FDM-Dust-BAT20-II
definition: Other activities reducing dust emissions to air. The BAT-AEL emission level is < 2�5 mg/Nm3.
status: valid
status modified: 2026-05-06
accepted date: 2026-05-06
in scheme: BATAEL values as defined into the EC BAT-Tool

Food, Drink and Milk Industries - Dust - BAT23
type: Concept
notation: FDM-Dust-BAT23
definition: Other activities reducing dust emissions to air. The BAT-AEL emission level is < 2�10 mg/Nm3.
status: valid
status modified: 2026-05-06
accepted date: 2026-05-06
in scheme: BATAEL values as defined into the EC BAT-Tool

Food, Drink and Milk Industries - Dust - BAT28
type: Concept
notation: FDM-Dust-BAT28
definition: Other activities reducing dust emissions to air. The BAT-AEL emission level is < 2�5 mg/Nm3.
status: valid
status modified: 2026-05-06
accepted date: 2026-05-06
in scheme: BATAEL values as defined into the EC BAT-Tool

Food, Drink and Milk Industries - Dust - BAT31-I
type: Concept
notation: FDM-Dust-BAT31-I
definition: Other activities reducing dust emissions to air. The BAT-AEL emission level is < 2�10 mg/Nm3.
status: valid
status modified: 2026-05-06
accepted date: 2026-05-06
in scheme: BATAEL values as defined into the EC BAT-Tool

Food, Drink and Milk Industries - Dust - BAT31-II
type: Concept
notation: FDM-Dust-BAT31-II
definition: Other activities reducing dust emissions to air. The BAT-AEL emission level is < 2�5 mg/Nm3.
status: valid
status modified: 2026-05-06
accepted date: 2026-05-06
in scheme: BATAEL values as defined into the EC BAT-Tool

Food, Drink and Milk Industries - Dust - BAT34-I
type: Concept
notation: FDM-Dust-BAT34-I
definition: Other activities reducing dust emissions to air. The BAT-AEL emission level is < 2�10 mg/Nm3.
status: valid
status modified: 2026-05-06
accepted date: 2026-05-06
in scheme: BATAEL values as defined into the EC BAT-Tool

Food, Drink and Milk Industries - Dust - BAT34-II
type: Concept
notation: FDM-Dust-BAT34-II
definition: Other activities reducing dust emissions to air. The BAT-AEL emission level is < 2�5 mg/Nm3.
status: valid
status modified: 2026-05-06
accepted date: 2026-05-06
in scheme: BATAEL values as defined into the EC BAT-Tool

Food, Drink and Milk Industries - Dust - BAT36
type: Concept
notation: FDM-Dust-BAT36
definition: Other activities reducing dust emissions to air. The BAT-AEL emission level is 5�100 mg/Nm3.
status: valid
status modified: 2026-05-06
accepted date: 2026-05-06
in scheme: BATAEL values as defined into the EC BAT-Tool

Food, Drink and Milk Industries - SOx - BAT37
type: Concept
notation: FDM-SOx-BAT37
definition: Other activities reducing sulphur oxides (SOx) emissions to air. The BAT-AEL emission level is 30�100 mg/Nm3.
status: valid
status modified: 2026-05-06
accepted date: 2026-05-06
in scheme: BATAEL values as defined into the EC BAT-Tool

Food, Drink and Milk Industries - TN - BAT12-III
type: Concept
notation: FDM-TN-BAT12-III
definition: Other activities reducing total nitrogen to water. The BAT-AEL emission level is 2�20 mg/l.
status: valid
status modified: 2026-05-06
accepted date: 2026-05-06
in scheme: BATAEL values as defined into the EC BAT-Tool

Food, Drink and Milk Industries - TP - BAT12-IV
type: Concept
notation: FDM-TP-BAT12-IV
definition: Other activities reducing total phosphorus to water. The BAT-AEL emission level is 0.2�2 mg/l.
status: valid
status modified: 2026-05-06
accepted date: 2026-05-06
in scheme: BATAEL values as defined into the EC BAT-Tool

Food, Drink and Milk Industries - TSS - BAT12-II
type: Concept
notation: FDM-TSS-BAT12-II
definition: Other activities reducing total suspended solids to water. The BAT-AEL emission level is 4�50 mg/l.
status: valid
status modified: 2026-05-06
accepted date: 2026-05-06
in scheme: BATAEL values as defined into the EC BAT-Tool

Food, Drink and Milk Industries - TVOC - BAT26
type: Concept
notation: FDM-TVOC-BAT26
definition: Other activities reducing volatile organic compounds (VOC) emissions to air. The BAT-AEL emission level is 15�50 mg/Nm3.
status: valid
status modified: 2026-05-06
accepted date: 2026-05-06
in scheme: BATAEL values as defined into the EC BAT-Tool

Food, Drink and Milk Industries - TVOC - BAT29
type: Concept
notation: FDM-TVOC-BAT29
definition: Other activities reducing volatile organic compounds (VOC) emissions to air. The BAT-AEL emission level is 3�50 mg/Nm3.
status: valid
status modified: 2026-05-06
accepted date: 2026-05-06
in scheme: BATAEL values as defined into the EC BAT-Tool

Ferrous metals processing - BAT 31
type: Concept
notation: FMP-COD-BAT31-III
definition: 2, Production and processing of metals: 2.3 Processing of ferrous metals for (a) operation of hot rolling mills with a capacity exceeding 20 tonnes of crude steel per hour; (c) application of protective fused metal coats with an input exceeding 2 tonnes of crude steel per hour; this includes hot dip coating and batch galvanising. 2.6 Surface treatment of ferrous metals using electrolytic or chemical processes where the volume of the treatment vats exceeds 30 m3, when it is carried out in cold rolling, wire drawing or batch galvanising. 6.11 Independently operated treatment of waste water not covered by Directive 91/271/EEC, provided that the main pollutant load originates from the activities covered by these BAT conclusions Reducing chemical oxygen demand (COD) to water. The BAT-AEL emission level is 30�90 mg/l.
status: valid
status modified: 2026-05-06
accepted date: 2026-05-06
in scheme: BATAEL values as defined into the EC BAT-Tool

Ferrous metals processing - BAT 31
type: Concept
notation: FMP-Cd-BAT31-V
definition: 2, Production and processing of metals: 2.3 Processing of ferrous metals for (a) operation of hot rolling mills with a capacity exceeding 20 tonnes of crude steel per hour; (c) application of protective fused metal coats with an input exceeding 2 tonnes of crude steel per hour; this includes hot dip coating and batch galvanising. 2.6 Surface treatment of ferrous metals using electrolytic or chemical processes where the volume of the treatment vats exceeds 30 m3, when it is carried out in cold rolling, wire drawing or batch galvanising. 6.11 Independently operated treatment of waste water not covered by Directive 91/271/EEC, provided that the main pollutant load originates from the activities covered by these BAT conclusions Reducing cadmium to water. The BAT-AEL emission level is 1�5 ?g/l.
status: valid
status modified: 2026-05-06
accepted date: 2026-05-06
in scheme: BATAEL values as defined into the EC BAT-Tool

Ferrous metals processing - BAT 31
type: Concept
notation: FMP-Cd-BAT31-XXI
definition: 2, Production and processing of metals: 2.3 Processing of ferrous metals for (a) operation of hot rolling mills with a capacity exceeding 20 tonnes of crude steel per hour; (c) application of protective fused metal coats with an input exceeding 2 tonnes of crude steel per hour; this includes hot dip coating and batch galvanising. 2.6 Surface treatment of ferrous metals using electrolytic or chemical processes where the volume of the treatment vats exceeds 30 m3, when it is carried out in cold rolling, wire drawing or batch galvanising. 6.11 Independently operated treatment of waste water not covered by Directive 91/271/EEC, provided that the main pollutant load originates from the activities covered by these BAT conclusions Reducing cadmium to water. The BAT-AEL emission level is 1�5 ?g/l.
status: valid
status modified: 2026-05-06
accepted date: 2026-05-06
in scheme: BATAEL values as defined into the EC BAT-Tool

Ferrous metals processing - BAT 31
type: Concept
notation: FMP-Cr-BAT31-VI
definition: 2, Production and processing of metals: 2.3 Processing of ferrous metals for (a) operation of hot rolling mills with a capacity exceeding 20 tonnes of crude steel per hour; (c) application of protective fused metal coats with an input exceeding 2 tonnes of crude steel per hour; this includes hot dip coating and batch galvanising. 2.6 Surface treatment of ferrous metals using electrolytic or chemical processes where the volume of the treatment vats exceeds 30 m3, when it is carried out in cold rolling, wire drawing or batch galvanising. 6.11 Independently operated treatment of waste water not covered by Directive 91/271/EEC, provided that the main pollutant load originates from the activities covered by these BAT conclusions Reducing chromium to water. The BAT-AEL emission level is 0.01�0.1 mg/l.
status: valid
status modified: 2026-05-06
accepted date: 2026-05-06
in scheme: BATAEL values as defined into the EC BAT-Tool

Manufacture of Glass - Amines - BAT63-V
type: Concept
notation: GLS-Amines-BAT63-V
definition: 3, Mineral industry: 3,4 Melting mineral substances including the production of mineral fibres with a melting capacity exceeding 20�tonnes per day; Techniques (i)-(v) (see table); Reducing amines emissions to air. The BAT-AEL emission level is < 3 mg/Nm3.
status: valid
status modified: 2026-05-06
accepted date: 2026-05-06
in scheme: BATAEL values as defined into the EC BAT-Tool

Manufacture of Glass - Amines - BAT63-XI
type: Concept
notation: GLS-Amines-BAT63-XI
definition: 3, Mineral industry: 3,4 Melting mineral substances including the production of mineral fibres with a melting capacity exceeding 20�tonnes per day; Techniques (i)-(v) (see table); Reducing amines emissions to air. The BAT-AEL emission level is < 2 mg/Nm3.
status: valid
status modified: 2026-05-06
accepted date: 2026-05-06
in scheme: BATAEL values as defined into the EC BAT-Tool

Manufacture of Glass - Amines - BAT63-XVIII
type: Concept
notation: GLS-Amines-BAT63-XVIII
definition: 3, Mineral industry: 3,4 Melting mineral substances including the production of mineral fibres with a melting capacity exceeding 20�tonnes per day; Techniques (i)-(v) (see table); Reducing amines emissions to air. The BAT-AEL emission level is < 0,01 kg/t.
status: valid
status modified: 2026-05-06
accepted date: 2026-05-06
in scheme: BATAEL values as defined into the EC BAT-Tool

Manufacture of Glass - As - BAT13-IX
type: Concept
notation: GLS-As-BAT13-IX
definition: 3, Mineral industry: 3,3 Manufacture of glass including glass fibre with a melting capacity exceeding 20 tonnes per day Reducing arsenic to water. The BAT-AEL emission level is < 0,3 mg/l.
status: valid
status modified: 2026-05-06
accepted date: 2026-05-06
in scheme: BATAEL values as defined into the EC BAT-Tool

Manufacture of Glass - B - BAT13-XVIII
type: Concept
notation: GLS-B-BAT13-XVIII
definition: 3, Mineral industry: 3,3 Manufacture of glass including glass fibre with a melting capacity exceeding 20 tonnes per day Reducing boron to water. The BAT-AEL emission level is < 1 - 3 mg/l.
status: valid
status modified: 2026-05-06
accepted date: 2026-05-06
in scheme: BATAEL values as defined into the EC BAT-Tool

Ferrous metals processing - BAT 31
type: Concept
notation: FMP-Cr-BAT31-VII
definition: 2, Production and processing of metals: 2.3 Processing of ferrous metals for (a) operation of hot rolling mills with a capacity exceeding 20 tonnes of crude steel per hour; (c) application of protective fused metal coats with an input exceeding 2 tonnes of crude steel per hour; this includes hot dip coating and batch galvanising. 2.6 Surface treatment of ferrous metals using electrolytic or chemical processes where the volume of the treatment vats exceeds 30 m3, when it is carried out in cold rolling, wire drawing or batch galvanising. 6.11 Independently operated treatment of waste water not covered by Directive 91/271/EEC, provided that the main pollutant load originates from the activities covered by these BAT conclusions Reducing chromium to water. The BAT-AEL emission level is 0.01�0.3 mg/l.
status: valid
status modified: 2026-05-06
accepted date: 2026-05-06
in scheme: BATAEL values as defined into the EC BAT-Tool

Ferrous metals processing - BAT 31
type: Concept
notation: FMP-Cr-BAT31-XXII
definition: 2, Production and processing of metals: 2.3 Processing of ferrous metals for (a) operation of hot rolling mills with a capacity exceeding 20 tonnes of crude steel per hour; (c) application of protective fused metal coats with an input exceeding 2 tonnes of crude steel per hour; this includes hot dip coating and batch galvanising. 2.6 Surface treatment of ferrous metals using electrolytic or chemical processes where the volume of the treatment vats exceeds 30 m3, when it is carried out in cold rolling, wire drawing or batch galvanising. 6.11 Independently operated treatment of waste water not covered by Directive 91/271/EEC, provided that the main pollutant load originates from the activities covered by these BAT conclusions Reducing chromium to water. The BAT-AEL emission level is 0.01�0.1 mg/l.
status: valid
status modified: 2026-05-06
accepted date: 2026-05-06
in scheme: BATAEL values as defined into the EC BAT-Tool

Ferrous metals processing - BAT 31
type: Concept
notation: FMP-Cr-BAT31-XXIII
definition: 2, Production and processing of metals: 2.3 Processing of ferrous metals for (a) operation of hot rolling mills with a capacity exceeding 20 tonnes of crude steel per hour; (c) application of protective fused metal coats with an input exceeding 2 tonnes of crude steel per hour; this includes hot dip coating and batch galvanising. 2.6 Surface treatment of ferrous metals using electrolytic or chemical processes where the volume of the treatment vats exceeds 30 m3, when it is carried out in cold rolling, wire drawing or batch galvanising. 6.11 Independently operated treatment of waste water not covered by Directive 91/271/EEC, provided that the main pollutant load originates from the activities covered by these BAT conclusions Reducing chromium to water. The BAT-AEL emission level is 0.01�0.3 mg/l.
status: valid
status modified: 2026-05-06
accepted date: 2026-05-06
in scheme: BATAEL values as defined into the EC BAT-Tool

Ferrous metals processing - BAT 31
type: Concept
notation: FMP-CrVI-BAT31-VIII
definition: 2, Production and processing of metals: 2.3 Processing of ferrous metals for (a) operation of hot rolling mills with a capacity exceeding 20 tonnes of crude steel per hour; (c) application of protective fused metal coats with an input exceeding 2 tonnes of crude steel per hour; this includes hot dip coating and batch galvanising. 2.6 Surface treatment of ferrous metals using electrolytic or chemical processes where the volume of the treatment vats exceeds 30 m3, when it is carried out in cold rolling, wire drawing or batch galvanising. 6.11 Independently operated treatment of waste water not covered by Directive 91/271/EEC, provided that the main pollutant load originates from the activities covered by these BAT conclusions Reducing hexavalent chromium to water. The BAT-AEL emission level is 10�50 ?g/l.
status: valid
status modified: 2026-05-06
accepted date: 2026-05-06
in scheme: BATAEL values as defined into the EC BAT-Tool

Ferrous metals processing - BAT 31
type: Concept
notation: FMP-CrVI-BAT31-XXIV
definition: 2, Production and processing of metals: 2.3 Processing of ferrous metals for (a) operation of hot rolling mills with a capacity exceeding 20 tonnes of crude steel per hour; (c) application of protective fused metal coats with an input exceeding 2 tonnes of crude steel per hour; this includes hot dip coating and batch galvanising. 2.6 Surface treatment of ferrous metals using electrolytic or chemical processes where the volume of the treatment vats exceeds 30 m3, when it is carried out in cold rolling, wire drawing or batch galvanising. 6.11 Independently operated treatment of waste water not covered by Directive 91/271/EEC, provided that the main pollutant load originates from the activities covered by these BAT conclusions Reducing hexavalent chromium to water. The BAT-AEL emission level is 10�50 ?g/l.
status: valid
status modified: 2026-05-06
accepted date: 2026-05-06
in scheme: BATAEL values as defined into the EC BAT-Tool

Ferrous metals processing - BAT 20
type: Concept
notation: FMP-Dust-BAT20
definition: 2, Production and processing of metals: 2.3 Processing of ferrous metals for (a) operation of hot rolling mills with a capacity exceeding 20 tonnes of crude steel per hour; (c) application of protective fused metal coats with an input exceeding 2 tonnes of crude steel per hour; this includes hot dip coating and batch galvanising. 2.6 Surface treatment of ferrous metals using electrolytic or chemical processes where the volume of the treatment vats exceeds 30 m3, when it is carried out in cold rolling, wire drawing or batch galvanising. 6.11 Independently operated treatment of waste water not covered by Directive 91/271/EEC, provided that the main pollutant load originates from the activities covered by these BAT conclusions; Reducing dust emissions to air. The BAT-AEL emission level is < 2�10 mg/Nm3.
status: valid
status modified: 2026-05-06
accepted date: 2026-05-06
in scheme: BATAEL values as defined into the EC BAT-Tool

Manufacture of Glass - Ba - BAT13-X
type: Concept
notation: GLS-Ba-BAT13-X
definition: 3, Mineral industry: 3,3 Manufacture of glass including glass fibre with a melting capacity exceeding 20 tonnes per day Reducing barium to water. The BAT-AEL emission level is < 3 mg/l.
status: valid
status modified: 2026-05-06
accepted date: 2026-05-06
in scheme: BATAEL values as defined into the EC BAT-Tool

Manufacture of Glass - C - BAT37-IV
type: Concept
notation: GLS-C-BAT37-IV
definition: 3, Mineral industry: 3,3 Manufacture of glass including glass fibre with a melting capacity exceeding 20 tonnes per day; Techniques (i)-(iii) (see table); Reducing total volatile organic compounds emissions to air. The BAT-AEL emission level is < 20 mg/Nm3.
status: valid
status modified: 2026-05-06
accepted date: 2026-05-06
in scheme: BATAEL values as defined into the EC BAT-Tool

Manufacture of Glass - C - BAT63-VI
type: Concept
notation: GLS-C-BAT63-VI
definition: 3, Mineral industry: 3,4 Melting mineral substances including the production of mineral fibres with a melting capacity exceeding 20�tonnes per day; Techniques (i)-(v) (see table); Reducing total volatile organic compounds emissions to air. The BAT-AEL emission level is 10 - 30 mg/Nm3.
status: valid
status modified: 2026-05-06
accepted date: 2026-05-06
in scheme: BATAEL values as defined into the EC BAT-Tool

Manufacture of Glass - C - BAT63-XII
type: Concept
notation: GLS-C-BAT63-XII
definition: 3, Mineral industry: 3,4 Melting mineral substances including the production of mineral fibres with a melting capacity exceeding 20�tonnes per day; Techniques (i)-(v) (see table); Reducing total volatile organic compounds emissions to air. The BAT-AEL emission level is < 10 mg/Nm3.
status: valid
status modified: 2026-05-06
accepted date: 2026-05-06
in scheme: BATAEL values as defined into the EC BAT-Tool

Manufacture of Glass - C - BAT63-XIX
type: Concept
notation: GLS-C-BAT63-XIX
definition: 3, Mineral industry: 3,4 Melting mineral substances including the production of mineral fibres with a melting capacity exceeding 20�tonnes per day; Techniques (i)-(v) (see table); Reducing total volatile organic compounds emissions to air. The BAT-AEL emission level is < 0,065 kg/t.
status: valid
status modified: 2026-05-06
accepted date: 2026-05-06
in scheme: BATAEL values as defined into the EC BAT-Tool

Manufacture of Glass - C - BAT70
type: Concept
notation: GLS-C-BAT70
definition: 3, Mineral industry: 3,4 Melting mineral substances including the production of mineral fibres with a melting capacity exceeding 20�tonnes per day; Techniques (i)-(iii) (see table); Reducing volatile organic compounds emissions to air. The BAT-AEL emission level is 10 - 20 mg/Nm3.
status: valid
status modified: 2026-05-06
accepted date: 2026-05-06
in scheme: BATAEL values as defined into the EC BAT-Tool

Ferrous metals processing - BAT 26
type: Concept
notation: FMP-Dust-BAT26
definition: 2, Production and processing of metals: 2.3 Processing of ferrous metals for (a) operation of hot rolling mills with a capacity exceeding 20 tonnes of crude steel per hour; (c) application of protective fused metal coats with an input exceeding 2 tonnes of crude steel per hour; this includes hot dip coating and batch galvanising. 2.6 Surface treatment of ferrous metals using electrolytic or chemical processes where the volume of the treatment vats exceeds 30 m3, when it is carried out in cold rolling, wire drawing or batch galvanising. 6.11 Independently operated treatment of waste water not covered by Directive 91/271/EEC, provided that the main pollutant load originates from the activities covered by these BAT conclusions; Reducing dust emissions to air. The BAT-AEL emission level is < 2�5 mg/Nm3.
status: valid
status modified: 2026-05-06
accepted date: 2026-05-06
in scheme: BATAEL values as defined into the EC BAT-Tool

Ferrous metals processing - BAT 29
type: Concept
notation: FMP-Dust-BAT29-I
definition: 2, Production and processing of metals: 2.3 Processing of ferrous metals for (a) operation of hot rolling mills with a capacity exceeding 20 tonnes of crude steel per hour; (c) application of protective fused metal coats with an input exceeding 2 tonnes of crude steel per hour; this includes hot dip coating and batch galvanising. 2.6 Surface treatment of ferrous metals using electrolytic or chemical processes where the volume of the treatment vats exceeds 30 m3, when it is carried out in cold rolling, wire drawing or batch galvanising. 6.11 Independently operated treatment of waste water not covered by Directive 91/271/EEC, provided that the main pollutant load originates from the activities covered by these BAT conclusions; Reducing dust emissions to air. The BAT-AEL emission level is < 2�15 mg/Nm3.
status: valid
status modified: 2026-05-06
accepted date: 2026-05-06
in scheme: BATAEL values as defined into the EC BAT-Tool

Ferrous metals processing - BAT 29
type: Concept
notation: FMP-Dust-BAT29-VII
definition: 2, Production and processing of metals: 2.3 Processing of ferrous metals for (a) operation of hot rolling mills with a capacity exceeding 20 tonnes of crude steel per hour; (c) application of protective fused metal coats with an input exceeding 2 tonnes of crude steel per hour; this includes hot dip coating and batch galvanising. 2.6 Surface treatment of ferrous metals using electrolytic or chemical processes where the volume of the treatment vats exceeds 30 m3, when it is carried out in cold rolling, wire drawing or batch galvanising. 6.11 Independently operated treatment of waste water not covered by Directive 91/271/EEC, provided that the main pollutant load originates from the activities covered by these BAT conclusions; Reducing dust emissions to air. The BAT-AEL emission level is < 2�10 mg/Nm3.
status: valid
status modified: 2026-05-06
accepted date: 2026-05-06
in scheme: BATAEL values as defined into the EC BAT-Tool

Ferrous metals processing - BAT 42
type: Concept
notation: FMP-Dust-BAT42-I
definition: 2, Production and processing of metals: 2.3 Processing of ferrous metals for (a) operation of hot rolling mills with a capacity exceeding 20 tonnes of crude steel per hour; (c) application of protective fused metal coats with an input exceeding 2 tonnes of crude steel per hour; this includes hot dip coating and batch galvanising. 2.6 Surface treatment of ferrous metals using electrolytic or chemical processes where the volume of the treatment vats exceeds 30 m3, when it is carried out in cold rolling, wire drawing or batch galvanising. 6.11 Independently operated treatment of waste water not covered by Directive 91/271/EEC, provided that the main pollutant load originates from the activities covered by these BAT conclusions; Reducing dust emissions to air. The BAT-AEL emission level is < 2�5 mg/Nm3.
status: valid
status modified: 2026-05-06
accepted date: 2026-05-06
in scheme: BATAEL values as defined into the EC BAT-Tool

Ferrous metals processing - BAT 42
type: Concept
notation: FMP-Dust-BAT42-II
definition: 2, Production and processing of metals: 2.3 Processing of ferrous metals for (a) operation of hot rolling mills with a capacity exceeding 20 tonnes of crude steel per hour; (c) application of protective fused metal coats with an input exceeding 2 tonnes of crude steel per hour; this includes hot dip coating and batch galvanising. 2.6 Surface treatment of ferrous metals using electrolytic or chemical processes where the volume of the treatment vats exceeds 30 m3, when it is carried out in cold rolling, wire drawing or batch galvanising. 6.11 Independently operated treatment of waste water not covered by Directive 91/271/EEC, provided that the main pollutant load originates from the activities covered by these BAT conclusions; Reducing dust emissions to air. The BAT-AEL emission level is < 2�7 mg/Nm3.
status: valid
status modified: 2026-05-06
accepted date: 2026-05-06
in scheme: BATAEL values as defined into the EC BAT-Tool

Ferrous metals processing - BAT 46
type: Concept
notation: FMP-Dust-BAT46-I
definition: 2, Production and processing of metals: 2.3 Processing of ferrous metals for (a) operation of hot rolling mills with a capacity exceeding 20 tonnes of crude steel per hour; (c) application of protective fused metal coats with an input exceeding 2 tonnes of crude steel per hour; this includes hot dip coating and batch galvanising. 2.6 Surface treatment of ferrous metals using electrolytic or chemical processes where the volume of the treatment vats exceeds 30 m3, when it is carried out in cold rolling, wire drawing or batch galvanising. 6.11 Independently operated treatment of waste water not covered by Directive 91/271/EEC, provided that the main pollutant load originates from the activities covered by these BAT conclusions; Reducing dust emissions to air. The BAT-AEL emission level is < 2�5 mg/Nm3.
status: valid
status modified: 2026-05-06
accepted date: 2026-05-06
in scheme: BATAEL values as defined into the EC BAT-Tool

Manufacture of Glass - C6H6O - BAT13-XIX
type: Concept
notation: GLS-C6H6O-BAT13-XIX
definition: 3, Mineral industry: 3,3 Manufacture of glass including glass fibre with a melting capacity exceeding 20 tonnes per day Reducing phenol to water. The BAT-AEL emission level is < 1 mg/l.
status: valid
status modified: 2026-05-06
accepted date: 2026-05-06
in scheme: BATAEL values as defined into the EC BAT-Tool

Manufacture of Glass - C6H6O - BAT63-II
type: Concept
notation: GLS-C6H6O-BAT63-II
definition: 3, Mineral industry: 3,4 Melting mineral substances including the production of mineral fibres with a melting capacity exceeding 20�tonnes per day; Techniques (i)-(v) (see table); Reducing phenol emissions to air. The BAT-AEL emission level is < 5 - 10 mg/Nm3.
status: valid
status modified: 2026-05-06
accepted date: 2026-05-06
in scheme: BATAEL values as defined into the EC BAT-Tool

Manufacture of Glass - C6H6O - BAT63-VIII
type: Concept
notation: GLS-C6H6O-BAT63-VIII
definition: 3, Mineral industry: 3,4 Melting mineral substances including the production of mineral fibres with a melting capacity exceeding 20�tonnes per day; Techniques (i)-(v) (see table); Reducing phenol emissions to air. The BAT-AEL emission level is < 2 - 5 mg/Nm3.
status: valid
status modified: 2026-05-06
accepted date: 2026-05-06
in scheme: BATAEL values as defined into the EC BAT-Tool

Manufacture of Glass - C6H6O - BAT63-XV
type: Concept
notation: GLS-C6H6O-BAT63-XV
definition: 3, Mineral industry: 3,4 Melting mineral substances including the production of mineral fibres with a melting capacity exceeding 20�tonnes per day; Techniques (i)-(v) (see table); Reducing phenol emissions to air. The BAT-AEL emission level is < 0,03 kg/t.
status: valid
status modified: 2026-05-06
accepted date: 2026-05-06
in scheme: BATAEL values as defined into the EC BAT-Tool

Manufacture of Glass - CH2O - BAT37-II
type: Concept
notation: GLS-CH2O-BAT37-II
definition: 3, Mineral industry: 3,3 Manufacture of glass including glass fibre with a melting capacity exceeding 20 tonnes per day; Techniques (i)-(iii) (see table); Reducing formaldehyde emissions to air. The BAT-AEL emission level is < 10 mg/Nm3.
status: valid
status modified: 2026-05-06
accepted date: 2026-05-06
in scheme: BATAEL values as defined into the EC BAT-Tool

Manufacture of Glass - CH2O - BAT63-III
type: Concept
notation: GLS-CH2O-BAT63-III
definition: 3, Mineral industry: 3,4 Melting mineral substances including the production of mineral fibres with a melting capacity exceeding 20�tonnes per day; Techniques (i)-(v) (see table); Reducing formaldehyde emissions to air. The BAT-AEL emission level is < 2 - 5 mg/Nm3.
status: valid
status modified: 2026-05-06
accepted date: 2026-05-06
in scheme: BATAEL values as defined into the EC BAT-Tool

Ferrous metals processing - BAT 51
type: Concept
notation: FMP-Dust-BAT51-I
definition: 2, Production and processing of metals: 2.3 Processing of ferrous metals for (a) operation of hot rolling mills with a capacity exceeding 20 tonnes of crude steel per hour; (c) application of protective fused metal coats with an input exceeding 2 tonnes of crude steel per hour; this includes hot dip coating and batch galvanising. 2.6 Surface treatment of ferrous metals using electrolytic or chemical processes where the volume of the treatment vats exceeds 30 m3, when it is carried out in cold rolling, wire drawing or batch galvanising. 6.11 Independently operated treatment of waste water not covered by Directive 91/271/EEC, provided that the main pollutant load originates from the activities covered by these BAT conclusions; Reducing dust emissions to air. The BAT-AEL emission level is < 2�5 mg/Nm3.
status: valid
status modified: 2026-05-06
accepted date: 2026-05-06
in scheme: BATAEL values as defined into the EC BAT-Tool

Ferrous metals processing - BAT 52
type: Concept
notation: FMP-Dust-BAT52
definition: 2, Production and processing of metals: 2.3 Processing of ferrous metals for (a) operation of hot rolling mills with a capacity exceeding 20 tonnes of crude steel per hour; (c) application of protective fused metal coats with an input exceeding 2 tonnes of crude steel per hour; this includes hot dip coating and batch galvanising. 2.6 Surface treatment of ferrous metals using electrolytic or chemical processes where the volume of the treatment vats exceeds 30 m3, when it is carried out in cold rolling, wire drawing or batch galvanising. 6.11 Independently operated treatment of waste water not covered by Directive 91/271/EEC, provided that the main pollutant load originates from the activities covered by these BAT conclusions; Reducing dust emissions to air. The BAT-AEL emission level is < 2�5 mg/Nm3.
status: valid
status modified: 2026-05-06
accepted date: 2026-05-06
in scheme: BATAEL values as defined into the EC BAT-Tool

Ferrous metals processing - BAT 31
type: Concept
notation: FMP-F-BAT31-XIX
definition: 2, Production and processing of metals: 2.3 Processing of ferrous metals for (a) operation of hot rolling mills with a capacity exceeding 20 tonnes of crude steel per hour; (c) application of protective fused metal coats with an input exceeding 2 tonnes of crude steel per hour; this includes hot dip coating and batch galvanising. 2.6 Surface treatment of ferrous metals using electrolytic or chemical processes where the volume of the treatment vats exceeds 30 m3, when it is carried out in cold rolling, wire drawing or batch galvanising. 6.11 Independently operated treatment of waste water not covered by Directive 91/271/EEC, provided that the main pollutant load originates from the activities covered by these BAT conclusions Reducing fluorides to water. The BAT-AEL emission level is 1�15 mg/l.
status: valid
status modified: 2026-05-06
accepted date: 2026-05-06
in scheme: BATAEL values as defined into the EC BAT-Tool

Ferrous metals processing - BAT 31
type: Concept
notation: FMP-F-BAT31-XXXIV
definition: 2, Production and processing of metals: 2.3 Processing of ferrous metals for (a) operation of hot rolling mills with a capacity exceeding 20 tonnes of crude steel per hour; (c) application of protective fused metal coats with an input exceeding 2 tonnes of crude steel per hour; this includes hot dip coating and batch galvanising. 2.6 Surface treatment of ferrous metals using electrolytic or chemical processes where the volume of the treatment vats exceeds 30 m3, when it is carried out in cold rolling, wire drawing or batch galvanising. 6.11 Independently operated treatment of waste water not covered by Directive 91/271/EEC, provided that the main pollutant load originates from the activities covered by these BAT conclusions Reducing fluorides to water. The BAT-AEL emission level is 1�15 mg/l.
status: valid
status modified: 2026-05-06
accepted date: 2026-05-06
in scheme: BATAEL values as defined into the EC BAT-Tool

Ferrous metals processing - BAT 31
type: Concept
notation: FMP-Fe-BAT31-IX
definition: 2, Production and processing of metals: 2.3 Processing of ferrous metals for (a) operation of hot rolling mills with a capacity exceeding 20 tonnes of crude steel per hour; (c) application of protective fused metal coats with an input exceeding 2 tonnes of crude steel per hour; this includes hot dip coating and batch galvanising. 2.6 Surface treatment of ferrous metals using electrolytic or chemical processes where the volume of the treatment vats exceeds 30 m3, when it is carried out in cold rolling, wire drawing or batch galvanising. 6.11 Independently operated treatment of waste water not covered by Directive 91/271/EEC, provided that the main pollutant load originates from the activities covered by these BAT conclusions Reducing iron to water. The BAT-AEL emission level is 1�5 mg/l.
status: valid
status modified: 2026-05-06
accepted date: 2026-05-06
in scheme: BATAEL values as defined into the EC BAT-Tool

Ferrous metals processing - BAT 31
type: Concept
notation: FMP-Fe-BAT31-XXV
definition: 2, Production and processing of metals: 2.3 Processing of ferrous metals for (a) operation of hot rolling mills with a capacity exceeding 20 tonnes of crude steel per hour; (c) application of protective fused metal coats with an input exceeding 2 tonnes of crude steel per hour; this includes hot dip coating and batch galvanising. 2.6 Surface treatment of ferrous metals using electrolytic or chemical processes where the volume of the treatment vats exceeds 30 m3, when it is carried out in cold rolling, wire drawing or batch galvanising. 6.11 Independently operated treatment of waste water not covered by Directive 91/271/EEC, provided that the main pollutant load originates from the activities covered by these BAT conclusions Reducing iron to water. The BAT-AEL emission level is 1�5 mg/l.
status: valid
status modified: 2026-05-06
accepted date: 2026-05-06
in scheme: BATAEL values as defined into the EC BAT-Tool

Manufacture of Glass - CH2O - BAT63-IX
type: Concept
notation: GLS-CH2O-BAT63-IX
definition: 3, Mineral industry: 3,4 Melting mineral substances including the production of mineral fibres with a melting capacity exceeding 20�tonnes per day; Techniques (i)-(v) (see table); Reducing formaldehyde emissions to air. The BAT-AEL emission level is < 2 - 5 mg/Nm3.
status: valid
status modified: 2026-05-06
accepted date: 2026-05-06
in scheme: BATAEL values as defined into the EC BAT-Tool

Manufacture of Glass - CH2O - BAT63-XVI
type: Concept
notation: GLS-CH2O-BAT63-XVI
definition: 3, Mineral industry: 3,4 Melting mineral substances including the production of mineral fibres with a melting capacity exceeding 20�tonnes per day; Techniques (i)-(v) (see table); Reducing formaldehyde emissions to air. The BAT-AEL emission level is < 0,03 kg/t.
status: valid
status modified: 2026-05-06
accepted date: 2026-05-06
in scheme: BATAEL values as defined into the EC BAT-Tool

Manufacture of Glass - CO - BAT9
type: Concept
notation: GLS-CO-BAT9
definition: 3, Mineral industry: 3,3 Manufacture of glass including glass fibre with a melting capacity exceeding 20 tonnes per day; Techniques (see table); Reducing carbon monoxide (CO) emissions to air. The BAT-AEL emission level is < 100 mg/Nm3.
status: valid
status modified: 2026-05-06
accepted date: 2026-05-06
in scheme: BATAEL values as defined into the EC BAT-Tool

Manufacture of Glass - COD - BAT13-III
type: Concept
notation: GLS-COD-BAT13-III
definition: 3, Mineral industry: 3,3 Manufacture of glass including glass fibre with a melting capacity exceeding 20 tonnes per day Reducing chemical oxygen demand (COD) to water. The BAT-AEL emission level is < 5 - 130 mg/l.
status: valid
status modified: 2026-05-06
accepted date: 2026-05-06
in scheme: BATAEL values as defined into the EC BAT-Tool

Manufacture of Glass - Cd - BAT13-XIV
type: Concept
notation: GLS-Cd-BAT13-XIV
definition: 3, Mineral industry: 3,3 Manufacture of glass including glass fibre with a melting capacity exceeding 20 tonnes per day Reducing cadmium to water. The BAT-AEL emission level is < 0,05 mg/l.
status: valid
status modified: 2026-05-06
accepted date: 2026-05-06
in scheme: BATAEL values as defined into the EC BAT-Tool

Manufacture of Glass - Cr - BAT13-XIII
type: Concept
notation: GLS-Cr-BAT13-XIII
definition: 3, Mineral industry: 3,3 Manufacture of glass including glass fibre with a melting capacity exceeding 20 tonnes per day Reducing chromium to water. The BAT-AEL emission level is < 0,3 mg/l.
status: valid
status modified: 2026-05-06
accepted date: 2026-05-06
in scheme: BATAEL values as defined into the EC BAT-Tool

Ferrous metals processing - BAT 24
type: Concept
notation: FMP-HCl-BAT24-I
definition: 2, Production and processing of metals: 2.3 Processing of ferrous metals for (a) operation of hot rolling mills with a capacity exceeding 20 tonnes of crude steel per hour; (c) application of protective fused metal coats with an input exceeding 2 tonnes of crude steel per hour; this includes hot dip coating and batch galvanising. 2.6 Surface treatment of ferrous metals using electrolytic or chemical processes where the volume of the treatment vats exceeds 30 m3, when it is carried out in cold rolling, wire drawing or batch galvanising. 6.11 Independently operated treatment of waste water not covered by Directive 91/271/EEC, provided that the main pollutant load originates from the activities covered by these BAT conclusions; Reducing hydrogen chloride emissions to air. The BAT-AEL emission level is < 2�10 mg/Nm3.
status: valid
status modified: 2026-05-06
accepted date: 2026-05-06
in scheme: BATAEL values as defined into the EC BAT-Tool

Ferrous metals processing - BAT 24
type: Concept
notation: FMP-HCl-BAT24-IV
definition: 2, Production and processing of metals: 2.3 Processing of ferrous metals for (a) operation of hot rolling mills with a capacity exceeding 20 tonnes of crude steel per hour; (c) application of protective fused metal coats with an input exceeding 2 tonnes of crude steel per hour; this includes hot dip coating and batch galvanising. 2.6 Surface treatment of ferrous metals using electrolytic or chemical processes where the volume of the treatment vats exceeds 30 m3, when it is carried out in cold rolling, wire drawing or batch galvanising. 6.11 Independently operated treatment of waste water not covered by Directive 91/271/EEC, provided that the main pollutant load originates from the activities covered by these BAT conclusions; Reducing hydrogen chloride emissions to air. The BAT-AEL emission level is < 2�10 mg/Nm3.
status: valid
status modified: 2026-05-06
accepted date: 2026-05-06
in scheme: BATAEL values as defined into the EC BAT-Tool

Ferrous metals processing - BAT 29
type: Concept
notation: FMP-HCl-BAT29-II
definition: 2, Production and processing of metals: 2.3 Processing of ferrous metals for (a) operation of hot rolling mills with a capacity exceeding 20 tonnes of crude steel per hour; (c) application of protective fused metal coats with an input exceeding 2 tonnes of crude steel per hour; this includes hot dip coating and batch galvanising. 2.6 Surface treatment of ferrous metals using electrolytic or chemical processes where the volume of the treatment vats exceeds 30 m3, when it is carried out in cold rolling, wire drawing or batch galvanising. 6.11 Independently operated treatment of waste water not covered by Directive 91/271/EEC, provided that the main pollutant load originates from the activities covered by these BAT conclusions; Reducing hydrogen chloride emissions to air. The BAT-AEL emission level is < 2�15 mg/Nm3.
status: valid
status modified: 2026-05-06
accepted date: 2026-05-06
in scheme: BATAEL values as defined into the EC BAT-Tool

Ferrous metals processing - BAT 62
type: Concept
notation: FMP-HCl-BAT62
definition: 2, Production and processing of metals: 2.3 Processing of ferrous metals for (a) operation of hot rolling mills with a capacity exceeding 20 tonnes of crude steel per hour; (c) application of protective fused metal coats with an input exceeding 2 tonnes of crude steel per hour; this includes hot dip coating and batch galvanising. 2.6 Surface treatment of ferrous metals using electrolytic or chemical processes where the volume of the treatment vats exceeds 30 m3, when it is carried out in cold rolling, wire drawing or batch galvanising. 6.11 Independently operated treatment of waste water not covered by Directive 91/271/EEC, provided that the main pollutant load originates from the activities covered by these BAT conclusions; Reducing hydrogen chloride emissions to air. The BAT-AEL emission level is < 2 � 6 mg/Nm3.
status: valid
status modified: 2026-05-06
accepted date: 2026-05-06
in scheme: BATAEL values as defined into the EC BAT-Tool

Ferrous metals processing - BAT 24
type: Concept
notation: FMP-HF-BAT24-II
definition: 2, Production and processing of metals: 2.3 Processing of ferrous metals for (a) operation of hot rolling mills with a capacity exceeding 20 tonnes of crude steel per hour; (c) application of protective fused metal coats with an input exceeding 2 tonnes of crude steel per hour; this includes hot dip coating and batch galvanising. 2.6 Surface treatment of ferrous metals using electrolytic or chemical processes where the volume of the treatment vats exceeds 30 m3, when it is carried out in cold rolling, wire drawing or batch galvanising. 6.11 Independently operated treatment of waste water not covered by Directive 91/271/EEC, provided that the main pollutant load originates from the activities covered by these BAT conclusions; Reducing hydrogen fluoride emissions to air. The BAT-AEL emission level is < 1 mg/Nm3.
status: valid
status modified: 2026-05-06
accepted date: 2026-05-06
in scheme: BATAEL values as defined into the EC BAT-Tool

Ferrous metals processing - BAT 29
type: Concept
notation: FMP-HF-BAT29-V
definition: 2, Production and processing of metals: 2.3 Processing of ferrous metals for (a) operation of hot rolling mills with a capacity exceeding 20 tonnes of crude steel per hour; (c) application of protective fused metal coats with an input exceeding 2 tonnes of crude steel per hour; this includes hot dip coating and batch galvanising. 2.6 Surface treatment of ferrous metals using electrolytic or chemical processes where the volume of the treatment vats exceeds 30 m3, when it is carried out in cold rolling, wire drawing or batch galvanising. 6.11 Independently operated treatment of waste water not covered by Directive 91/271/EEC, provided that the main pollutant load originates from the activities covered by these BAT conclusions; Reducing hydrogen fluoride emissions to air. The BAT-AEL emission level is < 1 mg/Nm3.
status: valid
status modified: 2026-05-06
accepted date: 2026-05-06
in scheme: BATAEL values as defined into the EC BAT-Tool

Manufacture of Glass - Cu - BAT13-XII
type: Concept
notation: GLS-Cu-BAT13-XII
definition: 3, Mineral industry: 3,3 Manufacture of glass including glass fibre with a melting capacity exceeding 20 tonnes per day Reducing copper to water. The BAT-AEL emission level is < 0,3 mg/l.
status: valid
status modified: 2026-05-06
accepted date: 2026-05-06
in scheme: BATAEL values as defined into the EC BAT-Tool

Manufacture of Glass - Dust - BAT16-I
type: Concept
notation: GLS-Dust-BAT16-I
definition: 3, Mineral industry: 3,3 Manufacture of glass including glass fibre with a melting capacity exceeding 20 tonnes per day; Flue-gas cleaning system such as electrostatic precipitator or bag filter (see table); Reducing dust emissions to air. The BAT-AEL emission level is < 10 - 20 mg/Nm3.
status: valid
status modified: 2026-05-06
accepted date: 2026-05-06
in scheme: BATAEL values as defined into the EC BAT-Tool

Manufacture of Glass - Dust - BAT16-II
type: Concept
notation: GLS-Dust-BAT16-II
definition: 3, Mineral industry: 3,3 Manufacture of glass including glass fibre with a melting capacity exceeding 20 tonnes per day; Flue-gas cleaning system such as electrostatic precipitator or bag filter (see table); Reducing dust emissions to air. The BAT-AEL emission level is < 0,015 - 0,06 kg/t.
status: valid
status modified: 2026-05-06
accepted date: 2026-05-06
in scheme: BATAEL values as defined into the EC BAT-Tool

Manufacture of Glass - Dust - BAT22-I
type: Concept
notation: GLS-Dust-BAT22-I
definition: 3, Mineral industry: 3,3 Manufacture of glass including glass fibre with a melting capacity exceeding 20 tonnes per day; Techniques (i)-(iii) (see table); Reducing dust emissions to air. The BAT-AEL emission level is < 10 mg/Nm3.
status: valid
status modified: 2026-05-06
accepted date: 2026-05-06
in scheme: BATAEL values as defined into the EC BAT-Tool

Manufacture of Glass - Dust - BAT24-I
type: Concept
notation: GLS-Dust-BAT24-I
definition: 3, Mineral industry: 3,3 Manufacture of glass including glass fibre with a melting capacity exceeding 20 tonnes per day; Electrostatic precipitator or bag filter system; Reducing dust emissions to air. The BAT-AEL emission level is < 10 - 20 mg/Nm3.
status: valid
status modified: 2026-05-06
accepted date: 2026-05-06
in scheme: BATAEL values as defined into the EC BAT-Tool

Manufacture of Glass - Dust - BAT24-II
type: Concept
notation: GLS-Dust-BAT24-II
definition: 3, Mineral industry: 3,3 Manufacture of glass including glass fibre with a melting capacity exceeding 20 tonnes per day; Electrostatic precipitator or bag filter system; Reducing dust emissions to air. The BAT-AEL emission level is < 0,025 - 0,05 kg/t.
status: valid
status modified: 2026-05-06
accepted date: 2026-05-06
in scheme: BATAEL values as defined into the EC BAT-Tool

Ferrous metals processing - BAT 31
type: Concept
notation: FMP-HOI-BAT31-IV
definition: 2, Production and processing of metals: 2.3 Processing of ferrous metals for (a) operation of hot rolling mills with a capacity exceeding 20 tonnes of crude steel per hour; (c) application of protective fused metal coats with an input exceeding 2 tonnes of crude steel per hour; this includes hot dip coating and batch galvanising. 2.6 Surface treatment of ferrous metals using electrolytic or chemical processes where the volume of the treatment vats exceeds 30 m3, when it is carried out in cold rolling, wire drawing or batch galvanising. 6.11 Independently operated treatment of waste water not covered by Directive 91/271/EEC, provided that the main pollutant load originates from the activities covered by these BAT conclusions Reducing hydrocarbon oil index to water. The BAT-AEL emission level is 0.5�4 mg/l.
status: valid
status modified: 2026-05-06
accepted date: 2026-05-06
in scheme: BATAEL values as defined into the EC BAT-Tool

Ferrous metals processing - BAT 31
type: Concept
notation: FMP-HOI-BAT31-XX
definition: 2, Production and processing of metals: 2.3 Processing of ferrous metals for (a) operation of hot rolling mills with a capacity exceeding 20 tonnes of crude steel per hour; (c) application of protective fused metal coats with an input exceeding 2 tonnes of crude steel per hour; this includes hot dip coating and batch galvanising. 2.6 Surface treatment of ferrous metals using electrolytic or chemical processes where the volume of the treatment vats exceeds 30 m3, when it is carried out in cold rolling, wire drawing or batch galvanising. 6.11 Independently operated treatment of waste water not covered by Directive 91/271/EEC, provided that the main pollutant load originates from the activities covered by these BAT conclusions Reducing hydrocarbon oil index to water. The BAT-AEL emission level is 0.5�4 mg/l.
status: valid
status modified: 2026-05-06
accepted date: 2026-05-06
in scheme: BATAEL values as defined into the EC BAT-Tool

Ferrous metals processing - BAT 31
type: Concept
notation: FMP-Hg-BAT31-X
definition: 2, Production and processing of metals: 2.3 Processing of ferrous metals for (a) operation of hot rolling mills with a capacity exceeding 20 tonnes of crude steel per hour; (c) application of protective fused metal coats with an input exceeding 2 tonnes of crude steel per hour; this includes hot dip coating and batch galvanising. 2.6 Surface treatment of ferrous metals using electrolytic or chemical processes where the volume of the treatment vats exceeds 30 m3, when it is carried out in cold rolling, wire drawing or batch galvanising. 6.11 Independently operated treatment of waste water not covered by Directive 91/271/EEC, provided that the main pollutant load originates from the activities covered by these BAT conclusions Reducing mercury to water. The BAT-AEL emission level is 0.1�0.5 ?g/l.
status: valid
status modified: 2026-05-06
accepted date: 2026-05-06
in scheme: BATAEL values as defined into the EC BAT-Tool

Ferrous metals processing - BAT 31
type: Concept
notation: FMP-Hg-BAT31-XXVI
definition: 2, Production and processing of metals: 2.3 Processing of ferrous metals for (a) operation of hot rolling mills with a capacity exceeding 20 tonnes of crude steel per hour; (c) application of protective fused metal coats with an input exceeding 2 tonnes of crude steel per hour; this includes hot dip coating and batch galvanising. 2.6 Surface treatment of ferrous metals using electrolytic or chemical processes where the volume of the treatment vats exceeds 30 m3, when it is carried out in cold rolling, wire drawing or batch galvanising. 6.11 Independently operated treatment of waste water not covered by Directive 91/271/EEC, provided that the main pollutant load originates from the activities covered by these BAT conclusions Reducing mercury to water. The BAT-AEL emission level is 0.1�0.5 ?g/l.
status: valid
status modified: 2026-05-06
accepted date: 2026-05-06
in scheme: BATAEL values as defined into the EC BAT-Tool

Ferrous metals processing - BAT 22
type: Concept
notation: FMP-NOx-BAT22-I
definition: 2, Production and processing of metals: 2.3 Processing of ferrous metals for (a) operation of hot rolling mills with a capacity exceeding 20 tonnes of crude steel per hour; (c) application of protective fused metal coats with an input exceeding 2 tonnes of crude steel per hour; this includes hot dip coating and batch galvanising. 2.6 Surface treatment of ferrous metals using electrolytic or chemical processes where the volume of the treatment vats exceeds 30 m3, when it is carried out in cold rolling, wire drawing or batch galvanising. 6.11 Independently operated treatment of waste water not covered by Directive 91/271/EEC, provided that the main pollutant load originates from the activities covered by these BAT conclusions; Reducing nitrous oxides (Nox) emissions to air. The BAT-AEL emission level is 80�200 mg/Nm3.
status: valid
status modified: 2026-05-06
accepted date: 2026-05-06
in scheme: BATAEL values as defined into the EC BAT-Tool

Ferrous metals processing - BAT 22
type: Concept
notation: FMP-NOx-BAT22-II
definition: 2, Production and processing of metals: 2.3 Processing of ferrous metals for (a) operation of hot rolling mills with a capacity exceeding 20 tonnes of crude steel per hour; (c) application of protective fused metal coats with an input exceeding 2 tonnes of crude steel per hour; this includes hot dip coating and batch galvanising. 2.6 Surface treatment of ferrous metals using electrolytic or chemical processes where the volume of the treatment vats exceeds 30 m3, when it is carried out in cold rolling, wire drawing or batch galvanising. 6.11 Independently operated treatment of waste water not covered by Directive 91/271/EEC, provided that the main pollutant load originates from the activities covered by these BAT conclusions; Reducing nitrous oxides (Nox) emissions to air. The BAT-AEL emission level is 100�350 mg/Nm3.
status: valid
status modified: 2026-05-06
accepted date: 2026-05-06
in scheme: BATAEL values as defined into the EC BAT-Tool

Manufacture of Glass - Dust - BAT31-I
type: Concept
notation: GLS-Dust-BAT31-I
definition: 3, Mineral industry: 3,3 Manufacture of glass including glass fibre with a melting capacity exceeding 20 tonnes per day; Techniques (i)-(iv) (see table); Reducing dust emissions to air. The BAT-AEL emission level is < 15 - 20 mg/Nm3.
status: valid
status modified: 2026-05-06
accepted date: 2026-05-06
in scheme: BATAEL values as defined into the EC BAT-Tool

Manufacture of Glass - Dust - BAT32-I
type: Concept
notation: GLS-Dust-BAT32-I
definition: 3, Mineral industry: 3,3 Manufacture of glass including glass fibre with a melting capacity exceeding 20 tonnes per day; Techniques (i)-(iii) (see table); Reducing dust emissions to air. The BAT-AEL emission level is < 10 - 20 mg/Nm3.
status: valid
status modified: 2026-05-06
accepted date: 2026-05-06
in scheme: BATAEL values as defined into the EC BAT-Tool

Manufacture of Glass - Dust - BAT32-II
type: Concept
notation: GLS-Dust-BAT32-II
definition: 3, Mineral industry: 3,3 Manufacture of glass including glass fibre with a melting capacity exceeding 20 tonnes per day; Techniques (i)-(iii) (see table); Reducing dust emissions to air. The BAT-AEL emission level is < 0,045 - 0,09 kg/t.
status: valid
status modified: 2026-05-06
accepted date: 2026-05-06
in scheme: BATAEL values as defined into the EC BAT-Tool

Manufacture of Glass - Dust - BAT37-I
type: Concept
notation: GLS-Dust-BAT37-I
definition: 3, Mineral industry: 3,3 Manufacture of glass including glass fibre with a melting capacity exceeding 20 tonnes per day; Techniques (i)-(iii) (see table); Reducing dust emissions to air. The BAT-AEL emission level is < 5 - 20 mg/Nm3.
status: valid
status modified: 2026-05-06
accepted date: 2026-05-06
in scheme: BATAEL values as defined into the EC BAT-Tool

Manufacture of Glass - Dust - BAT37-V
type: Concept
notation: GLS-Dust-BAT37-V
definition: 3, Mineral industry: 3,3 Manufacture of glass including glass fibre with a melting capacity exceeding 20 tonnes per day; Techniques (i)-(iii) (see table); Reducing dust emissions to air. The BAT-AEL emission level is < 5 - 20 mg/Nm3.
status: valid
status modified: 2026-05-06
accepted date: 2026-05-06
in scheme: BATAEL values as defined into the EC BAT-Tool

Manufacture of Glass - Dust - BAT38-I
type: Concept
notation: GLS-Dust-BAT38-I
definition: 3, Mineral industry: 3,3 Manufacture of glass including glass fibre with a melting capacity exceeding 20 tonnes per day; Techniques (i)-(v) (see table); Reducing dust emissions to air. The BAT-AEL emission level is < 10 - 20 mg/Nm3.
status: valid
status modified: 2026-05-06
accepted date: 2026-05-06
in scheme: BATAEL values as defined into the EC BAT-Tool

Ferrous metals processing - BAT 22
type: Concept
notation: FMP-NOx-BAT22-III
definition: 2, Production and processing of metals: 2.3 Processing of ferrous metals for (a) operation of hot rolling mills with a capacity exceeding 20 tonnes of crude steel per hour; (c) application of protective fused metal coats with an input exceeding 2 tonnes of crude steel per hour; this includes hot dip coating and batch galvanising. 2.6 Surface treatment of ferrous metals using electrolytic or chemical processes where the volume of the treatment vats exceeds 30 m3, when it is carried out in cold rolling, wire drawing or batch galvanising. 6.11 Independently operated treatment of waste water not covered by Directive 91/271/EEC, provided that the main pollutant load originates from the activities covered by these BAT conclusions; Reducing nitrous oxides (Nox) emissions to air. The BAT-AEL emission level is 100�250 mg/Nm3.
status: valid
status modified: 2026-05-06
accepted date: 2026-05-06
in scheme: BATAEL values as defined into the EC BAT-Tool

Ferrous metals processing - BAT 22
type: Concept
notation: FMP-NOx-BAT22-IV
definition: 2, Production and processing of metals: 2.3 Processing of ferrous metals for (a) operation of hot rolling mills with a capacity exceeding 20 tonnes of crude steel per hour; (c) application of protective fused metal coats with an input exceeding 2 tonnes of crude steel per hour; this includes hot dip coating and batch galvanising. 2.6 Surface treatment of ferrous metals using electrolytic or chemical processes where the volume of the treatment vats exceeds 30 m3, when it is carried out in cold rolling, wire drawing or batch galvanising. 6.11 Independently operated treatment of waste water not covered by Directive 91/271/EEC, provided that the main pollutant load originates from the activities covered by these BAT conclusions; Reducing nitrous oxides (Nox) emissions to air. The BAT-AEL emission level is 100�200 mg/Nm3.
status: valid
status modified: 2026-05-06
accepted date: 2026-05-06
in scheme: BATAEL values as defined into the EC BAT-Tool

Ferrous metals processing - BAT 22
type: Concept
notation: FMP-NOx-BAT22-IX
definition: 2, Production and processing of metals: 2.3 Processing of ferrous metals for (a) operation of hot rolling mills with a capacity exceeding 20 tonnes of crude steel per hour; (c) application of protective fused metal coats with an input exceeding 2 tonnes of crude steel per hour; this includes hot dip coating and batch galvanising. 2.6 Surface treatment of ferrous metals using electrolytic or chemical processes where the volume of the treatment vats exceeds 30 m3, when it is carried out in cold rolling, wire drawing or batch galvanising. 6.11 Independently operated treatment of waste water not covered by Directive 91/271/EEC, provided that the main pollutant load originates from the activities covered by these BAT conclusions; Reducing nitrous oxides (Nox) emissions to air. The BAT-AEL emission level is 100�300 mg/Nm3.
status: valid
status modified: 2026-05-06
accepted date: 2026-05-06
in scheme: BATAEL values as defined into the EC BAT-Tool

Ferrous metals processing - BAT 22
type: Concept
notation: FMP-NOx-BAT22-V
definition: 2, Production and processing of metals: 2.3 Processing of ferrous metals for (a) operation of hot rolling mills with a capacity exceeding 20 tonnes of crude steel per hour; (c) application of protective fused metal coats with an input exceeding 2 tonnes of crude steel per hour; this includes hot dip coating and batch galvanising. 2.6 Surface treatment of ferrous metals using electrolytic or chemical processes where the volume of the treatment vats exceeds 30 m3, when it is carried out in cold rolling, wire drawing or batch galvanising. 6.11 Independently operated treatment of waste water not covered by Directive 91/271/EEC, provided that the main pollutant load originates from the activities covered by these BAT conclusions; Reducing nitrous oxides (Nox) emissions to air. The BAT-AEL emission level is 100�350 mg/Nm3.
status: valid
status modified: 2026-05-06
accepted date: 2026-05-06
in scheme: BATAEL values as defined into the EC BAT-Tool

Ferrous metals processing - BAT 22
type: Concept
notation: FMP-NOx-BAT22-VI
definition: 2, Production and processing of metals: 2.3 Processing of ferrous metals for (a) operation of hot rolling mills with a capacity exceeding 20 tonnes of crude steel per hour; (c) application of protective fused metal coats with an input exceeding 2 tonnes of crude steel per hour; this includes hot dip coating and batch galvanising. 2.6 Surface treatment of ferrous metals using electrolytic or chemical processes where the volume of the treatment vats exceeds 30 m3, when it is carried out in cold rolling, wire drawing or batch galvanising. 6.11 Independently operated treatment of waste water not covered by Directive 91/271/EEC, provided that the main pollutant load originates from the activities covered by these BAT conclusions; Reducing nitrous oxides (Nox) emissions to air. The BAT-AEL emission level is 100�550 mg/Nm3.
status: valid
status modified: 2026-05-06
accepted date: 2026-05-06
in scheme: BATAEL values as defined into the EC BAT-Tool

Ferrous metals processing - BAT 22
type: Concept
notation: FMP-NOx-BAT22-VII
definition: 2, Production and processing of metals: 2.3 Processing of ferrous metals for (a) operation of hot rolling mills with a capacity exceeding 20 tonnes of crude steel per hour; (c) application of protective fused metal coats with an input exceeding 2 tonnes of crude steel per hour; this includes hot dip coating and batch galvanising. 2.6 Surface treatment of ferrous metals using electrolytic or chemical processes where the volume of the treatment vats exceeds 30 m3, when it is carried out in cold rolling, wire drawing or batch galvanising. 6.11 Independently operated treatment of waste water not covered by Directive 91/271/EEC, provided that the main pollutant load originates from the activities covered by these BAT conclusions; Reducing nitrous oxides (Nox) emissions to air. The BAT-AEL emission level is 100�250 mg/Nm3.
status: valid
status modified: 2026-05-06
accepted date: 2026-05-06
in scheme: BATAEL values as defined into the EC BAT-Tool

Manufacture of Glass - Dust - BAT38-II
type: Concept
notation: GLS-Dust-BAT38-II
definition: 3, Mineral industry: 3,3 Manufacture of glass including glass fibre with a melting capacity exceeding 20 tonnes per day; Techniques (i)-(v) and batch formulations with significant amounts of dangerous substances (EC No 1272/2008); Reducing dust emissions to air. The BAT-AEL emission level is < 1 - 10 mg/Nm3.
status: valid
status modified: 2026-05-06
accepted date: 2026-05-06
in scheme: BATAEL values as defined into the EC BAT-Tool

Manufacture of Glass - Dust - BAT38-III
type: Concept
notation: GLS-Dust-BAT38-III
definition: 3, Mineral industry: 3,3 Manufacture of glass including glass fibre with a melting capacity exceeding 20 tonnes per day; Techniques (i)-(v) (see table); Reducing dust emissions to air. The BAT-AEL emission level is < 0,03 - 0,06 kg/t.
status: valid
status modified: 2026-05-06
accepted date: 2026-05-06
in scheme: BATAEL values as defined into the EC BAT-Tool

Manufacture of Glass - Dust - BAT38-IV
type: Concept
notation: GLS-Dust-BAT38-IV
definition: 3, Mineral industry: 3,3 Manufacture of glass including glass fibre with a melting capacity exceeding 20 tonnes per day; Techniques (i)-(v) and batch formulations with significant amounts of dangerous substances (EC No 1272/2008); Reducing dust emissions to air. The BAT-AEL emission level is < 0,003 - 0,03 kg/t.
status: valid
status modified: 2026-05-06
accepted date: 2026-05-06
in scheme: BATAEL values as defined into the EC BAT-Tool

Manufacture of Glass - Dust - BAT46-I
type: Concept
notation: GLS-Dust-BAT46-I
definition: 3, Mineral industry: 3,3 Manufacture of glass including glass fibre with a melting capacity exceeding 20 tonnes per day; Techniques (i)-(ii) (see table); Reducing dust emissions to air. The BAT-AEL emission level is < 1 - 10 mg/Nm3.
status: valid
status modified: 2026-05-06
accepted date: 2026-05-06
in scheme: BATAEL values as defined into the EC BAT-Tool

Manufacture of Glass - Dust - BAT48-I
type: Concept
notation: GLS-Dust-BAT48-I
definition: 3, Mineral industry: 3,3 Manufacture of glass including glass fibre with a melting capacity exceeding 20 tonnes per day; Techniques (i)-(iii) (see table); Reducing dust emissions to air. The BAT-AEL emission level is < 10 - 20 mg/Nm3.
status: valid
status modified: 2026-05-06
accepted date: 2026-05-06
in scheme: BATAEL values as defined into the EC BAT-Tool

Ferrous metals processing - BAT 22
type: Concept
notation: FMP-NOx-BAT22-VIII
definition: 2, Production and processing of metals: 2.3 Processing of ferrous metals for (a) operation of hot rolling mills with a capacity exceeding 20 tonnes of crude steel per hour; (c) application of protective fused metal coats with an input exceeding 2 tonnes of crude steel per hour; this includes hot dip coating and batch galvanising. 2.6 Surface treatment of ferrous metals using electrolytic or chemical processes where the volume of the treatment vats exceeds 30 m3, when it is carried out in cold rolling, wire drawing or batch galvanising. 6.11 Independently operated treatment of waste water not covered by Directive 91/271/EEC, provided that the main pollutant load originates from the activities covered by these BAT conclusions; Reducing nitrous oxides (Nox) emissions to air. The BAT-AEL emission level is 100�300 mg/Nm3.
status: valid
status modified: 2026-05-06
accepted date: 2026-05-06
in scheme: BATAEL values as defined into the EC BAT-Tool

Ferrous metals processing - BAT 22
type: Concept
notation: FMP-NOx-BAT22-X
definition: 2, Production and processing of metals: 2.3 Processing of ferrous metals for (a) operation of hot rolling mills with a capacity exceeding 20 tonnes of crude steel per hour; (c) application of protective fused metal coats with an input exceeding 2 tonnes of crude steel per hour; this includes hot dip coating and batch galvanising. 2.6 Surface treatment of ferrous metals using electrolytic or chemical processes where the volume of the treatment vats exceeds 30 m3, when it is carried out in cold rolling, wire drawing or batch galvanising. 6.11 Independently operated treatment of waste water not covered by Directive 91/271/EEC, provided that the main pollutant load originates from the activities covered by these BAT conclusions; Reducing nitrous oxides (Nox) emissions to air. The BAT-AEL emission level is 100�550 mg/Nm3.
status: valid
status modified: 2026-05-06
accepted date: 2026-05-06
in scheme: BATAEL values as defined into the EC BAT-Tool

Ferrous metals processing - BAT 22
type: Concept
notation: FMP-NOx-BAT22-XI
definition: 2, Production and processing of metals: 2.3 Processing of ferrous metals for (a) operation of hot rolling mills with a capacity exceeding 20 tonnes of crude steel per hour; (c) application of protective fused metal coats with an input exceeding 2 tonnes of crude steel per hour; this includes hot dip coating and batch galvanising. 2.6 Surface treatment of ferrous metals using electrolytic or chemical processes where the volume of the treatment vats exceeds 30 m3, when it is carried out in cold rolling, wire drawing or batch galvanising. 6.11 Independently operated treatment of waste water not covered by Directive 91/271/EEC, provided that the main pollutant load originates from the activities covered by these BAT conclusions; Reducing nitrous oxides (Nox) emissions to air. The BAT-AEL emission level is 100�250 mg/Nm3.
status: valid
status modified: 2026-05-06
accepted date: 2026-05-06
in scheme: BATAEL values as defined into the EC BAT-Tool

Ferrous metals processing - BAT 22
type: Concept
notation: FMP-NOx-BAT22-XII
definition: 2, Production and processing of metals: 2.3 Processing of ferrous metals for (a) operation of hot rolling mills with a capacity exceeding 20 tonnes of crude steel per hour; (c) application of protective fused metal coats with an input exceeding 2 tonnes of crude steel per hour; this includes hot dip coating and batch galvanising. 2.6 Surface treatment of ferrous metals using electrolytic or chemical processes where the volume of the treatment vats exceeds 30 m3, when it is carried out in cold rolling, wire drawing or batch galvanising. 6.11 Independently operated treatment of waste water not covered by Directive 91/271/EEC, provided that the main pollutant load originates from the activities covered by these BAT conclusions; Reducing nitrous oxides (Nox) emissions to air. The BAT-AEL emission level is 100�300 mg/Nm3.
status: valid
status modified: 2026-05-06
accepted date: 2026-05-06
in scheme: BATAEL values as defined into the EC BAT-Tool

Ferrous metals processing - BAT 22
type: Concept
notation: FMP-NOx-BAT22-XIII
definition: 2, Production and processing of metals: 2.3 Processing of ferrous metals for (a) operation of hot rolling mills with a capacity exceeding 20 tonnes of crude steel per hour; (c) application of protective fused metal coats with an input exceeding 2 tonnes of crude steel per hour; this includes hot dip coating and batch galvanising. 2.6 Surface treatment of ferrous metals using electrolytic or chemical processes where the volume of the treatment vats exceeds 30 m3, when it is carried out in cold rolling, wire drawing or batch galvanising. 6.11 Independently operated treatment of waste water not covered by Directive 91/271/EEC, provided that the main pollutant load originates from the activities covered by these BAT conclusions; Reducing nitrous oxides (Nox) emissions to air. The BAT-AEL emission level is 100�550 mg/Nm3.
status: valid
status modified: 2026-05-06
accepted date: 2026-05-06
in scheme: BATAEL values as defined into the EC BAT-Tool

Ferrous metals processing - BAT 22
type: Concept
notation: FMP-NOx-BAT22-XIV
definition: 2, Production and processing of metals: 2.3 Processing of ferrous metals for (a) operation of hot rolling mills with a capacity exceeding 20 tonnes of crude steel per hour; (c) application of protective fused metal coats with an input exceeding 2 tonnes of crude steel per hour; this includes hot dip coating and batch galvanising. 2.6 Surface treatment of ferrous metals using electrolytic or chemical processes where the volume of the treatment vats exceeds 30 m3, when it is carried out in cold rolling, wire drawing or batch galvanising. 6.11 Independently operated treatment of waste water not covered by Directive 91/271/EEC, provided that the main pollutant load originates from the activities covered by these BAT conclusions; Reducing nitrous oxides (Nox) emissions to air. The BAT-AEL emission level is 70�300 mg/Nm3.
status: valid
status modified: 2026-05-06
accepted date: 2026-05-06
in scheme: BATAEL values as defined into the EC BAT-Tool

Manufacture of Glass - Dust - BAT48-II
type: Concept
notation: GLS-Dust-BAT48-II
definition: 3, Mineral industry: 3,3 Manufacture of glass including glass fibre with a melting capacity exceeding 20 tonnes per day; Techniques (i)-(iii) (see table) and batch formulations with significant amounts of dangerous substances (EC No 1272/2008); Reducing dust emissions to air. The BAT-AEL emission level is < 1 - 10 mg/Nm3.
status: valid
status modified: 2026-05-06
accepted date: 2026-05-06
in scheme: BATAEL values as defined into the EC BAT-Tool

Manufacture of Glass - Dust - BAT48-III
type: Concept
notation: GLS-Dust-BAT48-III
definition: 3, Mineral industry: 3,3 Manufacture of glass including glass fibre with a melting capacity exceeding 20 tonnes per day; Techniques (i)-(iii) (see table); Reducing dust emissions to air. The BAT-AEL emission level is < 0,03 - 0,13 kg/t.
status: valid
status modified: 2026-05-06
accepted date: 2026-05-06
in scheme: BATAEL values as defined into the EC BAT-Tool

Manufacture of Glass - Dust - BAT48-IV
type: Concept
notation: GLS-Dust-BAT48-IV
definition: 3, Mineral industry: 3,3 Manufacture of glass including glass fibre with a melting capacity exceeding 20 tonnes per day; Techniques (i)-(iii) (see table) and batch formulations with significant amounts of dangerous substances (EC No 1272/2008); Reducing dust emissions to air. The BAT-AEL emission level is < 0,003 - 0,065 kg/t.
status: valid
status modified: 2026-05-06
accepted date: 2026-05-06
in scheme: BATAEL values as defined into the EC BAT-Tool

Manufacture of Glass - Dust - BAT54-I
type: Concept
notation: GLS-Dust-BAT54-I
definition: 3, Mineral industry: 3,3 Manufacture of glass including glass fibre with a melting capacity exceeding 20 tonnes per day; Techniques (i)-(ii) (see table); Reducing dust emissions to air. The BAT-AEL emission level is 1 - 10 mg/Nm3.
status: valid
status modified: 2026-05-06
accepted date: 2026-05-06
in scheme: BATAEL values as defined into the EC BAT-Tool

Manufacture of Glass - Dust - BAT56-I
type: Concept
notation: GLS-Dust-BAT56-I
definition: 3, Mineral industry: 3,4 Melting mineral substances including the production of mineral fibres with a melting capacity exceeding 20�tonnes per day; Electrostatic precipitator or bag filter system; Reducing dust emissions to air. The BAT-AEL emission level is < 10 - 20 mg/Nm3.
status: valid
status modified: 2026-05-06
accepted date: 2026-05-06
in scheme: BATAEL values as defined into the EC BAT-Tool

Ferrous metals processing - BAT 24
type: Concept
notation: FMP-NOx-BAT25
definition: 2, Production and processing of metals: 2.3 Processing of ferrous metals for (a) operation of hot rolling mills with a capacity exceeding 20 tonnes of crude steel per hour; (c) application of protective fused metal coats with an input exceeding 2 tonnes of crude steel per hour; this includes hot dip coating and batch galvanising. 2.6 Surface treatment of ferrous metals using electrolytic or chemical processes where the volume of the treatment vats exceeds 30 m3, when it is carried out in cold rolling, wire drawing or batch galvanising. 6.11 Independently operated treatment of waste water not covered by Directive 91/271/EEC, provided that the main pollutant load originates from the activities covered by these BAT conclusions; Reducing nitrous oxides (Nox) emissions to air. The BAT-AEL emission level is 10�200 mg/Nm3.
status: valid
status modified: 2026-05-06
accepted date: 2026-05-06
in scheme: BATAEL values as defined into the EC BAT-Tool

Ferrous metals processing - BAT 29
type: Concept
notation: FMP-NOx-BAT29-IV
definition: 2, Production and processing of metals: 2.3 Processing of ferrous metals for (a) operation of hot rolling mills with a capacity exceeding 20 tonnes of crude steel per hour; (c) application of protective fused metal coats with an input exceeding 2 tonnes of crude steel per hour; this includes hot dip coating and batch galvanising. 2.6 Surface treatment of ferrous metals using electrolytic or chemical processes where the volume of the treatment vats exceeds 30 m3, when it is carried out in cold rolling, wire drawing or batch galvanising. 6.11 Independently operated treatment of waste water not covered by Directive 91/271/EEC, provided that the main pollutant load originates from the activities covered by these BAT conclusions; Reducing nitrous oxides (Nox) emissions to air. The BAT-AEL emission level is 50�180 mg/Nm3.
status: valid
status modified: 2026-05-06
accepted date: 2026-05-06
in scheme: BATAEL values as defined into the EC BAT-Tool

Ferrous metals processing - BAT 29
type: Concept
notation: FMP-NOx-BAT29-VI
definition: 2, Production and processing of metals: 2.3 Processing of ferrous metals for (a) operation of hot rolling mills with a capacity exceeding 20 tonnes of crude steel per hour; (c) application of protective fused metal coats with an input exceeding 2 tonnes of crude steel per hour; this includes hot dip coating and batch galvanising. 2.6 Surface treatment of ferrous metals using electrolytic or chemical processes where the volume of the treatment vats exceeds 30 m3, when it is carried out in cold rolling, wire drawing or batch galvanising. 6.11 Independently operated treatment of waste water not covered by Directive 91/271/EEC, provided that the main pollutant load originates from the activities covered by these BAT conclusions; Reducing nitrous oxides (Nox) emissions to air. The BAT-AEL emission level is 50�100 mg/Nm3.
status: valid
status modified: 2026-05-06
accepted date: 2026-05-06
in scheme: BATAEL values as defined into the EC BAT-Tool

Ferrous metals processing - BAT 29
type: Concept
notation: FMP-NOx-BAT29-VII
definition: 2, Production and processing of metals: 2.3 Processing of ferrous metals for (a) operation of hot rolling mills with a capacity exceeding 20 tonnes of crude steel per hour; (c) application of protective fused metal coats with an input exceeding 2 tonnes of crude steel per hour; this includes hot dip coating and batch galvanising. 2.6 Surface treatment of ferrous metals using electrolytic or chemical processes where the volume of the treatment vats exceeds 30 m3, when it is carried out in cold rolling, wire drawing or batch galvanising. 6.11 Independently operated treatment of waste water not covered by Directive 91/271/EEC, provided that the main pollutant load originates from the activities covered by these BAT conclusions; Reducing nitrous oxides (Nox) emissions to air. The BAT-AEL emission level is 50�200 mg/Nm3.
status: valid
status modified: 2026-05-06
accepted date: 2026-05-06
in scheme: BATAEL values as defined into the EC BAT-Tool

Ferrous metals processing - BAT 31
type: Concept
notation: FMP-Ni-BAT31-XI
definition: 2, Production and processing of metals: 2.3 Processing of ferrous metals for (a) operation of hot rolling mills with a capacity exceeding 20 tonnes of crude steel per hour; (c) application of protective fused metal coats with an input exceeding 2 tonnes of crude steel per hour; this includes hot dip coating and batch galvanising. 2.6 Surface treatment of ferrous metals using electrolytic or chemical processes where the volume of the treatment vats exceeds 30 m3, when it is carried out in cold rolling, wire drawing or batch galvanising. 6.11 Independently operated treatment of waste water not covered by Directive 91/271/EEC, provided that the main pollutant load originates from the activities covered by these BAT conclusions Reducing nickel to water. The BAT-AEL emission level is 0.01�0. 2 mg/l.
status: valid
status modified: 2026-05-06
accepted date: 2026-05-06
in scheme: BATAEL values as defined into the EC BAT-Tool

Ferrous metals processing - BAT 31
type: Concept
notation: FMP-Ni-BAT31-XII
definition: 2, Production and processing of metals: 2.3 Processing of ferrous metals for (a) operation of hot rolling mills with a capacity exceeding 20 tonnes of crude steel per hour; (c) application of protective fused metal coats with an input exceeding 2 tonnes of crude steel per hour; this includes hot dip coating and batch galvanising. 2.6 Surface treatment of ferrous metals using electrolytic or chemical processes where the volume of the treatment vats exceeds 30 m3, when it is carried out in cold rolling, wire drawing or batch galvanising. 6.11 Independently operated treatment of waste water not covered by Directive 91/271/EEC, provided that the main pollutant load originates from the activities covered by these BAT conclusions Reducing nickel to water. The BAT-AEL emission level is 0.01�0.4 mg/l.
status: valid
status modified: 2026-05-06
accepted date: 2026-05-06
in scheme: BATAEL values as defined into the EC BAT-Tool

Manufacture of Glass - Dust - BAT56-II
type: Concept
notation: GLS-Dust-BAT56-II
definition: 3, Mineral industry: 3,4 Melting mineral substances including the production of mineral fibres with a melting capacity exceeding 20�tonnes per day; Electrostatic precipitator or bag filter system; Reducing dust emissions to air. The BAT-AEL emission level is < 0,02 - 0,05 kg/t.
status: valid
status modified: 2026-05-06
accepted date: 2026-05-06
in scheme: BATAEL values as defined into the EC BAT-Tool

Manufacture of Glass - Dust - BAT64
type: Concept
notation: GLS-Dust-BAT64
definition: 3, Mineral industry: 3,4 Melting mineral substances including the production of mineral fibres with a melting capacity exceeding 20�tonnes per day; Flue-gas cleaning by bag filter system; Reducing dust emissions to air. The BAT-AEL emission level is < 5 - 20 mg/Nm3.
status: valid
status modified: 2026-05-06
accepted date: 2026-05-06
in scheme: BATAEL values as defined into the EC BAT-Tool

Manufacture of Glass - Dust - BAT65
type: Concept
notation: GLS-Dust-BAT65
definition: 3, Mineral industry: 3,4 Melting mineral substances including the production of mineral fibres with a melting capacity exceeding 20�tonnes per day; Techniques (i)-(iii) (see table); Reducing dust emissions to air. The BAT-AEL emission level is 1 - 5 mg/Nm3.
status: valid
status modified: 2026-05-06
accepted date: 2026-05-06
in scheme: BATAEL values as defined into the EC BAT-Tool

Manufacture of Glass - Dust - BAT71-I
type: Concept
notation: GLS-Dust-BAT71-I
definition: 3, Mineral industry: 3,4 Melting mineral substances including the production of mineral fibres with a melting capacity exceeding 20�tonnes per day; Electrostatic precipitator or bag filter system; Reducing dust emissions to air. The BAT-AEL emission level is < 10 - 20 mg/Nm3.
status: valid
status modified: 2026-05-06
accepted date: 2026-05-06
in scheme: BATAEL values as defined into the EC BAT-Tool

Manufacture of Glass - Dust - BAT71-II
type: Concept
notation: GLS-Dust-BAT71-II
definition: 3, Mineral industry: 3,4 Melting mineral substances including the production of mineral fibres with a melting capacity exceeding 20�tonnes per day; Electrostatic precipitator or bag filter system; Reducing dust emissions to air. The BAT-AEL emission level is < 0,05 - 0,15 kg/t.
status: valid
status modified: 2026-05-06
accepted date: 2026-05-06
in scheme: BATAEL values as defined into the EC BAT-Tool

Ferrous metals processing - BAT 31
type: Concept
notation: FMP-Ni-BAT31-XXVII
definition: 2, Production and processing of metals: 2.3 Processing of ferrous metals for (a) operation of hot rolling mills with a capacity exceeding 20 tonnes of crude steel per hour; (c) application of protective fused metal coats with an input exceeding 2 tonnes of crude steel per hour; this includes hot dip coating and batch galvanising. 2.6 Surface treatment of ferrous metals using electrolytic or chemical processes where the volume of the treatment vats exceeds 30 m3, when it is carried out in cold rolling, wire drawing or batch galvanising. 6.11 Independently operated treatment of waste water not covered by Directive 91/271/EEC, provided that the main pollutant load originates from the activities covered by these BAT conclusions Reducing nickel to water. The BAT-AEL emission level is 0.01�0. 2 mg/l.
status: valid
status modified: 2026-05-06
accepted date: 2026-05-06
in scheme: BATAEL values as defined into the EC BAT-Tool

Ferrous metals processing - BAT 31
type: Concept
notation: FMP-Ni-BAT31-XXVIII
definition: 2, Production and processing of metals: 2.3 Processing of ferrous metals for (a) operation of hot rolling mills with a capacity exceeding 20 tonnes of crude steel per hour; (c) application of protective fused metal coats with an input exceeding 2 tonnes of crude steel per hour; this includes hot dip coating and batch galvanising. 2.6 Surface treatment of ferrous metals using electrolytic or chemical processes where the volume of the treatment vats exceeds 30 m3, when it is carried out in cold rolling, wire drawing or batch galvanising. 6.11 Independently operated treatment of waste water not covered by Directive 91/271/EEC, provided that the main pollutant load originates from the activities covered by these BAT conclusions Reducing nickel to water. The BAT-AEL emission level is 0.01�0.4 mg/l.
status: valid
status modified: 2026-05-06
accepted date: 2026-05-06
in scheme: BATAEL values as defined into the EC BAT-Tool

Ferrous metals processing - BAT 42
type: Concept
notation: FMP-Ni-BAT42-III
definition: 2, Production and processing of metals: 2.3 Processing of ferrous metals for (a) operation of hot rolling mills with a capacity exceeding 20 tonnes of crude steel per hour; (c) application of protective fused metal coats with an input exceeding 2 tonnes of crude steel per hour; this includes hot dip coating and batch galvanising. 2.6 Surface treatment of ferrous metals using electrolytic or chemical processes where the volume of the treatment vats exceeds 30 m3, when it is carried out in cold rolling, wire drawing or batch galvanising. 6.11 Independently operated treatment of waste water not covered by Directive 91/271/EEC, provided that the main pollutant load originates from the activities covered by these BAT conclusions; Reducing nickel emissions to air. The BAT-AEL emission level is 0.01�0.1 mg/Nm3.
status: valid
status modified: 2026-05-06
accepted date: 2026-05-06
in scheme: BATAEL values as defined into the EC BAT-Tool

Ferrous metals processing - BAT 46
type: Concept
notation: FMP-Ni-BAT46-II
definition: 2, Production and processing of metals: 2.3 Processing of ferrous metals for (a) operation of hot rolling mills with a capacity exceeding 20 tonnes of crude steel per hour; (c) application of protective fused metal coats with an input exceeding 2 tonnes of crude steel per hour; this includes hot dip coating and batch galvanising. 2.6 Surface treatment of ferrous metals using electrolytic or chemical processes where the volume of the treatment vats exceeds 30 m3, when it is carried out in cold rolling, wire drawing or batch galvanising. 6.11 Independently operated treatment of waste water not covered by Directive 91/271/EEC, provided that the main pollutant load originates from the activities covered by these BAT conclusions; Reducing nickel emissions to air. The BAT-AEL emission level is 0.01�0.1 mg/Nm3.
status: valid
status modified: 2026-05-06
accepted date: 2026-05-06
in scheme: BATAEL values as defined into the EC BAT-Tool

Ferrous metals processing - BAT 31
type: Concept
notation: FMP-Pb-BAT31-XIII
definition: 2, Production and processing of metals: 2.3 Processing of ferrous metals for (a) operation of hot rolling mills with a capacity exceeding 20 tonnes of crude steel per hour; (c) application of protective fused metal coats with an input exceeding 2 tonnes of crude steel per hour; this includes hot dip coating and batch galvanising. 2.6 Surface treatment of ferrous metals using electrolytic or chemical processes where the volume of the treatment vats exceeds 30 m3, when it is carried out in cold rolling, wire drawing or batch galvanising. 6.11 Independently operated treatment of waste water not covered by Directive 91/271/EEC, provided that the main pollutant load originates from the activities covered by these BAT conclusions Reducing lead to water. The BAT-AEL emission level is 5�20 ?g/l.
status: valid
status modified: 2026-05-06
accepted date: 2026-05-06
in scheme: BATAEL values as defined into the EC BAT-Tool

Ferrous metals processing - BAT 31
type: Concept
notation: FMP-Pb-BAT31-XIV
definition: 2, Production and processing of metals: 2.3 Processing of ferrous metals for (a) operation of hot rolling mills with a capacity exceeding 20 tonnes of crude steel per hour; (c) application of protective fused metal coats with an input exceeding 2 tonnes of crude steel per hour; this includes hot dip coating and batch galvanising. 2.6 Surface treatment of ferrous metals using electrolytic or chemical processes where the volume of the treatment vats exceeds 30 m3, when it is carried out in cold rolling, wire drawing or batch galvanising. 6.11 Independently operated treatment of waste water not covered by Directive 91/271/EEC, provided that the main pollutant load originates from the activities covered by these BAT conclusions Reducing lead to water. The BAT-AEL emission level is 5�35 ?g/l.
status: valid
status modified: 2026-05-06
accepted date: 2026-05-06
in scheme: BATAEL values as defined into the EC BAT-Tool

Manufacture of Glass - Dust - BAT76-I
type: Concept
notation: GLS-Dust-BAT76-I
definition: 3, Mineral industry: 3,4 Melting mineral substances including the production of mineral fibres with a melting capacity exceeding 20�tonnes per day; Techniques (i)-(iii) (see table); Reducing dust emissions to air. The BAT-AEL emission level is 5 - 10 mg/Nm3.
status: valid
status modified: 2026-05-06
accepted date: 2026-05-06
in scheme: BATAEL values as defined into the EC BAT-Tool

Manufacture of Glass - F - BAT13-V
type: Concept
notation: GLS-F-BAT13-V
definition: 3, Mineral industry: 3,3 Manufacture of glass including glass fibre with a melting capacity exceeding 20 tonnes per day Reducing fluorides to water. The BAT-AEL emission level is < 6 mg/l.
status: valid
status modified: 2026-05-06
accepted date: 2026-05-06
in scheme: BATAEL values as defined into the EC BAT-Tool

Manufacture of Glass - H2S - BAT61-I
type: Concept
notation: GLS-H2S-BAT61-I
definition: 3, Mineral industry: 3,4 Melting mineral substances including the production of mineral fibres with a melting capacity exceeding 20�tonnes per day; Waste gas incineration system to oxidise hydrogen sulphide to SO2; Reducing hydrogen sulphide emissions to air. The BAT-AEL emission level is < 2 mg/Nm3.
status: valid
status modified: 2026-05-06
accepted date: 2026-05-06
in scheme: BATAEL values as defined into the EC BAT-Tool

Manufacture of Glass - H2S - BAT61-II
type: Concept
notation: GLS-H2S-BAT61-II
definition: 3, Mineral industry: 3,4 Melting mineral substances including the production of mineral fibres with a melting capacity exceeding 20�tonnes per day; Waste gas incineration system to oxidise hydrogen sulphide to SO2; Reducing hydrogen sulphide emissions to air. The BAT-AEL emission level is < 0,005 kg/t.
status: valid
status modified: 2026-05-06
accepted date: 2026-05-06
in scheme: BATAEL values as defined into the EC BAT-Tool

Manufacture of Glass - HCl - BAT20-I
type: Concept
notation: GLS-HCl-BAT20-I
definition: 3, Mineral industry: 3,3 Manufacture of glass including glass fibre with a melting capacity exceeding 20 tonnes per day; Techniques (i)-(ii) (see table); Reducing hydrogen chloride emissions to air. The BAT-AEL emission level is < 10 - 20 mg/Nm3.
status: valid
status modified: 2026-05-06
accepted date: 2026-05-06
in scheme: BATAEL values as defined into the EC BAT-Tool

Manufacture of Glass - HCl - BAT20-III
type: Concept
notation: GLS-HCl-BAT20-III
definition: 3, Mineral industry: 3,3 Manufacture of glass including glass fibre with a melting capacity exceeding 20 tonnes per day; Techniques (i)-(ii) (see table); Reducing hydrogen chloride emissions to air. The BAT-AEL emission level is < 0,02 - 0,03 kg/t.
status: valid
status modified: 2026-05-06
accepted date: 2026-05-06
in scheme: BATAEL values as defined into the EC BAT-Tool

Ferrous metals processing - BAT 31
type: Concept
notation: FMP-Pb-BAT31-XV
definition: 2, Production and processing of metals: 2.3 Processing of ferrous metals for (a) operation of hot rolling mills with a capacity exceeding 20 tonnes of crude steel per hour; (c) application of protective fused metal coats with an input exceeding 2 tonnes of crude steel per hour; this includes hot dip coating and batch galvanising. 2.6 Surface treatment of ferrous metals using electrolytic or chemical processes where the volume of the treatment vats exceeds 30 m3, when it is carried out in cold rolling, wire drawing or batch galvanising. 6.11 Independently operated treatment of waste water not covered by Directive 91/271/EEC, provided that the main pollutant load originates from the activities covered by these BAT conclusions Reducing lead to water. The BAT-AEL emission level is 5�50 ?g/l.
status: valid
status modified: 2026-05-06
accepted date: 2026-05-06
in scheme: BATAEL values as defined into the EC BAT-Tool

Ferrous metals processing - BAT 31
type: Concept
notation: FMP-Pb-BAT31-XXIX
definition: 2, Production and processing of metals: 2.3 Processing of ferrous metals for (a) operation of hot rolling mills with a capacity exceeding 20 tonnes of crude steel per hour; (c) application of protective fused metal coats with an input exceeding 2 tonnes of crude steel per hour; this includes hot dip coating and batch galvanising. 2.6 Surface treatment of ferrous metals using electrolytic or chemical processes where the volume of the treatment vats exceeds 30 m3, when it is carried out in cold rolling, wire drawing or batch galvanising. 6.11 Independently operated treatment of waste water not covered by Directive 91/271/EEC, provided that the main pollutant load originates from the activities covered by these BAT conclusions Reducing lead to water. The BAT-AEL emission level is 5�20 ?g/l.
status: valid
status modified: 2026-05-06
accepted date: 2026-05-06
in scheme: BATAEL values as defined into the EC BAT-Tool

Ferrous metals processing - BAT 31
type: Concept
notation: FMP-Pb-BAT31-XXX
definition: 2, Production and processing of metals: 2.3 Processing of ferrous metals for (a) operation of hot rolling mills with a capacity exceeding 20 tonnes of crude steel per hour; (c) application of protective fused metal coats with an input exceeding 2 tonnes of crude steel per hour; this includes hot dip coating and batch galvanising. 2.6 Surface treatment of ferrous metals using electrolytic or chemical processes where the volume of the treatment vats exceeds 30 m3, when it is carried out in cold rolling, wire drawing or batch galvanising. 6.11 Independently operated treatment of waste water not covered by Directive 91/271/EEC, provided that the main pollutant load originates from the activities covered by these BAT conclusions Reducing lead to water. The BAT-AEL emission level is 5�35 ?g/l.
status: valid
status modified: 2026-05-06
accepted date: 2026-05-06
in scheme: BATAEL values as defined into the EC BAT-Tool

Ferrous metals processing - BAT 31
type: Concept
notation: FMP-Pb-BAT31-XXXI
definition: 2, Production and processing of metals: 2.3 Processing of ferrous metals for (a) operation of hot rolling mills with a capacity exceeding 20 tonnes of crude steel per hour; (c) application of protective fused metal coats with an input exceeding 2 tonnes of crude steel per hour; this includes hot dip coating and batch galvanising. 2.6 Surface treatment of ferrous metals using electrolytic or chemical processes where the volume of the treatment vats exceeds 30 m3, when it is carried out in cold rolling, wire drawing or batch galvanising. 6.11 Independently operated treatment of waste water not covered by Directive 91/271/EEC, provided that the main pollutant load originates from the activities covered by these BAT conclusions Reducing lead to water. The BAT-AEL emission level is 5�50 ?g/l.
status: valid
status modified: 2026-05-06
accepted date: 2026-05-06
in scheme: BATAEL values as defined into the EC BAT-Tool

Ferrous metals processing - BAT 42
type: Concept
notation: FMP-Pb-BAT42-IV
definition: 2, Production and processing of metals: 2.3 Processing of ferrous metals for (a) operation of hot rolling mills with a capacity exceeding 20 tonnes of crude steel per hour; (c) application of protective fused metal coats with an input exceeding 2 tonnes of crude steel per hour; this includes hot dip coating and batch galvanising. 2.6 Surface treatment of ferrous metals using electrolytic or chemical processes where the volume of the treatment vats exceeds 30 m3, when it is carried out in cold rolling, wire drawing or batch galvanising. 6.11 Independently operated treatment of waste water not covered by Directive 91/271/EEC, provided that the main pollutant load originates from the activities covered by these BAT conclusions; Reducing lead emissions to air. The BAT-AEL emission level is 0.01�0.035 mg/Nm3.
status: valid
status modified: 2026-05-06
accepted date: 2026-05-06
in scheme: BATAEL values as defined into the EC BAT-Tool

Ferrous metals processing - BAT 46
type: Concept
notation: FMP-Pb-BAT46-III
definition: 2, Production and processing of metals: 2.3 Processing of ferrous metals for (a) operation of hot rolling mills with a capacity exceeding 20 tonnes of crude steel per hour; (c) application of protective fused metal coats with an input exceeding 2 tonnes of crude steel per hour; this includes hot dip coating and batch galvanising. 2.6 Surface treatment of ferrous metals using electrolytic or chemical processes where the volume of the treatment vats exceeds 30 m3, when it is carried out in cold rolling, wire drawing or batch galvanising. 6.11 Independently operated treatment of waste water not covered by Directive 91/271/EEC, provided that the main pollutant load originates from the activities covered by these BAT conclusions; Reducing lead emissions to air. The BAT-AEL emission level is ? 0.003 mg/Nm3.
status: valid
status modified: 2026-05-06
accepted date: 2026-05-06
in scheme: BATAEL values as defined into the EC BAT-Tool

Manufacture of Glass - HCl - BAT22-IV
type: Concept
notation: GLS-HCl-BAT22-IV
definition: 3, Mineral industry: 3,3 Manufacture of glass including glass fibre with a melting capacity exceeding 20 tonnes per day; Techniques (i)-(iii) (see table); Reducing hydrogen chloride emissions to air. The BAT-AEL emission level is < 30 mg/Nm3.
status: valid
status modified: 2026-05-06
accepted date: 2026-05-06
in scheme: BATAEL values as defined into the EC BAT-Tool

Manufacture of Glass - HCl - BAT28-I
type: Concept
notation: GLS-HCl-BAT28-I
definition: 3, Mineral industry: 3,3 Manufacture of glass including glass fibre with a melting capacity exceeding 20 tonnes per day; Techniques (i)-(ii) (see table); Reducing hydrogen chloride emissions to air. The BAT-AEL emission level is < 10 - 25 mg/Nm3.
status: valid
status modified: 2026-05-06
accepted date: 2026-05-06
in scheme: BATAEL values as defined into the EC BAT-Tool

Manufacture of Glass - HCl - BAT28-III
type: Concept
notation: GLS-HCl-BAT28-III
definition: 3, Mineral industry: 3,3 Manufacture of glass including glass fibre with a melting capacity exceeding 20 tonnes per day; Techniques (i)-(ii) (see table); Reducing hydrogen chloride emissions to air. The BAT-AEL emission level is < 0,025 - 0,0625 kg/t.
status: valid
status modified: 2026-05-06
accepted date: 2026-05-06
in scheme: BATAEL values as defined into the EC BAT-Tool

Manufacture of Glass - HCl - BAT31-II
type: Concept
notation: GLS-HCl-BAT31-II
definition: 3, Mineral industry: 3,3 Manufacture of glass including glass fibre with a melting capacity exceeding 20 tonnes per day; Techniques (i)-(iv) (see table); Reducing hydrogen chloride emissions to air. The BAT-AEL emission level is < 10 mg/Nm3.
status: valid
status modified: 2026-05-06
accepted date: 2026-05-06
in scheme: BATAEL values as defined into the EC BAT-Tool

Manufacture of Glass - HCl - BAT35-I
type: Concept
notation: GLS-HCl-BAT35-I
definition: 3, Mineral industry: 3,3 Manufacture of glass including glass fibre with a melting capacity exceeding 20 tonnes per day; Techniques (i)-(iv) (see table); Reducing hydrogen chloride emissions to air. The BAT-AEL emission level is < 10 mg/Nm3.
status: valid
status modified: 2026-05-06
accepted date: 2026-05-06
in scheme: BATAEL values as defined into the EC BAT-Tool

Manufacture of Glass - HCl - BAT35-III
type: Concept
notation: GLS-HCl-BAT35-III
definition: 3, Mineral industry: 3,3 Manufacture of glass including glass fibre with a melting capacity exceeding 20 tonnes per day; Techniques (i)-(iv) (see table); Reducing hydrogen chloride emissions to air. The BAT-AEL emission level is < 0,05 kg/t.
status: valid
status modified: 2026-05-06
accepted date: 2026-05-06
in scheme: BATAEL values as defined into the EC BAT-Tool

Ferrous metals processing - BAT 51
type: Concept
notation: FMP-Pb-BAT51-II
definition: 2, Production and processing of metals: 2.3 Processing of ferrous metals for (a) operation of hot rolling mills with a capacity exceeding 20 tonnes of crude steel per hour; (c) application of protective fused metal coats with an input exceeding 2 tonnes of crude steel per hour; this includes hot dip coating and batch galvanising. 2.6 Surface treatment of ferrous metals using electrolytic or chemical processes where the volume of the treatment vats exceeds 30 m3, when it is carried out in cold rolling, wire drawing or batch galvanising. 6.11 Independently operated treatment of waste water not covered by Directive 91/271/EEC, provided that the main pollutant load originates from the activities covered by these BAT conclusions; Reducing lead emissions to air. The BAT-AEL emission level is ? 0.5 mg/Nm3.
status: valid
status modified: 2026-05-06
accepted date: 2026-05-06
in scheme: BATAEL values as defined into the EC BAT-Tool

Ferrous metals processing - BAT 21
type: Concept
notation: FMP-SO2-BAT21-I
definition: 2, Production and processing of metals: 2.3 Processing of ferrous metals for (a) operation of hot rolling mills with a capacity exceeding 20 tonnes of crude steel per hour; (c) application of protective fused metal coats with an input exceeding 2 tonnes of crude steel per hour; this includes hot dip coating and batch galvanising. 2.6 Surface treatment of ferrous metals using electrolytic or chemical processes where the volume of the treatment vats exceeds 30 m3, when it is carried out in cold rolling, wire drawing or batch galvanising. 6.11 Independently operated treatment of waste water not covered by Directive 91/271/EEC, provided that the main pollutant load originates from the activities covered by these BAT conclusions; Reducing sulphur oxides emissions to air. The BAT-AEL emission level is 50�200 mg/Nm3.
status: valid
status modified: 2026-05-06
accepted date: 2026-05-06
in scheme: BATAEL values as defined into the EC BAT-Tool

Ferrous metals processing - BAT 21
type: Concept
notation: FMP-SO2-BAT21-II
definition: 2, Production and processing of metals: 2.3 Processing of ferrous metals for (a) operation of hot rolling mills with a capacity exceeding 20 tonnes of crude steel per hour; (c) application of protective fused metal coats with an input exceeding 2 tonnes of crude steel per hour; this includes hot dip coating and batch galvanising. 2.6 Surface treatment of ferrous metals using electrolytic or chemical processes where the volume of the treatment vats exceeds 30 m3, when it is carried out in cold rolling, wire drawing or batch galvanising. 6.11 Independently operated treatment of waste water not covered by Directive 91/271/EEC, provided that the main pollutant load originates from the activities covered by these BAT conclusions; Reducing sulphur oxides emissions to air. The BAT-AEL emission level is 20�100 mg/Nm3.
status: valid
status modified: 2026-05-06
accepted date: 2026-05-06
in scheme: BATAEL values as defined into the EC BAT-Tool

Ferrous metals processing - BAT 29
type: Concept
notation: FMP-SO2-BAT29-III
definition: 2, Production and processing of metals: 2.3 Processing of ferrous metals for (a) operation of hot rolling mills with a capacity exceeding 20 tonnes of crude steel per hour; (c) application of protective fused metal coats with an input exceeding 2 tonnes of crude steel per hour; this includes hot dip coating and batch galvanising. 2.6 Surface treatment of ferrous metals using electrolytic or chemical processes where the volume of the treatment vats exceeds 30 m3, when it is carried out in cold rolling, wire drawing or batch galvanising. 6.11 Independently operated treatment of waste water not covered by Directive 91/271/EEC, provided that the main pollutant load originates from the activities covered by these BAT conclusions; Reducing sulphur oxides emissions to air. The BAT-AEL emission level is < 10 mg/Nm3.
status: valid
status modified: 2026-05-06
accepted date: 2026-05-06
in scheme: BATAEL values as defined into the EC BAT-Tool

Ferrous metals processing - BAT 24
type: Concept
notation: FMP-SOx-BAT24-III
definition: 2, Production and processing of metals: 2.3 Processing of ferrous metals for (a) operation of hot rolling mills with a capacity exceeding 20 tonnes of crude steel per hour; (c) application of protective fused metal coats with an input exceeding 2 tonnes of crude steel per hour; this includes hot dip coating and batch galvanising. 2.6 Surface treatment of ferrous metals using electrolytic or chemical processes where the volume of the treatment vats exceeds 30 m3, when it is carried out in cold rolling, wire drawing or batch galvanising. 6.11 Independently operated treatment of waste water not covered by Directive 91/271/EEC, provided that the main pollutant load originates from the activities covered by these BAT conclusions; Reducing sulphur oxides emissions to air. The BAT-AEL emission level is < 1�6 mg/Nm3.
status: valid
status modified: 2026-05-06
accepted date: 2026-05-06
in scheme: BATAEL values as defined into the EC BAT-Tool

Ferrous metals processing - BAT 24
type: Concept
notation: FMP-SOx-BAT24-V
definition: 2, Production and processing of metals: 2.3 Processing of ferrous metals for (a) operation of hot rolling mills with a capacity exceeding 20 tonnes of crude steel per hour; (c) application of protective fused metal coats with an input exceeding 2 tonnes of crude steel per hour; this includes hot dip coating and batch galvanising. 2.6 Surface treatment of ferrous metals using electrolytic or chemical processes where the volume of the treatment vats exceeds 30 m3, when it is carried out in cold rolling, wire drawing or batch galvanising. 6.11 Independently operated treatment of waste water not covered by Directive 91/271/EEC, provided that the main pollutant load originates from the activities covered by these BAT conclusions; Reducing sulphur oxides emissions to air. The BAT-AEL emission level is < 1�6 mg/Nm3.
status: valid
status modified: 2026-05-06
accepted date: 2026-05-06
in scheme: BATAEL values as defined into the EC BAT-Tool

Manufacture of Glass - HCl - BAT42-I
type: Concept
notation: GLS-HCl-BAT42-I
definition: 3, Mineral industry: 3,3 Manufacture of glass including glass fibre with a melting capacity exceeding 20 tonnes per day; Techniques (i)-(iv) (see table); Reducing hydrogen chloride emissions to air. The BAT-AEL emission level is < 10 - 20 mg/Nm3.
status: valid
status modified: 2026-05-06
accepted date: 2026-05-06
in scheme: BATAEL values as defined into the EC BAT-Tool

Manufacture of Glass - HCl - BAT42-III
type: Concept
notation: GLS-HCl-BAT42-III
definition: 3, Mineral industry: 3,3 Manufacture of glass including glass fibre with a melting capacity exceeding 20 tonnes per day; Techniques (i)-(iv) (see table); Reducing hydrogen chloride emissions to air. The BAT-AEL emission level is < 0,03 - 0,06 kg/t.
status: valid
status modified: 2026-05-06
accepted date: 2026-05-06
in scheme: BATAEL values as defined into the EC BAT-Tool

Manufacture of Glass - HCl - BAT52-I
type: Concept
notation: GLS-HCl-BAT52-I
definition: 3, Mineral industry: 3,3 Manufacture of glass including glass fibre with a melting capacity exceeding 20 tonnes per day; Techniques (i)-(iii) (see table); Reducing hydrogen chloride emissions to air. The BAT-AEL emission level is < 10 - 20 mg/Nm3.
status: valid
status modified: 2026-05-06
accepted date: 2026-05-06
in scheme: BATAEL values as defined into the EC BAT-Tool

Manufacture of Glass - HCl - BAT52-III
type: Concept
notation: GLS-HCl-BAT52-III
definition: 3, Mineral industry: 3,3 Manufacture of glass including glass fibre with a melting capacity exceeding 20 tonnes per day; Techniques (i)-(iii) (see table); Reducing hydrogen chloride emissions to air. The BAT-AEL emission level is < 0,03 - 0,05 kg/t.
status: valid
status modified: 2026-05-06
accepted date: 2026-05-06
in scheme: BATAEL values as defined into the EC BAT-Tool

Manufacture of Glass - HCl - BAT60-I
type: Concept
notation: GLS-HCl-BAT60-I
definition: 3, Mineral industry: 3,4 Melting mineral substances including the production of mineral fibres with a melting capacity exceeding 20�tonnes per day; Techniques (i)-(ii) (see table); for glass wool; Reducing hydrogen chloride emissions to air. The BAT-AEL emission level is < 5 - 10 mg/Nm3.
status: valid
status modified: 2026-05-06
accepted date: 2026-05-06
in scheme: BATAEL values as defined into the EC BAT-Tool

Manufacture of Glass - HCl - BAT60-II
type: Concept
notation: GLS-HCl-BAT60-II
definition: 3, Mineral industry: 3,4 Melting mineral substances including the production of mineral fibres with a melting capacity exceeding 20�tonnes per day; Techniques (i)-(ii) (see table); for stone wool; Reducing hydrogen chloride emissions to air. The BAT-AEL emission level is < 10 - 30 mg/Nm3.
status: valid
status modified: 2026-05-06
accepted date: 2026-05-06
in scheme: BATAEL values as defined into the EC BAT-Tool

Ferrous metals processing - BAT 31
type: Concept
notation: FMP-Sn-BAT31-XVI
definition: 2, Production and processing of metals: 2.3 Processing of ferrous metals for (a) operation of hot rolling mills with a capacity exceeding 20 tonnes of crude steel per hour; (c) application of protective fused metal coats with an input exceeding 2 tonnes of crude steel per hour; this includes hot dip coating and batch galvanising. 2.6 Surface treatment of ferrous metals using electrolytic or chemical processes where the volume of the treatment vats exceeds 30 m3, when it is carried out in cold rolling, wire drawing or batch galvanising. 6.11 Independently operated treatment of waste water not covered by Directive 91/271/EEC, provided that the main pollutant load originates from the activities covered by these BAT conclusions Reducing tin to water. The BAT-AEL emission level is 0.01�0. 2 mg/l.
status: valid
status modified: 2026-05-06
accepted date: 2026-05-06
in scheme: BATAEL values as defined into the EC BAT-Tool

Ferrous metals processing - BAT 31
type: Concept
notation: FMP-Sn-BAT31-XXXII
definition: 2, Production and processing of metals: 2.3 Processing of ferrous metals for (a) operation of hot rolling mills with a capacity exceeding 20 tonnes of crude steel per hour; (c) application of protective fused metal coats with an input exceeding 2 tonnes of crude steel per hour; this includes hot dip coating and batch galvanising. 2.6 Surface treatment of ferrous metals using electrolytic or chemical processes where the volume of the treatment vats exceeds 30 m3, when it is carried out in cold rolling, wire drawing or batch galvanising. 6.11 Independently operated treatment of waste water not covered by Directive 91/271/EEC, provided that the main pollutant load originates from the activities covered by these BAT conclusions Reducing tin to water. The BAT-AEL emission level is 0.01�0. 2 mg/l.
status: valid
status modified: 2026-05-06
accepted date: 2026-05-06
in scheme: BATAEL values as defined into the EC BAT-Tool

Ferrous metals processing - BAT 31
type: Concept
notation: FMP-TOC-BAT31-II
definition: 2, Production and processing of metals: 2.3 Processing of ferrous metals for (a) operation of hot rolling mills with a capacity exceeding 20 tonnes of crude steel per hour; (c) application of protective fused metal coats with an input exceeding 2 tonnes of crude steel per hour; this includes hot dip coating and batch galvanising. 2.6 Surface treatment of ferrous metals using electrolytic or chemical processes where the volume of the treatment vats exceeds 30 m3, when it is carried out in cold rolling, wire drawing or batch galvanising. 6.11 Independently operated treatment of waste water not covered by Directive 91/271/EEC, provided that the main pollutant load originates from the activities covered by these BAT conclusions Reducing total organic carbon to water. The BAT-AEL emission level is 10�30 mg/l.
status: valid
status modified: 2026-05-06
accepted date: 2026-05-06
in scheme: BATAEL values as defined into the EC BAT-Tool

Ferrous metals processing - BAT 31
type: Concept
notation: FMP-TP-BAT31-XVIII
definition: 2, Production and processing of metals: 2.3 Processing of ferrous metals for (a) operation of hot rolling mills with a capacity exceeding 20 tonnes of crude steel per hour; (c) application of protective fused metal coats with an input exceeding 2 tonnes of crude steel per hour; this includes hot dip coating and batch galvanising. 2.6 Surface treatment of ferrous metals using electrolytic or chemical processes where the volume of the treatment vats exceeds 30 m3, when it is carried out in cold rolling, wire drawing or batch galvanising. 6.11 Independently operated treatment of waste water not covered by Directive 91/271/EEC, provided that the main pollutant load originates from the activities covered by these BAT conclusions Reducing total phosphorus to water. The BAT-AEL emission level is 0. 2�1 mg/l.
status: valid
status modified: 2026-05-06
accepted date: 2026-05-06
in scheme: BATAEL values as defined into the EC BAT-Tool

Ferrous metals processing - BAT 31
type: Concept
notation: FMP-TSS-BAT31-I
definition: 2, Production and processing of metals: 2.3 Processing of ferrous metals for (a) operation of hot rolling mills with a capacity exceeding 20 tonnes of crude steel per hour; (c) application of protective fused metal coats with an input exceeding 2 tonnes of crude steel per hour; this includes hot dip coating and batch galvanising. 2.6 Surface treatment of ferrous metals using electrolytic or chemical processes where the volume of the treatment vats exceeds 30 m3, when it is carried out in cold rolling, wire drawing or batch galvanising. 6.11 Independently operated treatment of waste water not covered by Directive 91/271/EEC, provided that the main pollutant load originates from the activities covered by these BAT conclusions Reducing total suspended solids to water. The BAT-AEL emission level is 5�30 mg/l.
status: valid
status modified: 2026-05-06
accepted date: 2026-05-06
in scheme: BATAEL values as defined into the EC BAT-Tool

Ferrous metals processing - BAT 48
type: Concept
notation: FMP-TVOC-BAT48
definition: 2, Production and processing of metals: 2.3 Processing of ferrous metals for (a) operation of hot rolling mills with a capacity exceeding 20 tonnes of crude steel per hour; (c) application of protective fused metal coats with an input exceeding 2 tonnes of crude steel per hour; this includes hot dip coating and batch galvanising. 2.6 Surface treatment of ferrous metals using electrolytic or chemical processes where the volume of the treatment vats exceeds 30 m3, when it is carried out in cold rolling, wire drawing or batch galvanising. 6.11 Independently operated treatment of waste water not covered by Directive 91/271/EEC, provided that the main pollutant load originates from the activities covered by these BAT conclusions; Reducing total volatile organic compounds emissions to air. The BAT-AEL emission level is < 3�8 mg/Nm3.
status: valid
status modified: 2026-05-06
accepted date: 2026-05-06
in scheme: BATAEL values as defined into the EC BAT-Tool

Manufacture of Glass - HCl - BAT60-IV
type: Concept
notation: GLS-HCl-BAT60-IV
definition: 3, Mineral industry: 3,4 Melting mineral substances including the production of mineral fibres with a melting capacity exceeding 20�tonnes per day; Techniques (i)-(ii) (see table); for glass wool; Reducing hydrogen chloride emissions to air. The BAT-AEL emission level is < 0,01 - 0,02 kg/t.
status: valid
status modified: 2026-05-06
accepted date: 2026-05-06
in scheme: BATAEL values as defined into the EC BAT-Tool

Manufacture of Glass - HCl - BAT60-V
type: Concept
notation: GLS-HCl-BAT60-V
definition: 3, Mineral industry: 3,4 Melting mineral substances including the production of mineral fibres with a melting capacity exceeding 20�tonnes per day; Techniques (i)-(ii) (see table); for stone wool; Reducing hydrogen chloride emissions to air. The BAT-AEL emission level is < 0,025 - 0,075 kg/t.
status: valid
status modified: 2026-05-06
accepted date: 2026-05-06
in scheme: BATAEL values as defined into the EC BAT-Tool

Manufacture of Glass - HCl - BAT68-I
type: Concept
notation: GLS-HCl-BAT68-I
definition: 3, Mineral industry: 3,4 Melting mineral substances including the production of mineral fibres with a melting capacity exceeding 20�tonnes per day; Raw materials selection for batch formulation with low content of chlorine and fluorine; Reducing hydrogen chloride emissions to air. The BAT-AEL emission level is < 10 mg/Nm3.
status: valid
status modified: 2026-05-06
accepted date: 2026-05-06
in scheme: BATAEL values as defined into the EC BAT-Tool

Manufacture of Glass - HCl - BAT74-I
type: Concept
notation: GLS-HCl-BAT74-I
definition: 3, Mineral industry: 3,4 Melting mineral substances including the production of mineral fibres with a melting capacity exceeding 20�tonnes per day; Techniques (i)-(iii) (see table); Reducing hydrogen chloride emissions to air. The BAT-AEL emission level is < 10 mg/Nm3.
status: valid
status modified: 2026-05-06
accepted date: 2026-05-06
in scheme: BATAEL values as defined into the EC BAT-Tool

Manufacture of Glass - HCl - BAT74-III
type: Concept
notation: GLS-HCl-BAT74-III
definition: 3, Mineral industry: 3,4 Melting mineral substances including the production of mineral fibres with a melting capacity exceeding 20�tonnes per day; Techniques (i)-(iii) (see table); Reducing hydrogen chloride emissions to air. The BAT-AEL emission level is < 0,05 kg/t.
status: valid
status modified: 2026-05-06
accepted date: 2026-05-06
in scheme: BATAEL values as defined into the EC BAT-Tool

Ferrous metals processing - BAT 31
type: Concept
notation: FMP-Zn-BAT31-XVII
definition: 2, Production and processing of metals: 2.3 Processing of ferrous metals for (a) operation of hot rolling mills with a capacity exceeding 20 tonnes of crude steel per hour; (c) application of protective fused metal coats with an input exceeding 2 tonnes of crude steel per hour; this includes hot dip coating and batch galvanising. 2.6 Surface treatment of ferrous metals using electrolytic or chemical processes where the volume of the treatment vats exceeds 30 m3, when it is carried out in cold rolling, wire drawing or batch galvanising. 6.11 Independently operated treatment of waste water not covered by Directive 91/271/EEC, provided that the main pollutant load originates from the activities covered by these BAT conclusions Reducing zinc to water. The BAT-AEL emission level is 0.05�1 mg/l.
status: valid
status modified: 2026-05-06
accepted date: 2026-05-06
in scheme: BATAEL values as defined into the EC BAT-Tool

Ferrous metals processing - BAT 31
type: Concept
notation: FMP-Zn-BAT31-XXXIII
definition: 2, Production and processing of metals: 2.3 Processing of ferrous metals for (a) operation of hot rolling mills with a capacity exceeding 20 tonnes of crude steel per hour; (c) application of protective fused metal coats with an input exceeding 2 tonnes of crude steel per hour; this includes hot dip coating and batch galvanising. 2.6 Surface treatment of ferrous metals using electrolytic or chemical processes where the volume of the treatment vats exceeds 30 m3, when it is carried out in cold rolling, wire drawing or batch galvanising. 6.11 Independently operated treatment of waste water not covered by Directive 91/271/EEC, provided that the main pollutant load originates from the activities covered by these BAT conclusions Reducing zinc to water. The BAT-AEL emission level is 0.05�1 mg/l.
status: valid
status modified: 2026-05-06
accepted date: 2026-05-06
in scheme: BATAEL values as defined into the EC BAT-Tool

Manufacture of Glass - HF - BAT20-II
type: Concept
notation: GLS-HF-BAT20-II
definition: 3, Mineral industry: 3,3 Manufacture of glass including glass fibre with a melting capacity exceeding 20 tonnes per day; Techniques (i)-(ii) (see table); Reducing hydrogen fluoride emissions to air. The BAT-AEL emission level is < 1 - 5 mg/Nm3.
status: valid
status modified: 2026-05-06
accepted date: 2026-05-06
in scheme: BATAEL values as defined into the EC BAT-Tool

Manufacture of Glass - HF - BAT20-IV
type: Concept
notation: GLS-HF-BAT20-IV
definition: 3, Mineral industry: 3,3 Manufacture of glass including glass fibre with a melting capacity exceeding 20 tonnes per day; Techniques (i)-(ii) (see table); Reducing hydrogen fluoride emissions to air. The BAT-AEL emission level is 0,001 - 0,008 kg/t.
status: valid
status modified: 2026-05-06
accepted date: 2026-05-06
in scheme: BATAEL values as defined into the EC BAT-Tool

Manufacture of Glass - HF - BAT28-II
type: Concept
notation: GLS-HF-BAT28-II
definition: 3, Mineral industry: 3,3 Manufacture of glass including glass fibre with a melting capacity exceeding 20 tonnes per day; Techniques (i)-(ii) (see table); Reducing hydrogen fluoride emissions to air. The BAT-AEL emission level is < 1 - 4 mg/Nm3.
status: valid
status modified: 2026-05-06
accepted date: 2026-05-06
in scheme: BATAEL values as defined into the EC BAT-Tool

Manufacture of Glass - HF - BAT28-IV
type: Concept
notation: GLS-HF-BAT28-IV
definition: 3, Mineral industry: 3,3 Manufacture of glass including glass fibre with a melting capacity exceeding 20 tonnes per day; Techniques (i)-(ii) (see table); Reducing hydrogen fluoride emissions to air. The BAT-AEL emission level is < 0,0025 - 0,01 kg/t.
status: valid
status modified: 2026-05-06
accepted date: 2026-05-06
in scheme: BATAEL values as defined into the EC BAT-Tool

Manufacture of Glass - HF - BAT31-III
type: Concept
notation: GLS-HF-BAT31-III
definition: 3, Mineral industry: 3,3 Manufacture of glass including glass fibre with a melting capacity exceeding 20 tonnes per day; Techniques (i)-(iv) (see table); Reducing hydrogen fluoride emissions to air. The BAT-AEL emission level is < 1 - 5 mg/Nm3.
status: valid
status modified: 2026-05-06
accepted date: 2026-05-06
in scheme: BATAEL values as defined into the EC BAT-Tool

Manufacture of Glass - HF - BAT35-II
type: Concept
notation: GLS-HF-BAT35-II
definition: 3, Mineral industry: 3,3 Manufacture of glass including glass fibre with a melting capacity exceeding 20 tonnes per day; Techniques (i)-(iv) (see table); Reducing hydrogen fluoride emissions to air. The BAT-AEL emission level is < 5 - 15 mg/Nm3.
status: valid
status modified: 2026-05-06
accepted date: 2026-05-06
in scheme: BATAEL values as defined into the EC BAT-Tool

Manufacture of Glass - HF - BAT35-IV
type: Concept
notation: GLS-HF-BAT35-IV
definition: 3, Mineral industry: 3,3 Manufacture of glass including glass fibre with a melting capacity exceeding 20 tonnes per day; Techniques (i)-(iv) (see table); Reducing hydrogen fluoride emissions to air. The BAT-AEL emission level is < 0,02 - 0,07 kg/t.
status: valid
status modified: 2026-05-06
accepted date: 2026-05-06
in scheme: BATAEL values as defined into the EC BAT-Tool

Manufacture of Glass - HF - BAT42-II
type: Concept
notation: GLS-HF-BAT42-II
definition: 3, Mineral industry: 3,3 Manufacture of glass including glass fibre with a melting capacity exceeding 20 tonnes per day; Techniques (i)-(iv) (see table); Reducing hydrogen fluoride emissions to air. The BAT-AEL emission level is < 1 - 5 mg/Nm3.
status: valid
status modified: 2026-05-06
accepted date: 2026-05-06
in scheme: BATAEL values as defined into the EC BAT-Tool

Manufacture of Glass - HF - BAT42-IV
type: Concept
notation: GLS-HF-BAT42-IV
definition: 3, Mineral industry: 3,3 Manufacture of glass including glass fibre with a melting capacity exceeding 20 tonnes per day; Techniques (i)-(iv) (see table); Reducing hydrogen fluoride emissions to air. The BAT-AEL emission level is < 0,003 - 0,015 kg/t.
status: valid
status modified: 2026-05-06
accepted date: 2026-05-06
in scheme: BATAEL values as defined into the EC BAT-Tool

Manufacture of Glass - HF - BAT47
type: Concept
notation: GLS-HF-BAT47
definition: 3, Mineral industry: 3,3 Manufacture of glass including glass fibre with a melting capacity exceeding 20 tonnes per day; Techniques (i)-(ii) (see table); Reducing hydrogen fluoride emissions to air. The BAT-AEL emission level is < 5 mg/Nm3.
status: valid
status modified: 2026-05-06
accepted date: 2026-05-06
in scheme: BATAEL values as defined into the EC BAT-Tool

Manufacture of Glass - HF - BAT52-II
type: Concept
notation: GLS-HF-BAT52-II
definition: 3, Mineral industry: 3,3 Manufacture of glass including glass fibre with a melting capacity exceeding 20 tonnes per day; Techniques (i)-(iii) (see table); Reducing hydrogen fluoride emissions to air. The BAT-AEL emission level is < 1 - 5 mg/Nm3.
status: valid
status modified: 2026-05-06
accepted date: 2026-05-06
in scheme: BATAEL values as defined into the EC BAT-Tool

Manufacture of Glass - HF - BAT52-IV
type: Concept
notation: GLS-HF-BAT52-IV
definition: 3, Mineral industry: 3,3 Manufacture of glass including glass fibre with a melting capacity exceeding 20 tonnes per day; Techniques (i)-(iii) (see table); Reducing hydrogen fluoride emissions to air. The BAT-AEL emission level is < 0,003 - 0,04 kg/t.
status: valid
status modified: 2026-05-06
accepted date: 2026-05-06
in scheme: BATAEL values as defined into the EC BAT-Tool

Manufacture of Glass - HF - BAT55
type: Concept
notation: GLS-HF-BAT55
definition: 3, Mineral industry: 3,3 Manufacture of glass including glass fibre with a melting capacity exceeding 20 tonnes per day; Techniques (i)-(ii) (see table); Reducing hydrogen fluoride emissions to air. The BAT-AEL emission level is < 5 mg/Nm3.
status: valid
status modified: 2026-05-06
accepted date: 2026-05-06
in scheme: BATAEL values as defined into the EC BAT-Tool

Manufacture of Glass - HF - BAT60-III
type: Concept
notation: GLS-HF-BAT60-III
definition: 3, Mineral industry: 3,4 Melting mineral substances including the production of mineral fibres with a melting capacity exceeding 20�tonnes per day; Techniques (i)-(ii) (see table); for all products; Reducing hydrogen fluoride emissions to air. The BAT-AEL emission level is < 1 - 5 mg/Nm3.
status: valid
status modified: 2026-05-06
accepted date: 2026-05-06
in scheme: BATAEL values as defined into the EC BAT-Tool

Manufacture of Glass - HF - BAT60-VI
type: Concept
notation: GLS-HF-BAT60-VI
definition: 3, Mineral industry: 3,4 Melting mineral substances including the production of mineral fibres with a melting capacity exceeding 20�tonnes per day; Techniques (i)-(ii) (see table); for all products; Reducing hydrogen fluoride emissions to air. The BAT-AEL emission level is < 0,002 - 0,013 kg/t.
status: valid
status modified: 2026-05-06
accepted date: 2026-05-06
in scheme: BATAEL values as defined into the EC BAT-Tool

Manufacture of Glass - HF - BAT68-II
type: Concept
notation: GLS-HF-BAT68-II
definition: 3, Mineral industry: 3,4 Melting mineral substances including the production of mineral fibres with a melting capacity exceeding 20�tonnes per day; Raw materials selection for batch formulation with low content of chlorine and fluorine; Reducing hydrogen fluoride emissions to air. The BAT-AEL emission level is < 5 mg/Nm3.
status: valid
status modified: 2026-05-06
accepted date: 2026-05-06
in scheme: BATAEL values as defined into the EC BAT-Tool

Manufacture of Glass - HF - BAT74-II
type: Concept
notation: GLS-HF-BAT74-II
definition: 3, Mineral industry: 3,4 Melting mineral substances including the production of mineral fibres with a melting capacity exceeding 20�tonnes per day; Techniques (i)-(iii) (see table); Reducing hydrogen fluoride emissions to air. The BAT-AEL emission level is < 5 mg/Nm3.
status: valid
status modified: 2026-05-06
accepted date: 2026-05-06
in scheme: BATAEL values as defined into the EC BAT-Tool

Manufacture of Glass - HF - BAT74-IV
type: Concept
notation: GLS-HF-BAT74-IV
definition: 3, Mineral industry: 3,4 Melting mineral substances including the production of mineral fibres with a melting capacity exceeding 20�tonnes per day; Techniques (i)-(iii) (see table); Reducing hydrogen fluoride emissions to air. The BAT-AEL emission level is < 0,03 kg/t.
status: valid
status modified: 2026-05-06
accepted date: 2026-05-06
in scheme: BATAEL values as defined into the EC BAT-Tool

Manufacture of Glass - Metals - BAT21-I
type: Concept
notation: GLS-Metals-BAT21-I
definition: 3, Mineral industry: 3,3 Manufacture of glass including glass fibre with a melting capacity exceeding 20 tonnes per day; Techniques (i)-(iv) (see table); Reducing metals emissions to air. The BAT-AEL emission level is < 0,2 - 1 mg/Nm3.
status: valid
status modified: 2026-05-06
accepted date: 2026-05-06
in scheme: BATAEL values as defined into the EC BAT-Tool

Manufacture of Glass - Metals - BAT21-II
type: Concept
notation: GLS-Metals-BAT21-II
definition: 3, Mineral industry: 3,3 Manufacture of glass including glass fibre with a melting capacity exceeding 20 tonnes per day; Techniques (i)-(iv) (see table); Reducing metals emissions to air. The BAT-AEL emission level is < 1 - 5 mg/Nm3.
status: valid
status modified: 2026-05-06
accepted date: 2026-05-06
in scheme: BATAEL values as defined into the EC BAT-Tool

Manufacture of Glass - Metals - BAT21-III
type: Concept
notation: GLS-Metals-BAT21-III
definition: 3, Mineral industry: 3,3 Manufacture of glass including glass fibre with a melting capacity exceeding 20 tonnes per day; Techniques (i)-(iv) (see table); Reducing metals emissions to air. The BAT-AEL emission level is < 0,0003 - 0,0015 kg/t.
status: valid
status modified: 2026-05-06
accepted date: 2026-05-06
in scheme: BATAEL values as defined into the EC BAT-Tool

Manufacture of Glass - Metals - BAT21-IV
type: Concept
notation: GLS-Metals-BAT21-IV
definition: 3, Mineral industry: 3,3 Manufacture of glass including glass fibre with a melting capacity exceeding 20 tonnes per day; Techniques (i)-(iv) (see table); Reducing metals emissions to air. The BAT-AEL emission level is < 0,0015 - 0,0075 kg/t.
status: valid
status modified: 2026-05-06
accepted date: 2026-05-06
in scheme: BATAEL values as defined into the EC BAT-Tool

Manufacture of Glass - Metals - BAT29-I
type: Concept
notation: GLS-Metals-BAT29-I
definition: 3, Mineral industry: 3,3 Manufacture of glass including glass fibre with a melting capacity exceeding 20 tonnes per day; Techniques (i)-(iii) (see table); Reducing metals emissions to air. The BAT-AEL emission level is < 0,2 - 1 mg/Nm3.
status: valid
status modified: 2026-05-06
accepted date: 2026-05-06
in scheme: BATAEL values as defined into the EC BAT-Tool

Manufacture of Glass - Metals - BAT29-II
type: Concept
notation: GLS-Metals-BAT29-II
definition: 3, Mineral industry: 3,3 Manufacture of glass including glass fibre with a melting capacity exceeding 20 tonnes per day; Techniques (i)-(iii) (see table); Reducing metals emissions to air. The BAT-AEL emission level is < 1 - 5 mg/Nm3.
status: valid
status modified: 2026-05-06
accepted date: 2026-05-06
in scheme: BATAEL values as defined into the EC BAT-Tool

Manufacture of Glass - Metals - BAT29-III
type: Concept
notation: GLS-Metals-BAT29-III
definition: 3, Mineral industry: 3,3 Manufacture of glass including glass fibre with a melting capacity exceeding 20 tonnes per day; Techniques (i)-(iii) (see table); Reducing metals emissions to air. The BAT-AEL emission level is < 0,0005 - 0,0025 kg/t.
status: valid
status modified: 2026-05-06
accepted date: 2026-05-06
in scheme: BATAEL values as defined into the EC BAT-Tool

Manufacture of Glass - Metals - BAT29-IV
type: Concept
notation: GLS-Metals-BAT29-IV
definition: 3, Mineral industry: 3,3 Manufacture of glass including glass fibre with a melting capacity exceeding 20 tonnes per day; Techniques (i)-(iii) (see table); Reducing metals emissions to air. The BAT-AEL emission level is < 0,0025 - 0,0125 kg/t.
status: valid
status modified: 2026-05-06
accepted date: 2026-05-06
in scheme: BATAEL values as defined into the EC BAT-Tool

Manufacture of Glass - Metals - BAT31-V
type: Concept
notation: GLS-Metals-BAT31-V
definition: 3, Mineral industry: 3,3 Manufacture of glass including glass fibre with a melting capacity exceeding 20 tonnes per day; Techniques (i)-(iv) (see table); Reducing metals emissions to air. The BAT-AEL emission level is < 1 mg/Nm3.
status: valid
status modified: 2026-05-06
accepted date: 2026-05-06
in scheme: BATAEL values as defined into the EC BAT-Tool

Manufacture of Glass - Metals - BAT31-VI
type: Concept
notation: GLS-Metals-BAT31-VI
definition: 3, Mineral industry: 3,3 Manufacture of glass including glass fibre with a melting capacity exceeding 20 tonnes per day; Techniques (i)-(iv) (see table); Reducing metals emissions to air. The BAT-AEL emission level is < 5 mg/Nm3.
status: valid
status modified: 2026-05-06
accepted date: 2026-05-06
in scheme: BATAEL values as defined into the EC BAT-Tool

Manufacture of Glass - Metals - BAT36-I
type: Concept
notation: GLS-Metals-BAT36-I
definition: 3, Mineral industry: 3,3 Manufacture of glass including glass fibre with a melting capacity exceeding 20 tonnes per day; Techniques (i)-(iii) (see table); Reducing metals emissions to air. The BAT-AEL emission level is < 0,2 - 1 mg/Nm3.
status: valid
status modified: 2026-05-06
accepted date: 2026-05-06
in scheme: BATAEL values as defined into the EC BAT-Tool

Manufacture of Glass - Metals - BAT36-II
type: Concept
notation: GLS-Metals-BAT36-II
definition: 3, Mineral industry: 3,3 Manufacture of glass including glass fibre with a melting capacity exceeding 20 tonnes per day; Techniques (i)-(iii) (see table); Reducing metals emissions to air. The BAT-AEL emission level is < 1 - 3 mg/Nm3.
status: valid
status modified: 2026-05-06
accepted date: 2026-05-06
in scheme: BATAEL values as defined into the EC BAT-Tool

Manufacture of Glass - Metals - BAT36-III
type: Concept
notation: GLS-Metals-BAT36-III
definition: 3, Mineral industry: 3,3 Manufacture of glass including glass fibre with a melting capacity exceeding 20 tonnes per day; Techniques (i)-(iii) (see table); Reducing metals emissions to air. The BAT-AEL emission level is < 0,0009 - 0,0045 kg/t.
status: valid
status modified: 2026-05-06
accepted date: 2026-05-06
in scheme: BATAEL values as defined into the EC BAT-Tool

Manufacture of Glass - Metals - BAT36-IV
type: Concept
notation: GLS-Metals-BAT36-IV
definition: 3, Mineral industry: 3,3 Manufacture of glass including glass fibre with a melting capacity exceeding 20 tonnes per day; Techniques (i)-(iii) (see table); Reducing metals emissions to air. The BAT-AEL emission level is < 0,0045 - 0,0135 kg/t.
status: valid
status modified: 2026-05-06
accepted date: 2026-05-06
in scheme: BATAEL values as defined into the EC BAT-Tool

Manufacture of Glass - Metals - BAT43-I
type: Concept
notation: GLS-Metals-BAT43-I
definition: 3, Mineral industry: 3,3 Manufacture of glass including glass fibre with a melting capacity exceeding 20 tonnes per day; Techniques (i)-(iii) (see table); Reducing metals emissions to air. The BAT-AEL emission level is < 0,2 - 1 mg/Nm3.
status: valid
status modified: 2026-05-06
accepted date: 2026-05-06
in scheme: BATAEL values as defined into the EC BAT-Tool

Manufacture of Glass - Metals - BAT43-II
type: Concept
notation: GLS-Metals-BAT43-II
definition: 3, Mineral industry: 3,3 Manufacture of glass including glass fibre with a melting capacity exceeding 20 tonnes per day; Techniques (i)-(iii) (see table); Reducing metals emissions to air. The BAT-AEL emission level is < 1 - 5 mg/Nm3.
status: valid
status modified: 2026-05-06
accepted date: 2026-05-06
in scheme: BATAEL values as defined into the EC BAT-Tool

Manufacture of Glass - Metals - BAT43-III
type: Concept
notation: GLS-Metals-BAT43-III
definition: 3, Mineral industry: 3,3 Manufacture of glass including glass fibre with a melting capacity exceeding 20 tonnes per day; Techniques (i)-(iii) (see table); Reducing metals emissions to air. The BAT-AEL emission level is < 0,0006 - 0,003 kg/t.
status: valid
status modified: 2026-05-06
accepted date: 2026-05-06
in scheme: BATAEL values as defined into the EC BAT-Tool

Manufacture of Glass - Metals - BAT43-IV
type: Concept
notation: GLS-Metals-BAT43-IV
definition: 3, Mineral industry: 3,3 Manufacture of glass including glass fibre with a melting capacity exceeding 20 tonnes per day; Techniques (i)-(iii) (see table); Reducing metals emissions to air. The BAT-AEL emission level is < 0,003 - 0,015 kg/t.
status: valid
status modified: 2026-05-06
accepted date: 2026-05-06
in scheme: BATAEL values as defined into the EC BAT-Tool

Manufacture of Glass - Metals - BAT46-II
type: Concept
notation: GLS-Metals-BAT46-II
definition: 3, Mineral industry: 3,3 Manufacture of glass including glass fibre with a melting capacity exceeding 20 tonnes per day; Techniques (i)-(ii) (see table); Reducing metals emissions to air. The BAT-AEL emission level is < 1 mg/Nm3.
status: valid
status modified: 2026-05-06
accepted date: 2026-05-06
in scheme: BATAEL values as defined into the EC BAT-Tool

Manufacture of Glass - Metals - BAT46-III
type: Concept
notation: GLS-Metals-BAT46-III
definition: 3, Mineral industry: 3,3 Manufacture of glass including glass fibre with a melting capacity exceeding 20 tonnes per day; Techniques (i)-(ii) (see table); Reducing metals emissions to air. The BAT-AEL emission level is < 1 - 5 mg/Nm3.
status: valid
status modified: 2026-05-06
accepted date: 2026-05-06
in scheme: BATAEL values as defined into the EC BAT-Tool

Manufacture of Glass - Metals - BAT53-I
type: Concept
notation: GLS-Metals-BAT53-I
definition: 3, Mineral industry: 3,3 Manufacture of glass including glass fibre with a melting capacity exceeding 20 tonnes per day; Techniques (i)-(iii) (see table); Reducing metals emissions to air. The BAT-AEL emission level is < 0,1 - 1 mg/Nm3.
status: valid
status modified: 2026-05-06
accepted date: 2026-05-06
in scheme: BATAEL values as defined into the EC BAT-Tool

Manufacture of Glass - Metals - BAT53-II
type: Concept
notation: GLS-Metals-BAT53-II
definition: 3, Mineral industry: 3,3 Manufacture of glass including glass fibre with a melting capacity exceeding 20 tonnes per day; Techniques (i)-(iii) (see table); Reducing metals emissions to air. The BAT-AEL emission level is < 1 - 5 mg/Nm3.
status: valid
status modified: 2026-05-06
accepted date: 2026-05-06
in scheme: BATAEL values as defined into the EC BAT-Tool

Manufacture of Glass - Metals - BAT53-III
type: Concept
notation: GLS-Metals-BAT53-III
definition: 3, Mineral industry: 3,3 Manufacture of glass including glass fibre with a melting capacity exceeding 20 tonnes per day; Techniques (i)-(iii) (see table); Reducing metals emissions to air. The BAT-AEL emission level is < 0,0003 - 0,003 kg/t.
status: valid
status modified: 2026-05-06
accepted date: 2026-05-06
in scheme: BATAEL values as defined into the EC BAT-Tool

Manufacture of Glass - Metals - BAT53-IV
type: Concept
notation: GLS-Metals-BAT53-IV
definition: 3, Mineral industry: 3,3 Manufacture of glass including glass fibre with a melting capacity exceeding 20 tonnes per day; Techniques (i)-(iii) (see table); Reducing metals emissions to air. The BAT-AEL emission level is < 0,003 - 0,015 kg/t.
status: valid
status modified: 2026-05-06
accepted date: 2026-05-06
in scheme: BATAEL values as defined into the EC BAT-Tool

Manufacture of Glass - Metals - BAT54-II
type: Concept
notation: GLS-Metals-BAT54-II
definition: 3, Mineral industry: 3,3 Manufacture of glass including glass fibre with a melting capacity exceeding 20 tonnes per day; Techniques (i)-(ii) (see table); Reducing metals emissions to air. The BAT-AEL emission level is < 1 mg/Nm3.
status: valid
status modified: 2026-05-06
accepted date: 2026-05-06
in scheme: BATAEL values as defined into the EC BAT-Tool

Manufacture of Glass - Metals - BAT54-III
type: Concept
notation: GLS-Metals-BAT54-III
definition: 3, Mineral industry: 3,3 Manufacture of glass including glass fibre with a melting capacity exceeding 20 tonnes per day; Techniques (i)-(ii) (see table); Reducing metals emissions to air. The BAT-AEL emission level is < 1 - 5 mg/Nm3.
status: valid
status modified: 2026-05-06
accepted date: 2026-05-06
in scheme: BATAEL values as defined into the EC BAT-Tool

Manufacture of Glass - Metals - BAT62-I
type: Concept
notation: GLS-Metals-BAT62-I
definition: 3, Mineral industry: 3,4 Melting mineral substances including the production of mineral fibres with a melting capacity exceeding 20�tonnes per day; Techniques (i)-(ii) (see table); Reducing metals emissions to air. The BAT-AEL emission level is < 0,2 - 1 mg/Nm3.
status: valid
status modified: 2026-05-06
accepted date: 2026-05-06
in scheme: BATAEL values as defined into the EC BAT-Tool

Manufacture of Glass - Metals - BAT62-II
type: Concept
notation: GLS-Metals-BAT62-II
definition: 3, Mineral industry: 3,4 Melting mineral substances including the production of mineral fibres with a melting capacity exceeding 20�tonnes per day; Techniques (i)-(ii) (see table); Reducing metals emissions to air. The BAT-AEL emission level is < 1 - 2 mg/Nm3.
status: valid
status modified: 2026-05-06
accepted date: 2026-05-06
in scheme: BATAEL values as defined into the EC BAT-Tool

Manufacture of Glass - Metals - BAT62-III
type: Concept
notation: GLS-Metals-BAT62-III
definition: 3, Mineral industry: 3,4 Melting mineral substances including the production of mineral fibres with a melting capacity exceeding 20�tonnes per day; Techniques (i)-(ii) (see table); Reducing metals emissions to air. The BAT-AEL emission level is < 0,0004 - 0,0025 kg/t.
status: valid
status modified: 2026-05-06
accepted date: 2026-05-06
in scheme: BATAEL values as defined into the EC BAT-Tool

Manufacture of Glass - Metals - BAT62-IV
type: Concept
notation: GLS-Metals-BAT62-IV
definition: 3, Mineral industry: 3,4 Melting mineral substances including the production of mineral fibres with a melting capacity exceeding 20�tonnes per day; Techniques (i)-(ii) (see table); Reducing metals emissions to air. The BAT-AEL emission level is < 0,002 - 0,005 kg/t.
status: valid
status modified: 2026-05-06
accepted date: 2026-05-06
in scheme: BATAEL values as defined into the EC BAT-Tool

Manufacture of Glass - Metals - BAT69-I
type: Concept
notation: GLS-Metals-BAT69-I
definition: 3, Mineral industry: 3,4 Melting mineral substances including the production of mineral fibres with a melting capacity exceeding 20�tonnes per day; Techniques (i)-(ii) (see table); Reducing metals emissions to air. The BAT-AEL emission level is < 1 mg/Nm3.
status: valid
status modified: 2026-05-06
accepted date: 2026-05-06
in scheme: BATAEL values as defined into the EC BAT-Tool

Manufacture of Glass - Metals - BAT69-II
type: Concept
notation: GLS-Metals-BAT69-II
definition: 3, Mineral industry: 3,4 Melting mineral substances including the production of mineral fibres with a melting capacity exceeding 20�tonnes per day; Techniques (i)-(ii) (see table); Reducing metals emissions to air. The BAT-AEL emission level is < 5 mg/Nm3.
status: valid
status modified: 2026-05-06
accepted date: 2026-05-06
in scheme: BATAEL values as defined into the EC BAT-Tool

Manufacture of Glass - Metals - BAT75-I
type: Concept
notation: GLS-Metals-BAT75-I
definition: 3, Mineral industry: 3,4 Melting mineral substances including the production of mineral fibres with a melting capacity exceeding 20�tonnes per day; Techniques (i)-(iii) (see table); Reducing metals emissions to air. The BAT-AEL emission level is < 1 mg/Nm3.
status: valid
status modified: 2026-05-06
accepted date: 2026-05-06
in scheme: BATAEL values as defined into the EC BAT-Tool

Manufacture of Glass - Metals - BAT75-II
type: Concept
notation: GLS-Metals-BAT75-II
definition: 3, Mineral industry: 3,4 Melting mineral substances including the production of mineral fibres with a melting capacity exceeding 20�tonnes per day; Techniques (i)-(iii) (see table); Reducing metals emissions to air. The BAT-AEL emission level is < 5 mg/Nm3.
status: valid
status modified: 2026-05-06
accepted date: 2026-05-06
in scheme: BATAEL values as defined into the EC BAT-Tool

Manufacture of Glass - Metals - BAT75-III
type: Concept
notation: GLS-Metals-BAT75-III
definition: 3, Mineral industry: 3,4 Melting mineral substances including the production of mineral fibres with a melting capacity exceeding 20�tonnes per day; Techniques (i)-(iii) (see table); Reducing metals emissions to air. The BAT-AEL emission level is < 0,0075 kg/t.
status: valid
status modified: 2026-05-06
accepted date: 2026-05-06
in scheme: BATAEL values as defined into the EC BAT-Tool

Manufacture of Glass - Metals - BAT75-IV
type: Concept
notation: GLS-Metals-BAT75-IV
definition: 3, Mineral industry: 3,4 Melting mineral substances including the production of mineral fibres with a melting capacity exceeding 20�tonnes per day; Techniques (i)-(iii) (see table); Reducing metals emissions to air. The BAT-AEL emission level is < 0,037 kg/t.
status: valid
status modified: 2026-05-06
accepted date: 2026-05-06
in scheme: BATAEL values as defined into the EC BAT-Tool

Manufacture of Glass - Metals - BAT76-II
type: Concept
notation: GLS-Metals-BAT76-II
definition: 3, Mineral industry: 3,4 Melting mineral substances including the production of mineral fibres with a melting capacity exceeding 20�tonnes per day; Techniques (i)-(iii) (see table); Reducing metals emissions to air. The BAT-AEL emission level is < 1 mg/Nm3.
status: valid
status modified: 2026-05-06
accepted date: 2026-05-06
in scheme: BATAEL values as defined into the EC BAT-Tool

Manufacture of Glass - Metals - BAT76-III
type: Concept
notation: GLS-Metals-BAT76-III
definition: 3, Mineral industry: 3,4 Melting mineral substances including the production of mineral fibres with a melting capacity exceeding 20�tonnes per day; Techniques (i)-(iii) (see table); Reducing metals emissions to air. The BAT-AEL emission level is < 5 mg/Nm3.
status: valid
status modified: 2026-05-06
accepted date: 2026-05-06
in scheme: BATAEL values as defined into the EC BAT-Tool

Manufacture of Glass - NH3 - BAT10
type: Concept
notation: GLS-NH3-BAT10
definition: 3, Mineral industry: 3,3 Manufacture of glass including glass fibre with a melting capacity exceeding 20 tonnes per day; SCR or SNCR; Reducing ammonia (NH3) emissions to air. The BAT-AEL emission level is < 5 - 30 mg/Nm3.
status: valid
status modified: 2026-05-06
accepted date: 2026-05-06
in scheme: BATAEL values as defined into the EC BAT-Tool

Manufacture of Glass - NH3 - BAT37-III
type: Concept
notation: GLS-NH3-BAT37-III
definition: 3, Mineral industry: 3,3 Manufacture of glass including glass fibre with a melting capacity exceeding 20 tonnes per day; Techniques (i)-(iii) (see table); Reducing ammonia emissions to air. The BAT-AEL emission level is < 30 mg/Nm3.
status: valid
status modified: 2026-05-06
accepted date: 2026-05-06
in scheme: BATAEL values as defined into the EC BAT-Tool

Manufacture of Glass - NH3 - BAT63-IV
type: Concept
notation: GLS-NH3-BAT63-IV
definition: 3, Mineral industry: 3,4 Melting mineral substances including the production of mineral fibres with a melting capacity exceeding 20�tonnes per day; Techniques (i)-(v) (see table); Reducing ammonia emissions to air. The BAT-AEL emission level is 30 - 60 mg/Nm3.
status: valid
status modified: 2026-05-06
accepted date: 2026-05-06
in scheme: BATAEL values as defined into the EC BAT-Tool

Manufacture of Glass - NH3 - BAT63-X
type: Concept
notation: GLS-NH3-BAT63-X
definition: 3, Mineral industry: 3,4 Melting mineral substances including the production of mineral fibres with a melting capacity exceeding 20�tonnes per day; Techniques (i)-(v) (see table); Reducing ammonia emissions to air. The BAT-AEL emission level is < 20 - 60 mg/Nm3.
status: valid
status modified: 2026-05-06
accepted date: 2026-05-06
in scheme: BATAEL values as defined into the EC BAT-Tool

Manufacture of Glass - NH3 - BAT63-XVII
type: Concept
notation: GLS-NH3-BAT63-XVII
definition: 3, Mineral industry: 3,4 Melting mineral substances including the production of mineral fibres with a melting capacity exceeding 20�tonnes per day; Techniques (i)-(v) (see table); Reducing ammonia emissions to air. The BAT-AEL emission level is < 0,4 kg/t.
status: valid
status modified: 2026-05-06
accepted date: 2026-05-06
in scheme: BATAEL values as defined into the EC BAT-Tool

Manufacture of Glass - NH4 - BAT13-XVII
type: Concept
notation: GLS-NH4-BAT13-XVII
definition: 3, Mineral industry: 3,3 Manufacture of glass including glass fibre with a melting capacity exceeding 20 tonnes per day Reducing ammonia to water. The BAT-AEL emission level is < 10 mg/l.
status: valid
status modified: 2026-05-06
accepted date: 2026-05-06
in scheme: BATAEL values as defined into the EC BAT-Tool

Manufacture of Glass - NO2 - BAT17-I
type: Concept
notation: GLS-NO2-BAT17-I
definition: 3, Mineral industry: 3,3 Manufacture of glass including glass fibre with a melting capacity exceeding 20 tonnes per day; I. Primary techniques: Combustion modifications (i), special furnace design (ii); Reducing nitrogen oxides (NOx) emissions to air. The BAT-AEL emission level is 500 - 800 mg/Nm3.
status: valid
status modified: 2026-05-06
accepted date: 2026-05-06
in scheme: BATAEL values as defined into the EC BAT-Tool

Manufacture of Glass - NO2 - BAT17-II
type: Concept
notation: GLS-NO2-BAT17-II
definition: 3, Mineral industry: 3,3 Manufacture of glass including glass fibre with a melting capacity exceeding 20 tonnes per day; I. Primary techniques: Electric melting (iii); Reducing nitrogen oxides (NOx) emissions to air. The BAT-AEL emission level is < 100 mg/Nm3.
status: valid
status modified: 2026-05-06
accepted date: 2026-05-06
in scheme: BATAEL values as defined into the EC BAT-Tool

Manufacture of Glass - NO2 - BAT17-III
type: Concept
notation: GLS-NO2-BAT17-III
definition: 3, Mineral industry: 3,3 Manufacture of glass including glass fibre with a melting capacity exceeding 20 tonnes per day; II. Secondary techniques; Reducing nitrogen oxides (NOx) emissions to air. The BAT-AEL emission level is < 500 mg/Nm3.
status: valid
status modified: 2026-05-06
accepted date: 2026-05-06
in scheme: BATAEL values as defined into the EC BAT-Tool

Manufacture of Glass - NO2 - BAT17-IV
type: Concept
notation: GLS-NO2-BAT17-IV
definition: 3, Mineral industry: 3,3 Manufacture of glass including glass fibre with a melting capacity exceeding 20 tonnes per day; I. Primary techniques: Combustion modifications (i), special furnace design (ii); Reducing nitrogen oxides (NOx) emissions to air. The BAT-AEL emission level is 0,75 - 1,2 kg/t.
status: valid
status modified: 2026-05-06
accepted date: 2026-05-06
in scheme: BATAEL values as defined into the EC BAT-Tool

Manufacture of Glass - NO2 - BAT17-V
type: Concept
notation: GLS-NO2-BAT17-V
definition: 3, Mineral industry: 3,3 Manufacture of glass including glass fibre with a melting capacity exceeding 20 tonnes per day; I. Primary techniques: Electric melting (iii); Reducing nitrogen oxides (NOx) emissions to air. The BAT-AEL emission level is < 0,3 kg/t.
status: valid
status modified: 2026-05-06
accepted date: 2026-05-06
in scheme: BATAEL values as defined into the EC BAT-Tool

Manufacture of Glass - NO2 - BAT17-VI
type: Concept
notation: GLS-NO2-BAT17-VI
definition: 3, Mineral industry: 3,3 Manufacture of glass including glass fibre with a melting capacity exceeding 20 tonnes per day; I. Primary techniques: Oxy-fuel melting (iv); Reducing nitrogen oxides (NOx) emissions to air. The BAT-AEL emission level is < 0,5 - 0,8 kg/t.
status: valid
status modified: 2026-05-06
accepted date: 2026-05-06
in scheme: BATAEL values as defined into the EC BAT-Tool

Manufacture of Glass - NO2 - BAT17-VII
type: Concept
notation: GLS-NO2-BAT17-VII
definition: 3, Mineral industry: 3,3 Manufacture of glass including glass fibre with a melting capacity exceeding 20 tonnes per day; II. Secondary techniques; Reducing nitrogen oxides (NOx) emissions to air. The BAT-AEL emission level is < 0,75 kg/t.
status: valid
status modified: 2026-05-06
accepted date: 2026-05-06
in scheme: BATAEL values as defined into the EC BAT-Tool

Manufacture of Glass - NO2 - BAT18-I
type: Concept
notation: GLS-NO2-BAT18-I
definition: 3, Mineral industry: 3,3 Manufacture of glass including glass fibre with a melting capacity exceeding 20 tonnes per day; I. Primary techniques (see table BAT 17): Combustion modifications (i), special furnace designs (ii) combined with minimisation of these (nitrates) raw materials; Reducing nitrogen oxides (NOx) emissions to air. The BAT-AEL emission level is 500 - 800 mg/Nm3.
status: valid
status modified: 2026-05-06
accepted date: 2026-05-06
in scheme: BATAEL values as defined into the EC BAT-Tool

Manufacture of Glass - NO2 - BAT18-II
type: Concept
notation: GLS-NO2-BAT18-II
definition: 3, Mineral industry: 3,3 Manufacture of glass including glass fibre with a melting capacity exceeding 20 tonnes per day; I. Primary techniques (see table BAT 17): Electric melting (iii) combined with minimisation of these (nitrates) raw materials; Reducing nitrogen oxides (NOx) emissions to air. The BAT-AEL emission level is < 100 mg/Nm3.
status: valid
status modified: 2026-05-06
accepted date: 2026-05-06
in scheme: BATAEL values as defined into the EC BAT-Tool

Manufacture of Glass - NO2 - BAT18-III
type: Concept
notation: GLS-NO2-BAT18-III
definition: 3, Mineral industry: 3,3 Manufacture of glass including glass fibre with a melting capacity exceeding 20 tonnes per day; II. Secondary techniques (see table BAT 17) combined with minimisation of these (nitrates) raw materials; Reducing nitrogen oxides (NOx) emissions to air. The BAT-AEL emission level is < 500 mg/Nm3.
status: valid
status modified: 2026-05-06
accepted date: 2026-05-06
in scheme: BATAEL values as defined into the EC BAT-Tool

Manufacture of Glass - NO2 - BAT18-IV
type: Concept
notation: GLS-NO2-BAT18-IV
definition: 3, Mineral industry: 3,3 Manufacture of glass including glass fibre with a melting capacity exceeding 20 tonnes per day; I. Primary techniques (see table BAT 17): Combustion modifications (i), special furnace designs (ii) combined with minimisation of these (nitrates) raw materials; Reducing nitrogen oxides (NOx) emissions to air. The BAT-AEL emission level is 0,75 - 1,2 kg/t.
status: valid
status modified: 2026-05-06
accepted date: 2026-05-06
in scheme: BATAEL values as defined into the EC BAT-Tool

Manufacture of Glass - NO2 - BAT18-IX
type: Concept
notation: GLS-NO2-BAT18-IX
definition: 3, Mineral industry: 3,3 Manufacture of glass including glass fibre with a melting capacity exceeding 20 tonnes per day; Primary techniques (see table) in cases of short campaigns or melting furnaces with a capacity < 100 t/d; Reducing nitrogen oxides (NOx) emissions to air. The BAT-AEL emission level is < 3 kg/t.
status: valid
status modified: 2026-05-06
accepted date: 2026-05-06
in scheme: BATAEL values as defined into the EC BAT-Tool

Manufacture of Glass - NO2 - BAT18-V
type: Concept
notation: GLS-NO2-BAT18-V
definition: 3, Mineral industry: 3,3 Manufacture of glass including glass fibre with a melting capacity exceeding 20 tonnes per day; I. Primary techniques (see table BAT 17): Electric melting (iii) combined with minimisation of these (nitrates) raw materials; Reducing nitrogen oxides (NOx) emissions to air. The BAT-AEL emission level is < 0,3 kg/t.
status: valid
status modified: 2026-05-06
accepted date: 2026-05-06
in scheme: BATAEL values as defined into the EC BAT-Tool

Manufacture of Glass - NO2 - BAT18-VI
type: Concept
notation: GLS-NO2-BAT18-VI
definition: 3, Mineral industry: 3,3 Manufacture of glass including glass fibre with a melting capacity exceeding 20 tonnes per day; I. Primary techniques (see table BAT 17): Oxy-fuel melting (iv) combined with minimisation of these (nitrates) raw materials; Reducing nitrogen oxides (NOx) emissions to air. The BAT-AEL emission level is < 0,5 - 0,8 kg/t.
status: valid
status modified: 2026-05-06
accepted date: 2026-05-06
in scheme: BATAEL values as defined into the EC BAT-Tool

Manufacture of Glass - NO2 - BAT18-VII
type: Concept
notation: GLS-NO2-BAT18-VII
definition: 3, Mineral industry: 3,3 Manufacture of glass including glass fibre with a melting capacity exceeding 20 tonnes per day; II. Secondary techniques (see table BAT 17) combined with minimisation of these (nitrates) raw materials; Reducing nitrogen oxides (NOx) emissions to air. The BAT-AEL emission level is < 0,75 kg/t.
status: valid
status modified: 2026-05-06
accepted date: 2026-05-06
in scheme: BATAEL values as defined into the EC BAT-Tool

Manufacture of Glass - NO2 - BAT18-VIII
type: Concept
notation: GLS-NO2-BAT18-VIII
definition: 3, Mineral industry: 3,3 Manufacture of glass including glass fibre with a melting capacity exceeding 20 tonnes per day; Primary techniques (see table) in cases of short campaigns or melting furnaces with a capacity < 100 t/d; Reducing nitrogen oxides (NOx) emissions to air. The BAT-AEL emission level is < 1000 mg/Nm3.
status: valid
status modified: 2026-05-06
accepted date: 2026-05-06
in scheme: BATAEL values as defined into the EC BAT-Tool

Manufacture of Glass - NO2 - BAT25-I
type: Concept
notation: GLS-NO2-BAT25-I
definition: 3, Mineral industry: 3,3 Manufacture of glass including glass fibre with a melting capacity exceeding 20 tonnes per day; I. Primary techniques: Combustion modifications (i), Fenix process (ii); Reducing nitrogen oxides (NOx) emissions to air. The BAT-AEL emission level is 700 - 800 mg/Nm3.
status: valid
status modified: 2026-05-06
accepted date: 2026-05-06
in scheme: BATAEL values as defined into the EC BAT-Tool

Manufacture of Glass - NO2 - BAT25-II
type: Concept
notation: GLS-NO2-BAT25-II
definition: 3, Mineral industry: 3,3 Manufacture of glass including glass fibre with a melting capacity exceeding 20 tonnes per day; II. Secondary techniques; Reducing nitrogen oxides (NOx) emissions to air. The BAT-AEL emission level is 400 - 700 mg/Nm3.
status: valid
status modified: 2026-05-06
accepted date: 2026-05-06
in scheme: BATAEL values as defined into the EC BAT-Tool

Manufacture of Glass - NO2 - BAT25-III
type: Concept
notation: GLS-NO2-BAT25-III
definition: 3, Mineral industry: 3,3 Manufacture of glass including glass fibre with a melting capacity exceeding 20 tonnes per day; I. Primary techniques: Combustion modifications (i), Fenix process (ii); Reducing nitrogen oxides (NOx) emissions to air. The BAT-AEL emission level is 1,75 - 2 kg/t.
status: valid
status modified: 2026-05-06
accepted date: 2026-05-06
in scheme: BATAEL values as defined into the EC BAT-Tool

Manufacture of Glass - NO2 - BAT25-IV
type: Concept
notation: GLS-NO2-BAT25-IV
definition: 3, Mineral industry: 3,3 Manufacture of glass including glass fibre with a melting capacity exceeding 20 tonnes per day; I. Primary techniques: Oxy-fuel melting (iii); Reducing nitrogen oxides (NOx) emissions to air. The BAT-AEL emission level is < 1,25 - 2 kg/t.
status: valid
status modified: 2026-05-06
accepted date: 2026-05-06
in scheme: BATAEL values as defined into the EC BAT-Tool

Manufacture of Glass - NO2 - BAT25-V
type: Concept
notation: GLS-NO2-BAT25-V
definition: 3, Mineral industry: 3,3 Manufacture of glass including glass fibre with a melting capacity exceeding 20 tonnes per day; II. Secondary techniques; Reducing nitrogen oxides (NOx) emissions to air. The BAT-AEL emission level is 1 - 1,75 kg/t.
status: valid
status modified: 2026-05-06
accepted date: 2026-05-06
in scheme: BATAEL values as defined into the EC BAT-Tool

Manufacture of Glass - NO2 - BAT26-I
type: Concept
notation: GLS-NO2-BAT26-I
definition: 3, Mineral industry: 3,3 Manufacture of glass including glass fibre with a melting capacity exceeding 20 tonnes per day; II. Secondary techniques (see table BAT 25) and minimisation of these (nitrates) raw materials; Reducing nitrogen oxides (NOx) emissions to air. The BAT-AEL emission level is 400 - 700 mg/Nm3.
status: valid
status modified: 2026-05-06
accepted date: 2026-05-06
in scheme: BATAEL values as defined into the EC BAT-Tool

Manufacture of Glass - NO2 - BAT26-II
type: Concept
notation: GLS-NO2-BAT26-II
definition: 3, Mineral industry: 3,3 Manufacture of glass including glass fibre with a melting capacity exceeding 20 tonnes per day; II. Secondary techniques (see table BAT 25) and minimisation of these (nitrates) raw materials; Reducing nitrogen oxides (NOx) emissions to air. The BAT-AEL emission level is 1 - 1,75 kg/t.
status: valid
status modified: 2026-05-06
accepted date: 2026-05-06
in scheme: BATAEL values as defined into the EC BAT-Tool

Manufacture of Glass - NO2 - BAT26-III
type: Concept
notation: GLS-NO2-BAT26-III
definition: 3, Mineral industry: 3,3 Manufacture of glass including glass fibre with a melting capacity exceeding 20 tonnes per day; Primary techniques (see table) and production of special glasses in a limited number of short campaigns; Reducing nitrogen oxides (NOx) emissions to air. The BAT-AEL emission level is < 1200 mg/Nm3.
status: valid
status modified: 2026-05-06
accepted date: 2026-05-06
in scheme: BATAEL values as defined into the EC BAT-Tool

Manufacture of Glass - NO2 - BAT26-IV
type: Concept
notation: GLS-NO2-BAT26-IV
definition: 3, Mineral industry: 3,3 Manufacture of glass including glass fibre with a melting capacity exceeding 20 tonnes per day; Primary techniques (see table) and production of special glasses in a limited number of short campaigns; Reducing nitrogen oxides (NOx) emissions to air. The BAT-AEL emission level is < 3 kg/t.
status: valid
status modified: 2026-05-06
accepted date: 2026-05-06
in scheme: BATAEL values as defined into the EC BAT-Tool

Manufacture of Glass - NO2 - BAT33-I
type: Concept
notation: GLS-NO2-BAT33-I
definition: 3, Mineral industry: 3,3 Manufacture of glass including glass fibre with a melting capacity exceeding 20 tonnes per day; Combustion modifications (i); Reducing nitrogen oxides (NOx) emissions to air. The BAT-AEL emission level is < 600 - 1000 mg/Nm3.
status: valid
status modified: 2026-05-06
accepted date: 2026-05-06
in scheme: BATAEL values as defined into the EC BAT-Tool

Manufacture of Glass - NO2 - BAT33-II
type: Concept
notation: GLS-NO2-BAT33-II
definition: 3, Mineral industry: 3,3 Manufacture of glass including glass fibre with a melting capacity exceeding 20 tonnes per day; Combustion modifications (i); Reducing nitrogen oxides (NOx) emissions to air. The BAT-AEL emission level is < 2,7 - 4,5 kg/t.
status: valid
status modified: 2026-05-06
accepted date: 2026-05-06
in scheme: BATAEL values as defined into the EC BAT-Tool

Manufacture of Glass - NO2 - BAT33-III
type: Concept
notation: GLS-NO2-BAT33-III
definition: 3, Mineral industry: 3,3 Manufacture of glass including glass fibre with a melting capacity exceeding 20 tonnes per day; Oxy-fuel melting (ii); Reducing nitrogen oxides (NOx) emissions to air. The BAT-AEL emission level is < 0,5 - 1,5 kg/t.
status: valid
status modified: 2026-05-06
accepted date: 2026-05-06
in scheme: BATAEL values as defined into the EC BAT-Tool

Manufacture of Glass - NO2 - BAT39-I
type: Concept
notation: GLS-NO2-BAT39-I
definition: 3, Mineral industry: 3,3 Manufacture of glass including glass fibre with a melting capacity exceeding 20 tonnes per day; Combustion modifications (i), special furnace design (ii); Reducing nitrogen oxides (NOx) emissions to air. The BAT-AEL emission level is < 500 - 1000 mg/Nm3.
status: valid
status modified: 2026-05-06
accepted date: 2026-05-06
in scheme: BATAEL values as defined into the EC BAT-Tool

Manufacture of Glass - NO2 - BAT39-II
type: Concept
notation: GLS-NO2-BAT39-II
definition: 3, Mineral industry: 3,3 Manufacture of glass including glass fibre with a melting capacity exceeding 20 tonnes per day; Electric melting (iii); Reducing nitrogen oxides (NOx) emissions to air. The BAT-AEL emission level is < 100 mg/Nm3.
status: valid
status modified: 2026-05-06
accepted date: 2026-05-06
in scheme: BATAEL values as defined into the EC BAT-Tool

Manufacture of Glass - NO2 - BAT39-III
type: Concept
notation: GLS-NO2-BAT39-III
definition: 3, Mineral industry: 3,3 Manufacture of glass including glass fibre with a melting capacity exceeding 20 tonnes per day; Combustion modifications (i), special furnace design (ii); Reducing nitrogen oxides (NOx) emissions to air. The BAT-AEL emission level is < 1,25 - 2,5 kg/t.
status: valid
status modified: 2026-05-06
accepted date: 2026-05-06
in scheme: BATAEL values as defined into the EC BAT-Tool

Manufacture of Glass - NO2 - BAT39-IV
type: Concept
notation: GLS-NO2-BAT39-IV
definition: 3, Mineral industry: 3,3 Manufacture of glass including glass fibre with a melting capacity exceeding 20 tonnes per day; Electric melting (iii); Reducing nitrogen oxides (NOx) emissions to air. The BAT-AEL emission level is < 0,3 kg/t.
status: valid
status modified: 2026-05-06
accepted date: 2026-05-06
in scheme: BATAEL values as defined into the EC BAT-Tool

Manufacture of Glass - NO2 - BAT39-V
type: Concept
notation: GLS-NO2-BAT39-V
definition: 3, Mineral industry: 3,3 Manufacture of glass including glass fibre with a melting capacity exceeding 20 tonnes per day; Oxy-fuel melting (iv); Reducing nitrogen oxides (NOx) emissions to air. The BAT-AEL emission level is < 0,5 - 1,5 kg/t.
status: valid
status modified: 2026-05-06
accepted date: 2026-05-06
in scheme: BATAEL values as defined into the EC BAT-Tool

Manufacture of Glass - NO2 - BAT40-I
type: Concept
notation: GLS-NO2-BAT40-I
definition: 3, Mineral industry: 3,3 Manufacture of glass including glass fibre with a melting capacity exceeding 20 tonnes per day; Combustion modifications (i), special furnace designs (ii) (see table BAT 39) combined with minimisation of these (nitrates) raw materials; Reducing nitrogen oxides (NOx) emissions to air. The BAT-AEL emission level is < 500 - 1500 mg/Nm3.
status: valid
status modified: 2026-05-06
accepted date: 2026-05-06
in scheme: BATAEL values as defined into the EC BAT-Tool

Manufacture of Glass - NO2 - BAT40-II
type: Concept
notation: GLS-NO2-BAT40-II
definition: 3, Mineral industry: 3,3 Manufacture of glass including glass fibre with a melting capacity exceeding 20 tonnes per day; Electric melting (iii) (see table BAT 39) combined with minimisation of these (nitrates) raw materials; Reducing nitrogen oxides (NOx) emissions to air. The BAT-AEL emission level is < 100 mg/Nm3.
status: valid
status modified: 2026-05-06
accepted date: 2026-05-06
in scheme: BATAEL values as defined into the EC BAT-Tool

Manufacture of Glass - NO2 - BAT40-III
type: Concept
notation: GLS-NO2-BAT40-III
definition: 3, Mineral industry: 3,3 Manufacture of glass including glass fibre with a melting capacity exceeding 20 tonnes per day; Combustion modifications (i), special furnace designs (ii) (see table BAT 39) combined with minimisation of these (nitrates) raw materials; Reducing nitrogen oxides (NOx) emissions to air. The BAT-AEL emission level is < 1,25 - 2,5 kg/t.
status: valid
status modified: 2026-05-06
accepted date: 2026-05-06
in scheme: BATAEL values as defined into the EC BAT-Tool

Manufacture of Glass - NO2 - BAT40-IV
type: Concept
notation: GLS-NO2-BAT40-IV
definition: 3, Mineral industry: 3,3 Manufacture of glass including glass fibre with a melting capacity exceeding 20 tonnes per day; Electric melting (iii) (see table BAT 39) combined with minimisation of these (nitrates) raw materials; Reducing nitrogen oxides (NOx) emissions to air. The BAT-AEL emission level is < 0,3 kg/t.
status: valid
status modified: 2026-05-06
accepted date: 2026-05-06
in scheme: BATAEL values as defined into the EC BAT-Tool

Manufacture of Glass - NO2 - BAT40-IX
type: Concept
notation: GLS-NO2-BAT40-IX
definition: 3, Mineral industry: 3,3 Manufacture of glass including glass fibre with a melting capacity exceeding 20 tonnes per day; Electric melting in production of special types of soda-lime glasses and other special glasses and for a limited number of short campaigns or for melting furnaces with a capacity < 100 t/d; Reducing nitrogen oxides (NOx) emissions to air. The BAT-AEL emission level is < 8 - 10 kg/t.
status: valid
status modified: 2026-05-06
accepted date: 2026-05-06
in scheme: BATAEL values as defined into the EC BAT-Tool

Manufacture of Glass - NO2 - BAT40-V
type: Concept
notation: GLS-NO2-BAT40-V
definition: 3, Mineral industry: 3,3 Manufacture of glass including glass fibre with a melting capacity exceeding 20 tonnes per day; Oxy-fuel melting (iv) (see table BAT 39) combined with minimisation of these (nitrates) raw materials; Reducing nitrogen oxides (NOx) emissions to air. The BAT-AEL emission level is < 0,5 - 1,5 kg/t.
status: valid
status modified: 2026-05-06
accepted date: 2026-05-06
in scheme: BATAEL values as defined into the EC BAT-Tool

Manufacture of Glass - NO2 - BAT40-VI
type: Concept
notation: GLS-NO2-BAT40-VI
definition: 3, Mineral industry: 3,3 Manufacture of glass including glass fibre with a melting capacity exceeding 20 tonnes per day; Fuel/air conventional furnaces in production of special types of soda-lime glasses and other special glasses and for a limited number of short campaigns or for melting furnaces with a capacity < 100 t/d; Reducing nitrogen oxides (NOx) emissions to air. The BAT-AEL emission level is < 500 - 1500 mg/Nm3.
status: valid
status modified: 2026-05-06
accepted date: 2026-05-06
in scheme: BATAEL values as defined into the EC BAT-Tool

Manufacture of Glass - NO2 - BAT40-VII
type: Concept
notation: GLS-NO2-BAT40-VII
definition: 3, Mineral industry: 3,3 Manufacture of glass including glass fibre with a melting capacity exceeding 20 tonnes per day; Electric melting in production of special types of soda-lime glasses and other special glasses and for a limited number of short campaigns or for melting furnaces with a capacity < 100 t/d; Reducing nitrogen oxides (NOx) emissions to air. The BAT-AEL emission level is < 300 - 500 mg/Nm3.
status: valid
status modified: 2026-05-06
accepted date: 2026-05-06
in scheme: BATAEL values as defined into the EC BAT-Tool

Manufacture of Glass - NO2 - BAT40-VIII
type: Concept
notation: GLS-NO2-BAT40-VIII
definition: 3, Mineral industry: 3,3 Manufacture of glass including glass fibre with a melting capacity exceeding 20 tonnes per day; Fuel/air conventional furnaces in production of special types of soda-lime glasses and other special glasses and for a limited number of short campaigns or for melting furnaces with a capacity < 100 t/d; Reducing nitrogen oxides (NOx) emissions to air. The BAT-AEL emission level is < 1,25 - 3,75 kg/t.
status: valid
status modified: 2026-05-06
accepted date: 2026-05-06
in scheme: BATAEL values as defined into the EC BAT-Tool

Manufacture of Glass - NO2 - BAT49-I
type: Concept
notation: GLS-NO2-BAT49-I
definition: 3, Mineral industry: 3,3 Manufacture of glass including glass fibre with a melting capacity exceeding 20 tonnes per day; I. Primary techniques: Combustion modifications (i); Reducing nitrogen oxides (NOx) emissions to air. The BAT-AEL emission level is 600 - 800 mg/Nm3.
status: valid
status modified: 2026-05-06
accepted date: 2026-05-06
in scheme: BATAEL values as defined into the EC BAT-Tool

Manufacture of Glass - NO2 - BAT49-II
type: Concept
notation: GLS-NO2-BAT49-II
definition: 3, Mineral industry: 3,3 Manufacture of glass including glass fibre with a melting capacity exceeding 20 tonnes per day; I. Primary techniques: Electric melting (ii); Reducing nitrogen oxides (NOx) emissions to air. The BAT-AEL emission level is < 100 mg/Nm3.
status: valid
status modified: 2026-05-06
accepted date: 2026-05-06
in scheme: BATAEL values as defined into the EC BAT-Tool

Manufacture of Glass - NO2 - BAT49-III
type: Concept
notation: GLS-NO2-BAT49-III
definition: 3, Mineral industry: 3,3 Manufacture of glass including glass fibre with a melting capacity exceeding 20 tonnes per day; II. Secondary techniques; Reducing nitrogen oxides (NOx) emissions to air. The BAT-AEL emission level is < 500 mg/Nm3.
status: valid
status modified: 2026-05-06
accepted date: 2026-05-06
in scheme: BATAEL values as defined into the EC BAT-Tool

Manufacture of Glass - NO2 - BAT49-IV
type: Concept
notation: GLS-NO2-BAT49-IV
definition: 3, Mineral industry: 3,3 Manufacture of glass including glass fibre with a melting capacity exceeding 20 tonnes per day; I. Primary techniques: Combustion modifications (i); Reducing nitrogen oxides (NOx) emissions to air. The BAT-AEL emission level is 1,5 - 3,2 kg/t.
status: valid
status modified: 2026-05-06
accepted date: 2026-05-06
in scheme: BATAEL values as defined into the EC BAT-Tool

Manufacture of Glass - NO2 - BAT49-V
type: Concept
notation: GLS-NO2-BAT49-V
definition: 3, Mineral industry: 3,3 Manufacture of glass including glass fibre with a melting capacity exceeding 20 tonnes per day; I. Primary techniques: Electric melting (ii); Reducing nitrogen oxides (NOx) emissions to air. The BAT-AEL emission level is < 0,25 - 0,4 kg/t.
status: valid
status modified: 2026-05-06
accepted date: 2026-05-06
in scheme: BATAEL values as defined into the EC BAT-Tool

Manufacture of Glass - NO2 - BAT49-VI
type: Concept
notation: GLS-NO2-BAT49-VI
definition: 3, Mineral industry: 3,3 Manufacture of glass including glass fibre with a melting capacity exceeding 20 tonnes per day; I. Primary techniques: Oxy-fuel melting (iii); Reducing nitrogen oxides (NOx) emissions to air. The BAT-AEL emission level is < 1 - 3 kg/t.
status: valid
status modified: 2026-05-06
accepted date: 2026-05-06
in scheme: BATAEL values as defined into the EC BAT-Tool

Manufacture of Glass - NO2 - BAT49-VII
type: Concept
notation: GLS-NO2-BAT49-VII
definition: 3, Mineral industry: 3,3 Manufacture of glass including glass fibre with a melting capacity exceeding 20 tonnes per day; II. Secondary techniques; Reducing nitrogen oxides (NOx) emissions to air. The BAT-AEL emission level is < 1 - 3 kg/t.
status: valid
status modified: 2026-05-06
accepted date: 2026-05-06
in scheme: BATAEL values as defined into the EC BAT-Tool

Manufacture of Glass - NO2 - BAT50-I
type: Concept
notation: GLS-NO2-BAT50-I
definition: 3, Mineral industry: 3,3 Manufacture of glass including glass fibre with a melting capacity exceeding 20 tonnes per day; Primary or secondary techniques (see table) combined with minimisation of nitrate input; Reducing nitrogen oxides (NOx) emissions to air. The BAT-AEL emission level is < 500 - 1000 mg/Nm3.
status: valid
status modified: 2026-05-06
accepted date: 2026-05-06
in scheme: BATAEL values as defined into the EC BAT-Tool

Manufacture of Glass - NO2 - BAT50-II
type: Concept
notation: GLS-NO2-BAT50-II
definition: 3, Mineral industry: 3,3 Manufacture of glass including glass fibre with a melting capacity exceeding 20 tonnes per day; Primary or secondary techniques (see table) combined with minimisation of nitrate input; Reducing nitrogen oxides (NOx) emissions to air. The BAT-AEL emission level is < 1 - 6 kg/t.
status: valid
status modified: 2026-05-06
accepted date: 2026-05-06
in scheme: BATAEL values as defined into the EC BAT-Tool

Manufacture of Glass - NO2 - BAT57-I
type: Concept
notation: GLS-NO2-BAT57-I
definition: 3, Mineral industry: 3,4 Melting mineral substances including the production of mineral fibres with a melting capacity exceeding 20�tonnes per day; For glass wool: Fuel/air (i) and electric furnaces (ii); Reducing nitrogen oxides (NOx) emissions to air. The BAT-AEL emission level is < 200 - 500 mg/Nm3.
status: valid
status modified: 2026-05-06
accepted date: 2026-05-06
in scheme: BATAEL values as defined into the EC BAT-Tool

Manufacture of Glass - NO2 - BAT57-II
type: Concept
notation: GLS-NO2-BAT57-II
definition: 3, Mineral industry: 3,4 Melting mineral substances including the production of mineral fibres with a melting capacity exceeding 20�tonnes per day; For stone wool: All types of furnaces; Reducing nitrogen oxides (NOx) emissions to air. The BAT-AEL emission level is < 400 - 500 mg/Nm3.
status: valid
status modified: 2026-05-06
accepted date: 2026-05-06
in scheme: BATAEL values as defined into the EC BAT-Tool

Manufacture of Glass - NO2 - BAT57-III
type: Concept
notation: GLS-NO2-BAT57-III
definition: 3, Mineral industry: 3,4 Melting mineral substances including the production of mineral fibres with a melting capacity exceeding 20�tonnes per day; For glass wool: Fuel/air (i) and electric furnaces (ii); Reducing nitrogen oxides (NOx) emissions to air. The BAT-AEL emission level is < 0,4 - 1 kg/t.
status: valid
status modified: 2026-05-06
accepted date: 2026-05-06
in scheme: BATAEL values as defined into the EC BAT-Tool

Manufacture of Glass - NO2 - BAT57-IV
type: Concept
notation: GLS-NO2-BAT57-IV
definition: 3, Mineral industry: 3,4 Melting mineral substances including the production of mineral fibres with a melting capacity exceeding 20�tonnes per day; For glass wool: Oxy-fuel melting (iii); Reducing nitrogen oxides (NOx) emissions to air. The BAT-AEL emission level is < 0,5 kg/t.
status: valid
status modified: 2026-05-06
accepted date: 2026-05-06
in scheme: BATAEL values as defined into the EC BAT-Tool

Manufacture of Glass - NO2 - BAT57-V
type: Concept
notation: GLS-NO2-BAT57-V
definition: 3, Mineral industry: 3,4 Melting mineral substances including the production of mineral fibres with a melting capacity exceeding 20�tonnes per day; For stone wool: All types of furnaces; Reducing nitrogen oxides (NOx) emissions to air. The BAT-AEL emission level is < 1 - 1,25 kg/t.
status: valid
status modified: 2026-05-06
accepted date: 2026-05-06
in scheme: BATAEL values as defined into the EC BAT-Tool

Manufacture of Glass - NO2 - BAT58-I
type: Concept
notation: GLS-NO2-BAT58-I
definition: 3, Mineral industry: 3,4 Melting mineral substances including the production of mineral fibres with a melting capacity exceeding 20�tonnes per day; Primary techniques (i)-(iii) combined with minimisation of nitrate input; Reducing nitrogen oxides (NOx) emissions to air. The BAT-AEL emission level is < 500 - 700 mg/Nm3.
status: valid
status modified: 2026-05-06
accepted date: 2026-05-06
in scheme: BATAEL values as defined into the EC BAT-Tool

Manufacture of Glass - NO2 - BAT58-II
type: Concept
notation: GLS-NO2-BAT58-II
definition: 3, Mineral industry: 3,4 Melting mineral substances including the production of mineral fibres with a melting capacity exceeding 20�tonnes per day; Primary techniques (i)-(iii) combined with minimisation of nitrate input; Reducing nitrogen oxides (NOx) emissions to air. The BAT-AEL emission level is < 1 - 1,4 kg/t.
status: valid
status modified: 2026-05-06
accepted date: 2026-05-06
in scheme: BATAEL values as defined into the EC BAT-Tool

Manufacture of Glass - NO2 - BAT63-XIII
type: Concept
notation: GLS-NO2-BAT63-XIII
definition: 3, Mineral industry: 3,4 Melting mineral substances including the production of mineral fibres with a melting capacity exceeding 20�tonnes per day; Techniques (i)-(v) (see table); Reducing nitrogen oxides (NOx) emissions to air. The BAT-AEL emission level is < 100 - 200 mg/Nm3.
status: valid
status modified: 2026-05-06
accepted date: 2026-05-06
in scheme: BATAEL values as defined into the EC BAT-Tool

Manufacture of Glass - NO2 - BAT63-XX
type: Concept
notation: GLS-NO2-BAT63-XX
definition: 3, Mineral industry: 3,4 Melting mineral substances including the production of mineral fibres with a melting capacity exceeding 20�tonnes per day; Techniques (i)-(v) (see table); Reducing nitrogen oxides (NOx) emissions to air. The BAT-AEL emission level is < 1 kg/t.
status: valid
status modified: 2026-05-06
accepted date: 2026-05-06
in scheme: BATAEL values as defined into the EC BAT-Tool

Manufacture of Glass - NO2 - BAT66
type: Concept
notation: GLS-NO2-BAT66
definition: 3, Mineral industry: 3,4 Melting mineral substances including the production of mineral fibres with a melting capacity exceeding 20�tonnes per day; Lubricant burn-off oven with combustion control and/or modifications (see table); Reducing nitrogen oxides (NOx) emissions to air. The BAT-AEL emission level is 100 - 200 mg/Nm3.
status: valid
status modified: 2026-05-06
accepted date: 2026-05-06
in scheme: BATAEL values as defined into the EC BAT-Tool

Manufacture of Glass - NO2 - BAT72-I
type: Concept
notation: GLS-NO2-BAT72-I
definition: 3, Mineral industry: 3,4 Melting mineral substances including the production of mineral fibres with a melting capacity exceeding 20�tonnes per day; Primary techniques: Fuel/air, fuel/oxygen- enriched air combustion, without nitrates; Reducing nitrogen oxides (NOx) emissions to air. The BAT-AEL emission level is 500 - 1000 mg/Nm3.
status: valid
status modified: 2026-05-06
accepted date: 2026-05-06
in scheme: BATAEL values as defined into the EC BAT-Tool

Manufacture of Glass - NO2 - BAT72-II
type: Concept
notation: GLS-NO2-BAT72-II
definition: 3, Mineral industry: 3,4 Melting mineral substances including the production of mineral fibres with a melting capacity exceeding 20�tonnes per day; Primary techniques: Fuel/air, fuel/oxygen- enriched air combustion, with use of nitrates; Reducing nitrogen oxides (NOx) emissions to air. The BAT-AEL emission level is < 1600 mg/Nm3.
status: valid
status modified: 2026-05-06
accepted date: 2026-05-06
in scheme: BATAEL values as defined into the EC BAT-Tool

Manufacture of Glass - NO2 - BAT72-III
type: Concept
notation: GLS-NO2-BAT72-III
definition: 3, Mineral industry: 3,4 Melting mineral substances including the production of mineral fibres with a melting capacity exceeding 20�tonnes per day; Primary techniques: Oxy-fuel firing, without nitrates; Reducing nitrogen oxides (NOx) emissions to air. The BAT-AEL emission level is < 2,5 - 5 kg/t.
status: valid
status modified: 2026-05-06
accepted date: 2026-05-06
in scheme: BATAEL values as defined into the EC BAT-Tool

Manufacture of Glass - NO2 - BAT72-IV
type: Concept
notation: GLS-NO2-BAT72-IV
definition: 3, Mineral industry: 3,4 Melting mineral substances including the production of mineral fibres with a melting capacity exceeding 20�tonnes per day; Primary techniques: Oxy-fuel firing, with use of nitrates; Reducing nitrogen oxides (NOx) emissions to air. The BAT-AEL emission level is 5 - 10 kg/t.
status: valid
status modified: 2026-05-06
accepted date: 2026-05-06
in scheme: BATAEL values as defined into the EC BAT-Tool

Manufacture of Glass - NO2 - BAT72-V
type: Concept
notation: GLS-NO2-BAT72-V
definition: 3, Mineral industry: 3,4 Melting mineral substances including the production of mineral fibres with a melting capacity exceeding 20�tonnes per day; Primary techniques: Fuel/air, fuel/oxygen- enriched air combustion, without nitrates; Reducing nitrogen oxides (NOx) emissions to air. The BAT-AEL emission level is 2,5 - 7,5 kg/t.
status: valid
status modified: 2026-05-06
accepted date: 2026-05-06
in scheme: BATAEL values as defined into the EC BAT-Tool

Manufacture of Glass - NO2 - BAT72-VI
type: Concept
notation: GLS-NO2-BAT72-VI
definition: 3, Mineral industry: 3,4 Melting mineral substances including the production of mineral fibres with a melting capacity exceeding 20�tonnes per day; Primary techniques: Fuel/air, fuel/oxygen- enriched air combustion, with use of nitrates; Reducing nitrogen oxides (NOx) emissions to air. The BAT-AEL emission level is < 12 kg/t.
status: valid
status modified: 2026-05-06
accepted date: 2026-05-06
in scheme: BATAEL values as defined into the EC BAT-Tool

Manufacture of Glass - Ni - BAT13-XVI
type: Concept
notation: GLS-Ni-BAT13-XVI
definition: 3, Mineral industry: 3,3 Manufacture of glass including glass fibre with a melting capacity exceeding 20 tonnes per day Reducing nickel to water. The BAT-AEL emission level is < 0,5 mg/l.
status: valid
status modified: 2026-05-06
accepted date: 2026-05-06
in scheme: BATAEL values as defined into the EC BAT-Tool

Manufacture of Glass - Pb - BAT13-VII
type: Concept
notation: GLS-Pb-BAT13-VII
definition: 3, Mineral industry: 3,3 Manufacture of glass including glass fibre with a melting capacity exceeding 20 tonnes per day Reducing lead to water. The BAT-AEL emission level is < 0,05 - 0,3 mg/l.
status: valid
status modified: 2026-05-06
accepted date: 2026-05-06
in scheme: BATAEL values as defined into the EC BAT-Tool

Manufacture of Glass - Pb - BAT45-I
type: Concept
notation: GLS-Pb-BAT45-I
definition: 3, Mineral industry: 3,3 Manufacture of glass including glass fibre with a melting capacity exceeding 20 tonnes per day; Techniques (i)-(iv) (see table); Reducing lead compounds emissions to air. The BAT-AEL emission level is < 0,5 - 1 mg/Nm3.
status: valid
status modified: 2026-05-06
accepted date: 2026-05-06
in scheme: BATAEL values as defined into the EC BAT-Tool

Manufacture of Glass - Pb - BAT45-II
type: Concept
notation: GLS-Pb-BAT45-II
definition: 3, Mineral industry: 3,3 Manufacture of glass including glass fibre with a melting capacity exceeding 20 tonnes per day; Techniques (i)-(iv) (see table); Reducing lead compounds emissions to air. The BAT-AEL emission level is < 0,001 - 0,003 kg/t.
status: valid
status modified: 2026-05-06
accepted date: 2026-05-06
in scheme: BATAEL values as defined into the EC BAT-Tool

Manufacture of Glass - Pb - BAT46-IV
type: Concept
notation: GLS-Pb-BAT46-IV
definition: 3, Mineral industry: 3,3 Manufacture of glass including glass fibre with a melting capacity exceeding 20 tonnes per day; Techniques (i)-(ii) (see table); Reducing lead emissions to air. The BAT-AEL emission level is < 1 - 1,5 mg/Nm3.
status: valid
status modified: 2026-05-06
accepted date: 2026-05-06
in scheme: BATAEL values as defined into the EC BAT-Tool

Manufacture of Glass - SO2 - BAT19-I
type: Concept
notation: GLS-SO2-BAT19-I
definition: 3, Mineral industry: 3,3 Manufacture of glass including glass fibre with a melting capacity exceeding 20 tonnes per day; Techniques (i)-(iii) (see table), and natural gas; Reducing sulphur oxides (SOx) emissions to air. The BAT-AEL emission level is < 200 - 500 mg/Nm3.
status: valid
status modified: 2026-05-06
accepted date: 2026-05-06
in scheme: BATAEL values as defined into the EC BAT-Tool

Manufacture of Glass - SO2 - BAT19-II
type: Concept
notation: GLS-SO2-BAT19-II
definition: 3, Mineral industry: 3,3 Manufacture of glass including glass fibre with a melting capacity exceeding 20 tonnes per day; Techniques (i)-(iii) (see table), and fuel oil; Reducing sulphur oxides (SOx) emissions to air. The BAT-AEL emission level is < 500 - 1200 mg/Nm3.
status: valid
status modified: 2026-05-06
accepted date: 2026-05-06
in scheme: BATAEL values as defined into the EC BAT-Tool

Manufacture of Glass - SO2 - BAT19-III
type: Concept
notation: GLS-SO2-BAT19-III
definition: 3, Mineral industry: 3,3 Manufacture of glass including glass fibre with a melting capacity exceeding 20 tonnes per day; Techniques (i)-(iii) (see table), and natural gas; Reducing sulphur oxides (SOx) emissions to air. The BAT-AEL emission level is < 0,3 - 0,75 kg/t.
status: valid
status modified: 2026-05-06
accepted date: 2026-05-06
in scheme: BATAEL values as defined into the EC BAT-Tool

Manufacture of Glass - SO2 - BAT19-IV
type: Concept
notation: GLS-SO2-BAT19-IV
definition: 3, Mineral industry: 3,3 Manufacture of glass including glass fibre with a melting capacity exceeding 20 tonnes per day; Techniques (i)-(iii) (see table), and fuel oil; Reducing sulphur oxides (SOx) emissions to air. The BAT-AEL emission level is < 0,75 - 1,8 kg/t.
status: valid
status modified: 2026-05-06
accepted date: 2026-05-06
in scheme: BATAEL values as defined into the EC BAT-Tool

Manufacture of Glass - SO2 - BAT23
type: Concept
notation: GLS-SO2-BAT23
definition: 3, Mineral industry: 3,3 Manufacture of glass including glass fibre with a melting capacity exceeding 20 tonnes per day; Techniques (i)-(ii) (see table); Reducing sulphur oxides (SOx) emissions to air. The BAT-AEL emission level is < 100 - 200 mg/Nm3.
status: valid
status modified: 2026-05-06
accepted date: 2026-05-06
in scheme: BATAEL values as defined into the EC BAT-Tool

Manufacture of Glass - SO2 - BAT27-I
type: Concept
notation: GLS-SO2-BAT27-I
definition: 3, Mineral industry: 3,3 Manufacture of glass including glass fibre with a melting capacity exceeding 20 tonnes per day; Techniques (i)-(iii) (see table), and natural gas; Reducing sulphur oxides (SOx) emissions to air. The BAT-AEL emission level is < 300 - 500 mg/Nm3.
status: valid
status modified: 2026-05-06
accepted date: 2026-05-06
in scheme: BATAEL values as defined into the EC BAT-Tool

Manufacture of Glass - SO2 - BAT27-II
type: Concept
notation: GLS-SO2-BAT27-II
definition: 3, Mineral industry: 3,3 Manufacture of glass including glass fibre with a melting capacity exceeding 20 tonnes per day; Techniques (i)-(iii) (see table), and fuel oil; Reducing sulphur oxides (SOx) emissions to air. The BAT-AEL emission level is 500 - 1300 mg/Nm3.
status: valid
status modified: 2026-05-06
accepted date: 2026-05-06
in scheme: BATAEL values as defined into the EC BAT-Tool

Manufacture of Glass - SO2 - BAT27-III
type: Concept
notation: GLS-SO2-BAT27-III
definition: 3, Mineral industry: 3,3 Manufacture of glass including glass fibre with a melting capacity exceeding 20 tonnes per day; Techniques (i)-(iii) (see table), and natural gas; Reducing sulphur oxides (SOx) emissions to air. The BAT-AEL emission level is < 0,75 - 1,25 kg/t.
status: valid
status modified: 2026-05-06
accepted date: 2026-05-06
in scheme: BATAEL values as defined into the EC BAT-Tool

Manufacture of Glass - SO2 - BAT27-IV
type: Concept
notation: GLS-SO2-BAT27-IV
definition: 3, Mineral industry: 3,3 Manufacture of glass including glass fibre with a melting capacity exceeding 20 tonnes per day; Techniques (i)-(iii) (see table), and fuel oil; Reducing sulphur oxides (SOx) emissions to air. The BAT-AEL emission level is 1,25 - 3,25 kg/t.
status: valid
status modified: 2026-05-06
accepted date: 2026-05-06
in scheme: BATAEL values as defined into the EC BAT-Tool

Manufacture of Glass - SO2 - BAT31-IV
type: Concept
notation: GLS-SO2-BAT31-IV
definition: 3, Mineral industry: 3,3 Manufacture of glass including glass fibre with a melting capacity exceeding 20 tonnes per day; Techniques (i)-(iv) (see table); Reducing sulphur oxides (SOx) emissions to air. The BAT-AEL emission level is < 200 mg/Nm3.
status: valid
status modified: 2026-05-06
accepted date: 2026-05-06
in scheme: BATAEL values as defined into the EC BAT-Tool

Manufacture of Glass - SO2 - BAT34-I
type: Concept
notation: GLS-SO2-BAT34-I
definition: 3, Mineral industry: 3,3 Manufacture of glass including glass fibre with a melting capacity exceeding 20 tonnes per day; Techniques (i)-(iv) (see table), and natural gas; Reducing sulphur oxides (SOx) emissions to air. The BAT-AEL emission level is < 200 - 800 mg/Nm3.
status: valid
status modified: 2026-05-06
accepted date: 2026-05-06
in scheme: BATAEL values as defined into the EC BAT-Tool

Manufacture of Glass - SO2 - BAT34-II
type: Concept
notation: GLS-SO2-BAT34-II
definition: 3, Mineral industry: 3,3 Manufacture of glass including glass fibre with a melting capacity exceeding 20 tonnes per day; Techniques (i)-(iv) (see table), and fuel oil; Reducing sulphur oxides (SOx) emissions to air. The BAT-AEL emission level is < 500 - 1000 mg/Nm3.
status: valid
status modified: 2026-05-06
accepted date: 2026-05-06
in scheme: BATAEL values as defined into the EC BAT-Tool

Manufacture of Glass - SO2 - BAT34-III
type: Concept
notation: GLS-SO2-BAT34-III
definition: 3, Mineral industry: 3,3 Manufacture of glass including glass fibre with a melting capacity exceeding 20 tonnes per day; Techniques (i)-(iv) (see table), and natural gas; Reducing sulphur oxides (SOx) emissions to air. The BAT-AEL emission level is < 0,9 - 3,6 kg/t.
status: valid
status modified: 2026-05-06
accepted date: 2026-05-06
in scheme: BATAEL values as defined into the EC BAT-Tool

Manufacture of Glass - SO2 - BAT34-IV
type: Concept
notation: GLS-SO2-BAT34-IV
definition: 3, Mineral industry: 3,3 Manufacture of glass including glass fibre with a melting capacity exceeding 20 tonnes per day; Techniques (i)-(iv) (see table), and fuel oil; Reducing sulphur oxides (SOx) emissions to air. The BAT-AEL emission level is < 2,25 - 4,5 kg/t.
status: valid
status modified: 2026-05-06
accepted date: 2026-05-06
in scheme: BATAEL values as defined into the EC BAT-Tool

Manufacture of Glass - SO2 - BAT41-I
type: Concept
notation: GLS-SO2-BAT41-I
definition: 3, Mineral industry: 3,3 Manufacture of glass including glass fibre with a melting capacity exceeding 20 tonnes per day; Techniques (i)-(iii) (see table), and natural gas; Reducing sulphur oxides (SOx) emissions to air. The BAT-AEL emission level is < 200 - 300 mg/Nm3.
status: valid
status modified: 2026-05-06
accepted date: 2026-05-06
in scheme: BATAEL values as defined into the EC BAT-Tool

Manufacture of Glass - SO2 - BAT41-II
type: Concept
notation: GLS-SO2-BAT41-II
definition: 3, Mineral industry: 3,3 Manufacture of glass including glass fibre with a melting capacity exceeding 20 tonnes per day; Techniques (i)-(iii) (see table), and fuel oil; Reducing sulphur oxides (SOx) emissions to air. The BAT-AEL emission level is < 1000 mg/Nm3.
status: valid
status modified: 2026-05-06
accepted date: 2026-05-06
in scheme: BATAEL values as defined into the EC BAT-Tool

Manufacture of Glass - SO2 - BAT41-III
type: Concept
notation: GLS-SO2-BAT41-III
definition: 3, Mineral industry: 3,3 Manufacture of glass including glass fibre with a melting capacity exceeding 20 tonnes per day; Techniques (i)-(iii) (see table), and electric melting; Reducing sulphur oxides (SOx) emissions to air. The BAT-AEL emission level is < 100 mg/Nm3.
status: valid
status modified: 2026-05-06
accepted date: 2026-05-06
in scheme: BATAEL values as defined into the EC BAT-Tool

Manufacture of Glass - SO2 - BAT41-IV
type: Concept
notation: GLS-SO2-BAT41-IV
definition: 3, Mineral industry: 3,3 Manufacture of glass including glass fibre with a melting capacity exceeding 20 tonnes per day; Techniques (i)-(iii) (see table), and natural gas; Reducing sulphur oxides (SOx) emissions to air. The BAT-AEL emission level is < 0,5 - 0,75 kg/t.
status: valid
status modified: 2026-05-06
accepted date: 2026-05-06
in scheme: BATAEL values as defined into the EC BAT-Tool

Manufacture of Glass - SO2 - BAT41-V
type: Concept
notation: GLS-SO2-BAT41-V
definition: 3, Mineral industry: 3,3 Manufacture of glass including glass fibre with a melting capacity exceeding 20 tonnes per day; Techniques (i)-(iii) (see table), and fuel oil; Reducing sulphur oxides (SOx) emissions to air. The BAT-AEL emission level is < 2,5 kg/t.
status: valid
status modified: 2026-05-06
accepted date: 2026-05-06
in scheme: BATAEL values as defined into the EC BAT-Tool

Manufacture of Glass - SO2 - BAT41-VI
type: Concept
notation: GLS-SO2-BAT41-VI
definition: 3, Mineral industry: 3,3 Manufacture of glass including glass fibre with a melting capacity exceeding 20 tonnes per day; Techniques (i)-(iii) (see table), and electric melting; Reducing sulphur oxides (SOx) emissions to air. The BAT-AEL emission level is < 0,25 kg/t.
status: valid
status modified: 2026-05-06
accepted date: 2026-05-06
in scheme: BATAEL values as defined into the EC BAT-Tool

Manufacture of Glass - SO2 - BAT51-I
type: Concept
notation: GLS-SO2-BAT51-I
definition: 3, Mineral industry: 3,3 Manufacture of glass including glass fibre with a melting capacity exceeding 20 tonnes per day; Techniques (i)-(iii) (see table), and natural gas and/or electric melting; Reducing sulphur oxides (SOx) emissions to air. The BAT-AEL emission level is < 30 - 200 mg/Nm3.
status: valid
status modified: 2026-05-06
accepted date: 2026-05-06
in scheme: BATAEL values as defined into the EC BAT-Tool

Manufacture of Glass - SO2 - BAT51-II
type: Concept
notation: GLS-SO2-BAT51-II
definition: 3, Mineral industry: 3,3 Manufacture of glass including glass fibre with a melting capacity exceeding 20 tonnes per day; Techniques (i)-(iii) (see table), and fuel oil; Reducing sulphur oxides (SOx) emissions to air. The BAT-AEL emission level is 500 - 800 mg/Nm3.
status: valid
status modified: 2026-05-06
accepted date: 2026-05-06
in scheme: BATAEL values as defined into the EC BAT-Tool

Manufacture of Glass - SO2 - BAT51-III
type: Concept
notation: GLS-SO2-BAT51-III
definition: 3, Mineral industry: 3,3 Manufacture of glass including glass fibre with a melting capacity exceeding 20 tonnes per day; Techniques (i)-(iii) (see table), and natural gas and/or electric melting; Reducing sulphur oxides (SOx) emissions to air. The BAT-AEL emission level is < 0,08 - 0,5 kg/t.
status: valid
status modified: 2026-05-06
accepted date: 2026-05-06
in scheme: BATAEL values as defined into the EC BAT-Tool

Manufacture of Glass - SO2 - BAT51-IV
type: Concept
notation: GLS-SO2-BAT51-IV
definition: 3, Mineral industry: 3,3 Manufacture of glass including glass fibre with a melting capacity exceeding 20 tonnes per day; Techniques (i)-(iii) (see table), and fuel oil; Reducing sulphur oxides (SOx) emissions to air. The BAT-AEL emission level is 1,25 - 2 kg/t.
status: valid
status modified: 2026-05-06
accepted date: 2026-05-06
in scheme: BATAEL values as defined into the EC BAT-Tool

Manufacture of Glass - SO2 - BAT59-I
type: Concept
notation: GLS-SO2-BAT59-I
definition: 3, Mineral industry: 3,4 Melting mineral substances including the production of mineral fibres with a melting capacity exceeding 20�tonnes per day; Techniques (i)-(iv) (see table); for glass wool: Gas-fired and electric furnaces; Reducing sulphur oxides (SOx) emissions to air. The BAT-AEL emission level is < 50 - 150 mg/Nm3.
status: valid
status modified: 2026-05-06
accepted date: 2026-05-06
in scheme: BATAEL values as defined into the EC BAT-Tool

Manufacture of Glass - SO2 - BAT59-II
type: Concept
notation: GLS-SO2-BAT59-II
definition: 3, Mineral industry: 3,4 Melting mineral substances including the production of mineral fibres with a melting capacity exceeding 20�tonnes per day; Techniques (i)-(iv) (see table); for stone wool: Gas-fired and electric furnaces; Reducing sulphur oxides (SOx) emissions to air. The BAT-AEL emission level is < 350 mg/Nm3.
status: valid
status modified: 2026-05-06
accepted date: 2026-05-06
in scheme: BATAEL values as defined into the EC BAT-Tool

Manufacture of Glass - SO2 - BAT59-III
type: Concept
notation: GLS-SO2-BAT59-III
definition: 3, Mineral industry: 3,4 Melting mineral substances including the production of mineral fibres with a melting capacity exceeding 20�tonnes per day; Techniques (i)-(iv) (see table); for stone wool: Cupola furnaces, no briquettes or slag recycling; Reducing sulphur oxides (SOx) emissions to air. The BAT-AEL emission level is < 400 mg/Nm3.
status: valid
status modified: 2026-05-06
accepted date: 2026-05-06
in scheme: BATAEL values as defined into the EC BAT-Tool

Manufacture of Glass - SO2 - BAT59-IV
type: Concept
notation: GLS-SO2-BAT59-IV
definition: 3, Mineral industry: 3,4 Melting mineral substances including the production of mineral fibres with a melting capacity exceeding 20�tonnes per day; Techniques (i)-(iv) (see table); for stone wool: Cupola furnaces, with cement briquettes or slag recycling; Reducing sulphur oxides (SOx) emissions to air. The BAT-AEL emission level is < 1400 mg/Nm3.
status: valid
status modified: 2026-05-06
accepted date: 2026-05-06
in scheme: BATAEL values as defined into the EC BAT-Tool

Manufacture of Glass - SO2 - BAT59-V
type: Concept
notation: GLS-SO2-BAT59-V
definition: 3, Mineral industry: 3,4 Melting mineral substances including the production of mineral fibres with a melting capacity exceeding 20�tonnes per day; Techniques (i)-(iv) (see table); for glass wool: Gas-fired and electric furnaces; Reducing sulphur oxides (SOx) emissions to air. The BAT-AEL emission level is < 0,1 - 0,3 kg/t.
status: valid
status modified: 2026-05-06
accepted date: 2026-05-06
in scheme: BATAEL values as defined into the EC BAT-Tool

Manufacture of Glass - SO2 - BAT59-VI
type: Concept
notation: GLS-SO2-BAT59-VI
definition: 3, Mineral industry: 3,4 Melting mineral substances including the production of mineral fibres with a melting capacity exceeding 20�tonnes per day; Techniques (i)-(iv) (see table); for stone wool: Gas-fired and electric furnaces; Reducing sulphur oxides (SOx) emissions to air. The BAT-AEL emission level is < 0,9 kg/t.
status: valid
status modified: 2026-05-06
accepted date: 2026-05-06
in scheme: BATAEL values as defined into the EC BAT-Tool

Manufacture of Glass - SO2 - BAT59-VII
type: Concept
notation: GLS-SO2-BAT59-VII
definition: 3, Mineral industry: 3,4 Melting mineral substances including the production of mineral fibres with a melting capacity exceeding 20�tonnes per day; Techniques (i)-(iv) (see table); for stone wool: Cupola furnaces, no briquettes or slag recycling; Reducing sulphur oxides (SOx) emissions to air. The BAT-AEL emission level is < 1 kg/t.
status: valid
status modified: 2026-05-06
accepted date: 2026-05-06
in scheme: BATAEL values as defined into the EC BAT-Tool

Manufacture of Glass - SO2 - BAT59-VIII
type: Concept
notation: GLS-SO2-BAT59-VIII
definition: 3, Mineral industry: 3,4 Melting mineral substances including the production of mineral fibres with a melting capacity exceeding 20�tonnes per day; Techniques (i)-(iv) (see table); for stone wool: Cupola furnaces, with cement briquettes or slag recycling; Reducing sulphur oxides (SOx) emissions to air. The BAT-AEL emission level is < 3,5 kg/t.
status: valid
status modified: 2026-05-06
accepted date: 2026-05-06
in scheme: BATAEL values as defined into the EC BAT-Tool

Manufacture of Glass - SO2 - BAT67
type: Concept
notation: GLS-SO2-BAT67
definition: 3, Mineral industry: 3,4 Melting mineral substances including the production of mineral fibres with a melting capacity exceeding 20�tonnes per day; Primary techniques (i)-(ii) (see table); Reducing sulphur oxides (SOx) emissions to air. The BAT-AEL emission level is < 50 mg/Nm3.
status: valid
status modified: 2026-05-06
accepted date: 2026-05-06
in scheme: BATAEL values as defined into the EC BAT-Tool

Manufacture of Glass - SO2 - BAT73-I
type: Concept
notation: GLS-SO2-BAT73-I
definition: 3, Mineral industry: 3,4 Melting mineral substances including the production of mineral fibres with a melting capacity exceeding 20�tonnes per day; Techniques (i)-(iii) (see table); Reducing sulphur oxides (SOx) emissions to air. The BAT-AEL emission level is < 50 - 200 mg/Nm3.
status: valid
status modified: 2026-05-06
accepted date: 2026-05-06
in scheme: BATAEL values as defined into the EC BAT-Tool

Manufacture of Glass - SO2 - BAT73-II
type: Concept
notation: GLS-SO2-BAT73-II
definition: 3, Mineral industry: 3,4 Melting mineral substances including the production of mineral fibres with a melting capacity exceeding 20�tonnes per day; Techniques (i)-(iii) (see table); Reducing sulphur oxides (SOx) emissions to air. The BAT-AEL emission level is < 0,25 - 1,5 kg/t.
status: valid
status modified: 2026-05-06
accepted date: 2026-05-06
in scheme: BATAEL values as defined into the EC BAT-Tool

Manufacture of Glass - SO4 - BAT13-IV
type: Concept
notation: GLS-SO4-BAT13-IV
definition: 3, Mineral industry: 3,3 Manufacture of glass including glass fibre with a melting capacity exceeding 20 tonnes per day Reducing sulphates to water. The BAT-AEL emission level is < 1000 mg/l.
status: valid
status modified: 2026-05-06
accepted date: 2026-05-06
in scheme: BATAEL values as defined into the EC BAT-Tool

Manufacture of Glass - Sb - BAT13-VIII
type: Concept
notation: GLS-Sb-BAT13-VIII
definition: 3, Mineral industry: 3,3 Manufacture of glass including glass fibre with a melting capacity exceeding 20 tonnes per day Reducing antimony to water. The BAT-AEL emission level is < 0,5 mg/l.
status: valid
status modified: 2026-05-06
accepted date: 2026-05-06
in scheme: BATAEL values as defined into the EC BAT-Tool

Manufacture of Glass - Se - BAT30-I
type: Concept
notation: GLS-Se-BAT30-I
definition: 3, Mineral industry: 3,3 Manufacture of glass including glass fibre with a melting capacity exceeding 20 tonnes per day; Techniques (i)-(iii) (see table); Reducing selenium compounds emissions to air. The BAT-AEL emission level is 1 - 3 mg/Nm3.
status: valid
status modified: 2026-05-06
accepted date: 2026-05-06
in scheme: BATAEL values as defined into the EC BAT-Tool

Manufacture of Glass - Se - BAT30-II
type: Concept
notation: GLS-Se-BAT30-II
definition: 3, Mineral industry: 3,3 Manufacture of glass including glass fibre with a melting capacity exceeding 20 tonnes per day; Techniques (i)-(iii) (see table); Reducing selenium compounds emissions to air. The BAT-AEL emission level is 0,0025 - 0,0075 kg/t.
status: valid
status modified: 2026-05-06
accepted date: 2026-05-06
in scheme: BATAEL values as defined into the EC BAT-Tool

Manufacture of Glass - Se - BAT44-I
type: Concept
notation: GLS-Se-BAT44-I
definition: 3, Mineral industry: 3,3 Manufacture of glass including glass fibre with a melting capacity exceeding 20 tonnes per day; Techniques (i)-(ii) (see table); Reducing selenium compounds emissions to air. The BAT-AEL emission level is < 1 mg/Nm3.
status: valid
status modified: 2026-05-06
accepted date: 2026-05-06
in scheme: BATAEL values as defined into the EC BAT-Tool

Manufacture of Glass - Se - BAT44-II
type: Concept
notation: GLS-Se-BAT44-II
definition: 3, Mineral industry: 3,3 Manufacture of glass including glass fibre with a melting capacity exceeding 20 tonnes per day; Techniques (i)-(ii) (see table); Reducing selenium compounds emissions to air. The BAT-AEL emission level is < 0,003 kg/t.
status: valid
status modified: 2026-05-06
accepted date: 2026-05-06
in scheme: BATAEL values as defined into the EC BAT-Tool

Manufacture of Glass - Sn - BAT13-XV
type: Concept
notation: GLS-Sn-BAT13-XV
definition: 3, Mineral industry: 3,3 Manufacture of glass including glass fibre with a melting capacity exceeding 20 tonnes per day Reducing tin to water. The BAT-AEL emission level is < 0,5 mg/l.
status: valid
status modified: 2026-05-06
accepted date: 2026-05-06
in scheme: BATAEL values as defined into the EC BAT-Tool

Manufacture of Glass - Sn - BAT22-III
type: Concept
notation: GLS-Sn-BAT22-III
definition: 3, Mineral industry: 3,3 Manufacture of glass including glass fibre with a melting capacity exceeding 20 tonnes per day; Techniques (i)-(iii) (see table); Reducing tin compounds emissions to air. The BAT-AEL emission level is < 5 mg/Nm3.
status: valid
status modified: 2026-05-06
accepted date: 2026-05-06
in scheme: BATAEL values as defined into the EC BAT-Tool

Manufacture of Glass - THC - BAT13-VI
type: Concept
notation: GLS-THC-BAT13-VI
definition: 3, Mineral industry: 3,3 Manufacture of glass including glass fibre with a melting capacity exceeding 20 tonnes per day Reducing total hydrocarbons to water. The BAT-AEL emission level is < 15 mg/l.
status: valid
status modified: 2026-05-06
accepted date: 2026-05-06
in scheme: BATAEL values as defined into the EC BAT-Tool

Manufacture of Glass - TPM - BAT63-I
type: Concept
notation: GLS-TPM-BAT63-I
definition: 3, Mineral industry: 3,4 Melting mineral substances including the production of mineral fibres with a melting capacity exceeding 20�tonnes per day; Techniques (i)-(v) (see table); Reducing total particulate matter emissions to air. The BAT-AEL emission level is < 20 - 50 mg/Nm3.
status: valid
status modified: 2026-05-06
accepted date: 2026-05-06
in scheme: BATAEL values as defined into the EC BAT-Tool

Manufacture of Glass - TPM - BAT63-VII
type: Concept
notation: GLS-TPM-BAT63-VII
definition: 3, Mineral industry: 3,4 Melting mineral substances including the production of mineral fibres with a melting capacity exceeding 20�tonnes per day; Techniques (i)-(v) (see table); Reducing total particulate matter emissions to air. The BAT-AEL emission level is < 5 - 30 mg/Nm3.
status: valid
status modified: 2026-05-06
accepted date: 2026-05-06
in scheme: BATAEL values as defined into the EC BAT-Tool

Manufacture of Glass - TPM - BAT63-XIV
type: Concept
notation: GLS-TPM-BAT63-XIV
definition: 3, Mineral industry: 3,4 Melting mineral substances including the production of mineral fibres with a melting capacity exceeding 20�tonnes per day; Techniques (i)-(v) (see table); Reducing total particulate matter emissions to air. The BAT-AEL emission level is < 0,2 kg/t.
status: valid
status modified: 2026-05-06
accepted date: 2026-05-06
in scheme: BATAEL values as defined into the EC BAT-Tool

Manufacture of Glass - TSS - BAT13-II
type: Concept
notation: GLS-TSS-BAT13-II
definition: 3, Mineral industry: 3,3 Manufacture of glass including glass fibre with a melting capacity exceeding 20 tonnes per day Reducing total suspended solids to water. The BAT-AEL emission level is < 30 mg/l.
status: valid
status modified: 2026-05-06
accepted date: 2026-05-06
in scheme: BATAEL values as defined into the EC BAT-Tool

Manufacture of Glass - Ti - BAT22-II
type: Concept
notation: GLS-Ti-BAT22-II
definition: 3, Mineral industry: 3,3 Manufacture of glass including glass fibre with a melting capacity exceeding 20 tonnes per day; Techniques (i)-(iii) (see table); Reducing titanium compounds emissions to air. The BAT-AEL emission level is < 5 mg/Nm3.
status: valid
status modified: 2026-05-06
accepted date: 2026-05-06
in scheme: BATAEL values as defined into the EC BAT-Tool

Manufacture of Glass - Zn - BAT13-XI
type: Concept
notation: GLS-Zn-BAT13-XI
definition: 3, Mineral industry: 3,3 Manufacture of glass including glass fibre with a melting capacity exceeding 20 tonnes per day Reducing zinc to water. The BAT-AEL emission level is < 0,5 mg/l.
status: valid
status modified: 2026-05-06
accepted date: 2026-05-06
in scheme: BATAEL values as defined into the EC BAT-Tool

Manufacture of Glass - pH - BAT13-I
type: Concept
notation: GLS-pH-BAT13-I
definition: 3, Mineral industry: 3,3 Manufacture of glass including glass fibre with a melting capacity exceeding 20 tonnes per day Reducing pH to water. The BAT-AEL emission level is 6,5 � 9.
status: valid
status modified: 2026-05-06
accepted date: 2026-05-06
in scheme: BATAEL values as defined into the EC BAT-Tool

Intensive rearing of poultry or pigs - NH3 - BAT30-I
type: Concept
notation: IRPP-NH3-BAT30-I
definition: 6.� Other activities: 6.6 (c): Intensive rearing of poultry or pigs with more than 750 places for sows - mating and gestating sows; Techniques (a)-(e) (see table incl. footnote) for mating and gestating sows; Reducing ammonia emissions to air. The BAT-AEL emission level is 0,2-2,7 kg NH3/animal place/year.
status: valid
status modified: 2026-05-06
accepted date: 2026-05-06
in scheme: BATAEL values as defined into the EC BAT-Tool

Intensive rearing of poultry or pigs - NH3 - BAT30-II
type: Concept
notation: IRPP-NH3-BAT30-II
definition: 6.� Other activities: 6.6 (c): Intensive rearing of poultry or pigs with more than 750 places for sows - farrowing sows (including piglets) in crates; Techniques (a)-(e) (see table incl. footnote) for farrowing sows (including piglets) in crates; Reducing ammonia emissions to air. The BAT-AEL emission level is 0,4-5,6 kg NH3/animal place/year.
status: valid
status modified: 2026-05-06
accepted date: 2026-05-06
in scheme: BATAEL values as defined into the EC BAT-Tool

Intensive rearing of poultry or pigs - NH3 - BAT30-III
type: Concept
notation: IRPP-NH3-BAT30-III
definition: 6.� Other activities: 6.6 (c): Intensive rearing of poultry or pigs with more than 750 places for sows - weaners; Techniques (a)-(e) (see table incl. footnote) for weaners; Reducing ammonia emissions to air. The BAT-AEL emission level is 0,03-0,53 kg NH3/animal place/year.
status: valid
status modified: 2026-05-06
accepted date: 2026-05-06
in scheme: BATAEL values as defined into the EC BAT-Tool

Intensive rearing of poultry or pigs - NH3 - BAT30-IV
type: Concept
notation: IRPP-NH3-BAT30-IV
definition: 6.� Other activities: 6.6 (b): Intensive rearing of poultry or pigs with more than 2 000 places for production pigs (over 30 kg) - fattening pigs; Techniques (a)-(e) (see table incl. footnote) for fattening pigs; Reducing ammonia emissions to air. The BAT-AEL emission level is 0,1-2,6 kg NH3/animal place/year.
status: valid
status modified: 2026-05-06
accepted date: 2026-05-06
in scheme: BATAEL values as defined into the EC BAT-Tool

Intensive rearing of poultry or pigs - NH3 - BAT31-I
type: Concept
notation: IRPP-NH3-BAT31-I
definition: 6.� Other activities: 6.6 (a): Intensive rearing of poultry or pigs with more than 40 000 places for poultry; Techniques (a)-(c) (see table incl. footnote) for fattening pigs for cage systems; Reducing ammonia emissions to air. The BAT-AEL emission level is 0,02-0,08 kg NH3/animal place/year.
status: valid
status modified: 2026-05-06
accepted date: 2026-05-06
in scheme: BATAEL values as defined into the EC BAT-Tool

Intensive rearing of poultry or pigs - NH3 - BAT31-II
type: Concept
notation: IRPP-NH3-BAT31-II
definition: 6.� Other activities: 6.6 (a): Intensive rearing of poultry or pigs with more than 40 000 places for poultry; Techniques (a)-(c) (see table incl. footnote) for fattening pigs for non-cage systems; Reducing ammonia emissions to air. The BAT-AEL emission level is 0,02-0,13 kg NH3/animal place/year.
status: valid
status modified: 2026-05-06
accepted date: 2026-05-06
in scheme: BATAEL values as defined into the EC BAT-Tool

Intensive rearing of poultry or pigs - NH3 - BAT32
type: Concept
notation: IRPP-NH3-BAT32
definition: 6.� Other activities: 6.6 (a): Intensive rearing of poultry or pigs with more than 40 000 places for poultry; Techniques (a)-(f) (see table incl. footnote); Reducing ammonia emissions to air. The BAT-AEL emission level is 0,01-0,08 kg NH3/animal place/year.
status: valid
status modified: 2026-05-06
accepted date: 2026-05-06
in scheme: BATAEL values as defined into the EC BAT-Tool

Iron and Steel Production - BOD5 - BAT56-II
type: Concept
notation: IS-BOD5-BAT56-II
definition: 1, Energy industries undertaking activities related to 2.2: 1,3 Production of coke Reducing biological oxygen demand for 5 days (BOD5) to water. The BAT-AEL emission level is < 20 mg/l.
status: valid
status modified: 2026-05-06
accepted date: 2026-05-06
in scheme: BATAEL values as defined into the EC BAT-Tool

Iron and Steel Production - CN - BAT56-V
type: Concept
notation: IS-CN-BAT56-V
definition: 1, Energy industries undertaking activities related to 2.2: 1,3 Production of coke Reducing cyanide (CN-) to water. The BAT-AEL emission level is < 0,1 mg/l.
status: valid
status modified: 2026-05-06
accepted date: 2026-05-06
in scheme: BATAEL values as defined into the EC BAT-Tool

Iron and Steel Production - CN - BAT67-V
type: Concept
notation: IS-CN-BAT67-V
definition: 2, Production and processing of metals: 2,2 Production of pig iron or steel (primary or secondary fusion) including continuous casting, with a capacity exceeding 2,5�tonnes per hour Reducing cyanide (CN-) to water. The BAT-AEL emission level is < 0,4 mg/l.
status: valid
status modified: 2026-05-06
accepted date: 2026-05-06
in scheme: BATAEL values as defined into the EC BAT-Tool

Iron and Steel Production - COD - BAT28-II
type: Concept
notation: IS-COD-BAT28-II
definition: 2, Production and processing of metals: 2,1 Metal ore (including sulphide ore) roasting or sintering Reducing chemical oxygen demand (COD) to water. The BAT-AEL emission level is < 100 mg/l.
status: valid
status modified: 2026-05-06
accepted date: 2026-05-06
in scheme: BATAEL values as defined into the EC BAT-Tool

Iron and Steel Production - COD - BAT39-II
type: Concept
notation: IS-COD-BAT39-II
definition: 2, Production and processing of metals: 2,1 Metal ore (including sulphide ore) roasting or sintering Reducing chemical oxygen demand (COD) to water. The BAT-AEL emission level is < 160 mg/l.
status: valid
status modified: 2026-05-06
accepted date: 2026-05-06
in scheme: BATAEL values as defined into the EC BAT-Tool

Iron and Steel Production - COD - BAT56-I
type: Concept
notation: IS-COD-BAT56-I
definition: 1, Energy industries undertaking activities related to 2.2: 1,3 Production of coke Reducing chemical oxygen demand (COD) to water. The BAT-AEL emission level is < 220 mg/l.
status: valid
status modified: 2026-05-06
accepted date: 2026-05-06
in scheme: BATAEL values as defined into the EC BAT-Tool

Iron and Steel Production - Cr - BAT81-V
type: Concept
notation: IS-Cr-BAT81-V
definition: 2, Production and processing of metals: 2,2 Production of pig iron or steel (primary or secondary fusion) including continuous casting, with a capacity exceeding 2,5�tonnes per hour Reducing total chromium to water. The BAT-AEL emission level is < 0,5 mg/l.
status: valid
status modified: 2026-05-06
accepted date: 2026-05-06
in scheme: BATAEL values as defined into the EC BAT-Tool

Iron and Steel Production - Cr - BAT92-V
type: Concept
notation: IS-Cr-BAT92-V
definition: 2, Production and processing of metals: 2,2 Production of pig iron or steel (primary or secondary fusion) including continuous casting, with a capacity exceeding 2,5�tonnes per hour Reducing total chromium to water. The BAT-AEL emission level is < 0,5 mg/l.
status: valid
status modified: 2026-05-06
accepted date: 2026-05-06
in scheme: BATAEL values as defined into the EC BAT-Tool

Iron and Steel Production - Dust - BAT20-I
type: Concept
notation: IS-Dust-BAT20-I
definition: 2, Production and processing of metals: 2,1 Metal ore (including sulphide ore) roasting or sintering; Bag filter for new and existing plants; Reducing dust emissions to air. The BAT-AEL emission level is < 1 - 15 mg/Nm3.
status: valid
status modified: 2026-05-06
accepted date: 2026-05-06
in scheme: BATAEL values as defined into the EC BAT-Tool

Iron and Steel Production - Dust - BAT20-II
type: Concept
notation: IS-Dust-BAT20-II
definition: 2, Production and processing of metals: 2,1 Metal ore (including sulphide ore) roasting or sintering; Advanced electrostatic precipitators for existing plants, when bag filters are not applicable; Reducing dust emissions to air. The BAT-AEL emission level is < 20 - 40 mg/Nm3.
status: valid
status modified: 2026-05-06
accepted date: 2026-05-06
in scheme: BATAEL values as defined into the EC BAT-Tool

Iron and Steel Production - Dust - BAT26-I
type: Concept
notation: IS-Dust-BAT26-I
definition: 2, Production and processing of metals: 2,1 Metal ore (including sulphide ore) roasting or sintering; Bag filter; Reducing dust emissions to air. The BAT-AEL emission level is < 10 mg/Nm3.
status: valid
status modified: 2026-05-06
accepted date: 2026-05-06
in scheme: BATAEL values as defined into the EC BAT-Tool

Iron and Steel Production - Dust - BAT26-II
type: Concept
notation: IS-Dust-BAT26-II
definition: 2, Production and processing of metals: 2,1 Metal ore (including sulphide ore) roasting or sintering; Electrostatic precipitator; Reducing dust emissions to air. The BAT-AEL emission level is < 30 mg/Nm3.
status: valid
status modified: 2026-05-06
accepted date: 2026-05-06
in scheme: BATAEL values as defined into the EC BAT-Tool

Iron and Steel Production - Dust - BAT33-I
type: Concept
notation: IS-Dust-BAT33-I
definition: 2, Production and processing of metals: 2,1 Metal ore (including sulphide ore) roasting or sintering; Crushing, grinding and drying; Reducing dust emissions to air. The BAT-AEL emission level is < 20 mg/Nm3.
status: valid
status modified: 2026-05-06
accepted date: 2026-05-06
in scheme: BATAEL values as defined into the EC BAT-Tool

Iron and Steel Production - Dust - BAT33-II
type: Concept
notation: IS-Dust-BAT33-II
definition: 2, Production and processing of metals: 2,1 Metal ore (including sulphide ore) roasting or sintering; All other process steps or where all waste gases are treated together; Reducing dust emissions to air. The BAT-AEL emission level is < 10 - 15 mg/Nm3.
status: valid
status modified: 2026-05-06
accepted date: 2026-05-06
in scheme: BATAEL values as defined into the EC BAT-Tool

Iron and Steel Production - Dust - BAT42
type: Concept
notation: IS-Dust-BAT42
definition: 1, Energy industries undertaking activities related to 2.2: 1,3 Production of coke; Coal grinding plants, techniques (I.)-(II.) (see list); Reducing dust emissions to air. The BAT-AEL emission level is < 10 - 20 mg/Nm3.
status: valid
status modified: 2026-05-06
accepted date: 2026-05-06
in scheme: BATAEL values as defined into the EC BAT-Tool

Iron and Steel Production - Dust - BAT43
type: Concept
notation: IS-Dust-BAT43
definition: 1, Energy industries undertaking activities related to 2.2: 1,3 Production of coke; Using efficient extraction and subsequent dedusting (technique (V.); Reducing dust emissions to air. The BAT-AEL emission level is < 10 - 20 mg/Nm3.
status: valid
status modified: 2026-05-06
accepted date: 2026-05-06
in scheme: BATAEL values as defined into the EC BAT-Tool

Iron and Steel Production - Dust - BAT44-I
type: Concept
notation: IS-Dust-BAT44-I
definition: 1, Energy industries undertaking activities related to 2.2: 1,3 Production of coke; Coal charging systems with land-based treatment of extracted gases; Reducing dust emissions to air. The BAT-AEL emission level is < 5 g/t.
status: valid
status modified: 2026-05-06
accepted date: 2026-05-06
in scheme: BATAEL values as defined into the EC BAT-Tool

Iron and Steel Production - Dust - BAT44-II
type: Concept
notation: IS-Dust-BAT44-II
definition: 1, Energy industries undertaking activities related to 2.2: 1,3 Production of coke; Coal charging systems with land-based treatment of extracted gases; Reducing dust emissions to air. The BAT-AEL emission level is < 50 mg/Nm3.
status: valid
status modified: 2026-05-06
accepted date: 2026-05-06
in scheme: BATAEL values as defined into the EC BAT-Tool

Iron and Steel Production - Dust - BAT49-II
type: Concept
notation: IS-Dust-BAT49-II
definition: 1, Energy industries undertaking activities related to 2.2: 1,3 Production of coke; Techniques (I.)-(IV.) (see list); Reducing dust emissions to air. The BAT-AEL emission level is < 1 - 20 mg/Nm3.
status: valid
status modified: 2026-05-06
accepted date: 2026-05-06
in scheme: BATAEL values as defined into the EC BAT-Tool

Iron and Steel Production - Dust - BAT50-I
type: Concept
notation: IS-Dust-BAT50-I
definition: 1, Energy industries undertaking activities related to 2.2: 1,3 Production of coke; Bag filters; Reducing dust emissions to air. The BAT-AEL emission level is < 10 mg/Nm3.
status: valid
status modified: 2026-05-06
accepted date: 2026-05-06
in scheme: BATAEL values as defined into the EC BAT-Tool

Iron and Steel Production - Dust - BAT50-II
type: Concept
notation: IS-Dust-BAT50-II
definition: 1, Energy industries undertaking activities related to 2.2: 1,3 Production of coke; Other cases; Reducing dust emissions to air. The BAT-AEL emission level is < 20 mg/Nm3.
status: valid
status modified: 2026-05-06
accepted date: 2026-05-06
in scheme: BATAEL values as defined into the EC BAT-Tool

Iron and Steel Production - Dust - BAT51-I
type: Concept
notation: IS-Dust-BAT51-I
definition: 1, Energy industries undertaking activities related to 2.2: 1,3 Production of coke; Coke dry quenching (CDQ); Reducing dust emissions to air. The BAT-AEL emission level is < 20 mg/Nm3.
status: valid
status modified: 2026-05-06
accepted date: 2026-05-06
in scheme: BATAEL values as defined into the EC BAT-Tool

Iron and Steel Production - Dust - BAT51-II
type: Concept
notation: IS-Dust-BAT51-II
definition: 1, Energy industries undertaking activities related to 2.2: 1,3 Production of coke; Emission-minimised conventional wet quenching; Reducing dust emissions to air. The BAT-AEL emission level is < 25 g/t.
status: valid
status modified: 2026-05-06
accepted date: 2026-05-06
in scheme: BATAEL values as defined into the EC BAT-Tool

Iron and Steel Production - Dust - BAT51-III
type: Concept
notation: IS-Dust-BAT51-III
definition: 1, Energy industries undertaking activities related to 2.2: 1,3 Production of coke; Coke stabilisation quenching (CSQ); Reducing dust emissions to air. The BAT-AEL emission level is < 10 g/t.
status: valid
status modified: 2026-05-06
accepted date: 2026-05-06
in scheme: BATAEL values as defined into the EC BAT-Tool

Iron and Steel Production - Dust - BAT52
type: Concept
notation: IS-Dust-BAT52
definition: 1, Energy industries undertaking activities related to 2.2: 1,3 Production of coke; Techniques (I.)-(II.) (see list); Reducing dust emissions to air. The BAT-AEL emission level is < 10 mg/Nm3.
status: valid
status modified: 2026-05-06
accepted date: 2026-05-06
in scheme: BATAEL values as defined into the EC BAT-Tool

Iron and Steel Production - Dust - BAT59
type: Concept
notation: IS-Dust-BAT59
definition: 2, Production and processing of metals: 2,2 Production of pig iron or steel (primary or secondary fusion) including continuous casting, with a capacity exceeding 2,5�tonnes per hour; Dust capture and dry dedusting; Reducing dust emissions to air. The BAT-AEL emission level is < 20 mg/Nm3.
status: valid
status modified: 2026-05-06
accepted date: 2026-05-06
in scheme: BATAEL values as defined into the EC BAT-Tool

Iron and Steel Production - Dust - BAT61
type: Concept
notation: IS-Dust-BAT61
definition: 2, Production and processing of metals: 2,2 Production of pig iron or steel (primary or secondary fusion) including continuous casting, with a capacity exceeding 2,5�tonnes per hour; BAT II (see list); Reducing dust emissions to air. The BAT-AEL emission level is < 1 - 15 mg/Nm3.
status: valid
status modified: 2026-05-06
accepted date: 2026-05-06
in scheme: BATAEL values as defined into the EC BAT-Tool

Iron and Steel Production - Dust - BAT64
type: Concept
notation: IS-Dust-BAT64
definition: 2, Production and processing of metals: 2,2 Production of pig iron or steel (primary or secondary fusion) including continuous casting, with a capacity exceeding 2,5�tonnes per hour; Techniques (I)-(II) (see list); Reducing dust emissions to air. The BAT-AEL emission level is < 10 mg/Nm3 .
status: valid
status modified: 2026-05-06
accepted date: 2026-05-06
in scheme: BATAEL values as defined into the EC BAT-Tool

Iron and Steel Production - Dust - BAT65-II
type: Concept
notation: IS-Dust-BAT65-II
definition: 2, Production and processing of metals: 2,2 Production of pig iron or steel (primary or secondary fusion) including continuous casting, with a capacity exceeding 2,5�tonnes per hour; Desulphurised and dedusted surplus coke oven gas, dedusted blast furnace gas, dedusted basic oxygen furnace gas and natural gas; Reducing dust emissions to air. The BAT-AEL emission level is < 10 mg/Nm3.
status: valid
status modified: 2026-05-06
accepted date: 2026-05-06
in scheme: BATAEL values as defined into the EC BAT-Tool

Iron and Steel Production - Dust - BAT75-I
type: Concept
notation: IS-Dust-BAT75-I
definition: 2, Production and processing of metals: 2,2 Production of pig iron or steel (primary or secondary fusion) including continuous casting, with a capacity exceeding 2,5�tonnes per hour; BAT III.i (see list); Reducing dust emissions to air. The BAT-AEL emission level is 10 � 30 mg/Nm3 .
status: valid
status modified: 2026-05-06
accepted date: 2026-05-06
in scheme: BATAEL values as defined into the EC BAT-Tool

Iron and Steel Production - Dust - BAT75-II
type: Concept
notation: IS-Dust-BAT75-II
definition: 2, Production and processing of metals: 2,2 Production of pig iron or steel (primary or secondary fusion) including continuous casting, with a capacity exceeding 2,5�tonnes per hour; BAT III.ii (see list); Reducing dust emissions to air. The BAT-AEL emission level is < 50 mg/Nm3 .
status: valid
status modified: 2026-05-06
accepted date: 2026-05-06
in scheme: BATAEL values as defined into the EC BAT-Tool

Iron and Steel Production - Dust - BAT76-I
type: Concept
notation: IS-Dust-BAT76-I
definition: 2, Production and processing of metals: 2,2 Production of pig iron or steel (primary or secondary fusion) including continuous casting, with a capacity exceeding 2,5�tonnes per hour; BAT I (see list) for new and existing plants; Reducing dust emissions to air. The BAT-AEL emission level is 10 - 30 mg/Nm3.
status: valid
status modified: 2026-05-06
accepted date: 2026-05-06
in scheme: BATAEL values as defined into the EC BAT-Tool

Iron and Steel Production - Dust - BAT76-II
type: Concept
notation: IS-Dust-BAT76-II
definition: 2, Production and processing of metals: 2,2 Production of pig iron or steel (primary or secondary fusion) including continuous casting, with a capacity exceeding 2,5�tonnes per hour; BAT II (see list) for existing plants; Reducing dust emissions to air. The BAT-AEL emission level is < 50 mg/Nm3.
status: valid
status modified: 2026-05-06
accepted date: 2026-05-06
in scheme: BATAEL values as defined into the EC BAT-Tool

Iron and Steel Production - Dust - BAT78-I
type: Concept
notation: IS-Dust-BAT78-I
definition: 2, Production and processing of metals: 2,2 Production of pig iron or steel (primary or secondary fusion) including continuous casting, with a capacity exceeding 2,5�tonnes per hour; Bag filter; Reducing dust emissions to air. The BAT-AEL emission level is < 1 - 15 mg/Nm3.
status: valid
status modified: 2026-05-06
accepted date: 2026-05-06
in scheme: BATAEL values as defined into the EC BAT-Tool

Iron and Steel Production - Dust - BAT78-II
type: Concept
notation: IS-Dust-BAT78-II
definition: 2, Production and processing of metals: 2,2 Production of pig iron or steel (primary or secondary fusion) including continuous casting, with a capacity exceeding 2,5�tonnes per hour; ESP; Reducing dust emissions to air. The BAT-AEL emission level is < 20 mg/Nm3.
status: valid
status modified: 2026-05-06
accepted date: 2026-05-06
in scheme: BATAEL values as defined into the EC BAT-Tool

Iron and Steel Production - Dust - BAT78-III
type: Concept
notation: IS-Dust-BAT78-III
definition: 2, Production and processing of metals: 2,2 Production of pig iron or steel (primary or secondary fusion) including continuous casting, with a capacity exceeding 2,5�tonnes per hour; Bag filter; Reducing dust emissions to air. The BAT-AEL emission level is < 1 - 10 mg/Nm3.
status: valid
status modified: 2026-05-06
accepted date: 2026-05-06
in scheme: BATAEL values as defined into the EC BAT-Tool

Iron and Steel Production - Dust - BAT78-IV
type: Concept
notation: IS-Dust-BAT78-IV
definition: 2, Production and processing of metals: 2,2 Production of pig iron or steel (primary or secondary fusion) including continuous casting, with a capacity exceeding 2,5�tonnes per hour; ESP; Reducing dust emissions to air. The BAT-AEL emission level is < 20 mg/Nm3.
status: valid
status modified: 2026-05-06
accepted date: 2026-05-06
in scheme: BATAEL values as defined into the EC BAT-Tool

Iron and Steel Production - Dust - BAT79
type: Concept
notation: IS-Dust-BAT79
definition: 2, Production and processing of metals: 2,2 Production of pig iron or steel (primary or secondary fusion) including continuous casting, with a capacity exceeding 2,5�tonnes per hour; BAT I (see list); Reducing dust emissions to air. The BAT-AEL emission level is < 10 - 20 mg/Nm3.
status: valid
status modified: 2026-05-06
accepted date: 2026-05-06
in scheme: BATAEL values as defined into the EC BAT-Tool

Iron and Steel Production - Dust - BAT88-I
type: Concept
notation: IS-Dust-BAT88-I
definition: 2, Production and processing of metals: 2,2 Production of pig iron or steel (primary or secondary fusion) including continuous casting, with a capacity exceeding 2,5�tonnes per hour; Techniques (I.)-(III.) (see list) and dedusting by bag filter; Reducing dust emissions to air. The BAT-AEL emission level is < 5 mg/Nm3.
status: valid
status modified: 2026-05-06
accepted date: 2026-05-06
in scheme: BATAEL values as defined into the EC BAT-Tool

Iron and Steel Production - Dust - BAT90
type: Concept
notation: IS-Dust-BAT90
definition: 2, Production and processing of metals: 2,2 Production of pig iron or steel (primary or secondary fusion) including continuous casting, with a capacity exceeding 2,5�tonnes per hour; BAT I; Reducing dust emissions to air. The BAT-AEL emission level is < 10 - 20 mg/Nm3.
status: valid
status modified: 2026-05-06
accepted date: 2026-05-06
in scheme: BATAEL values as defined into the EC BAT-Tool

Iron and Steel Production - Fe - BAT67-II
type: Concept
notation: IS-Fe-BAT67-II
definition: 2, Production and processing of metals: 2,2 Production of pig iron or steel (primary or secondary fusion) including continuous casting, with a capacity exceeding 2,5�tonnes per hour Reducing iron to water. The BAT-AEL emission level is < 5 mg/l.
status: valid
status modified: 2026-05-06
accepted date: 2026-05-06
in scheme: BATAEL values as defined into the EC BAT-Tool

Iron and Steel Production - Fe - BAT81-II
type: Concept
notation: IS-Fe-BAT81-II
definition: 2, Production and processing of metals: 2,2 Production of pig iron or steel (primary or secondary fusion) including continuous casting, with a capacity exceeding 2,5�tonnes per hour Reducing iron to water. The BAT-AEL emission level is < 5 mg/l.
status: valid
status modified: 2026-05-06
accepted date: 2026-05-06
in scheme: BATAEL values as defined into the EC BAT-Tool

Iron and Steel Production - Fe - BAT92-II
type: Concept
notation: IS-Fe-BAT92-II
definition: 2, Production and processing of metals: 2,2 Production of pig iron or steel (primary or secondary fusion) including continuous casting, with a capacity exceeding 2,5�tonnes per hour Reducing iron to water. The BAT-AEL emission level is < 5 mg/l.
status: valid
status modified: 2026-05-06
accepted date: 2026-05-06
in scheme: BATAEL values as defined into the EC BAT-Tool

Iron and Steel Production - H2S - BAT48-I
type: Concept
notation: IS-H2S-BAT48-I
definition: 1, Energy industries undertaking activities related to 2.2: 1,3 Production of coke; Technique (I.) (see list); Reducing hydrogen sulphide emissions to air. The BAT-AEL emission level is < 300 � 1 000 mg/Nm3.
status: valid
status modified: 2026-05-06
accepted date: 2026-05-06
in scheme: BATAEL values as defined into the EC BAT-Tool

Iron and Steel Production - H2S - BAT48-II
type: Concept
notation: IS-H2S-BAT48-II
definition: 1, Energy industries undertaking activities related to 2.2: 1,3 Production of coke; Technique (II.) (see list); Reducing hydrogen sulphide emissions to air. The BAT-AEL emission level is < 10 mg/Nm3 .
status: valid
status modified: 2026-05-06
accepted date: 2026-05-06
in scheme: BATAEL values as defined into the EC BAT-Tool

Iron and Steel Production - HCl - BAT34-III
type: Concept
notation: IS-HCl-BAT34-III
definition: 2, Production and processing of metals: 2,1 Metal ore (including sulphide ore) roasting or sintering; Wet scrubber, semi-dry absorption with a subsequent dedusting system; Reducing hydrogen chloride (HCl) emissions to air. The BAT-AEL emission level is < 1 - 3 mg/Nm3.
status: valid
status modified: 2026-05-06
accepted date: 2026-05-06
in scheme: BATAEL values as defined into the EC BAT-Tool

Iron and Steel Production - HF - BAT34-II
type: Concept
notation: IS-HF-BAT34-II
definition: 2, Production and processing of metals: 2,1 Metal ore (including sulphide ore) roasting or sintering; Wet scrubber, semi-dry absorption with a subsequent dedusting system; Reducing hydrogen fluoride (HF) emissions to air. The BAT-AEL emission level is < 1 - 3 mg/Nm3.
status: valid
status modified: 2026-05-06
accepted date: 2026-05-06
in scheme: BATAEL values as defined into the EC BAT-Tool

Iron and Steel Production - Hg - BAT21
type: Concept
notation: IS-Hg-BAT21
definition: 2, Production and processing of metals: 2,1 Metal ore (including sulphide ore) roasting or sintering; Waste gas treatment with activated carbon or lignite coke injection; Reducing mercury emissions to air. The BAT-AEL emission level is < 0,03 - 0,05 mg/Nm3.
status: valid
status modified: 2026-05-06
accepted date: 2026-05-06
in scheme: BATAEL values as defined into the EC BAT-Tool

Iron and Steel Production - Hg - BAT88-II
type: Concept
notation: IS-Hg-BAT88-II
definition: 2, Production and processing of metals: 2,2 Production of pig iron or steel (primary or secondary fusion) including continuous casting, with a capacity exceeding 2,5�tonnes per hour; Techniques (I.)-(III.) (see list) and dedusting by bag filter; Reducing mercury emissions to air. The BAT-AEL emission level is < 0,05 mg/Nm3.
status: valid
status modified: 2026-05-06
accepted date: 2026-05-06
in scheme: BATAEL values as defined into the EC BAT-Tool

Iron and Steel Production - Metals - BAT28-III
type: Concept
notation: IS-Metals-BAT28-III
definition: 2, Production and processing of metals: 2,1 Metal ore (including sulphide ore) roasting or sintering Reducing heavy metals to water. The BAT-AEL emission level is < 0,1 mg/l.
status: valid
status modified: 2026-05-06
accepted date: 2026-05-06
in scheme: BATAEL values as defined into the EC BAT-Tool

Iron and Steel Production - Metals - BAT39-IV
type: Concept
notation: IS-Metals-BAT39-IV
definition: 2, Production and processing of metals: 2,1 Metal ore (including sulphide ore) roasting or sintering Reducing heavy metals to water. The BAT-AEL emission level is < 0,55 mg/l.
status: valid
status modified: 2026-05-06
accepted date: 2026-05-06
in scheme: BATAEL values as defined into the EC BAT-Tool

Iron and Steel Production - NO2 - BAT23-I
type: Concept
notation: IS-NO2-BAT23-I
definition: 2, Production and processing of metals: 2,1 Metal ore (including sulphide ore) roasting or sintering; Process integrated measures (I.); Reducing nitrogen oxides (NOx) emissions to air. The BAT-AEL emission level is < 500 mg/Nm3.
status: valid
status modified: 2026-05-06
accepted date: 2026-05-06
in scheme: BATAEL values as defined into the EC BAT-Tool

Iron and Steel Production - NO2 - BAT23-II
type: Concept
notation: IS-NO2-BAT23-II
definition: 2, Production and processing of metals: 2,1 Metal ore (including sulphide ore) roasting or sintering; RAC (II.i); Reducing nitrogen oxides (NOx) emissions to air. The BAT-AEL emission level is < 250 mg/Nm3.
status: valid
status modified: 2026-05-06
accepted date: 2026-05-06
in scheme: BATAEL values as defined into the EC BAT-Tool

Iron and Steel Production - NO2 - BAT23-III
type: Concept
notation: IS-NO2-BAT23-III
definition: 2, Production and processing of metals: 2,1 Metal ore (including sulphide ore) roasting or sintering; SCR (II.ii); Reducing nitrogen oxides (NOx) emissions to air. The BAT-AEL emission level is < 120 mg/Nm3.
status: valid
status modified: 2026-05-06
accepted date: 2026-05-06
in scheme: BATAEL values as defined into the EC BAT-Tool

Iron and Steel Production - NO2 - BAT49-III
type: Concept
notation: IS-NO2-BAT49-III
definition: 1, Energy industries undertaking activities related to 2.2: 1,3 Production of coke; Techniques (I.)-(IV.) (see list) for New or substantially revamped plants (< 10 years old); Reducing nitrogen oxides (NOx) emissions to air. The BAT-AEL emission level is < 350 - 500 mg/Nm3.
status: valid
status modified: 2026-05-06
accepted date: 2026-05-06
in scheme: BATAEL values as defined into the EC BAT-Tool

Iron and Steel Production - NO2 - BAT49-IV
type: Concept
notation: IS-NO2-BAT49-IV
definition: 1, Energy industries undertaking activities related to 2.2: 1,3 Production of coke; Techniques (I.)-(IV.) (see list) for Older plants (> 10 years old); Reducing nitrogen oxides (NOx) emissions to air. The BAT-AEL emission level is 500 - 650 mg/Nm3.
status: valid
status modified: 2026-05-06
accepted date: 2026-05-06
in scheme: BATAEL values as defined into the EC BAT-Tool

Iron and Steel Production - NO2 - BAT65-III
type: Concept
notation: IS-NO2-BAT65-III
definition: 2, Production and processing of metals: 2,2 Production of pig iron or steel (primary or secondary fusion) including continuous casting, with a capacity exceeding 2,5�tonnes per hour; Desulphurised and dedusted surplus coke oven gas, dedusted blast furnace gas, dedusted basic oxygen furnace gas and natural gas; Reducing nitrogen oxides (NOx) emissions to air. The BAT-AEL emission level is < 100 mg/Nm3.
status: valid
status modified: 2026-05-06
accepted date: 2026-05-06
in scheme: BATAEL values as defined into the EC BAT-Tool

Iron and Steel Production - Ni - BAT81-IV
type: Concept
notation: IS-Ni-BAT81-IV
definition: 2, Production and processing of metals: 2,2 Production of pig iron or steel (primary or secondary fusion) including continuous casting, with a capacity exceeding 2,5�tonnes per hour Reducing nickel to water. The BAT-AEL emission level is < 0,5 mg/l.
status: valid
status modified: 2026-05-06
accepted date: 2026-05-06
in scheme: BATAEL values as defined into the EC BAT-Tool

Iron and Steel Production - Ni - BAT92-IV
type: Concept
notation: IS-Ni-BAT92-IV
definition: 2, Production and processing of metals: 2,2 Production of pig iron or steel (primary or secondary fusion) including continuous casting, with a capacity exceeding 2,5�tonnes per hour Reducing nickel to water. The BAT-AEL emission level is < 0,5 mg/l.
status: valid
status modified: 2026-05-06
accepted date: 2026-05-06
in scheme: BATAEL values as defined into the EC BAT-Tool

Iron and Steel Production - PAH - BAT56-VI
type: Concept
notation: IS-PAH-BAT56-VI
definition: 1, Energy industries undertaking activities related to 2.2: 1,3 Production of coke Reducing polycyclic aromatic hydrocarbons (PAH) to water. The BAT-AEL emission level is < 0,05 mg/l.
status: valid
status modified: 2026-05-06
accepted date: 2026-05-06
in scheme: BATAEL values as defined into the EC BAT-Tool

Iron and Steel Production - PCDD.F - BAT25-I
type: Concept
notation: IS-PCDD.F-BAT25-I
definition: 2, Production and processing of metals: 2,1 Metal ore (including sulphide ore) roasting or sintering; Bag filter; Reducing polychlorinated dibenzodioxins/ furans (PCDD/F) emissions to air. The BAT-AEL emission level is < 0,05 - 0,2 ng/Nm3.
status: valid
status modified: 2026-05-06
accepted date: 2026-05-06
in scheme: BATAEL values as defined into the EC BAT-Tool

Iron and Steel Production - PCDD.F - BAT25-II
type: Concept
notation: IS-PCDD.F-BAT25-II
definition: 2, Production and processing of metals: 2,1 Metal ore (including sulphide ore) roasting or sintering; Advanced electrostatic precipitator; Reducing polychlorinated dibenzodioxins/ furans (PCDD/F) emissions to air. The BAT-AEL emission level is < 0,2 - 0,4 ng/Nm3.
status: valid
status modified: 2026-05-06
accepted date: 2026-05-06
in scheme: BATAEL values as defined into the EC BAT-Tool

Iron and Steel Production - PCDD.F - BAT89
type: Concept
notation: IS-PCDD.F-BAT89
definition: 2, Production and processing of metals: 2,2 Production of pig iron or steel (primary or secondary fusion) including continuous casting, with a capacity exceeding 2,5�tonnes per hour; Techniques (I.)-(III.) (see list); Reducing polychlorinated dibenzodioxins/ furans (PCDD/F) emissions to air. The BAT-AEL emission level is < 0,1 ng/Nm3.
status: valid
status modified: 2026-05-06
accepted date: 2026-05-06
in scheme: BATAEL values as defined into the EC BAT-Tool

Iron and Steel Production - Pb - BAT67-III
type: Concept
notation: IS-Pb-BAT67-III
definition: 2, Production and processing of metals: 2,2 Production of pig iron or steel (primary or secondary fusion) including continuous casting, with a capacity exceeding 2,5�tonnes per hour Reducing lead to water. The BAT-AEL emission level is < 0,5 mg/l.
status: valid
status modified: 2026-05-06
accepted date: 2026-05-06
in scheme: BATAEL values as defined into the EC BAT-Tool

Iron and Steel Production - Phenols - BAT56-VII
type: Concept
notation: IS-Phenols-BAT56-VII
definition: 1, Energy industries undertaking activities related to 2.2: 1,3 Production of coke Reducing phenols to water. The BAT-AEL emission level is < 0,5 mg/l.
status: valid
status modified: 2026-05-06
accepted date: 2026-05-06
in scheme: BATAEL values as defined into the EC BAT-Tool

Iron and Steel Production - S - BAT56-III
type: Concept
notation: IS-S-BAT56-III
definition: 1, Energy industries undertaking activities related to 2.2: 1,3 Production of coke Reducing sulphides to water. The BAT-AEL emission level is < 0,1 mg/l.
status: valid
status modified: 2026-05-06
accepted date: 2026-05-06
in scheme: BATAEL values as defined into the EC BAT-Tool

Iron and Steel Production - SCN - BAT56-IV
type: Concept
notation: IS-SCN-BAT56-IV
definition: 1, Energy industries undertaking activities related to 2.2: 1,3 Production of coke Reducing thiocyanate (SCN-) to water. The BAT-AEL emission level is < 4 mg/l.
status: valid
status modified: 2026-05-06
accepted date: 2026-05-06
in scheme: BATAEL values as defined into the EC BAT-Tool

Iron and Steel Production - SO2 - BAT22-I
type: Concept
notation: IS-SO2-BAT22-I
definition: 2, Production and processing of metals: 2,1 Metal ore (including sulphide ore) roasting or sintering; BAT I - IV (see list); Reducing sulphur oxides (SOx) emissions to air. The BAT-AEL emission level is < 350 - 500 mg/Nm3.
status: valid
status modified: 2026-05-06
accepted date: 2026-05-06
in scheme: BATAEL values as defined into the EC BAT-Tool

Iron and Steel Production - SO2 - BAT22-II
type: Concept
notation: IS-SO2-BAT22-II
definition: 2, Production and processing of metals: 2,1 Metal ore (including sulphide ore) roasting or sintering; BAT V (see list); Reducing sulphur oxides (SOx) emissions to air. The BAT-AEL emission level is < 100 mg/Nm3.
status: valid
status modified: 2026-05-06
accepted date: 2026-05-06
in scheme: BATAEL values as defined into the EC BAT-Tool

Iron and Steel Production - SO2 - BAT34-I
type: Concept
notation: IS-SO2-BAT34-I
definition: 2, Production and processing of metals: 2,1 Metal ore (including sulphide ore) roasting or sintering; Wet scrubber, semi-dry absorption with a subsequent dedusting system; Reducing sulphur oxides (SOx) emissions to air. The BAT-AEL emission level is < 30 - 50 mg/Nm3.
status: valid
status modified: 2026-05-06
accepted date: 2026-05-06
in scheme: BATAEL values as defined into the EC BAT-Tool

Iron and Steel Production - SO2 - BAT49-I
type: Concept
notation: IS-SO2-BAT49-I
definition: 1, Energy industries undertaking activities related to 2.2: 1,3 Production of coke; Techniques (I.)-(IV.) (see list); Reducing sulphur oxides (SOx) emissions to air. The BAT-AEL emission level is < 200 - 500 mg/Nm3.
status: valid
status modified: 2026-05-06
accepted date: 2026-05-06
in scheme: BATAEL values as defined into the EC BAT-Tool

Iron and Steel Production - SO2 - BAT65-I
type: Concept
notation: IS-SO2-BAT65-I
definition: 2, Production and processing of metals: 2,2 Production of pig iron or steel (primary or secondary fusion) including continuous casting, with a capacity exceeding 2,5�tonnes per hour; Desulphurised and dedusted surplus coke oven gas, dedusted blast furnace gas, dedusted basic oxygen furnace gas and natural gas; Reducing sulphur oxides (SOx) emissions to air. The BAT-AEL emission level is < 200 mg/Nm3.
status: valid
status modified: 2026-05-06
accepted date: 2026-05-06
in scheme: BATAEL values as defined into the EC BAT-Tool

Iron and Steel Production - SS - BAT28-I
type: Concept
notation: IS-SS-BAT28-I
definition: 2, Production and processing of metals: 2,1 Metal ore (including sulphide ore) roasting or sintering Reducing suspended solids to water. The BAT-AEL emission level is < 30 mg/l.
status: valid
status modified: 2026-05-06
accepted date: 2026-05-06
in scheme: BATAEL values as defined into the EC BAT-Tool

Iron and Steel Production - SS - BAT39-I
type: Concept
notation: IS-SS-BAT39-I
definition: 2, Production and processing of metals: 2,1 Metal ore (including sulphide ore) roasting or sintering Reducing suspended solids to water. The BAT-AEL emission level is < 50 mg/l.
status: valid
status modified: 2026-05-06
accepted date: 2026-05-06
in scheme: BATAEL values as defined into the EC BAT-Tool

Iron and Steel Production - SS - BAT67-I
type: Concept
notation: IS-SS-BAT67-I
definition: 2, Production and processing of metals: 2,2 Production of pig iron or steel (primary or secondary fusion) including continuous casting, with a capacity exceeding 2,5�tonnes per hour Reducing suspended solids to water. The BAT-AEL emission level is < 30 mg/l.
status: valid
status modified: 2026-05-06
accepted date: 2026-05-06
in scheme: BATAEL values as defined into the EC BAT-Tool

Iron and Steel Production - SS - BAT81-I
type: Concept
notation: IS-SS-BAT81-I
definition: 2, Production and processing of metals: 2,2 Production of pig iron or steel (primary or secondary fusion) including continuous casting, with a capacity exceeding 2,5�tonnes per hour Reducing suspended solids to water. The BAT-AEL emission level is < 20 mg/l.
status: valid
status modified: 2026-05-06
accepted date: 2026-05-06
in scheme: BATAEL values as defined into the EC BAT-Tool

Iron and Steel Production - SS - BAT92-I
type: Concept
notation: IS-SS-BAT92-I
definition: 2, Production and processing of metals: 2,2 Production of pig iron or steel (primary or secondary fusion) including continuous casting, with a capacity exceeding 2,5�tonnes per hour Reducing suspended solids to water. The BAT-AEL emission level is < 20 mg/l.
status: valid
status modified: 2026-05-06
accepted date: 2026-05-06
in scheme: BATAEL values as defined into the EC BAT-Tool

Iron and Steel Production - THC - BAT81-VI
type: Concept
notation: IS-THC-BAT81-VI
definition: 2, Production and processing of metals: 2,2 Production of pig iron or steel (primary or secondary fusion) including continuous casting, with a capacity exceeding 2,5�tonnes per hour Reducing total hydrocarbons to water. The BAT-AEL emission level is < 5 mg/l.
status: valid
status modified: 2026-05-06
accepted date: 2026-05-06
in scheme: BATAEL values as defined into the EC BAT-Tool

Iron and Steel Production - THC - BAT92-VI
type: Concept
notation: IS-THC-BAT92-VI
definition: 2, Production and processing of metals: 2,2 Production of pig iron or steel (primary or secondary fusion) including continuous casting, with a capacity exceeding 2,5�tonnes per hour Reducing total hydrocarbons to water. The BAT-AEL emission level is < 5 mg/l.
status: valid
status modified: 2026-05-06
accepted date: 2026-05-06
in scheme: BATAEL values as defined into the EC BAT-Tool

Iron and Steel Production - TKN - BAT39-III
type: Concept
notation: IS-TKN-BAT39-III
definition: 2, Production and processing of metals: 2,1 Metal ore (including sulphide ore) roasting or sintering Reducing kjeldahl nitrogen to water. The BAT-AEL emission level is < 45 mg/l.
status: valid
status modified: 2026-05-06
accepted date: 2026-05-06
in scheme: BATAEL values as defined into the EC BAT-Tool

Iron and Steel Production - TN - BAT56-VIII
type: Concept
notation: IS-TN-BAT56-VIII
definition: 1, Energy industries undertaking activities related to 2.2: 1,3 Production of coke Reducing sum of ammonia-nitrogen (NH4+ - N), nitrate-nitrogen (NO3- - N) and nitrite-nitrogen (NO2- - N) to water. The BAT-AEL emission level is < 15 - 50 mg/l.
status: valid
status modified: 2026-05-06
accepted date: 2026-05-06
in scheme: BATAEL values as defined into the EC BAT-Tool

Iron and Steel Production - Zn - BAT67-IV
type: Concept
notation: IS-Zn-BAT67-IV
definition: 2, Production and processing of metals: 2,2 Production of pig iron or steel (primary or secondary fusion) including continuous casting, with a capacity exceeding 2,5�tonnes per hour Reducing zinc to water. The BAT-AEL emission level is < 2 mg/l.
status: valid
status modified: 2026-05-06
accepted date: 2026-05-06
in scheme: BATAEL values as defined into the EC BAT-Tool

Iron and Steel Production - Zn - BAT81-III
type: Concept
notation: IS-Zn-BAT81-III
definition: 2, Production and processing of metals: 2,2 Production of pig iron or steel (primary or secondary fusion) including continuous casting, with a capacity exceeding 2,5�tonnes per hour Reducing zinc to water. The BAT-AEL emission level is < 2 mg/l.
status: valid
status modified: 2026-05-06
accepted date: 2026-05-06
in scheme: BATAEL values as defined into the EC BAT-Tool

Iron and Steel Production - Zn - BAT92-III
type: Concept
notation: IS-Zn-BAT92-III
definition: 2, Production and processing of metals: 2,2 Production of pig iron or steel (primary or secondary fusion) including continuous casting, with a capacity exceeding 2,5�tonnes per hour Reducing zinc to water. The BAT-AEL emission level is < 2 mg/l.
status: valid
status modified: 2026-05-06
accepted date: 2026-05-06
in scheme: BATAEL values as defined into the EC BAT-Tool

Large combustion plants - As - BAT15-VIII
type: Concept
notation: LCP-As-BAT15-VIII
definition: 1.� Energy industries; 5.� Waste management: 1.1, Combustion of fuels in installations with a total rated thermal input of 50 MW or more, only when this activity takes place in combustion plants with a total rated thermal input of 50 MW or more; 1.4, Gasification of coal or other fuels in installations with a total rated thermal input of 20 MW or more, only when this activity is directly associated to a combustion plant; 5.2, Disposal or recovery of waste in waste co-incineration plants for non-hazardous waste with a capacity exceeding 3 tonnes per hour or for hazardous waste with a capacity exceeding 10 tonnes per day, only when this activity takes place in combustion plants covered under 1.1 above. Reducing arsenic to water. The BAT-AEL emission level is 10�50 �g/l .
status: valid
status modified: 2026-05-06
accepted date: 2026-05-06
in scheme: BATAEL values as defined into the EC BAT-Tool

Large combustion plants - CH4 - BAT45-II
type: Concept
notation: LCP-CH4-BAT45-II
definition: 1. Energy industries: 1.1, Combustion of fuels in installations with a total rated thermal input of 50 MW or more, only when this activity takes place in combustion plants with a total rated thermal input of 50 MW or more; Ensure optimised combustion and/or to use oxidation catalysts for Existing plant; Reducing methane emissions to air. The BAT-AEL emission level is 215�560 mg/Nm3.
status: valid
status modified: 2026-05-06
accepted date: 2026-05-06
in scheme: BATAEL values as defined into the EC BAT-Tool

Large combustion plants - CH4 - BAT45-III
type: Concept
notation: LCP-CH4-BAT45-III
definition: #N/A
status: valid
status modified: 2026-05-06
accepted date: 2026-05-06
in scheme: BATAEL values as defined into the EC BAT-Tool

Large combustion plants - Dust - BAT22-I
type: Concept
notation: LCP-Dust-BAT22-I
definition: 1. Energy industries: 1.1, Combustion of fuels in installations with a total rated thermal input of 50 MW or more, only when this activity takes place in combustion plants with a total rated thermal input of 50 MW or more; Techniques (a)-(e) (see table) for New plant; Reducing dust emissions to air. The BAT-AEL emission level is 2�5 mg/Nm3.
status: valid
status modified: 2026-05-06
accepted date: 2026-05-06
in scheme: BATAEL values as defined into the EC BAT-Tool

Large combustion plants - Dust - BAT22-II
type: Concept
notation: LCP-Dust-BAT22-II
definition: 1. Energy industries: 1.1, Combustion of fuels in installations with a total rated thermal input of 50 MW or more, only when this activity takes place in combustion plants with a total rated thermal input of 50 MW or more; Techniques (a)-(e) (see table) for Existing plant; Reducing dust emissions to air. The BAT-AEL emission level is 2�18 mg/Nm3.
status: valid
status modified: 2026-05-06
accepted date: 2026-05-06
in scheme: BATAEL values as defined into the EC BAT-Tool

Large combustion plants - Dust - BAT22-III
type: Concept
notation: LCP-Dust-BAT22-III
definition: 1. Energy industries: 1.1, Combustion of fuels in installations with a total rated thermal input of 50 MW or more, only when this activity takes place in combustion plants with a total rated thermal input of 50 MW or more; Techniques (a)-(e) (see table) for New plant; Reducing dust emissions to air. The BAT-AEL emission level is 4�16 mg/Nm3.
status: valid
status modified: 2026-05-06
accepted date: 2026-05-06
in scheme: BATAEL values as defined into the EC BAT-Tool

Large combustion plants - Dust - BAT22-IV
type: Concept
notation: LCP-Dust-BAT22-IV
definition: 1. Energy industries: 1.1, Combustion of fuels in installations with a total rated thermal input of 50 MW or more, only when this activity takes place in combustion plants with a total rated thermal input of 50 MW or more; Techniques (a)-(e) (see table) for Existing plant; Reducing dust emissions to air. The BAT-AEL emission level is 4�22 mg/Nm3.
status: valid
status modified: 2026-05-06
accepted date: 2026-05-06
in scheme: BATAEL values as defined into the EC BAT-Tool

Large combustion plants - Dust - BAT22-IX
type: Concept
notation: LCP-Dust-BAT22-IX
definition: 1. Energy industries: 1.1, Combustion of fuels in installations with a total rated thermal input of 50 MW or more, only when this activity takes place in combustion plants with a total rated thermal input of 50 MW or more; Techniques (a)-(e) (see table) for New plant; Reducing dust emissions to air. The BAT-AEL emission level is 2�5 mg/Nm3.
status: valid
status modified: 2026-05-06
accepted date: 2026-05-06
in scheme: BATAEL values as defined into the EC BAT-Tool

Large combustion plants - COD - BAT15-II
type: Concept
notation: LCP-COD-BAT15-II
definition: 1.� Energy industries; 5.� Waste management: 1.1, Combustion of fuels in installations with a total rated thermal input of 50 MW or more, only when this activity takes place in combustion plants with a total rated thermal input of 50 MW or more; 1.4, Gasification of coal or other fuels in installations with a total rated thermal input of 20 MW or more, only when this activity is directly associated to a combustion plant; 5.2, Disposal or recovery of waste in waste co-incineration plants for non-hazardous waste with a capacity exceeding 3 tonnes per hour or for hazardous waste with a capacity exceeding 10 tonnes per day, only when this activity takes place in combustion plants covered under 1.1 above. Reducing chemical oxygen demand (COD) to water. The BAT-AEL emission level is 60�150 mg/l .
status: valid
status modified: 2026-05-06
accepted date: 2026-05-06
in scheme: BATAEL values as defined into the EC BAT-Tool

Large combustion plants - Cd - BAT15-IX
type: Concept
notation: LCP-Cd-BAT15-IX
definition: 1.� Energy industries; 5.� Waste management: 1.1, Combustion of fuels in installations with a total rated thermal input of 50 MW or more, only when this activity takes place in combustion plants with a total rated thermal input of 50 MW or more; 1.4, Gasification of coal or other fuels in installations with a total rated thermal input of 20 MW or more, only when this activity is directly associated to a combustion plant; 5.2, Disposal or recovery of waste in waste co-incineration plants for non-hazardous waste with a capacity exceeding 3 tonnes per hour or for hazardous waste with a capacity exceeding 10 tonnes per day, only when this activity takes place in combustion plants covered under 1.1 above. Reducing cadmium to water. The BAT-AEL emission level is 2�5 �g/l .
status: valid
status modified: 2026-05-06
accepted date: 2026-05-06
in scheme: BATAEL values as defined into the EC BAT-Tool

Large combustion plants - Cr - BAT15-X
type: Concept
notation: LCP-Cr-BAT15-X
definition: 1.� Energy industries; 5.� Waste management: 1.1, Combustion of fuels in installations with a total rated thermal input of 50 MW or more, only when this activity takes place in combustion plants with a total rated thermal input of 50 MW or more; 1.4, Gasification of coal or other fuels in installations with a total rated thermal input of 20 MW or more, only when this activity is directly associated to a combustion plant; 5.2, Disposal or recovery of waste in waste co-incineration plants for non-hazardous waste with a capacity exceeding 3 tonnes per hour or for hazardous waste with a capacity exceeding 10 tonnes per day, only when this activity takes place in combustion plants covered under 1.1 above. Reducing chromium to water. The BAT-AEL emission level is 10�50 �g/l .
status: valid
status modified: 2026-05-06
accepted date: 2026-05-06
in scheme: BATAEL values as defined into the EC BAT-Tool

Large combustion plants - Cu - BAT15-XI
type: Concept
notation: LCP-Cu-BAT15-XI
definition: 1.� Energy industries; 5.� Waste management: 1.1, Combustion of fuels in installations with a total rated thermal input of 50 MW or more, only when this activity takes place in combustion plants with a total rated thermal input of 50 MW or more; 1.4, Gasification of coal or other fuels in installations with a total rated thermal input of 20 MW or more, only when this activity is directly associated to a combustion plant; 5.2, Disposal or recovery of waste in waste co-incineration plants for non-hazardous waste with a capacity exceeding 3 tonnes per hour or for hazardous waste with a capacity exceeding 10 tonnes per day, only when this activity takes place in combustion plants covered under 1.1 above. Reducing copper to water. The BAT-AEL emission level is 10�50 �g/l .
status: valid
status modified: 2026-05-06
accepted date: 2026-05-06
in scheme: BATAEL values as defined into the EC BAT-Tool

Large combustion plants - Dust - BAT22-V
type: Concept
notation: LCP-Dust-BAT22-V
definition: 1. Energy industries: 1.1, Combustion of fuels in installations with a total rated thermal input of 50 MW or more, only when this activity takes place in combustion plants with a total rated thermal input of 50 MW or more; Techniques (a)-(e) (see table) for New plant; Reducing dust emissions to air. The BAT-AEL emission level is 2�5 mg/Nm3.
status: valid
status modified: 2026-05-06
accepted date: 2026-05-06
in scheme: BATAEL values as defined into the EC BAT-Tool

Large combustion plants - Dust - BAT22-VI
type: Concept
notation: LCP-Dust-BAT22-VI
definition: 1. Energy industries: 1.1, Combustion of fuels in installations with a total rated thermal input of 50 MW or more, only when this activity takes place in combustion plants with a total rated thermal input of 50 MW or more; Techniques (a)-(e) (see table) for Existing plant; Reducing dust emissions to air. The BAT-AEL emission level is 2�14 mg/Nm3.
status: valid
status modified: 2026-05-06
accepted date: 2026-05-06
in scheme: BATAEL values as defined into the EC BAT-Tool

Large combustion plants - Dust - BAT22-VII
type: Concept
notation: LCP-Dust-BAT22-VII
definition: 1. Energy industries: 1.1, Combustion of fuels in installations with a total rated thermal input of 50 MW or more, only when this activity takes place in combustion plants with a total rated thermal input of 50 MW or more; Techniques (a)-(e) (see table) for New plant; Reducing dust emissions to air. The BAT-AEL emission level is 3�15 mg/Nm3.
status: valid
status modified: 2026-05-06
accepted date: 2026-05-06
in scheme: BATAEL values as defined into the EC BAT-Tool

Large combustion plants - Dust - BAT22-VIII
type: Concept
notation: LCP-Dust-BAT22-VIII
definition: 1. Energy industries: 1.1, Combustion of fuels in installations with a total rated thermal input of 50 MW or more, only when this activity takes place in combustion plants with a total rated thermal input of 50 MW or more; Techniques (a)-(e) (see table) for Existing plant; Reducing dust emissions to air. The BAT-AEL emission level is 4�22 mg/Nm3.
status: valid
status modified: 2026-05-06
accepted date: 2026-05-06
in scheme: BATAEL values as defined into the EC BAT-Tool

Large combustion plants - Dust - BAT22-X
type: Concept
notation: LCP-Dust-BAT22-X
definition: 1. Energy industries: 1.1, Combustion of fuels in installations with a total rated thermal input of 50 MW or more, only when this activity takes place in combustion plants with a total rated thermal input of 50 MW or more; Techniques (a)-(e) (see table) for Existing plant; Reducing dust emissions to air. The BAT-AEL emission level is 2�10 mg/Nm3.
status: valid
status modified: 2026-05-06
accepted date: 2026-05-06
in scheme: BATAEL values as defined into the EC BAT-Tool

Large combustion plants - Dust - BAT22-XI
type: Concept
notation: LCP-Dust-BAT22-XI
definition: 1. Energy industries: 1.1, Combustion of fuels in installations with a total rated thermal input of 50 MW or more, only when this activity takes place in combustion plants with a total rated thermal input of 50 MW or more; Techniques (a)-(e) (see table) for New plant; Reducing dust emissions to air. The BAT-AEL emission level is 3�15 mg/Nm3.
status: valid
status modified: 2026-05-06
accepted date: 2026-05-06
in scheme: BATAEL values as defined into the EC BAT-Tool

Large combustion plants - Dust - BAT22-XII
type: Concept
notation: LCP-Dust-BAT22-XII
definition: 1. Energy industries: 1.1, Combustion of fuels in installations with a total rated thermal input of 50 MW or more, only when this activity takes place in combustion plants with a total rated thermal input of 50 MW or more; Techniques (a)-(e) (see table) for Existing plant; Reducing dust emissions to air. The BAT-AEL emission level is 4�22 mg/Nm3.
status: valid
status modified: 2026-05-06
accepted date: 2026-05-06
in scheme: BATAEL values as defined into the EC BAT-Tool

Large combustion plants - Dust - BAT22-XIII
type: Concept
notation: LCP-Dust-BAT22-XIII
definition: 1. Energy industries: 1.1, Combustion of fuels in installations with a total rated thermal input of 50 MW or more, only when this activity takes place in combustion plants with a total rated thermal input of 50 MW or more; Techniques (a)-(e) (see table) for New plant; Reducing dust emissions to air. The BAT-AEL emission level is 2�5 mg/Nm3.
status: valid
status modified: 2026-05-06
accepted date: 2026-05-06
in scheme: BATAEL values as defined into the EC BAT-Tool

Large combustion plants - Dust - BAT22-XIV
type: Concept
notation: LCP-Dust-BAT22-XIV
definition: 1. Energy industries: 1.1, Combustion of fuels in installations with a total rated thermal input of 50 MW or more, only when this activity takes place in combustion plants with a total rated thermal input of 50 MW or more; Techniques (a)-(e) (see table) for Existing plant; Reducing dust emissions to air. The BAT-AEL emission level is 2�8 mg/Nm3.
status: valid
status modified: 2026-05-06
accepted date: 2026-05-06
in scheme: BATAEL values as defined into the EC BAT-Tool

Large combustion plants - Dust - BAT22-XV
type: Concept
notation: LCP-Dust-BAT22-XV
definition: 1. Energy industries: 1.1, Combustion of fuels in installations with a total rated thermal input of 50 MW or more, only when this activity takes place in combustion plants with a total rated thermal input of 50 MW or more; Techniques (a)-(e) (see table) for New plant; Reducing dust emissions to air. The BAT-AEL emission level is 3�10 mg/Nm3.
status: valid
status modified: 2026-05-06
accepted date: 2026-05-06
in scheme: BATAEL values as defined into the EC BAT-Tool

Large combustion plants - Dust - BAT22-XVI
type: Concept
notation: LCP-Dust-BAT22-XVI
definition: 1. Energy industries: 1.1, Combustion of fuels in installations with a total rated thermal input of 50 MW or more, only when this activity takes place in combustion plants with a total rated thermal input of 50 MW or more; Techniques (a)-(e) (see table) for Existing plant; Reducing dust emissions to air. The BAT-AEL emission level is 3�11 mg/Nm3.
status: valid
status modified: 2026-05-06
accepted date: 2026-05-06
in scheme: BATAEL values as defined into the EC BAT-Tool

Large combustion plants - Dust - BAT26-I
type: Concept
notation: LCP-Dust-BAT26-I
definition: 1. Energy industries: 1.1, Combustion of fuels in installations with a total rated thermal input of 50 MW or more, only when this activity takes place in combustion plants with a total rated thermal input of 50 MW or more; Techniques (a)-(e) (see table) for New plant; Reducing dust emissions to air. The BAT-AEL emission level is 2�5 mg/Nm3.
status: valid
status modified: 2026-05-06
accepted date: 2026-05-06
in scheme: BATAEL values as defined into the EC BAT-Tool

Large combustion plants - Dust - BAT26-II
type: Concept
notation: LCP-Dust-BAT26-II
definition: 1. Energy industries: 1.1, Combustion of fuels in installations with a total rated thermal input of 50 MW or more, only when this activity takes place in combustion plants with a total rated thermal input of 50 MW or more; Techniques (a)-(e) (see table) for Existing plant; Reducing dust emissions to air. The BAT-AEL emission level is 2�15 mg/Nm3.
status: valid
status modified: 2026-05-06
accepted date: 2026-05-06
in scheme: BATAEL values as defined into the EC BAT-Tool

Large combustion plants - Dust - BAT26-III
type: Concept
notation: LCP-Dust-BAT26-III
definition: 1. Energy industries: 1.1, Combustion of fuels in installations with a total rated thermal input of 50 MW or more, only when this activity takes place in combustion plants with a total rated thermal input of 50 MW or more; Techniques (a)-(e) (see table) for New plant; Reducing dust emissions to air. The BAT-AEL emission level is 2�10 mg/Nm3.
status: valid
status modified: 2026-05-06
accepted date: 2026-05-06
in scheme: BATAEL values as defined into the EC BAT-Tool

Large combustion plants - Dust - BAT26-IV
type: Concept
notation: LCP-Dust-BAT26-IV
definition: 1. Energy industries: 1.1, Combustion of fuels in installations with a total rated thermal input of 50 MW or more, only when this activity takes place in combustion plants with a total rated thermal input of 50 MW or more; Techniques (a)-(e) (see table) for Existing plant; Reducing dust emissions to air. The BAT-AEL emission level is 2�22 mg/Nm3.
status: valid
status modified: 2026-05-06
accepted date: 2026-05-06
in scheme: BATAEL values as defined into the EC BAT-Tool

Large combustion plants - Dust - BAT26-IX
type: Concept
notation: LCP-Dust-BAT26-IX
definition: 1. Energy industries: 1.1, Combustion of fuels in installations with a total rated thermal input of 50 MW or more, only when this activity takes place in combustion plants with a total rated thermal input of 50 MW or more; Techniques (a)-(e) (see table) for New plant; Reducing dust emissions to air. The BAT-AEL emission level is 2�5 mg/Nm3.
status: valid
status modified: 2026-05-06
accepted date: 2026-05-06
in scheme: BATAEL values as defined into the EC BAT-Tool

Large combustion plants - Dust - BAT26-V
type: Concept
notation: LCP-Dust-BAT26-V
definition: 1. Energy industries: 1.1, Combustion of fuels in installations with a total rated thermal input of 50 MW or more, only when this activity takes place in combustion plants with a total rated thermal input of 50 MW or more; Techniques (a)-(e) (see table) for New plant; Reducing dust emissions to air. The BAT-AEL emission level is 2�5 mg/Nm3.
status: valid
status modified: 2026-05-06
accepted date: 2026-05-06
in scheme: BATAEL values as defined into the EC BAT-Tool

Large combustion plants - Dust - BAT26-VI
type: Concept
notation: LCP-Dust-BAT26-VI
definition: 1. Energy industries: 1.1, Combustion of fuels in installations with a total rated thermal input of 50 MW or more, only when this activity takes place in combustion plants with a total rated thermal input of 50 MW or more; Techniques (a)-(e) (see table) for Existing plant; Reducing dust emissions to air. The BAT-AEL emission level is 2�12 mg/Nm3.
status: valid
status modified: 2026-05-06
accepted date: 2026-05-06
in scheme: BATAEL values as defined into the EC BAT-Tool

Large combustion plants - Dust - BAT26-VII
type: Concept
notation: LCP-Dust-BAT26-VII
definition: 1. Energy industries: 1.1, Combustion of fuels in installations with a total rated thermal input of 50 MW or more, only when this activity takes place in combustion plants with a total rated thermal input of 50 MW or more; Techniques (a)-(e) (see table) for New plant; Reducing dust emissions to air. The BAT-AEL emission level is 2�10 mg/Nm3.
status: valid
status modified: 2026-05-06
accepted date: 2026-05-06
in scheme: BATAEL values as defined into the EC BAT-Tool

Large combustion plants - Dust - BAT26-VIII
type: Concept
notation: LCP-Dust-BAT26-VIII
definition: 1. Energy industries: 1.1, Combustion of fuels in installations with a total rated thermal input of 50 MW or more, only when this activity takes place in combustion plants with a total rated thermal input of 50 MW or more; Techniques (a)-(e) (see table) for Existing plant; Reducing dust emissions to air. The BAT-AEL emission level is 2�18 mg/Nm3.
status: valid
status modified: 2026-05-06
accepted date: 2026-05-06
in scheme: BATAEL values as defined into the EC BAT-Tool

Large combustion plants - Dust - BAT26-X
type: Concept
notation: LCP-Dust-BAT26-X
definition: 1. Energy industries: 1.1, Combustion of fuels in installations with a total rated thermal input of 50 MW or more, only when this activity takes place in combustion plants with a total rated thermal input of 50 MW or more; Techniques (a)-(e) (see table) for Existing plant; Reducing dust emissions to air. The BAT-AEL emission level is 2�10 mg/Nm3.
status: valid
status modified: 2026-05-06
accepted date: 2026-05-06
in scheme: BATAEL values as defined into the EC BAT-Tool

Large combustion plants - Dust - BAT26-XI
type: Concept
notation: LCP-Dust-BAT26-XI
definition: 1. Energy industries: 1.1, Combustion of fuels in installations with a total rated thermal input of 50 MW or more, only when this activity takes place in combustion plants with a total rated thermal input of 50 MW or more; Techniques (a)-(e) (see table) for New plant; Reducing dust emissions to air. The BAT-AEL emission level is 2�10 mg/Nm3.
status: valid
status modified: 2026-05-06
accepted date: 2026-05-06
in scheme: BATAEL values as defined into the EC BAT-Tool

Large combustion plants - Dust - BAT26-XII
type: Concept
notation: LCP-Dust-BAT26-XII
definition: 1. Energy industries: 1.1, Combustion of fuels in installations with a total rated thermal input of 50 MW or more, only when this activity takes place in combustion plants with a total rated thermal input of 50 MW or more; Techniques (a)-(e) (see table) for Existing plant; Reducing dust emissions to air. The BAT-AEL emission level is 2�16 mg/Nm3.
status: valid
status modified: 2026-05-06
accepted date: 2026-05-06
in scheme: BATAEL values as defined into the EC BAT-Tool

Large combustion plants - Dust - BAT30-I
type: Concept
notation: LCP-Dust-BAT30-I
definition: 1. Energy industries: 1.1, Combustion of fuels in installations with a total rated thermal input of 50 MW or more, only when this activity takes place in combustion plants with a total rated thermal input of 50 MW or more; Techniques (a)-(f) (see table) for New plant; Reducing dust emissions to air. The BAT-AEL emission level is 2�10 mg/Nm3.
status: valid
status modified: 2026-05-06
accepted date: 2026-05-06
in scheme: BATAEL values as defined into the EC BAT-Tool

Large combustion plants - Dust - BAT30-II
type: Concept
notation: LCP-Dust-BAT30-II
definition: 1. Energy industries: 1.1, Combustion of fuels in installations with a total rated thermal input of 50 MW or more, only when this activity takes place in combustion plants with a total rated thermal input of 50 MW or more; Techniques (a)-(f) (see table) for Existing plant; Reducing dust emissions to air. The BAT-AEL emission level is 2�20 mg/Nm3.
status: valid
status modified: 2026-05-06
accepted date: 2026-05-06
in scheme: BATAEL values as defined into the EC BAT-Tool

Large combustion plants - Dust - BAT30-III
type: Concept
notation: LCP-Dust-BAT30-III
definition: 1. Energy industries: 1.1, Combustion of fuels in installations with a total rated thermal input of 50 MW or more, only when this activity takes place in combustion plants with a total rated thermal input of 50 MW or more; Techniques (a)-(f) (see table) for New plant; Reducing dust emissions to air. The BAT-AEL emission level is 7�18 mg/Nm3.
status: valid
status modified: 2026-05-06
accepted date: 2026-05-06
in scheme: BATAEL values as defined into the EC BAT-Tool

Large combustion plants - Dust - BAT30-IV
type: Concept
notation: LCP-Dust-BAT30-IV
definition: 1. Energy industries: 1.1, Combustion of fuels in installations with a total rated thermal input of 50 MW or more, only when this activity takes place in combustion plants with a total rated thermal input of 50 MW or more; Techniques (a)-(f) (see table) for Existing plant; Reducing dust emissions to air. The BAT-AEL emission level is 7�22 mg/Nm3.
status: valid
status modified: 2026-05-06
accepted date: 2026-05-06
in scheme: BATAEL values as defined into the EC BAT-Tool

Large combustion plants - Dust - BAT30-V
type: Concept
notation: LCP-Dust-BAT30-V
definition: 1. Energy industries: 1.1, Combustion of fuels in installations with a total rated thermal input of 50 MW or more, only when this activity takes place in combustion plants with a total rated thermal input of 50 MW or more; Techniques (a)-(f) (see table) for New plant; Reducing dust emissions to air. The BAT-AEL emission level is 2�5 mg/Nm3.
status: valid
status modified: 2026-05-06
accepted date: 2026-05-06
in scheme: BATAEL values as defined into the EC BAT-Tool

Large combustion plants - Dust - BAT30-VI
type: Concept
notation: LCP-Dust-BAT30-VI
definition: 1. Energy industries: 1.1, Combustion of fuels in installations with a total rated thermal input of 50 MW or more, only when this activity takes place in combustion plants with a total rated thermal input of 50 MW or more; Techniques (a)-(f) (see table) for Existing plant; Reducing dust emissions to air. The BAT-AEL emission level is 2�10 mg/Nm3.
status: valid
status modified: 2026-05-06
accepted date: 2026-05-06
in scheme: BATAEL values as defined into the EC BAT-Tool

Large combustion plants - Dust - BAT30-VII
type: Concept
notation: LCP-Dust-BAT30-VII
definition: 1. Energy industries: 1.1, Combustion of fuels in installations with a total rated thermal input of 50 MW or more, only when this activity takes place in combustion plants with a total rated thermal input of 50 MW or more; Techniques (a)-(f) (see table) for New plant; Reducing dust emissions to air. The BAT-AEL emission level is 7�10 mg/Nm3.
status: valid
status modified: 2026-05-06
accepted date: 2026-05-06
in scheme: BATAEL values as defined into the EC BAT-Tool

Large combustion plants - Dust - BAT30-VIII
type: Concept
notation: LCP-Dust-BAT30-VIII
definition: 1. Energy industries: 1.1, Combustion of fuels in installations with a total rated thermal input of 50 MW or more, only when this activity takes place in combustion plants with a total rated thermal input of 50 MW or more; Techniques (a)-(f) (see table) for Existing plant; Reducing dust emissions to air. The BAT-AEL emission level is 7�11 mg/Nm3.
status: valid
status modified: 2026-05-06
accepted date: 2026-05-06
in scheme: BATAEL values as defined into the EC BAT-Tool

Large combustion plants - Dust - BAT35-I
type: Concept
notation: LCP-Dust-BAT35-I
definition: 1. Energy industries: 1.1, Combustion of fuels in installations with a total rated thermal input of 50 MW or more, only when this activity takes place in combustion plants with a total rated thermal input of 50 MW or more; Techniques (a)-(c) (see table) for New plant; Reducing dust emissions to air. The BAT-AEL emission level is 5�10 mg/Nm3.
status: valid
status modified: 2026-05-06
accepted date: 2026-05-06
in scheme: BATAEL values as defined into the EC BAT-Tool

Large combustion plants - Dust - BAT35-II
type: Concept
notation: LCP-Dust-BAT35-II
definition: 1. Energy industries: 1.1, Combustion of fuels in installations with a total rated thermal input of 50 MW or more, only when this activity takes place in combustion plants with a total rated thermal input of 50 MW or more; Techniques (a)-(c) (see table) for Existing plant; Reducing dust emissions to air. The BAT-AEL emission level is 5�35 mg/Nm3.
status: valid
status modified: 2026-05-06
accepted date: 2026-05-06
in scheme: BATAEL values as defined into the EC BAT-Tool

Large combustion plants - Dust - BAT35-III
type: Concept
notation: LCP-Dust-BAT35-III
definition: 1. Energy industries: 1.1, Combustion of fuels in installations with a total rated thermal input of 50 MW or more, only when this activity takes place in combustion plants with a total rated thermal input of 50 MW or more; Techniques (a)-(c) (see table) for New plant; Reducing dust emissions to air. The BAT-AEL emission level is 10�20 mg/Nm3.
status: valid
status modified: 2026-05-06
accepted date: 2026-05-06
in scheme: BATAEL values as defined into the EC BAT-Tool

Large combustion plants - Dust - BAT35-IV
type: Concept
notation: LCP-Dust-BAT35-IV
definition: 1. Energy industries: 1.1, Combustion of fuels in installations with a total rated thermal input of 50 MW or more, only when this activity takes place in combustion plants with a total rated thermal input of 50 MW or more; Techniques (a)-(c) (see table) for Existing plant; Reducing dust emissions to air. The BAT-AEL emission level is 10�45 mg/Nm3.
status: valid
status modified: 2026-05-06
accepted date: 2026-05-06
in scheme: BATAEL values as defined into the EC BAT-Tool

Large combustion plants - Dust - BAT39-III
type: Concept
notation: LCP-Dust-BAT39-III
definition: 1. Energy industries: 1.1, Combustion of fuels in installations with a total rated thermal input of 50 MW or more, only when this activity takes place in combustion plants with a total rated thermal input of 50 MW or more; Technique (a) (see table) for new and existing plants; Reducing dust emissions to air. The BAT-AEL emission level is 2�5 mg/Nm3.
status: valid
status modified: 2026-05-06
accepted date: 2026-05-06
in scheme: BATAEL values as defined into the EC BAT-Tool

Large combustion plants - Dust - BAT39-IV
type: Concept
notation: LCP-Dust-BAT39-IV
definition: 1. Energy industries: 1.1, Combustion of fuels in installations with a total rated thermal input of 50 MW or more, only when this activity takes place in combustion plants with a total rated thermal input of 50 MW or more; Technique (a) (see table) for new and existing plants; Reducing dust emissions to air. The BAT-AEL emission level is 2�10 mg/Nm3.
status: valid
status modified: 2026-05-06
accepted date: 2026-05-06
in scheme: BATAEL values as defined into the EC BAT-Tool

Large combustion plants - Dust - BAT51-I
type: Concept
notation: LCP-Dust-BAT51-I
definition: 1. Energy industries: 1.1, Combustion of fuels in installations with a total rated thermal input of 50 MW or more, only when this activity takes place in combustion plants with a total rated thermal input of 50 MW or more; Techniques (a)-(e) (see table) in boilers; Reducing dust emissions to air. The BAT-AEL emission level is 2�7 mg/Nm3.
status: valid
status modified: 2026-05-06
accepted date: 2026-05-06
in scheme: BATAEL values as defined into the EC BAT-Tool

Large combustion plants - Dust - BAT51-II
type: Concept
notation: LCP-Dust-BAT51-II
definition: 1. Energy industries: 1.1, Combustion of fuels in installations with a total rated thermal input of 50 MW or more, only when this activity takes place in combustion plants with a total rated thermal input of 50 MW or more; Techniques (a)-(e) (see table) in boilers; Reducing dust emissions to air. The BAT-AEL emission level is 2�10 mg/Nm3.
status: valid
status modified: 2026-05-06
accepted date: 2026-05-06
in scheme: BATAEL values as defined into the EC BAT-Tool

Large combustion plants - Dust - BAT51-III
type: Concept
notation: LCP-Dust-BAT51-III
definition: 1. Energy industries: 1.1, Combustion of fuels in installations with a total rated thermal input of 50 MW or more, only when this activity takes place in combustion plants with a total rated thermal input of 50 MW or more; Techniques (a)-(e) (see table) in combined-cycle gas turbines (CCGTs); Reducing dust emissions to air. The BAT-AEL emission level is 2�5 mg/Nm3.
status: valid
status modified: 2026-05-06
accepted date: 2026-05-06
in scheme: BATAEL values as defined into the EC BAT-Tool

Large combustion plants - Dust - BAT51-IV
type: Concept
notation: LCP-Dust-BAT51-IV
definition: 1. Energy industries: 1.1, Combustion of fuels in installations with a total rated thermal input of 50 MW or more, only when this activity takes place in combustion plants with a total rated thermal input of 50 MW or more; Techniques (a)-(e) (see table) in combined-cycle gas turbines (CCGTs); Reducing dust emissions to air. The BAT-AEL emission level is 2�5 mg/Nm3.
status: valid
status modified: 2026-05-06
accepted date: 2026-05-06
in scheme: BATAEL values as defined into the EC BAT-Tool

Large combustion plants - Dust - BAT58-I
type: Concept
notation: LCP-Dust-BAT58-I
definition: 1. Energy industries: 1.1, Combustion of fuels in installations with a total rated thermal input of 50 MW or more, only when this activity takes place in combustion plants with a total rated thermal input of 50 MW or more; Techniques (a)-(e) (see table). for New plant; Reducing dust emissions to air. The BAT-AEL emission level is 2�5 mg/Nm3.
status: valid
status modified: 2026-05-06
accepted date: 2026-05-06
in scheme: BATAEL values as defined into the EC BAT-Tool

Large combustion plants - Dust - BAT58-II
type: Concept
notation: LCP-Dust-BAT58-II
definition: 1. Energy industries: 1.1, Combustion of fuels in installations with a total rated thermal input of 50 MW or more, only when this activity takes place in combustion plants with a total rated thermal input of 50 MW or more; Techniques (a)-(e) (see table). for Existing plant; Reducing dust emissions to air. The BAT-AEL emission level is 2�15 mg/Nm3.
status: valid
status modified: 2026-05-06
accepted date: 2026-05-06
in scheme: BATAEL values as defined into the EC BAT-Tool

Large combustion plants - Dust - BAT58-III
type: Concept
notation: LCP-Dust-BAT58-III
definition: 1. Energy industries: 1.1, Combustion of fuels in installations with a total rated thermal input of 50 MW or more, only when this activity takes place in combustion plants with a total rated thermal input of 50 MW or more; Techniques (a)-(e) (see table). for New plant; Reducing dust emissions to air. The BAT-AEL emission level is 2�10 mg/Nm3.
status: valid
status modified: 2026-05-06
accepted date: 2026-05-06
in scheme: BATAEL values as defined into the EC BAT-Tool

Large combustion plants - Dust - BAT58-IV
type: Concept
notation: LCP-Dust-BAT58-IV
definition: 1. Energy industries: 1.1, Combustion of fuels in installations with a total rated thermal input of 50 MW or more, only when this activity takes place in combustion plants with a total rated thermal input of 50 MW or more; Techniques (a)-(e) (see table). for Existing plant; Reducing dust emissions to air. The BAT-AEL emission level is 2�22 mg/Nm3.
status: valid
status modified: 2026-05-06
accepted date: 2026-05-06
in scheme: BATAEL values as defined into the EC BAT-Tool

Large combustion plants - Dust - BAT58-V
type: Concept
notation: LCP-Dust-BAT58-V
definition: 1. Energy industries: 1.1, Combustion of fuels in installations with a total rated thermal input of 50 MW or more, only when this activity takes place in combustion plants with a total rated thermal input of 50 MW or more; Techniques (a)-(e) (see table). for New plant; Reducing dust emissions to air. The BAT-AEL emission level is 2�5 mg/Nm3.
status: valid
status modified: 2026-05-06
accepted date: 2026-05-06
in scheme: BATAEL values as defined into the EC BAT-Tool

Large combustion plants - Dust - BAT58-VI
type: Concept
notation: LCP-Dust-BAT58-VI
definition: 1. Energy industries: 1.1, Combustion of fuels in installations with a total rated thermal input of 50 MW or more, only when this activity takes place in combustion plants with a total rated thermal input of 50 MW or more; Techniques (a)-(e) (see table). for Existing plant; Reducing dust emissions to air. The BAT-AEL emission level is 2�10 mg/Nm3.
status: valid
status modified: 2026-05-06
accepted date: 2026-05-06
in scheme: BATAEL values as defined into the EC BAT-Tool

Large combustion plants - Dust - BAT58-VII
type: Concept
notation: LCP-Dust-BAT58-VII
definition: 1. Energy industries: 1.1, Combustion of fuels in installations with a total rated thermal input of 50 MW or more, only when this activity takes place in combustion plants with a total rated thermal input of 50 MW or more; Techniques (a)-(e) (see table). for New plant; Reducing dust emissions to air. The BAT-AEL emission level is 2�10 mg/Nm3.
status: valid
status modified: 2026-05-06
accepted date: 2026-05-06
in scheme: BATAEL values as defined into the EC BAT-Tool

Large combustion plants - Dust - BAT58-VIII
type: Concept
notation: LCP-Dust-BAT58-VIII
definition: 1. Energy industries: 1.1, Combustion of fuels in installations with a total rated thermal input of 50 MW or more, only when this activity takes place in combustion plants with a total rated thermal input of 50 MW or more; Techniques (a)-(e) (see table). for Existing plant; Reducing dust emissions to air. The BAT-AEL emission level is 2�11 mg/Nm3.
status: valid
status modified: 2026-05-06
accepted date: 2026-05-06
in scheme: BATAEL values as defined into the EC BAT-Tool

Large combustion plants - Dust - BAT75-III
type: Concept
notation: LCP-Dust-BAT75-III
definition: 1. Energy industries: 1.4, Gasification of coal or other fuels in installations with a total rated thermal input of 20 MW or more, only when this activity is directly associated to a combustion plant; Techniques (a)-(c) (see table); Reducing dust emissions to air. The BAT-AEL emission level is < 2,5 mg/Nm3.
status: valid
status modified: 2026-05-06
accepted date: 2026-05-06
in scheme: BATAEL values as defined into the EC BAT-Tool

Large combustion plants - F - BAT15-IV
type: Concept
notation: LCP-F-BAT15-IV
definition: 1.� Energy industries; 5.� Waste management: 1.1, Combustion of fuels in installations with a total rated thermal input of 50 MW or more, only when this activity takes place in combustion plants with a total rated thermal input of 50 MW or more; 1.4, Gasification of coal or other fuels in installations with a total rated thermal input of 20 MW or more, only when this activity is directly associated to a combustion plant; 5.2, Disposal or recovery of waste in waste co-incineration plants for non-hazardous waste with a capacity exceeding 3 tonnes per hour or for hazardous waste with a capacity exceeding 10 tonnes per day, only when this activity takes place in combustion plants covered under 1.1 above. Reducing fluorides to water. The BAT-AEL emission level is 10�25 mg/l.
status: valid
status modified: 2026-05-06
accepted date: 2026-05-06
in scheme: BATAEL values as defined into the EC BAT-Tool

Large combustion plants - Formaldehyde - BAT45-I
type: Concept
notation: LCP-Formaldehyde-BAT45-I
definition: 1. Energy industries: 1.1, Combustion of fuels in installations with a total rated thermal input of 50 MW or more, only when this activity takes place in combustion plants with a total rated thermal input of 50 MW or more; Ensure optimised combustion and/or to use oxidation catalysts for New or existing plan; Reducing formaldehyde emissions to air. The BAT-AEL emission level is 5�15 mg/Nm3.
status: valid
status modified: 2026-05-06
accepted date: 2026-05-06
in scheme: BATAEL values as defined into the EC BAT-Tool

Large combustion plants - HCl - BAT21-XIX
type: Concept
notation: LCP-HCl-BAT21-XIX
definition: 1. Energy industries: 1.1, Combustion of fuels in installations with a total rated thermal input of 50 MW or more, only when this activity takes place in combustion plants with a total rated thermal input of 50 MW or more; Techniques (a)-(j) (see table) for New plant; Reducing hydrogen chloride emissions to air. The BAT-AEL emission level is 1�3 mg/Nm3.
status: valid
status modified: 2026-05-06
accepted date: 2026-05-06
in scheme: BATAEL values as defined into the EC BAT-Tool

Large combustion plants - HCl - BAT21-XVII
type: Concept
notation: LCP-HCl-BAT21-XVII
definition: 1. Energy industries: 1.1, Combustion of fuels in installations with a total rated thermal input of 50 MW or more, only when this activity takes place in combustion plants with a total rated thermal input of 50 MW or more; Techniques (a)-(j) (see table) for New plant; Reducing hydrogen chloride emissions to air. The BAT-AEL emission level is 1�6 mg/Nm3.
status: valid
status modified: 2026-05-06
accepted date: 2026-05-06
in scheme: BATAEL values as defined into the EC BAT-Tool

Large combustion plants - HCl - BAT21-XVIII
type: Concept
notation: LCP-HCl-BAT21-XVIII
definition: 1. Energy industries: 1.1, Combustion of fuels in installations with a total rated thermal input of 50 MW or more, only when this activity takes place in combustion plants with a total rated thermal input of 50 MW or more; Techniques (a)-(j) (see table) for Existing plant; Reducing hydrogen chloride emissions to air. The BAT-AEL emission level is 2�10 mg/Nm3.
status: valid
status modified: 2026-05-06
accepted date: 2026-05-06
in scheme: BATAEL values as defined into the EC BAT-Tool

Large combustion plants - HCl - BAT21-XX
type: Concept
notation: LCP-HCl-BAT21-XX
definition: 1. Energy industries: 1.1, Combustion of fuels in installations with a total rated thermal input of 50 MW or more, only when this activity takes place in combustion plants with a total rated thermal input of 50 MW or more; Techniques (a)-(j) (see table) for Existing plant; Reducing hydrogen chloride emissions to air. The BAT-AEL emission level is 1�5 mg/Nm3.
status: valid
status modified: 2026-05-06
accepted date: 2026-05-06
in scheme: BATAEL values as defined into the EC BAT-Tool

Large combustion plants - HCl - BAT25-XIII
type: Concept
notation: LCP-HCl-BAT25-XIII
definition: 1. Energy industries: 1.1, Combustion of fuels in installations with a total rated thermal input of 50 MW or more, only when this activity takes place in combustion plants with a total rated thermal input of 50 MW or more; Techniques (a)-(h) (see table) for New plant; Reducing hydrogen chloride emissions to air. The BAT-AEL emission level is 1�7 mg/Nm3.
status: valid
status modified: 2026-05-06
accepted date: 2026-05-06
in scheme: BATAEL values as defined into the EC BAT-Tool

Large combustion plants - HCl - BAT25-XIV
type: Concept
notation: LCP-HCl-BAT25-XIV
definition: 1. Energy industries: 1.1, Combustion of fuels in installations with a total rated thermal input of 50 MW or more, only when this activity takes place in combustion plants with a total rated thermal input of 50 MW or more; Techniques (a)-(h) (see table) for Existing plant; Reducing hydrogen chloride emissions to air. The BAT-AEL emission level is 1�15 mg/Nm3.
status: valid
status modified: 2026-05-06
accepted date: 2026-05-06
in scheme: BATAEL values as defined into the EC BAT-Tool

Large combustion plants - HCl - BAT25-XIX
type: Concept
notation: LCP-HCl-BAT25-XIX
definition: 1. Energy industries: 1.1, Combustion of fuels in installations with a total rated thermal input of 50 MW or more, only when this activity takes place in combustion plants with a total rated thermal input of 50 MW or more; Techniques (a)-(h) (see table) for New plant; Reducing hydrogen chloride emissions to air. The BAT-AEL emission level is 1�12 mg/Nm3.
status: valid
status modified: 2026-05-06
accepted date: 2026-05-06
in scheme: BATAEL values as defined into the EC BAT-Tool

Large combustion plants - HCl - BAT25-XV
type: Concept
notation: LCP-HCl-BAT25-XV
definition: 1. Energy industries: 1.1, Combustion of fuels in installations with a total rated thermal input of 50 MW or more, only when this activity takes place in combustion plants with a total rated thermal input of 50 MW or more; Techniques (a)-(h) (see table) for New plant; Reducing hydrogen chloride emissions to air. The BAT-AEL emission level is 1�12 mg/Nm3.
status: valid
status modified: 2026-05-06
accepted date: 2026-05-06
in scheme: BATAEL values as defined into the EC BAT-Tool

Large combustion plants - HCl - BAT25-XVI
type: Concept
notation: LCP-HCl-BAT25-XVI
definition: 1. Energy industries: 1.1, Combustion of fuels in installations with a total rated thermal input of 50 MW or more, only when this activity takes place in combustion plants with a total rated thermal input of 50 MW or more; Techniques (a)-(h) (see table) for Existing plant; Reducing hydrogen chloride emissions to air. The BAT-AEL emission level is 1�35 mg/Nm3.
status: valid
status modified: 2026-05-06
accepted date: 2026-05-06
in scheme: BATAEL values as defined into the EC BAT-Tool

Large combustion plants - HCl - BAT25-XVII
type: Concept
notation: LCP-HCl-BAT25-XVII
definition: 1. Energy industries: 1.1, Combustion of fuels in installations with a total rated thermal input of 50 MW or more, only when this activity takes place in combustion plants with a total rated thermal input of 50 MW or more; Techniques (a)-(h) (see table) for New plant; Reducing hydrogen chloride emissions to air. The BAT-AEL emission level is 1�5 mg/Nm3.
status: valid
status modified: 2026-05-06
accepted date: 2026-05-06
in scheme: BATAEL values as defined into the EC BAT-Tool

Large combustion plants - HCl - BAT25-XVIII
type: Concept
notation: LCP-HCl-BAT25-XVIII
definition: 1. Energy industries: 1.1, Combustion of fuels in installations with a total rated thermal input of 50 MW or more, only when this activity takes place in combustion plants with a total rated thermal input of 50 MW or more; Techniques (a)-(h) (see table) for Existing plant; Reducing hydrogen chloride emissions to air. The BAT-AEL emission level is 1�9 mg/Nm3.
status: valid
status modified: 2026-05-06
accepted date: 2026-05-06
in scheme: BATAEL values as defined into the EC BAT-Tool

Large combustion plants - HCl - BAT25-XX
type: Concept
notation: LCP-HCl-BAT25-XX
definition: 1. Energy industries: 1.1, Combustion of fuels in installations with a total rated thermal input of 50 MW or more, only when this activity takes place in combustion plants with a total rated thermal input of 50 MW or more; Techniques (a)-(h) (see table) for Existing plant; Reducing hydrogen chloride emissions to air. The BAT-AEL emission level is 1�12 mg/Nm3.
status: valid
status modified: 2026-05-06
accepted date: 2026-05-06
in scheme: BATAEL values as defined into the EC BAT-Tool

Large combustion plants - HCl - BAT25-XXI
type: Concept
notation: LCP-HCl-BAT25-XXI
definition: 1. Energy industries: 1.1, Combustion of fuels in installations with a total rated thermal input of 50 MW or more, only when this activity takes place in combustion plants with a total rated thermal input of 50 MW or more; Techniques (a)-(h) (see table) for New plant; Reducing hydrogen chloride emissions to air. The BAT-AEL emission level is 1�5 mg/Nm3.
status: valid
status modified: 2026-05-06
accepted date: 2026-05-06
in scheme: BATAEL values as defined into the EC BAT-Tool

Large combustion plants - HCl - BAT25-XXII
type: Concept
notation: LCP-HCl-BAT25-XXII
definition: 1. Energy industries: 1.1, Combustion of fuels in installations with a total rated thermal input of 50 MW or more, only when this activity takes place in combustion plants with a total rated thermal input of 50 MW or more; Techniques (a)-(h) (see table) for Existing plant; Reducing hydrogen chloride emissions to air. The BAT-AEL emission level is 1�5 mg/Nm3.
status: valid
status modified: 2026-05-06
accepted date: 2026-05-06
in scheme: BATAEL values as defined into the EC BAT-Tool

Large combustion plants - HCl - BAT25-XXIII
type: Concept
notation: LCP-HCl-BAT25-XXIII
definition: 1. Energy industries: 1.1, Combustion of fuels in installations with a total rated thermal input of 50 MW or more, only when this activity takes place in combustion plants with a total rated thermal input of 50 MW or more; Techniques (a)-(h) (see table) for New plant; Reducing hydrogen chloride emissions to air. The BAT-AEL emission level is 1�12 mg/Nm3.
status: valid
status modified: 2026-05-06
accepted date: 2026-05-06
in scheme: BATAEL values as defined into the EC BAT-Tool

Large combustion plants - HCl - BAT25-XXIV
type: Concept
notation: LCP-HCl-BAT25-XXIV
definition: 1. Energy industries: 1.1, Combustion of fuels in installations with a total rated thermal input of 50 MW or more, only when this activity takes place in combustion plants with a total rated thermal input of 50 MW or more; Techniques (a)-(h) (see table) for Existing plant; Reducing hydrogen chloride emissions to air. The BAT-AEL emission level is 1�12 mg/Nm3.
status: valid
status modified: 2026-05-06
accepted date: 2026-05-06
in scheme: BATAEL values as defined into the EC BAT-Tool

Large combustion plants - HCl - BAT57-III
type: Concept
notation: LCP-HCl-BAT57-III
definition: 1. Energy industries: 1.1, Combustion of fuels in installations with a total rated thermal input of 50 MW or more, only when this activity takes place in combustion plants with a total rated thermal input of 50 MW or more; Techniques (a)-(g) (see table). for New plant; Reducing hydrogen chloride emissions to air. The BAT-AEL emission level is 1�7 mg/Nm3.
status: valid
status modified: 2026-05-06
accepted date: 2026-05-06
in scheme: BATAEL values as defined into the EC BAT-Tool

Large combustion plants - HCl - BAT57-IV
type: Concept
notation: LCP-HCl-BAT57-IV
definition: 1. Energy industries: 1.1, Combustion of fuels in installations with a total rated thermal input of 50 MW or more, only when this activity takes place in combustion plants with a total rated thermal input of 50 MW or more; Techniques (a)-(g) (see table). for Existing plant; Reducing hydrogen chloride emissions to air. The BAT-AEL emission level is 2�15 mg/Nm3.
status: valid
status modified: 2026-05-06
accepted date: 2026-05-06
in scheme: BATAEL values as defined into the EC BAT-Tool

Large combustion plants - HCl - BAT57-VII
type: Concept
notation: LCP-HCl-BAT57-VII
definition: 1. Energy industries: 1.1, Combustion of fuels in installations with a total rated thermal input of 50 MW or more, only when this activity takes place in combustion plants with a total rated thermal input of 50 MW or more; Techniques (a)-(g) (see table). for New plant; Reducing hydrogen chloride emissions to air. The BAT-AEL emission level is 1�5 mg/Nm3.
status: valid
status modified: 2026-05-06
accepted date: 2026-05-06
in scheme: BATAEL values as defined into the EC BAT-Tool

Large combustion plants - HCl - BAT57-VIII
type: Concept
notation: LCP-HCl-BAT57-VIII
definition: 1. Energy industries: 1.1, Combustion of fuels in installations with a total rated thermal input of 50 MW or more, only when this activity takes place in combustion plants with a total rated thermal input of 50 MW or more; Techniques (a)-(g) (see table). for Existing plant; Reducing hydrogen chloride emissions to air. The BAT-AEL emission level is 1�9 mg/Nm3.
status: valid
status modified: 2026-05-06
accepted date: 2026-05-06
in scheme: BATAEL values as defined into the EC BAT-Tool

Large combustion plants - HF - BAT21-XXI
type: Concept
notation: LCP-HF-BAT21-XXI
definition: 1. Energy industries: 1.1, Combustion of fuels in installations with a total rated thermal input of 50 MW or more, only when this activity takes place in combustion plants with a total rated thermal input of 50 MW or more; Techniques (a)-(j) (see table) for New plant; Reducing hydrogen fluoride emissions to air. The BAT-AEL emission level is < 1�3 mg/Nm3.
status: valid
status modified: 2026-05-06
accepted date: 2026-05-06
in scheme: BATAEL values as defined into the EC BAT-Tool

Large combustion plants - HF - BAT21-XXII
type: Concept
notation: LCP-HF-BAT21-XXII
definition: 1. Energy industries: 1.1, Combustion of fuels in installations with a total rated thermal input of 50 MW or more, only when this activity takes place in combustion plants with a total rated thermal input of 50 MW or more; Techniques (a)-(j) (see table) for Existing plant; Reducing hydrogen fluoride emissions to air. The BAT-AEL emission level is < 1�6 mg/Nm3.
status: valid
status modified: 2026-05-06
accepted date: 2026-05-06
in scheme: BATAEL values as defined into the EC BAT-Tool

Large combustion plants - HF - BAT21-XXIII
type: Concept
notation: LCP-HF-BAT21-XXIII
definition: 1. Energy industries: 1.1, Combustion of fuels in installations with a total rated thermal input of 50 MW or more, only when this activity takes place in combustion plants with a total rated thermal input of 50 MW or more; Techniques (a)-(j) (see table) for New plant; Reducing hydrogen fluoride emissions to air. The BAT-AEL emission level is < 1�2 mg/Nm3.
status: valid
status modified: 2026-05-06
accepted date: 2026-05-06
in scheme: BATAEL values as defined into the EC BAT-Tool

Large combustion plants - HF - BAT21-XXIV
type: Concept
notation: LCP-HF-BAT21-XXIV
definition: 1. Energy industries: 1.1, Combustion of fuels in installations with a total rated thermal input of 50 MW or more, only when this activity takes place in combustion plants with a total rated thermal input of 50 MW or more; Techniques (a)-(j) (see table) for Existing plant; Reducing hydrogen fluoride emissions to air. The BAT-AEL emission level is < 1�3 mg/Nm3.
status: valid
status modified: 2026-05-06
accepted date: 2026-05-06
in scheme: BATAEL values as defined into the EC BAT-Tool

Large combustion plants - HF - BAT25-XXIX
type: Concept
notation: LCP-HF-BAT25-XXIX
definition: 1. Energy industries: 1.1, Combustion of fuels in installations with a total rated thermal input of 50 MW or more, only when this activity takes place in combustion plants with a total rated thermal input of 50 MW or more; Techniques (a)-(h) (see table) for New plant; Reducing hydrogen fluoride emissions to air. The BAT-AEL emission level is < 1 mg/Nm3.
status: valid
status modified: 2026-05-06
accepted date: 2026-05-06
in scheme: BATAEL values as defined into the EC BAT-Tool

Large combustion plants - HF - BAT25-XXV
type: Concept
notation: LCP-HF-BAT25-XXV
definition: 1. Energy industries: 1.1, Combustion of fuels in installations with a total rated thermal input of 50 MW or more, only when this activity takes place in combustion plants with a total rated thermal input of 50 MW or more; Techniques (a)-(h) (see table) for New plant; Reducing hydrogen fluoride emissions to air. The BAT-AEL emission level is < 1 mg/Nm3.
status: valid
status modified: 2026-05-06
accepted date: 2026-05-06
in scheme: BATAEL values as defined into the EC BAT-Tool

Large combustion plants - HF - BAT25-XXVI
type: Concept
notation: LCP-HF-BAT25-XXVI
definition: 1. Energy industries: 1.1, Combustion of fuels in installations with a total rated thermal input of 50 MW or more, only when this activity takes place in combustion plants with a total rated thermal input of 50 MW or more; Techniques (a)-(h) (see table) for Existing plant; Reducing hydrogen fluoride emissions to air. The BAT-AEL emission level is < 1,5 mg/Nm3.
status: valid
status modified: 2026-05-06
accepted date: 2026-05-06
in scheme: BATAEL values as defined into the EC BAT-Tool

Large combustion plants - HF - BAT25-XXVII
type: Concept
notation: LCP-HF-BAT25-XXVII
definition: 1. Energy industries: 1.1, Combustion of fuels in installations with a total rated thermal input of 50 MW or more, only when this activity takes place in combustion plants with a total rated thermal input of 50 MW or more; Techniques (a)-(h) (see table) for New plant; Reducing hydrogen fluoride emissions to air. The BAT-AEL emission level is < 1 mg/Nm3.
status: valid
status modified: 2026-05-06
accepted date: 2026-05-06
in scheme: BATAEL values as defined into the EC BAT-Tool

Large combustion plants - HF - BAT25-XXVIII
type: Concept
notation: LCP-HF-BAT25-XXVIII
definition: 1. Energy industries: 1.1, Combustion of fuels in installations with a total rated thermal input of 50 MW or more, only when this activity takes place in combustion plants with a total rated thermal input of 50 MW or more; Techniques (a)-(h) (see table) for Existing plant; Reducing hydrogen fluoride emissions to air. The BAT-AEL emission level is < 1 mg/Nm3.
status: valid
status modified: 2026-05-06
accepted date: 2026-05-06
in scheme: BATAEL values as defined into the EC BAT-Tool

Large combustion plants - HF - BAT25-XXX
type: Concept
notation: LCP-HF-BAT25-XXX
definition: 1. Energy industries: 1.1, Combustion of fuels in installations with a total rated thermal input of 50 MW or more, only when this activity takes place in combustion plants with a total rated thermal input of 50 MW or more; Techniques (a)-(h) (see table) for Existing plant; Reducing hydrogen fluoride emissions to air. The BAT-AEL emission level is < 1 mg/Nm3.
status: valid
status modified: 2026-05-06
accepted date: 2026-05-06
in scheme: BATAEL values as defined into the EC BAT-Tool

Large combustion plants - HF - BAT57-IX
type: Concept
notation: LCP-HF-BAT57-IX
definition: 1. Energy industries: 1.1, Combustion of fuels in installations with a total rated thermal input of 50 MW or more, only when this activity takes place in combustion plants with a total rated thermal input of 50 MW or more; Techniques (a)-(g) (see table). for New plant; Reducing hydrogen fluoride emissions to air. The BAT-AEL emission level is < 1�2 mg/Nm3.
status: valid
status modified: 2026-05-06
accepted date: 2026-05-06
in scheme: BATAEL values as defined into the EC BAT-Tool

Large combustion plants - HF - BAT57-V
type: Concept
notation: LCP-HF-BAT57-V
definition: 1. Energy industries: 1.1, Combustion of fuels in installations with a total rated thermal input of 50 MW or more, only when this activity takes place in combustion plants with a total rated thermal input of 50 MW or more; Techniques (a)-(g) (see table). for New plant; Reducing hydrogen fluoride emissions to air. The BAT-AEL emission level is < 1�3 mg/Nm3.
status: valid
status modified: 2026-05-06
accepted date: 2026-05-06
in scheme: BATAEL values as defined into the EC BAT-Tool

Large combustion plants - HF - BAT57-VI
type: Concept
notation: LCP-HF-BAT57-VI
definition: 1. Energy industries: 1.1, Combustion of fuels in installations with a total rated thermal input of 50 MW or more, only when this activity takes place in combustion plants with a total rated thermal input of 50 MW or more; Techniques (a)-(g) (see table). for Existing plant; Reducing hydrogen fluoride emissions to air. The BAT-AEL emission level is < 1�6 mg/Nm3.
status: valid
status modified: 2026-05-06
accepted date: 2026-05-06
in scheme: BATAEL values as defined into the EC BAT-Tool

Large combustion plants - HF - BAT57-X
type: Concept
notation: LCP-HF-BAT57-X
definition: 1. Energy industries: 1.1, Combustion of fuels in installations with a total rated thermal input of 50 MW or more, only when this activity takes place in combustion plants with a total rated thermal input of 50 MW or more; Techniques (a)-(g) (see table). for Existing plant; Reducing hydrogen fluoride emissions to air. The BAT-AEL emission level is < 1�3 mg/Nm3.
status: valid
status modified: 2026-05-06
accepted date: 2026-05-06
in scheme: BATAEL values as defined into the EC BAT-Tool

Large combustion plants - Hg - BAT23-I
type: Concept
notation: LCP-Hg-BAT23-I
definition: 1. Energy industries: 1.1, Combustion of fuels in installations with a total rated thermal input of 50 MW or more, only when this activity takes place in combustion plants with a total rated thermal input of 50 MW or more; Techniques (a)-(i) (see table) for New plant; Reducing mercury emissions to air. The BAT-AEL emission level is < 1�3 �g/Nm3.
status: valid
status modified: 2026-05-06
accepted date: 2026-05-06
in scheme: BATAEL values as defined into the EC BAT-Tool

Large combustion plants - Hg - BAT23-II
type: Concept
notation: LCP-Hg-BAT23-II
definition: 1. Energy industries: 1.1, Combustion of fuels in installations with a total rated thermal input of 50 MW or more, only when this activity takes place in combustion plants with a total rated thermal input of 50 MW or more; Techniques (a)-(i) (see table) for New plant; Reducing mercury emissions to air. The BAT-AEL emission level is < 1�5 �g/Nm3.
status: valid
status modified: 2026-05-06
accepted date: 2026-05-06
in scheme: BATAEL values as defined into the EC BAT-Tool

Large combustion plants - Hg - BAT23-III
type: Concept
notation: LCP-Hg-BAT23-III
definition: 1. Energy industries: 1.1, Combustion of fuels in installations with a total rated thermal input of 50 MW or more, only when this activity takes place in combustion plants with a total rated thermal input of 50 MW or more; Techniques (a)-(i) (see table) for Existing plant; Reducing mercury emissions to air. The BAT-AEL emission level is < 1�9 �g/Nm3.
status: valid
status modified: 2026-05-06
accepted date: 2026-05-06
in scheme: BATAEL values as defined into the EC BAT-Tool

Large combustion plants - Hg - BAT23-IV
type: Concept
notation: LCP-Hg-BAT23-IV
definition: 1. Energy industries: 1.1, Combustion of fuels in installations with a total rated thermal input of 50 MW or more, only when this activity takes place in combustion plants with a total rated thermal input of 50 MW or more; Techniques (a)-(i) (see table) for Existing plant; Reducing mercury emissions to air. The BAT-AEL emission level is < 1�10 �g/Nm3.
status: valid
status modified: 2026-05-06
accepted date: 2026-05-06
in scheme: BATAEL values as defined into the EC BAT-Tool

Large combustion plants - Hg - BAT15-XII
type: Concept
notation: LCP-Hg-BAT15-XII
definition: 1.� Energy industries; 5.� Waste management: 1.1, Combustion of fuels in installations with a total rated thermal input of 50 MW or more, only when this activity takes place in combustion plants with a total rated thermal input of 50 MW or more; 1.4, Gasification of coal or other fuels in installations with a total rated thermal input of 20 MW or more, only when this activity is directly associated to a combustion plant; 5.2, Disposal or recovery of waste in waste co-incineration plants for non-hazardous waste with a capacity exceeding 3 tonnes per hour or for hazardous waste with a capacity exceeding 10 tonnes per day, only when this activity takes place in combustion plants covered under 1.1 above. Reducing mercury to water. The BAT-AEL emission level is 0,2�3 �g/l .
status: valid
status modified: 2026-05-06
accepted date: 2026-05-06
in scheme: BATAEL values as defined into the EC BAT-Tool

Large combustion plants - Hg - BAT23-V
type: Concept
notation: LCP-Hg-BAT23-V
definition: 1. Energy industries: 1.1, Combustion of fuels in installations with a total rated thermal input of 50 MW or more, only when this activity takes place in combustion plants with a total rated thermal input of 50 MW or more; Techniques (a)-(i) (see table) for New plant; Reducing mercury emissions to air. The BAT-AEL emission level is < 1�2 �g/Nm3.
status: valid
status modified: 2026-05-06
accepted date: 2026-05-06
in scheme: BATAEL values as defined into the EC BAT-Tool

Large combustion plants - Hg - BAT23-VI
type: Concept
notation: LCP-Hg-BAT23-VI
definition: 1. Energy industries: 1.1, Combustion of fuels in installations with a total rated thermal input of 50 MW or more, only when this activity takes place in combustion plants with a total rated thermal input of 50 MW or more; Techniques (a)-(i) (see table) for New plant; Reducing mercury emissions to air. The BAT-AEL emission level is < 1�4 �g/Nm3.
status: valid
status modified: 2026-05-06
accepted date: 2026-05-06
in scheme: BATAEL values as defined into the EC BAT-Tool

Large combustion plants - Hg - BAT23-VII
type: Concept
notation: LCP-Hg-BAT23-VII
definition: 1. Energy industries: 1.1, Combustion of fuels in installations with a total rated thermal input of 50 MW or more, only when this activity takes place in combustion plants with a total rated thermal input of 50 MW or more; Techniques (a)-(i) (see table) for Existing plant; Reducing mercury emissions to air. The BAT-AEL emission level is < 1�4 �g/Nm3.
status: valid
status modified: 2026-05-06
accepted date: 2026-05-06
in scheme: BATAEL values as defined into the EC BAT-Tool

Large combustion plants - Hg - BAT23-VIII
type: Concept
notation: LCP-Hg-BAT23-VIII
definition: 1. Energy industries: 1.1, Combustion of fuels in installations with a total rated thermal input of 50 MW or more, only when this activity takes place in combustion plants with a total rated thermal input of 50 MW or more; Techniques (a)-(i) (see table) for Existing plant; Reducing mercury emissions to air. The BAT-AEL emission level is < 1�7 �g/Nm3.
status: valid
status modified: 2026-05-06
accepted date: 2026-05-06
in scheme: BATAEL values as defined into the EC BAT-Tool

Large combustion plants - Hg - BAT27
type: Concept
notation: LCP-Hg-BAT27
definition: 1. Energy industries: 1.1, Combustion of fuels in installations with a total rated thermal input of 50 MW or more, only when this activity takes place in combustion plants with a total rated thermal input of 50 MW or more; Techniques (a)-(g) (see table); Reducing mercury emissions to air. The BAT-AEL emission level is < 1�5 �g/Nm3 .
status: valid
status modified: 2026-05-06
accepted date: 2026-05-06
in scheme: BATAEL values as defined into the EC BAT-Tool

Large combustion plants - Hg - BAT75-II
type: Concept
notation: LCP-Hg-BAT75-II
definition: 1. Energy industries: 1.4, Gasification of coal or other fuels in installations with a total rated thermal input of 20 MW or more, only when this activity is directly associated to a combustion plant; Techniques (a)-(c) (see table); Reducing particulate-bound mercury emissions to air. The BAT-AEL emission level is < 1 �g/Nm3.
status: valid
status modified: 2026-05-06
accepted date: 2026-05-06
in scheme: BATAEL values as defined into the EC BAT-Tool

Large combustion plants - Metals - BAT68-I
type: Concept
notation: LCP-Metals-BAT68-I
definition: 1. Energy industries: 1.1, Combustion of fuels in installations with a total rated thermal input of 50 MW or more, only when this activity takes place in combustion plants with a total rated thermal input of 50 MW or more; Use one or a combination of the techniques given in BAT 22; Reducing metals emissions to air. The BAT-AEL emission level is 0,005�0,5 mg/Nm3 .
status: valid
status modified: 2026-05-06
accepted date: 2026-05-06
in scheme: BATAEL values as defined into the EC BAT-Tool

Large combustion plants - Metals - BAT68-II
type: Concept
notation: LCP-Metals-BAT68-II
definition: 1. Energy industries: 1.1, Combustion of fuels in installations with a total rated thermal input of 50 MW or more, only when this activity takes place in combustion plants with a total rated thermal input of 50 MW or more; Use one or a combination of the techniques given in BAT 22; Reducing metals emissions to air. The BAT-AEL emission level is 5�12 �g/Nm3.
status: valid
status modified: 2026-05-06
accepted date: 2026-05-06
in scheme: BATAEL values as defined into the EC BAT-Tool

Large combustion plants - Metals - BAT68-III
type: Concept
notation: LCP-Metals-BAT68-III
definition: 1. Energy industries: 1.1, Combustion of fuels in installations with a total rated thermal input of 50 MW or more, only when this activity takes place in combustion plants with a total rated thermal input of 50 MW or more; Use one or a combination of the techniques given in BAT 22; Reducing metals emissions to air. The BAT-AEL emission level is 0,005�0,2 mg/Nm3 .
status: valid
status modified: 2026-05-06
accepted date: 2026-05-06
in scheme: BATAEL values as defined into the EC BAT-Tool

Large combustion plants - Metals - BAT68-IV
type: Concept
notation: LCP-Metals-BAT68-IV
definition: 1. Energy industries: 1.1, Combustion of fuels in installations with a total rated thermal input of 50 MW or more, only when this activity takes place in combustion plants with a total rated thermal input of 50 MW or more; Use one or a combination of the techniques given in BAT 22; Reducing metals emissions to air. The BAT-AEL emission level is 5�6 �g/Nm3.
status: valid
status modified: 2026-05-06
accepted date: 2026-05-06
in scheme: BATAEL values as defined into the EC BAT-Tool

Large combustion plants - Metals - BAT69-I
type: Concept
notation: LCP-Metals-BAT69-I
definition: 1. Energy industries: 1.1, Combustion of fuels in installations with a total rated thermal input of 50 MW or more, only when this activity takes place in combustion plants with a total rated thermal input of 50 MW or more; Use one or a combination of the techniques given in BAT 26; Reducing metals emissions to air. The BAT-AEL emission level is 0,075�0,3 mg/Nm3.
status: valid
status modified: 2026-05-06
accepted date: 2026-05-06
in scheme: BATAEL values as defined into the EC BAT-Tool

Large combustion plants - Metals - BAT69-II
type: Concept
notation: LCP-Metals-BAT69-II
definition: 1. Energy industries: 1.1, Combustion of fuels in installations with a total rated thermal input of 50 MW or more, only when this activity takes place in combustion plants with a total rated thermal input of 50 MW or more; Use one or a combination of the techniques given in BAT 26; Reducing metals emissions to air. The BAT-AEL emission level is < 5 �g/Nm3.
status: valid
status modified: 2026-05-06
accepted date: 2026-05-06
in scheme: BATAEL values as defined into the EC BAT-Tool

Large combustion plants - Metals - BAT75-I
type: Concept
notation: LCP-Metals-BAT75-I
definition: 1. Energy industries: 1.4, Gasification of coal or other fuels in installations with a total rated thermal input of 20 MW or more, only when this activity is directly associated to a combustion plant; Techniques (a)-(c) (see table); Reducing particulate-bound metals emissions to air. The BAT-AEL emission level is < 0,025 mg/Nm3.
status: valid
status modified: 2026-05-06
accepted date: 2026-05-06
in scheme: BATAEL values as defined into the EC BAT-Tool

Large combustion plants - NOx - BAT20-I
type: Concept
notation: LCP-NOx-BAT20-I
definition: 1. Energy industries: 1.1, Combustion of fuels in installations with a total rated thermal input of 50 MW or more, only when this activity takes place in combustion plants with a total rated thermal input of 50 MW or more; Techniques (a)-(e) (see table incl. footnote) for New plant; Reducing nitrogen oxides (NOx) emissions to air. The BAT-AEL emission level is 100�150 mg/Nm3.
status: valid
status modified: 2026-05-06
accepted date: 2026-05-06
in scheme: BATAEL values as defined into the EC BAT-Tool

Large combustion plants - NOx - BAT20-II
type: Concept
notation: LCP-NOx-BAT20-II
definition: 1. Energy industries: 1.1, Combustion of fuels in installations with a total rated thermal input of 50 MW or more, only when this activity takes place in combustion plants with a total rated thermal input of 50 MW or more; Techniques (a)-(e) (see table incl. footnote) for Existing plant; Reducing nitrogen oxides (NOx) emissions to air. The BAT-AEL emission level is 100�270 mg/Nm3.
status: valid
status modified: 2026-05-06
accepted date: 2026-05-06
in scheme: BATAEL values as defined into the EC BAT-Tool

Large combustion plants - NH3 - BAT7
type: Concept
notation: LCP-NH3-BAT7
definition: 1.� Energy industries; 5.� Waste management: 1.1Combustion of fuels in installations with a total rated thermal input of 50 MW or more, only when this activity takes place in combustion plants with a total rated thermal input of 50 MW or more; 1.4, Gasification of coal or other fuels in installations with a total rated thermal input of 20 MW or more, only when this activity is directly associated to a combustion plant; 5.2, Disposal or recovery of waste in waste co-incineration plants for non-hazardous waste with a capacity exceeding 3 tonnes per hour or for hazardous waste with a capacity exceeding 10 tonnes per day, only when this activity takes place in combustion plants covered under 1.1 above; Optimise the design and/or operation of SCR and/or SNCR; Reducing ammonia emissions to air. The BAT-AEL emission level is < 3�10 mg/Nm3 .
status: valid
status modified: 2026-05-06
accepted date: 2026-05-06
in scheme: BATAEL values as defined into the EC BAT-Tool

Large combustion plants - NOx - BAT20-III
type: Concept
notation: LCP-NOx-BAT20-III
definition: 1. Energy industries: 1.1, Combustion of fuels in installations with a total rated thermal input of 50 MW or more, only when this activity takes place in combustion plants with a total rated thermal input of 50 MW or more; Techniques (a)-(e) (see table incl. footnote) for New plant; Reducing nitrogen oxides (NOx) emissions to air. The BAT-AEL emission level is 155�200 mg/Nm3.
status: valid
status modified: 2026-05-06
accepted date: 2026-05-06
in scheme: BATAEL values as defined into the EC BAT-Tool

Large combustion plants - NOx - BAT20-IV
type: Concept
notation: LCP-NOx-BAT20-IV
definition: 1. Energy industries: 1.1, Combustion of fuels in installations with a total rated thermal input of 50 MW or more, only when this activity takes place in combustion plants with a total rated thermal input of 50 MW or more; Techniques (a)-(e) (see table incl. footnote) for Existing plant; Reducing nitrogen oxides (NOx) emissions to air. The BAT-AEL emission level is 165�330 mg/Nm3 .
status: valid
status modified: 2026-05-06
accepted date: 2026-05-06
in scheme: BATAEL values as defined into the EC BAT-Tool

Large combustion plants - NOx - BAT20-IX
type: Concept
notation: LCP-NOx-BAT20-IX
definition: 1. Energy industries: 1.1, Combustion of fuels in installations with a total rated thermal input of 50 MW or more, only when this activity takes place in combustion plants with a total rated thermal input of 50 MW or more; Techniques (a)-(e) (see table incl. footnote) in FBC boiler combusting coal and/or lignite and lignite-fired PC boiler. for New plant; Reducing nitrogen oxides (NOx) emissions to air. The BAT-AEL emission level is 50-85 mg/Nm3.
status: valid
status modified: 2026-05-06
accepted date: 2026-05-06
in scheme: BATAEL values as defined into the EC BAT-Tool

Large combustion plants - NOx - BAT20-V
type: Concept
notation: LCP-NOx-BAT20-V
definition: 1. Energy industries: 1.1, Combustion of fuels in installations with a total rated thermal input of 50 MW or more, only when this activity takes place in combustion plants with a total rated thermal input of 50 MW or more; Techniques (a)-(e) (see table incl. footnote) for New plant; Reducing nitrogen oxides (NOx) emissions to air. The BAT-AEL emission level is 50�100 mg/Nm3.
status: valid
status modified: 2026-05-06
accepted date: 2026-05-06
in scheme: BATAEL values as defined into the EC BAT-Tool

Large combustion plants - NOx - BAT20-VI
type: Concept
notation: LCP-NOx-BAT20-VI
definition: 1. Energy industries: 1.1, Combustion of fuels in installations with a total rated thermal input of 50 MW or more, only when this activity takes place in combustion plants with a total rated thermal input of 50 MW or more; Techniques (a)-(e) (see table incl. footnote) for Existing plant; Reducing nitrogen oxides (NOx) emissions to air. The BAT-AEL emission level is 100�180 mg/Nm3 .
status: valid
status modified: 2026-05-06
accepted date: 2026-05-06
in scheme: BATAEL values as defined into the EC BAT-Tool

Large combustion plants - NOx - BAT20-VII
type: Concept
notation: LCP-NOx-BAT20-VII
definition: 1. Energy industries: 1.1, Combustion of fuels in installations with a total rated thermal input of 50 MW or more, only when this activity takes place in combustion plants with a total rated thermal input of 50 MW or more; Techniques (a)-(e) (see table incl. footnote) for New plant; Reducing nitrogen oxides (NOx) emissions to air. The BAT-AEL emission level is 80�130 mg/Nm3 .
status: valid
status modified: 2026-05-06
accepted date: 2026-05-06
in scheme: BATAEL values as defined into the EC BAT-Tool

Large combustion plants - NOx - BAT20-VIII
type: Concept
notation: LCP-NOx-BAT20-VIII
definition: 1. Energy industries: 1.1, Combustion of fuels in installations with a total rated thermal input of 50 MW or more, only when this activity takes place in combustion plants with a total rated thermal input of 50 MW or more; Techniques (a)-(e) (see table incl. footnote) for Existing plant; Reducing nitrogen oxides (NOx) emissions to air. The BAT-AEL emission level is 155�210 mg/Nm3 .
status: valid
status modified: 2026-05-06
accepted date: 2026-05-06
in scheme: BATAEL values as defined into the EC BAT-Tool

Large combustion plants - NOx - BAT20-X
type: Concept
notation: LCP-NOx-BAT20-X
definition: 1. Energy industries: 1.1, Combustion of fuels in installations with a total rated thermal input of 50 MW or more, only when this activity takes place in combustion plants with a total rated thermal input of 50 MW or more; Techniques (a)-(e) (see table incl. footnote) in FBC boiler combusting coal and/or lignite and lignite-fired PC boiler. for Existing plant; Reducing nitrogen oxides (NOx) emissions to air. The BAT-AEL emission level is < 85 - 150 mg/Nm3 .
status: valid
status modified: 2026-05-06
accepted date: 2026-05-06
in scheme: BATAEL values as defined into the EC BAT-Tool

Large combustion plants - NOx - BAT20-XI
type: Concept
notation: LCP-NOx-BAT20-XI
definition: 1. Energy industries: 1.1, Combustion of fuels in installations with a total rated thermal input of 50 MW or more, only when this activity takes place in combustion plants with a total rated thermal input of 50 MW or more; Techniques (a)-(e) (see table incl. footnote) in FBC boiler combusting coal and/or lignite and lignite-fired PC boiler. for New plant; Reducing nitrogen oxides (NOx) emissions to air. The BAT-AEL emission level is 80-125 mg/Nm3.
status: valid
status modified: 2026-05-06
accepted date: 2026-05-06
in scheme: BATAEL values as defined into the EC BAT-Tool

Large combustion plants - NOx - BAT20-XII
type: Concept
notation: LCP-NOx-BAT20-XII
definition: 1. Energy industries: 1.1, Combustion of fuels in installations with a total rated thermal input of 50 MW or more, only when this activity takes place in combustion plants with a total rated thermal input of 50 MW or more; Techniques (a)-(e) (see table incl. footnote) in FBC boiler combusting coal and/or lignite and lignite-fired PC boiler. for Existing plant; Reducing nitrogen oxides (NOx) emissions to air. The BAT-AEL emission level is 140-165 mg/Nm3 .
status: valid
status modified: 2026-05-06
accepted date: 2026-05-06
in scheme: BATAEL values as defined into the EC BAT-Tool

Large combustion plants - NOx - BAT20-XIII
type: Concept
notation: LCP-NOx-BAT20-XIII
definition: 1. Energy industries: 1.1, Combustion of fuels in installations with a total rated thermal input of 50 MW or more, only when this activity takes place in combustion plants with a total rated thermal input of 50 MW or more; Techniques (a)-(e) (see table incl. footnote) in coal-fired PC boiler. for New plant; Reducing nitrogen oxides (NOx) emissions to air. The BAT-AEL emission level is 65 � 85 mg/Nm3.
status: valid
status modified: 2026-05-06
accepted date: 2026-05-06
in scheme: BATAEL values as defined into the EC BAT-Tool

Large combustion plants - NOx - BAT20-XIV
type: Concept
notation: LCP-NOx-BAT20-XIV
definition: 1. Energy industries: 1.1, Combustion of fuels in installations with a total rated thermal input of 50 MW or more, only when this activity takes place in combustion plants with a total rated thermal input of 50 MW or more; Techniques (a)-(e) (see table incl. footnote) in coal-fired PC boiler. for Existing plant; Reducing nitrogen oxides (NOx) emissions to air. The BAT-AEL emission level is 65 � 150 mg/Nm3 .
status: valid
status modified: 2026-05-06
accepted date: 2026-05-06
in scheme: BATAEL values as defined into the EC BAT-Tool

Large combustion plants - NOx - BAT20-XV
type: Concept
notation: LCP-NOx-BAT20-XV
definition: 1. Energy industries: 1.1, Combustion of fuels in installations with a total rated thermal input of 50 MW or more, only when this activity takes place in combustion plants with a total rated thermal input of 50 MW or more; Techniques (a)-(e) (see table incl. footnote) in coal-fired PC boiler. for New plant; Reducing nitrogen oxides (NOx) emissions to air. The BAT-AEL emission level is 80 � 125 mg/Nm3 .
status: valid
status modified: 2026-05-06
accepted date: 2026-05-06
in scheme: BATAEL values as defined into the EC BAT-Tool

Large combustion plants - NOx - BAT20-XVI
type: Concept
notation: LCP-NOx-BAT20-XVI
definition: 1. Energy industries: 1.1, Combustion of fuels in installations with a total rated thermal input of 50 MW or more, only when this activity takes place in combustion plants with a total rated thermal input of 50 MW or more; Techniques (a)-(e) (see table incl. footnote) in coal-fired PC boiler. for Existing plant; Reducing nitrogen oxides (NOx) emissions to air. The BAT-AEL emission level is < 85 � 165 mg/Nm3 .
status: valid
status modified: 2026-05-06
accepted date: 2026-05-06
in scheme: BATAEL values as defined into the EC BAT-Tool

Large combustion plants - NOx - BAT24-I
type: Concept
notation: LCP-NOx-BAT24-I
definition: 1. Energy industries: 1.1, Combustion of fuels in installations with a total rated thermal input of 50 MW or more, only when this activity takes place in combustion plants with a total rated thermal input of 50 MW or more; Techniques (a)-(g) (see table) for New plant; Reducing nitrogen oxides (NOx) emissions to air. The BAT-AEL emission level is 70-150 mg/Nm3.
status: valid
status modified: 2026-05-06
accepted date: 2026-05-06
in scheme: BATAEL values as defined into the EC BAT-Tool

Large combustion plants - NOx - BAT24-II
type: Concept
notation: LCP-NOx-BAT24-II
definition: 1. Energy industries: 1.1, Combustion of fuels in installations with a total rated thermal input of 50 MW or more, only when this activity takes place in combustion plants with a total rated thermal input of 50 MW or more; Techniques (a)-(g) (see table) for Existing plant; Reducing nitrogen oxides (NOx) emissions to air. The BAT-AEL emission level is 70-225 mg/Nm3.
status: valid
status modified: 2026-05-06
accepted date: 2026-05-06
in scheme: BATAEL values as defined into the EC BAT-Tool

Large combustion plants - NOx - BAT24-III
type: Concept
notation: LCP-NOx-BAT24-III
definition: 1. Energy industries: 1.1, Combustion of fuels in installations with a total rated thermal input of 50 MW or more, only when this activity takes place in combustion plants with a total rated thermal input of 50 MW or more; Techniques (a)-(g) (see table) for New plant; Reducing nitrogen oxides (NOx) emissions to air. The BAT-AEL emission level is 120�200 mg/Nm3.
status: valid
status modified: 2026-05-06
accepted date: 2026-05-06
in scheme: BATAEL values as defined into the EC BAT-Tool

Large combustion plants - NOx - BAT24-IV
type: Concept
notation: LCP-NOx-BAT24-IV
definition: 1. Energy industries: 1.1, Combustion of fuels in installations with a total rated thermal input of 50 MW or more, only when this activity takes place in combustion plants with a total rated thermal input of 50 MW or more; Techniques (a)-(g) (see table) for Existing plant; Reducing nitrogen oxides (NOx) emissions to air. The BAT-AEL emission level is 120�275 mg/Nm3.
status: valid
status modified: 2026-05-06
accepted date: 2026-05-06
in scheme: BATAEL values as defined into the EC BAT-Tool

Large combustion plants - NOx - BAT24-IX
type: Concept
notation: LCP-NOx-BAT24-IX
definition: 1. Energy industries: 1.1, Combustion of fuels in installations with a total rated thermal input of 50 MW or more, only when this activity takes place in combustion plants with a total rated thermal input of 50 MW or more; Techniques (a)-(g) (see table) for New plant; Reducing nitrogen oxides (NOx) emissions to air. The BAT-AEL emission level is 40�140 mg/Nm3.
status: valid
status modified: 2026-05-06
accepted date: 2026-05-06
in scheme: BATAEL values as defined into the EC BAT-Tool

Large combustion plants - NOx - BAT24-V
type: Concept
notation: LCP-NOx-BAT24-V
definition: 1. Energy industries: 1.1, Combustion of fuels in installations with a total rated thermal input of 50 MW or more, only when this activity takes place in combustion plants with a total rated thermal input of 50 MW or more; Techniques (a)-(g) (see table) for New plant; Reducing nitrogen oxides (NOx) emissions to air. The BAT-AEL emission level is 50�140 mg/Nm3.
status: valid
status modified: 2026-05-06
accepted date: 2026-05-06
in scheme: BATAEL values as defined into the EC BAT-Tool

Large combustion plants - NOx - BAT24-VI
type: Concept
notation: LCP-NOx-BAT24-VI
definition: 1. Energy industries: 1.1, Combustion of fuels in installations with a total rated thermal input of 50 MW or more, only when this activity takes place in combustion plants with a total rated thermal input of 50 MW or more; Techniques (a)-(g) (see table) for Existing plant; Reducing nitrogen oxides (NOx) emissions to air. The BAT-AEL emission level is 50�180 mg/Nm3.
status: valid
status modified: 2026-05-06
accepted date: 2026-05-06
in scheme: BATAEL values as defined into the EC BAT-Tool

Large combustion plants - NOx - BAT24-VII
type: Concept
notation: LCP-NOx-BAT24-VII
definition: 1. Energy industries: 1.1, Combustion of fuels in installations with a total rated thermal input of 50 MW or more, only when this activity takes place in combustion plants with a total rated thermal input of 50 MW or more; Techniques (a)-(g) (see table) for New plant; Reducing nitrogen oxides (NOx) emissions to air. The BAT-AEL emission level is 100�200 mg/Nm3.
status: valid
status modified: 2026-05-06
accepted date: 2026-05-06
in scheme: BATAEL values as defined into the EC BAT-Tool

Large combustion plants - NOx - BAT24-VIII
type: Concept
notation: LCP-NOx-BAT24-VIII
definition: 1. Energy industries: 1.1, Combustion of fuels in installations with a total rated thermal input of 50 MW or more, only when this activity takes place in combustion plants with a total rated thermal input of 50 MW or more; Techniques (a)-(g) (see table) for Existing plant; Reducing nitrogen oxides (NOx) emissions to air. The BAT-AEL emission level is 100�220 mg/Nm3.
status: valid
status modified: 2026-05-06
accepted date: 2026-05-06
in scheme: BATAEL values as defined into the EC BAT-Tool

Large combustion plants - NOx - BAT24-X
type: Concept
notation: LCP-NOx-BAT24-X
definition: 1. Energy industries: 1.1, Combustion of fuels in installations with a total rated thermal input of 50 MW or more, only when this activity takes place in combustion plants with a total rated thermal input of 50 MW or more; Techniques (a)-(g) (see table) for Existing plant; Reducing nitrogen oxides (NOx) emissions to air. The BAT-AEL emission level is 40�150 mg/Nm3.
status: valid
status modified: 2026-05-06
accepted date: 2026-05-06
in scheme: BATAEL values as defined into the EC BAT-Tool

Large combustion plants - NOx - BAT24-XI
type: Concept
notation: LCP-NOx-BAT24-XI
definition: 1. Energy industries: 1.1, Combustion of fuels in installations with a total rated thermal input of 50 MW or more, only when this activity takes place in combustion plants with a total rated thermal input of 50 MW or more; Techniques (a)-(g) (see table) for New plant; Reducing nitrogen oxides (NOx) emissions to air. The BAT-AEL emission level is 65�150 mg/Nm3.
status: valid
status modified: 2026-05-06
accepted date: 2026-05-06
in scheme: BATAEL values as defined into the EC BAT-Tool

Large combustion plants - NOx - BAT24-XII
type: Concept
notation: LCP-NOx-BAT24-XII
definition: 1. Energy industries: 1.1, Combustion of fuels in installations with a total rated thermal input of 50 MW or more, only when this activity takes place in combustion plants with a total rated thermal input of 50 MW or more; Techniques (a)-(g) (see table) for Existing plant; Reducing nitrogen oxides (NOx) emissions to air. The BAT-AEL emission level is 95�165 mg/Nm3.
status: valid
status modified: 2026-05-06
accepted date: 2026-05-06
in scheme: BATAEL values as defined into the EC BAT-Tool

Large combustion plants - NOx - BAT28-I
type: Concept
notation: LCP-NOx-BAT28-I
definition: 1. Energy industries: 1.1, Combustion of fuels in installations with a total rated thermal input of 50 MW or more, only when this activity takes place in combustion plants with a total rated thermal input of 50 MW or more; Techniques (a)-(i) (see table) for New plant; Reducing nitrogen oxides (NOx) emissions to air. The BAT-AEL emission level is 75�200 mg/Nm3.
status: valid
status modified: 2026-05-06
accepted date: 2026-05-06
in scheme: BATAEL values as defined into the EC BAT-Tool

Large combustion plants - NOx - BAT28-II
type: Concept
notation: LCP-NOx-BAT28-II
definition: 1. Energy industries: 1.1, Combustion of fuels in installations with a total rated thermal input of 50 MW or more, only when this activity takes place in combustion plants with a total rated thermal input of 50 MW or more; Techniques (a)-(i) (see table) for Existing plant; Reducing nitrogen oxides (NOx) emissions to air. The BAT-AEL emission level is 150�270 mg/Nm3.
status: valid
status modified: 2026-05-06
accepted date: 2026-05-06
in scheme: BATAEL values as defined into the EC BAT-Tool

Large combustion plants - NOx - BAT28-III
type: Concept
notation: LCP-NOx-BAT28-III
definition: 1. Energy industries: 1.1, Combustion of fuels in installations with a total rated thermal input of 50 MW or more, only when this activity takes place in combustion plants with a total rated thermal input of 50 MW or more; Techniques (a)-(i) (see table) for New plant; Reducing nitrogen oxides (NOx) emissions to air. The BAT-AEL emission level is 100�215 mg/Nm3.
status: valid
status modified: 2026-05-06
accepted date: 2026-05-06
in scheme: BATAEL values as defined into the EC BAT-Tool

Large combustion plants - NOx - BAT28-IV
type: Concept
notation: LCP-NOx-BAT28-IV
definition: 1. Energy industries: 1.1, Combustion of fuels in installations with a total rated thermal input of 50 MW or more, only when this activity takes place in combustion plants with a total rated thermal input of 50 MW or more; Techniques (a)-(i) (see table) for Existing plant; Reducing nitrogen oxides (NOx) emissions to air. The BAT-AEL emission level is 210�330 mg/Nm3.
status: valid
status modified: 2026-05-06
accepted date: 2026-05-06
in scheme: BATAEL values as defined into the EC BAT-Tool

Large combustion plants - NOx - BAT28-V
type: Concept
notation: LCP-NOx-BAT28-V
definition: 1. Energy industries: 1.1, Combustion of fuels in installations with a total rated thermal input of 50 MW or more, only when this activity takes place in combustion plants with a total rated thermal input of 50 MW or more; Techniques (a)-(i) (see table) for New plant; Reducing nitrogen oxides (NOx) emissions to air. The BAT-AEL emission level is 45�75 mg/Nm3.
status: valid
status modified: 2026-05-06
accepted date: 2026-05-06
in scheme: BATAEL values as defined into the EC BAT-Tool

Large combustion plants - NOx - BAT28-VI
type: Concept
notation: LCP-NOx-BAT28-VI
definition: 1. Energy industries: 1.1, Combustion of fuels in installations with a total rated thermal input of 50 MW or more, only when this activity takes place in combustion plants with a total rated thermal input of 50 MW or more; Techniques (a)-(i) (see table) for Existing plant; Reducing nitrogen oxides (NOx) emissions to air. The BAT-AEL emission level is 45�100 mg/Nm3.
status: valid
status modified: 2026-05-06
accepted date: 2026-05-06
in scheme: BATAEL values as defined into the EC BAT-Tool

Large combustion plants - NOx - BAT28-VII
type: Concept
notation: LCP-NOx-BAT28-VII
definition: 1. Energy industries: 1.1, Combustion of fuels in installations with a total rated thermal input of 50 MW or more, only when this activity takes place in combustion plants with a total rated thermal input of 50 MW or more; Techniques (a)-(i) (see table) for New plant; Reducing nitrogen oxides (NOx) emissions to air. The BAT-AEL emission level is 85�100 mg/Nm3.
status: valid
status modified: 2026-05-06
accepted date: 2026-05-06
in scheme: BATAEL values as defined into the EC BAT-Tool

Large combustion plants - NOx - BAT28-VIII
type: Concept
notation: LCP-NOx-BAT28-VIII
definition: 1. Energy industries: 1.1, Combustion of fuels in installations with a total rated thermal input of 50 MW or more, only when this activity takes place in combustion plants with a total rated thermal input of 50 MW or more; Techniques (a)-(i) (see table) for Existing plant; Reducing nitrogen oxides (NOx) emissions to air. The BAT-AEL emission level is 85�110 mg/Nm3.
status: valid
status modified: 2026-05-06
accepted date: 2026-05-06
in scheme: BATAEL values as defined into the EC BAT-Tool

Large combustion plants - NOx - BAT33-I
type: Concept
notation: LCP-NOx-BAT33-I
definition: 1. Energy industries: 1.1, Combustion of fuels in installations with a total rated thermal input of 50 MW or more, only when this activity takes place in combustion plants with a total rated thermal input of 50 MW or more; Techniques (a)-(b) (see table) for New plant; Reducing nitrogen oxides (NOx) emissions to air. The BAT-AEL emission level is 115�190 mg/Nm3.
status: valid
status modified: 2026-05-06
accepted date: 2026-05-06
in scheme: BATAEL values as defined into the EC BAT-Tool

Large combustion plants - NOx - BAT33-II
type: Concept
notation: LCP-NOx-BAT33-II
definition: 1. Energy industries: 1.1, Combustion of fuels in installations with a total rated thermal input of 50 MW or more, only when this activity takes place in combustion plants with a total rated thermal input of 50 MW or more; Techniques (a)-(b) (see table) for Existing plant; Reducing nitrogen oxides (NOx) emissions to air. The BAT-AEL emission level is 125�625 mg/Nm3.
status: valid
status modified: 2026-05-06
accepted date: 2026-05-06
in scheme: BATAEL values as defined into the EC BAT-Tool

Large combustion plants - NOx - BAT33-III
type: Concept
notation: LCP-NOx-BAT33-III
definition: 1. Energy industries: 1.1, Combustion of fuels in installations with a total rated thermal input of 50 MW or more, only when this activity takes place in combustion plants with a total rated thermal input of 50 MW or more; Techniques (a)-(b) (see table) for New plant; Reducing nitrogen oxides (NOx) emissions to air. The BAT-AEL emission level is 145�300 mg/Nm3.
status: valid
status modified: 2026-05-06
accepted date: 2026-05-06
in scheme: BATAEL values as defined into the EC BAT-Tool

Large combustion plants - NOx - BAT33-IV
type: Concept
notation: LCP-NOx-BAT33-IV
definition: 1. Energy industries: 1.1, Combustion of fuels in installations with a total rated thermal input of 50 MW or more, only when this activity takes place in combustion plants with a total rated thermal input of 50 MW or more; Techniques (a)-(b) (see table) for Existing plant; Reducing nitrogen oxides (NOx) emissions to air. The BAT-AEL emission level is 150�750 mg/Nm3.
status: valid
status modified: 2026-05-06
accepted date: 2026-05-06
in scheme: BATAEL values as defined into the EC BAT-Tool

Large combustion plants - NOx - BAT44-I
type: Concept
notation: LCP-NOx-BAT44-I
definition: 1. Energy industries: 1.1, Combustion of fuels in installations with a total rated thermal input of 50 MW or more, only when this activity takes place in combustion plants with a total rated thermal input of 50 MW or more; Ensure optimised combustion and/or to use oxidation catalysts for new open-cycle gas turbines (OCGTs); Reducing nitrogen oxides (NOx) emissions to air. The BAT-AEL emission level is 15�35 mg/Nm3.
status: valid
status modified: 2026-05-06
accepted date: 2026-05-06
in scheme: BATAEL values as defined into the EC BAT-Tool

Large combustion plants - NOx - BAT44-II
type: Concept
notation: LCP-NOx-BAT44-II
definition: 1. Energy industries: 1.1, Combustion of fuels in installations with a total rated thermal input of 50 MW or more, only when this activity takes place in combustion plants with a total rated thermal input of 50 MW or more; Ensure optimised combustion and/or to use oxidation catalysts for new open-cycle gas turbines (OCGTs); Reducing nitrogen oxides (NOx) emissions to air. The BAT-AEL emission level is 25�50 mg/Nm3.
status: valid
status modified: 2026-05-06
accepted date: 2026-05-06
in scheme: BATAEL values as defined into the EC BAT-Tool

Large combustion plants - NOx - BAT44-III
type: Concept
notation: LCP-NOx-BAT44-III
definition: 1. Energy industries: 1.1, Combustion of fuels in installations with a total rated thermal input of 50 MW or more, only when this activity takes place in combustion plants with a total rated thermal input of 50 MW or more; Ensure optimised combustion and/or to use oxidation catalysts for Existing OCGT (excluding turbines for mechanical drive applications); Reducing nitrogen oxides (NOx) emissions to air. The BAT-AEL emission level is 15�50 mg/Nm3.
status: valid
status modified: 2026-05-06
accepted date: 2026-05-06
in scheme: BATAEL values as defined into the EC BAT-Tool

Large combustion plants - NOx - BAT44-IV
type: Concept
notation: LCP-NOx-BAT44-IV
definition: 1. Energy industries: 1.1, Combustion of fuels in installations with a total rated thermal input of 50 MW or more, only when this activity takes place in combustion plants with a total rated thermal input of 50 MW or more; Ensure optimised combustion and/or to use oxidation catalysts for Existing OCGT (excluding turbines for mechanical drive applications); Reducing nitrogen oxides (NOx) emissions to air. The BAT-AEL emission level is 25�55 mg/Nm3.
status: valid
status modified: 2026-05-06
accepted date: 2026-05-06
in scheme: BATAEL values as defined into the EC BAT-Tool

Large combustion plants - NOx - BAT44-IX
type: Concept
notation: LCP-NOx-BAT44-IX
definition: 1. Energy industries: 1.1, Combustion of fuels in installations with a total rated thermal input of 50 MW or more, only when this activity takes place in combustion plants with a total rated thermal input of 50 MW or more; Ensure optimised combustion and/or to use oxidation catalysts for existing combined-cycle gas turbines (CCGTs); Reducing nitrogen oxides (NOx) emissions to air. The BAT-AEL emission level is 10�50 mg/Nm3.
status: valid
status modified: 2026-05-06
accepted date: 2026-05-06
in scheme: BATAEL values as defined into the EC BAT-Tool

Large combustion plants - NOx - BAT44-V
type: Concept
notation: LCP-NOx-BAT44-V
definition: 1. Energy industries: 1.1, Combustion of fuels in installations with a total rated thermal input of 50 MW or more, only when this activity takes place in combustion plants with a total rated thermal input of 50 MW or more; Ensure optimised combustion and/or to use oxidation catalysts for new combined-cycle gas turbines (CCGTs); Reducing nitrogen oxides (NOx) emissions to air. The BAT-AEL emission level is 10�30 mg/Nm3.
status: valid
status modified: 2026-05-06
accepted date: 2026-05-06
in scheme: BATAEL values as defined into the EC BAT-Tool

Large combustion plants - NOx - BAT44-VI
type: Concept
notation: LCP-NOx-BAT44-VI
definition: 1. Energy industries: 1.1, Combustion of fuels in installations with a total rated thermal input of 50 MW or more, only when this activity takes place in combustion plants with a total rated thermal input of 50 MW or more; Ensure optimised combustion and/or to use oxidation catalysts for new combined-cycle gas turbines (CCGTs); Reducing nitrogen oxides (NOx) emissions to air. The BAT-AEL emission level is 15�40 mg/Nm3.
status: valid
status modified: 2026-05-06
accepted date: 2026-05-06
in scheme: BATAEL values as defined into the EC BAT-Tool

Large combustion plants - NOx - BAT44-VII
type: Concept
notation: LCP-NOx-BAT44-VII
definition: 1. Energy industries: 1.1, Combustion of fuels in installations with a total rated thermal input of 50 MW or more, only when this activity takes place in combustion plants with a total rated thermal input of 50 MW or more; Ensure optimised combustion and/or to use oxidation catalysts for existing combined-cycle gas turbines (CCGTs); Reducing nitrogen oxides (NOx) emissions to air. The BAT-AEL emission level is 10�40 mg/Nm3.
status: valid
status modified: 2026-05-06
accepted date: 2026-05-06
in scheme: BATAEL values as defined into the EC BAT-Tool

Large combustion plants - NOx - BAT44-VIII
type: Concept
notation: LCP-NOx-BAT44-VIII
definition: 1. Energy industries: 1.1, Combustion of fuels in installations with a total rated thermal input of 50 MW or more, only when this activity takes place in combustion plants with a total rated thermal input of 50 MW or more; Ensure optimised combustion and/or to use oxidation catalysts for existing combined-cycle gas turbines (CCGTs); Reducing nitrogen oxides (NOx) emissions to air. The BAT-AEL emission level is 18-50 mg/Nm3.
status: valid
status modified: 2026-05-06
accepted date: 2026-05-06
in scheme: BATAEL values as defined into the EC BAT-Tool

Large combustion plants - NOx - BAT44-X
type: Concept
notation: LCP-NOx-BAT44-X
definition: 1. Energy industries: 1.1, Combustion of fuels in installations with a total rated thermal input of 50 MW or more, only when this activity takes place in combustion plants with a total rated thermal input of 50 MW or more; Ensure optimised combustion and/or to use oxidation catalysts for existing combined-cycle gas turbines (CCGTs); Reducing nitrogen oxides (NOx) emissions to air. The BAT-AEL emission level is 18-55 mg/Nm3.
status: valid
status modified: 2026-05-06
accepted date: 2026-05-06
in scheme: BATAEL values as defined into the EC BAT-Tool

Large combustion plants - NOx - BAT44-XI
type: Concept
notation: LCP-NOx-BAT44-XI
definition: 1. Energy industries: 1.1, Combustion of fuels in installations with a total rated thermal input of 50 MW or more, only when this activity takes place in combustion plants with a total rated thermal input of 50 MW or more; Ensure optimised combustion and/or to use oxidation catalysts for existing combined-cycle gas turbines (CCGTs); Reducing nitrogen oxides (NOx) emissions to air. The BAT-AEL emission level is 10-45 mg/Nm3.
status: valid
status modified: 2026-05-06
accepted date: 2026-05-06
in scheme: BATAEL values as defined into the EC BAT-Tool

Large combustion plants - NOx - BAT44-XII
type: Concept
notation: LCP-NOx-BAT44-XII
definition: 1. Energy industries: 1.1, Combustion of fuels in installations with a total rated thermal input of 50 MW or more, only when this activity takes place in combustion plants with a total rated thermal input of 50 MW or more; Ensure optimised combustion and/or to use oxidation catalysts for existing combined-cycle gas turbines (CCGTs); Reducing nitrogen oxides (NOx) emissions to air. The BAT-AEL emission level is 35-55 mg/Nm3.
status: valid
status modified: 2026-05-06
accepted date: 2026-05-06
in scheme: BATAEL values as defined into the EC BAT-Tool

Large combustion plants - NOx - BAT44-XIII
type: Concept
notation: LCP-NOx-BAT44-XIII
definition: 1. Energy industries: 1.1, Combustion of fuels in installations with a total rated thermal input of 50 MW or more, only when this activity takes place in combustion plants with a total rated thermal input of 50 MW or more; Ensure optimised combustion and/or to use oxidation catalysts for existing combined-cycle gas turbines (CCGTs); Reducing nitrogen oxides (NOx) emissions to air. The BAT-AEL emission level is 25-50 mg/Nm3.
status: valid
status modified: 2026-05-06
accepted date: 2026-05-06
in scheme: BATAEL values as defined into the EC BAT-Tool

Large combustion plants - NOx - BAT44-XIV
type: Concept
notation: LCP-NOx-BAT44-XIV
definition: 1. Energy industries: 1.1, Combustion of fuels in installations with a total rated thermal input of 50 MW or more, only when this activity takes place in combustion plants with a total rated thermal input of 50 MW or more; Ensure optimised combustion and/or to use oxidation catalysts for existing combined-cycle gas turbines (CCGTs); Reducing nitrogen oxides (NOx) emissions to air. The BAT-AEL emission level is 35-55 mg/Nm3.
status: valid
status modified: 2026-05-06
accepted date: 2026-05-06
in scheme: BATAEL values as defined into the EC BAT-Tool

Large combustion plants - NOx - BAT44-XIX
type: Concept
notation: LCP-NOx-BAT44-XIX
definition: 1. Energy industries: 1.1, Combustion of fuels in installations with a total rated thermal input of 50 MW or more, only when this activity takes place in combustion plants with a total rated thermal input of 50 MW or more; Ensure optimised combustion and/or to use oxidation catalysts for Existing plant; Reducing nitrogen oxides (NOx) emissions to air. The BAT-AEL emission level is 50�100 mg/Nm3.
status: valid
status modified: 2026-05-06
accepted date: 2026-05-06
in scheme: BATAEL values as defined into the EC BAT-Tool

Large combustion plants - NOx - BAT44-XV
type: Concept
notation: LCP-NOx-BAT44-XV
definition: 1. Energy industries: 1.1, Combustion of fuels in installations with a total rated thermal input of 50 MW or more, only when this activity takes place in combustion plants with a total rated thermal input of 50 MW or more; Ensure optimised combustion and/or to use oxidation catalysts for open- and combined-cycle gas turbines put into operation no later than 27 November 2003, or existing gas turbine for emergency use and operated < 500 h/yr; Reducing nitrogen oxides (NOx) emissions to air. The BAT-AEL emission level is 60�140 mg/Nm3.
status: valid
status modified: 2026-05-06
accepted date: 2026-05-06
in scheme: BATAEL values as defined into the EC BAT-Tool

Large combustion plants - NOx - BAT44-XVI
type: Concept
notation: LCP-NOx-BAT44-XVI
definition: 1. Energy industries: 1.1, Combustion of fuels in installations with a total rated thermal input of 50 MW or more, only when this activity takes place in combustion plants with a total rated thermal input of 50 MW or more; Ensure optimised combustion and/or to use oxidation catalysts for Existing plant; Reducing nitrogen oxides (NOx) emissions to air. The BAT-AEL emission level is 15�50 mg/Nm3.
status: valid
status modified: 2026-05-06
accepted date: 2026-05-06
in scheme: BATAEL values as defined into the EC BAT-Tool

Large combustion plants - NOx - BAT44-XVII
type: Concept
notation: LCP-NOx-BAT44-XVII
definition: 1. Energy industries: 1.1, Combustion of fuels in installations with a total rated thermal input of 50 MW or more, only when this activity takes place in combustion plants with a total rated thermal input of 50 MW or more; Ensure optimised combustion and/or to use oxidation catalysts for New plant; Reducing nitrogen oxides (NOx) emissions to air. The BAT-AEL emission level is 25-55 mg/Nm3.
status: valid
status modified: 2026-05-06
accepted date: 2026-05-06
in scheme: BATAEL values as defined into the EC BAT-Tool

Large combustion plants - NOx - BAT44-XVIII
type: Concept
notation: LCP-NOx-BAT44-XVIII
definition: 1. Energy industries: 1.1, Combustion of fuels in installations with a total rated thermal input of 50 MW or more, only when this activity takes place in combustion plants with a total rated thermal input of 50 MW or more; Ensure optimised combustion and/or to use oxidation catalysts for New plant; Reducing nitrogen oxides (NOx) emissions to air. The BAT-AEL emission level is 10�60 mg/Nm3.
status: valid
status modified: 2026-05-06
accepted date: 2026-05-06
in scheme: BATAEL values as defined into the EC BAT-Tool

Large combustion plants - NOx - BAT44-XX
type: Concept
notation: LCP-NOx-BAT44-XX
definition: 1. Energy industries: 1.1, Combustion of fuels in installations with a total rated thermal input of 50 MW or more, only when this activity takes place in combustion plants with a total rated thermal input of 50 MW or more; Ensure optimised combustion and/or to use oxidation catalysts for New plant; Reducing nitrogen oxides (NOx) emissions to air. The BAT-AEL emission level is 30�85 mg/Nm3.
status: valid
status modified: 2026-05-06
accepted date: 2026-05-06
in scheme: BATAEL values as defined into the EC BAT-Tool

Large combustion plants - NOx - BAT44-XXI
type: Concept
notation: LCP-NOx-BAT44-XXI
definition: 1. Energy industries: 1.1, Combustion of fuels in installations with a total rated thermal input of 50 MW or more, only when this activity takes place in combustion plants with a total rated thermal input of 50 MW or more; Ensure optimised combustion and/or to use oxidation catalysts for Existing plant; Reducing nitrogen oxides (NOx) emissions to air. The BAT-AEL emission level is 85�110 mg/Nm3.
status: valid
status modified: 2026-05-06
accepted date: 2026-05-06
in scheme: BATAEL values as defined into the EC BAT-Tool

Large combustion plants - NOx - BAT44-XXII
type: Concept
notation: LCP-NOx-BAT44-XXII
definition: 1. Energy industries: 1.1, Combustion of fuels in installations with a total rated thermal input of 50 MW or more, only when this activity takes place in combustion plants with a total rated thermal input of 50 MW or more; Ensure optimised combustion and/or to use oxidation catalysts for New plant; Reducing nitrogen oxides (NOx) emissions to air. The BAT-AEL emission level is 20�75 mg/Nm3.
status: valid
status modified: 2026-05-06
accepted date: 2026-05-06
in scheme: BATAEL values as defined into the EC BAT-Tool

Large combustion plants - NOx - BAT44-XXIII
type: Concept
notation: LCP-NOx-BAT44-XXIII
definition: 1. Energy industries: 1.1, Combustion of fuels in installations with a total rated thermal input of 50 MW or more, only when this activity takes place in combustion plants with a total rated thermal input of 50 MW or more; Ensure optimised combustion and/or to use oxidation catalysts for Existing plant; Reducing nitrogen oxides (NOx) emissions to air. The BAT-AEL emission level is 20�100 mg/Nm3.
status: valid
status modified: 2026-05-06
accepted date: 2026-05-06
in scheme: BATAEL values as defined into the EC BAT-Tool

Large combustion plants - NOx - BAT44-XXIV
type: Concept
notation: LCP-NOx-BAT44-XXIV
definition: 1. Energy industries: 1.1, Combustion of fuels in installations with a total rated thermal input of 50 MW or more, only when this activity takes place in combustion plants with a total rated thermal input of 50 MW or more; Ensure optimised combustion and/or to use oxidation catalysts for New plant; Reducing nitrogen oxides (NOx) emissions to air. The BAT-AEL emission level is 55�85 mg/Nm3.
status: valid
status modified: 2026-05-06
accepted date: 2026-05-06
in scheme: BATAEL values as defined into the EC BAT-Tool

Large combustion plants - NOx - BAT44-XXV
type: Concept
notation: LCP-NOx-BAT44-XXV
definition: 1. Energy industries: 1.1, Combustion of fuels in installations with a total rated thermal input of 50 MW or more, only when this activity takes place in combustion plants with a total rated thermal input of 50 MW or more; Ensure optimised combustion and/or to use oxidation catalysts for Existing plant; Reducing nitrogen oxides (NOx) emissions to air. The BAT-AEL emission level is 55�110 mg/Nm3.
status: valid
status modified: 2026-05-06
accepted date: 2026-05-06
in scheme: BATAEL values as defined into the EC BAT-Tool

Large combustion plants - NOx - BAT49-I
type: Concept
notation: LCP-NOx-BAT49-I
definition: 1. Energy industries: 1.1, Combustion of fuels in installations with a total rated thermal input of 50 MW or more, only when this activity takes place in combustion plants with a total rated thermal input of 50 MW or more; Techniques (a)-(b) (see table) for New boilers; Reducing nitrogen oxides (NOx) emissions to air. The BAT-AEL emission level is 15�65 mg/Nm3.
status: valid
status modified: 2026-05-06
accepted date: 2026-05-06
in scheme: BATAEL values as defined into the EC BAT-Tool

Large combustion plants - NOx - BAT49-II
type: Concept
notation: LCP-NOx-BAT49-II
definition: 1. Energy industries: 1.1, Combustion of fuels in installations with a total rated thermal input of 50 MW or more, only when this activity takes place in combustion plants with a total rated thermal input of 50 MW or more; Techniques (a)-(b) (see table) for New boilers; Reducing nitrogen oxides (NOx) emissions to air. The BAT-AEL emission level is 22�100 mg/Nm3.
status: valid
status modified: 2026-05-06
accepted date: 2026-05-06
in scheme: BATAEL values as defined into the EC BAT-Tool

Large combustion plants - NOx - BAT49-III
type: Concept
notation: LCP-NOx-BAT49-III
definition: 1. Energy industries: 1.1, Combustion of fuels in installations with a total rated thermal input of 50 MW or more, only when this activity takes place in combustion plants with a total rated thermal input of 50 MW or more; Techniques (a)-(b) (see table) for Existing boilers; Reducing nitrogen oxides (NOx) emissions to air. The BAT-AEL emission level is 20�100 mg/Nm3.
status: valid
status modified: 2026-05-06
accepted date: 2026-05-06
in scheme: BATAEL values as defined into the EC BAT-Tool

Large combustion plants - NOx - BAT49-IV
type: Concept
notation: LCP-NOx-BAT49-IV
definition: 1. Energy industries: 1.1, Combustion of fuels in installations with a total rated thermal input of 50 MW or more, only when this activity takes place in combustion plants with a total rated thermal input of 50 MW or more; Techniques (a)-(b) (see table) for Existing boilers; Reducing nitrogen oxides (NOx) emissions to air. The BAT-AEL emission level is 22�110 mg/Nm3.
status: valid
status modified: 2026-05-06
accepted date: 2026-05-06
in scheme: BATAEL values as defined into the EC BAT-Tool

Large combustion plants - NOx - BAT49-V
type: Concept
notation: LCP-NOx-BAT49-V
definition: 1. Energy industries: 1.1, Combustion of fuels in installations with a total rated thermal input of 50 MW or more, only when this activity takes place in combustion plants with a total rated thermal input of 50 MW or more; Techniques (a)-(b) (see table) for new combined-cycle gas turbines (CCGTs); Reducing nitrogen oxides (NOx) emissions to air. The BAT-AEL emission level is 20�35 mg/Nm3.
status: valid
status modified: 2026-05-06
accepted date: 2026-05-06
in scheme: BATAEL values as defined into the EC BAT-Tool

Large combustion plants - NOx - BAT49-VI
type: Concept
notation: LCP-NOx-BAT49-VI
definition: 1. Energy industries: 1.1, Combustion of fuels in installations with a total rated thermal input of 50 MW or more, only when this activity takes place in combustion plants with a total rated thermal input of 50 MW or more; Techniques (a)-(b) (see table) for new combined-cycle gas turbines (CCGTs); Reducing nitrogen oxides (NOx) emissions to air. The BAT-AEL emission level is 30�50 mg/Nm3.
status: valid
status modified: 2026-05-06
accepted date: 2026-05-06
in scheme: BATAEL values as defined into the EC BAT-Tool

Large combustion plants - NOx - BAT49-VII
type: Concept
notation: LCP-NOx-BAT49-VII
definition: 1. Energy industries: 1.1, Combustion of fuels in installations with a total rated thermal input of 50 MW or more, only when this activity takes place in combustion plants with a total rated thermal input of 50 MW or more; Techniques (a)-(b) (see table) for existing combined-cycle gas turbines (CCGTs); Reducing nitrogen oxides (NOx) emissions to air. The BAT-AEL emission level is 20�50 mg/Nm3.
status: valid
status modified: 2026-05-06
accepted date: 2026-05-06
in scheme: BATAEL values as defined into the EC BAT-Tool

Large combustion plants - NOx - BAT49-VIII
type: Concept
notation: LCP-NOx-BAT49-VIII
definition: 1. Energy industries: 1.1, Combustion of fuels in installations with a total rated thermal input of 50 MW or more, only when this activity takes place in combustion plants with a total rated thermal input of 50 MW or more; Techniques (a)-(b) (see table) for existing combined-cycle gas turbines (CCGTs); Reducing nitrogen oxides (NOx) emissions to air. The BAT-AEL emission level is 30�55 mg/Nm3.
status: valid
status modified: 2026-05-06
accepted date: 2026-05-06
in scheme: BATAEL values as defined into the EC BAT-Tool

Large combustion plants - NOx - BAT53-I
type: Concept
notation: LCP-NOx-BAT53-I
definition: 1. Energy industries: 1.1, Combustion of fuels in installations with a total rated thermal input of 50 MW or more, only when this activity takes place in combustion plants with a total rated thermal input of 50 MW or more; Techniques (a)-(d) (see table). for new open-cycle gas turbines on offshore platforms; Reducing nitrogen oxides (NOx) emissions to air. The BAT-AEL emission level is 15�50 mg/Nm3.
status: valid
status modified: 2026-05-06
accepted date: 2026-05-06
in scheme: BATAEL values as defined into the EC BAT-Tool

Large combustion plants - NOx - BAT53-II
type: Concept
notation: LCP-NOx-BAT53-II
definition: 1. Energy industries: 1.1, Combustion of fuels in installations with a total rated thermal input of 50 MW or more, only when this activity takes place in combustion plants with a total rated thermal input of 50 MW or more; Techniques (a)-(d) (see table). for existing open-cycle gas turbines on offshore platforms; Reducing nitrogen oxides (NOx) emissions to air. The BAT-AEL emission level is < 50�350 mg/Nm3.
status: valid
status modified: 2026-05-06
accepted date: 2026-05-06
in scheme: BATAEL values as defined into the EC BAT-Tool

Large combustion plants - NOx - BAT56-I
type: Concept
notation: LCP-NOx-BAT56-I
definition: 1. Energy industries: 1.1, Combustion of fuels in installations with a total rated thermal input of 50 MW or more, only when this activity takes place in combustion plants with a total rated thermal input of 50 MW or more; Techniques (a)-(i) (see table). for New plant; Reducing nitrogen oxides (NOx) emissions to air. The BAT-AEL emission level is 30�85 mg/Nm3.
status: valid
status modified: 2026-05-06
accepted date: 2026-05-06
in scheme: BATAEL values as defined into the EC BAT-Tool

Large combustion plants - NOx - BAT56-II
type: Concept
notation: LCP-NOx-BAT56-II
definition: 1. Energy industries: 1.1, Combustion of fuels in installations with a total rated thermal input of 50 MW or more, only when this activity takes place in combustion plants with a total rated thermal input of 50 MW or more; Techniques (a)-(i) (see table). for Existing plant; Reducing nitrogen oxides (NOx) emissions to air. The BAT-AEL emission level is 80�290 mg/Nm3.
status: valid
status modified: 2026-05-06
accepted date: 2026-05-06
in scheme: BATAEL values as defined into the EC BAT-Tool

Large combustion plants - NOx - BAT56-III
type: Concept
notation: LCP-NOx-BAT56-III
definition: 1. Energy industries: 1.1, Combustion of fuels in installations with a total rated thermal input of 50 MW or more, only when this activity takes place in combustion plants with a total rated thermal input of 50 MW or more; Techniques (a)-(i) (see table). for New plant; Reducing nitrogen oxides (NOx) emissions to air. The BAT-AEL emission level is 50�110 mg/Nm3.
status: valid
status modified: 2026-05-06
accepted date: 2026-05-06
in scheme: BATAEL values as defined into the EC BAT-Tool

Large combustion plants - NOx - BAT56-IV
type: Concept
notation: LCP-NOx-BAT56-IV
definition: 1. Energy industries: 1.1, Combustion of fuels in installations with a total rated thermal input of 50 MW or more, only when this activity takes place in combustion plants with a total rated thermal input of 50 MW or more; Techniques (a)-(i) (see table). for Existing plant; Reducing nitrogen oxides (NOx) emissions to air. The BAT-AEL emission level is 100�330 mg/Nm3.
status: valid
status modified: 2026-05-06
accepted date: 2026-05-06
in scheme: BATAEL values as defined into the EC BAT-Tool

Large combustion plants - NOx - BAT56-V
type: Concept
notation: LCP-NOx-BAT56-V
definition: 1. Energy industries: 1.1, Combustion of fuels in installations with a total rated thermal input of 50 MW or more, only when this activity takes place in combustion plants with a total rated thermal input of 50 MW or more; Techniques (a)-(i) (see table). for New plant; Reducing nitrogen oxides (NOx) emissions to air. The BAT-AEL emission level is 20�80 mg/Nm3.
status: valid
status modified: 2026-05-06
accepted date: 2026-05-06
in scheme: BATAEL values as defined into the EC BAT-Tool

Large combustion plants - NOx - BAT56-VI
type: Concept
notation: LCP-NOx-BAT56-VI
definition: 1. Energy industries: 1.1, Combustion of fuels in installations with a total rated thermal input of 50 MW or more, only when this activity takes place in combustion plants with a total rated thermal input of 50 MW or more; Techniques (a)-(i) (see table). for Existing plant; Reducing nitrogen oxides (NOx) emissions to air. The BAT-AEL emission level is 70�100 mg/Nm3.
status: valid
status modified: 2026-05-06
accepted date: 2026-05-06
in scheme: BATAEL values as defined into the EC BAT-Tool

Large combustion plants - NOx - BAT56-VII
type: Concept
notation: LCP-NOx-BAT56-VII
definition: 1. Energy industries: 1.1, Combustion of fuels in installations with a total rated thermal input of 50 MW or more, only when this activity takes place in combustion plants with a total rated thermal input of 50 MW or more; Techniques (a)-(i) (see table). for New plant; Reducing nitrogen oxides (NOx) emissions to air. The BAT-AEL emission level is 30�100 mg/Nm3.
status: valid
status modified: 2026-05-06
accepted date: 2026-05-06
in scheme: BATAEL values as defined into the EC BAT-Tool

Large combustion plants - NOx - BAT56-VIII
type: Concept
notation: LCP-NOx-BAT56-VIII
definition: 1. Energy industries: 1.1, Combustion of fuels in installations with a total rated thermal input of 50 MW or more, only when this activity takes place in combustion plants with a total rated thermal input of 50 MW or more; Techniques (a)-(i) (see table). for Existing plant; Reducing nitrogen oxides (NOx) emissions to air. The BAT-AEL emission level is 85�110 mg/Nm3.
status: valid
status modified: 2026-05-06
accepted date: 2026-05-06
in scheme: BATAEL values as defined into the EC BAT-Tool

Large combustion plants - NOx - BAT73-I
type: Concept
notation: LCP-NOx-BAT73-I
definition: 1. Energy industries: 1.4, Gasification of coal or other fuels in installations with a total rated thermal input of 20 MW or more, only when this activity is directly associated to a combustion plant; Use one or a combination of the techniques given below: (a)-(e) (see table) for New plant; Reducing nitrogen oxides (NOx) emissions to air. The BAT-AEL emission level is 10�25 mg/Nm3 .
status: valid
status modified: 2026-05-06
accepted date: 2026-05-06
in scheme: BATAEL values as defined into the EC BAT-Tool

Large combustion plants - NOx - BAT73-II
type: Concept
notation: LCP-NOx-BAT73-II
definition: 1. Energy industries: 1.4, Gasification of coal or other fuels in installations with a total rated thermal input of 20 MW or more, only when this activity is directly associated to a combustion plant; Use one or a combination of the techniques given below: (a)-(e) (see table) for Existing plant; Reducing nitrogen oxides (NOx) emissions to air. The BAT-AEL emission level is 12�45 mg/Nm3 .
status: valid
status modified: 2026-05-06
accepted date: 2026-05-06
in scheme: BATAEL values as defined into the EC BAT-Tool

Large combustion plants - NOx - BAT73-III
type: Concept
notation: LCP-NOx-BAT73-III
definition: 1. Energy industries: 1.4, Gasification of coal or other fuels in installations with a total rated thermal input of 20 MW or more, only when this activity is directly associated to a combustion plant; Use one or a combination of the techniques given below: (a)-(e) (see table) for New plant; Reducing nitrogen oxides (NOx) emissions to air. The BAT-AEL emission level is 1�35 mg/Nm3 .
status: valid
status modified: 2026-05-06
accepted date: 2026-05-06
in scheme: BATAEL values as defined into the EC BAT-Tool

Large combustion plants - NOx - BAT73-IV
type: Concept
notation: LCP-NOx-BAT73-IV
definition: 1. Energy industries: 1.4, Gasification of coal or other fuels in installations with a total rated thermal input of 20 MW or more, only when this activity is directly associated to a combustion plant; Use one or a combination of the techniques given below: (a)-(e) (see table) for Existing plant; Reducing nitrogen oxides (NOx) emissions to air. The BAT-AEL emission level is 1�60 mg/Nm3 .
status: valid
status modified: 2026-05-06
accepted date: 2026-05-06
in scheme: BATAEL values as defined into the EC BAT-Tool

Large combustion plants - PCDD.F - BAT59
type: Concept
notation: LCP-PCDD.F-BAT59
definition: 1. Energy industries: 1.1, Combustion of fuels in installations with a total rated thermal input of 50 MW or more, only when this activity takes place in combustion plants with a total rated thermal input of 50 MW or more; Techniques (a)-(c) (see table); Reducing PCDD/F emissions to air. The BAT-AEL emission level is < 0,012�0,036 ng I-TEQ/Nm3 .
status: valid
status modified: 2026-05-06
accepted date: 2026-05-06
in scheme: BATAEL values as defined into the EC BAT-Tool

Large combustion plants - PCDD.F - BAT71-I
type: Concept
notation: LCP-PCDD.F-BAT71-I
definition: 1. Energy industries: 1.1, Combustion of fuels in installations with a total rated thermal input of 50 MW or more, only when this activity takes place in combustion plants with a total rated thermal input of 50 MW or more; Use a combination of the techniques given in BAT 6, BAT 26 and techniques (a)-(c) (see table); Reducing PCDD/F emissions to air. The BAT-AEL emission level is ? 0,01-0,03 ng I-TEQ/Nm3 .
status: valid
status modified: 2026-05-06
accepted date: 2026-05-06
in scheme: BATAEL values as defined into the EC BAT-Tool

Large combustion plants - SO2 - BAT21-I
type: Concept
notation: LCP-SO2-BAT21-I
definition: 1. Energy industries: 1.1, Combustion of fuels in installations with a total rated thermal input of 50 MW or more, only when this activity takes place in combustion plants with a total rated thermal input of 50 MW or more; Techniques (a)-(j) (see table) for New plant; Reducing sulphur dioxide (SO2) emissions to air. The BAT-AEL emission level is 150�200 mg/Nm3.
status: valid
status modified: 2026-05-06
accepted date: 2026-05-06
in scheme: BATAEL values as defined into the EC BAT-Tool

Large combustion plants - SO2 - BAT21-II
type: Concept
notation: LCP-SO2-BAT21-II
definition: 1. Energy industries: 1.1, Combustion of fuels in installations with a total rated thermal input of 50 MW or more, only when this activity takes place in combustion plants with a total rated thermal input of 50 MW or more; Techniques (a)-(j) (see table) for Existing plant; Reducing sulphur dioxide (SO2) emissions to air. The BAT-AEL emission level is 150�360 mg/Nm3 .
status: valid
status modified: 2026-05-06
accepted date: 2026-05-06
in scheme: BATAEL values as defined into the EC BAT-Tool

Large combustion plants - Ni - BAT15-XIII
type: Concept
notation: LCP-Ni-BAT15-XIII
definition: 1.� Energy industries; 5.� Waste management: 1.1, Combustion of fuels in installations with a total rated thermal input of 50 MW or more, only when this activity takes place in combustion plants with a total rated thermal input of 50 MW or more; 1.4, Gasification of coal or other fuels in installations with a total rated thermal input of 20 MW or more, only when this activity is directly associated to a combustion plant; 5.2, Disposal or recovery of waste in waste co-incineration plants for non-hazardous waste with a capacity exceeding 3 tonnes per hour or for hazardous waste with a capacity exceeding 10 tonnes per day, only when this activity takes place in combustion plants covered under 1.1 above. Reducing nickel to water. The BAT-AEL emission level is 10�50 �g/l .
status: valid
status modified: 2026-05-06
accepted date: 2026-05-06
in scheme: BATAEL values as defined into the EC BAT-Tool

Large combustion plants - Pb - BAT15-XIV
type: Concept
notation: LCP-Pb-BAT15-XIV
definition: 1.� Energy industries; 5.� Waste management: 1.1, Combustion of fuels in installations with a total rated thermal input of 50 MW or more, only when this activity takes place in combustion plants with a total rated thermal input of 50 MW or more; 1.4, Gasification of coal or other fuels in installations with a total rated thermal input of 20 MW or more, only when this activity is directly associated to a combustion plant; 5.2, Disposal or recovery of waste in waste co-incineration plants for non-hazardous waste with a capacity exceeding 3 tonnes per hour or for hazardous waste with a capacity exceeding 10 tonnes per day, only when this activity takes place in combustion plants covered under 1.1 above. Reducing lead to water. The BAT-AEL emission level is 10�20 �g/l .
status: valid
status modified: 2026-05-06
accepted date: 2026-05-06
in scheme: BATAEL values as defined into the EC BAT-Tool

Large combustion plants - S - BAT15-VI
type: Concept
notation: LCP-S-BAT15-VI
definition: 1.� Energy industries; 5.� Waste management: 1.1, Combustion of fuels in installations with a total rated thermal input of 50 MW or more, only when this activity takes place in combustion plants with a total rated thermal input of 50 MW or more; 1.4, Gasification of coal or other fuels in installations with a total rated thermal input of 20 MW or more, only when this activity is directly associated to a combustion plant; 5.2, Disposal or recovery of waste in waste co-incineration plants for non-hazardous waste with a capacity exceeding 3 tonnes per hour or for hazardous waste with a capacity exceeding 10 tonnes per day, only when this activity takes place in combustion plants covered under 1.1 above. Reducing sulphide to water. The BAT-AEL emission level is 0,1�0,2 mg/l.
status: valid
status modified: 2026-05-06
accepted date: 2026-05-06
in scheme: BATAEL values as defined into the EC BAT-Tool

Large combustion plants - SO2 - BAT21-III
type: Concept
notation: LCP-SO2-BAT21-III
definition: 1. Energy industries: 1.1, Combustion of fuels in installations with a total rated thermal input of 50 MW or more, only when this activity takes place in combustion plants with a total rated thermal input of 50 MW or more; Techniques (a)-(j) (see table) for New plant; Reducing sulphur dioxide (SO2) emissions to air. The BAT-AEL emission level is 170�220 mg/Nm3 .
status: valid
status modified: 2026-05-06
accepted date: 2026-05-06
in scheme: BATAEL values as defined into the EC BAT-Tool

Large combustion plants - SO2 - BAT21-IV
type: Concept
notation: LCP-SO2-BAT21-IV
definition: 1. Energy industries: 1.1, Combustion of fuels in installations with a total rated thermal input of 50 MW or more, only when this activity takes place in combustion plants with a total rated thermal input of 50 MW or more; Techniques (a)-(j) (see table) for Existing plant; Reducing sulphur dioxide (SO2) emissions to air. The BAT-AEL emission level is 170�400 mg/Nm3.
status: valid
status modified: 2026-05-06
accepted date: 2026-05-06
in scheme: BATAEL values as defined into the EC BAT-Tool

Large combustion plants - SO2 - BAT21-IX
type: Concept
notation: LCP-SO2-BAT21-IX
definition: 1. Energy industries: 1.1, Combustion of fuels in installations with a total rated thermal input of 50 MW or more, only when this activity takes place in combustion plants with a total rated thermal input of 50 MW or more; Techniques (a)-(j) (see table) in PC boilers for New plant; Reducing sulphur dioxide (SO2) emissions to air. The BAT-AEL emission level is 10�75 mg/Nm3 .
status: valid
status modified: 2026-05-06
accepted date: 2026-05-06
in scheme: BATAEL values as defined into the EC BAT-Tool

Large combustion plants - SO2 - BAT21-V
type: Concept
notation: LCP-SO2-BAT21-V
definition: 1. Energy industries: 1.1, Combustion of fuels in installations with a total rated thermal input of 50 MW or more, only when this activity takes place in combustion plants with a total rated thermal input of 50 MW or more; Techniques (a)-(j) (see table) for New plant; Reducing sulphur dioxide (SO2) emissions to air. The BAT-AEL emission level is 80�150 mg/Nm3 .
status: valid
status modified: 2026-05-06
accepted date: 2026-05-06
in scheme: BATAEL values as defined into the EC BAT-Tool

Large combustion plants - SO2 - BAT21-VI
type: Concept
notation: LCP-SO2-BAT21-VI
definition: 1. Energy industries: 1.1, Combustion of fuels in installations with a total rated thermal input of 50 MW or more, only when this activity takes place in combustion plants with a total rated thermal input of 50 MW or more; Techniques (a)-(j) (see table) for Existing plant; Reducing sulphur dioxide (SO2) emissions to air. The BAT-AEL emission level is 95�200 mg/Nm3 .
status: valid
status modified: 2026-05-06
accepted date: 2026-05-06
in scheme: BATAEL values as defined into the EC BAT-Tool

Large combustion plants - SO2 - BAT21-VII
type: Concept
notation: LCP-SO2-BAT21-VII
definition: 1. Energy industries: 1.1, Combustion of fuels in installations with a total rated thermal input of 50 MW or more, only when this activity takes place in combustion plants with a total rated thermal input of 50 MW or more; Techniques (a)-(j) (see table) for New plant; Reducing sulphur dioxide (SO2) emissions to air. The BAT-AEL emission level is 135�200 mg/Nm3 .
status: valid
status modified: 2026-05-06
accepted date: 2026-05-06
in scheme: BATAEL values as defined into the EC BAT-Tool

Large combustion plants - SO2 - BAT21-VIII
type: Concept
notation: LCP-SO2-BAT21-VIII
definition: 1. Energy industries: 1.1, Combustion of fuels in installations with a total rated thermal input of 50 MW or more, only when this activity takes place in combustion plants with a total rated thermal input of 50 MW or more; Techniques (a)-(j) (see table) for Existing plant; Reducing sulphur dioxide (SO2) emissions to air. The BAT-AEL emission level is 135�220 mg/Nm3 .
status: valid
status modified: 2026-05-06
accepted date: 2026-05-06
in scheme: BATAEL values as defined into the EC BAT-Tool

Large combustion plants - SO2 - BAT21-X
type: Concept
notation: LCP-SO2-BAT21-X
definition: 1. Energy industries: 1.1, Combustion of fuels in installations with a total rated thermal input of 50 MW or more, only when this activity takes place in combustion plants with a total rated thermal input of 50 MW or more; Techniques (a)-(j) (see table) in PC boilers for Existing plant; Reducing sulphur dioxide (SO2) emissions to air. The BAT-AEL emission level is 10�130 mg/Nm3.
status: valid
status modified: 2026-05-06
accepted date: 2026-05-06
in scheme: BATAEL values as defined into the EC BAT-Tool

Large combustion plants - SO2 - BAT21-XI
type: Concept
notation: LCP-SO2-BAT21-XI
definition: 1. Energy industries: 1.1, Combustion of fuels in installations with a total rated thermal input of 50 MW or more, only when this activity takes place in combustion plants with a total rated thermal input of 50 MW or more; Techniques (a)-(j) (see table) in PC boilers for New plant; Reducing sulphur dioxide (SO2) emissions to air. The BAT-AEL emission level is 25�110 mg/Nm3.
status: valid
status modified: 2026-05-06
accepted date: 2026-05-06
in scheme: BATAEL values as defined into the EC BAT-Tool

Large combustion plants - SO2 - BAT21-XII
type: Concept
notation: LCP-SO2-BAT21-XII
definition: 1. Energy industries: 1.1, Combustion of fuels in installations with a total rated thermal input of 50 MW or more, only when this activity takes place in combustion plants with a total rated thermal input of 50 MW or more; Techniques (a)-(j) (see table) in PC boilers for Existing plant; Reducing sulphur dioxide (SO2) emissions to air. The BAT-AEL emission level is 25�165 mg/Nm3 .
status: valid
status modified: 2026-05-06
accepted date: 2026-05-06
in scheme: BATAEL values as defined into the EC BAT-Tool

Large combustion plants - SO2 - BAT21-XIII
type: Concept
notation: LCP-SO2-BAT21-XIII
definition: 1. Energy industries: 1.1, Combustion of fuels in installations with a total rated thermal input of 50 MW or more, only when this activity takes place in combustion plants with a total rated thermal input of 50 MW or more; Techniques (a)-(j) (see table) in fluidised bed boilers for New plant; Reducing sulphur dioxide (SO2) emissions to air. The BAT-AEL emission level is 20�75 mg/Nm3 .
status: valid
status modified: 2026-05-06
accepted date: 2026-05-06
in scheme: BATAEL values as defined into the EC BAT-Tool

Large combustion plants - SO2 - BAT21-XIV
type: Concept
notation: LCP-SO2-BAT21-XIV
definition: 1. Energy industries: 1.1, Combustion of fuels in installations with a total rated thermal input of 50 MW or more, only when this activity takes place in combustion plants with a total rated thermal input of 50 MW or more; Techniques (a)-(j) (see table) in fluidised bed boilers for Existing plant; Reducing sulphur dioxide (SO2) emissions to air. The BAT-AEL emission level is 20�180 mg/Nm3 .
status: valid
status modified: 2026-05-06
accepted date: 2026-05-06
in scheme: BATAEL values as defined into the EC BAT-Tool

Large combustion plants - SO2 - BAT21-XV
type: Concept
notation: LCP-SO2-BAT21-XV
definition: 1. Energy industries: 1.1, Combustion of fuels in installations with a total rated thermal input of 50 MW or more, only when this activity takes place in combustion plants with a total rated thermal input of 50 MW or more; Techniques (a)-(j) (see table) in fluidised bed boilers for New plant; Reducing sulphur dioxide (SO2) emissions to air. The BAT-AEL emission level is 25�110 mg/Nm3.
status: valid
status modified: 2026-05-06
accepted date: 2026-05-06
in scheme: BATAEL values as defined into the EC BAT-Tool

Large combustion plants - SO2 - BAT21-XVI
type: Concept
notation: LCP-SO2-BAT21-XVI
definition: 1. Energy industries: 1.1, Combustion of fuels in installations with a total rated thermal input of 50 MW or more, only when this activity takes place in combustion plants with a total rated thermal input of 50 MW or more; Techniques (a)-(j) (see table) in fluidised bed boilers for Existing plant; Reducing sulphur dioxide (SO2) emissions to air. The BAT-AEL emission level is 50�220 mg/Nm3.
status: valid
status modified: 2026-05-06
accepted date: 2026-05-06
in scheme: BATAEL values as defined into the EC BAT-Tool

Large combustion plants - SO2 - BAT25-I
type: Concept
notation: LCP-SO2-BAT25-I
definition: 1. Energy industries: 1.1, Combustion of fuels in installations with a total rated thermal input of 50 MW or more, only when this activity takes place in combustion plants with a total rated thermal input of 50 MW or more; Techniques (a)-(h) (see table) for New plant; Reducing sulphur dioxide (SO2) emissions to air. The BAT-AEL emission level is 15�70 mg/Nm3.
status: valid
status modified: 2026-05-06
accepted date: 2026-05-06
in scheme: BATAEL values as defined into the EC BAT-Tool

Large combustion plants - SO2 - BAT25-II
type: Concept
notation: LCP-SO2-BAT25-II
definition: 1. Energy industries: 1.1, Combustion of fuels in installations with a total rated thermal input of 50 MW or more, only when this activity takes place in combustion plants with a total rated thermal input of 50 MW or more; Techniques (a)-(h) (see table) for Existing plant; Reducing sulphur dioxide (SO2) emissions to air. The BAT-AEL emission level is 15�100 mg/Nm3.
status: valid
status modified: 2026-05-06
accepted date: 2026-05-06
in scheme: BATAEL values as defined into the EC BAT-Tool

Large combustion plants - SO2 - BAT25-III
type: Concept
notation: LCP-SO2-BAT25-III
definition: 1. Energy industries: 1.1, Combustion of fuels in installations with a total rated thermal input of 50 MW or more, only when this activity takes place in combustion plants with a total rated thermal input of 50 MW or more; Techniques (a)-(h) (see table) for New plant; Reducing sulphur dioxide (SO2) emissions to air. The BAT-AEL emission level is 30�175 mg/Nm3.
status: valid
status modified: 2026-05-06
accepted date: 2026-05-06
in scheme: BATAEL values as defined into the EC BAT-Tool

Large combustion plants - SO2 - BAT25-IV
type: Concept
notation: LCP-SO2-BAT25-IV
definition: 1. Energy industries: 1.1, Combustion of fuels in installations with a total rated thermal input of 50 MW or more, only when this activity takes place in combustion plants with a total rated thermal input of 50 MW or more; Techniques (a)-(h) (see table) for Existing plant; Reducing sulphur dioxide (SO2) emissions to air. The BAT-AEL emission level is 30�215 mg/Nm3.
status: valid
status modified: 2026-05-06
accepted date: 2026-05-06
in scheme: BATAEL values as defined into the EC BAT-Tool

Large combustion plants - SO2 - BAT25-IX
type: Concept
notation: LCP-SO2-BAT25-IX
definition: 1. Energy industries: 1.1, Combustion of fuels in installations with a total rated thermal input of 50 MW or more, only when this activity takes place in combustion plants with a total rated thermal input of 50 MW or more; Techniques (a)-(h) (see table) for New plant; Reducing sulphur dioxide (SO2) emissions to air. The BAT-AEL emission level is < 10�35 mg/Nm3.
status: valid
status modified: 2026-05-06
accepted date: 2026-05-06
in scheme: BATAEL values as defined into the EC BAT-Tool

Large combustion plants - SO2 - BAT25-V
type: Concept
notation: LCP-SO2-BAT25-V
definition: 1. Energy industries: 1.1, Combustion of fuels in installations with a total rated thermal input of 50 MW or more, only when this activity takes place in combustion plants with a total rated thermal input of 50 MW or more; Techniques (a)-(h) (see table) for New plant; Reducing sulphur dioxide (SO2) emissions to air. The BAT-AEL emission level is < 10�50 mg/Nm3.
status: valid
status modified: 2026-05-06
accepted date: 2026-05-06
in scheme: BATAEL values as defined into the EC BAT-Tool

Large combustion plants - SO2 - BAT25-VI
type: Concept
notation: LCP-SO2-BAT25-VI
definition: 1. Energy industries: 1.1, Combustion of fuels in installations with a total rated thermal input of 50 MW or more, only when this activity takes place in combustion plants with a total rated thermal input of 50 MW or more; Techniques (a)-(h) (see table) for Existing plant; Reducing sulphur dioxide (SO2) emissions to air. The BAT-AEL emission level is < 10�70 mg/Nm3.
status: valid
status modified: 2026-05-06
accepted date: 2026-05-06
in scheme: BATAEL values as defined into the EC BAT-Tool

Large combustion plants - SO2 - BAT25-VII
type: Concept
notation: LCP-SO2-BAT25-VII
definition: 1. Energy industries: 1.1, Combustion of fuels in installations with a total rated thermal input of 50 MW or more, only when this activity takes place in combustion plants with a total rated thermal input of 50 MW or more; Techniques (a)-(h) (see table) for New plant; Reducing sulphur dioxide (SO2) emissions to air. The BAT-AEL emission level is < 20�85 mg/Nm3.
status: valid
status modified: 2026-05-06
accepted date: 2026-05-06
in scheme: BATAEL values as defined into the EC BAT-Tool

Large combustion plants - SO2 - BAT25-VIII
type: Concept
notation: LCP-SO2-BAT25-VIII
definition: 1. Energy industries: 1.1, Combustion of fuels in installations with a total rated thermal input of 50 MW or more, only when this activity takes place in combustion plants with a total rated thermal input of 50 MW or more; Techniques (a)-(h) (see table) for Existing plant; Reducing sulphur dioxide (SO2) emissions to air. The BAT-AEL emission level is < 20�175 mg/Nm3.
status: valid
status modified: 2026-05-06
accepted date: 2026-05-06
in scheme: BATAEL values as defined into the EC BAT-Tool

Large combustion plants - SO2 - BAT25-X
type: Concept
notation: LCP-SO2-BAT25-X
definition: 1. Energy industries: 1.1, Combustion of fuels in installations with a total rated thermal input of 50 MW or more, only when this activity takes place in combustion plants with a total rated thermal input of 50 MW or more; Techniques (a)-(h) (see table) for Existing plant; Reducing sulphur dioxide (SO2) emissions to air. The BAT-AEL emission level is < 10�50 mg/Nm3.
status: valid
status modified: 2026-05-06
accepted date: 2026-05-06
in scheme: BATAEL values as defined into the EC BAT-Tool

Large combustion plants - SO2 - BAT25-XI
type: Concept
notation: LCP-SO2-BAT25-XI
definition: 1. Energy industries: 1.1, Combustion of fuels in installations with a total rated thermal input of 50 MW or more, only when this activity takes place in combustion plants with a total rated thermal input of 50 MW or more; Techniques (a)-(h) (see table); Reducing sulphur dioxide (SO2) emissions to air. The BAT-AEL emission level is < 20�70 mg/Nm3.
status: valid
status modified: 2026-05-06
accepted date: 2026-05-06
in scheme: BATAEL values as defined into the EC BAT-Tool

Large combustion plants - SO2 - BAT25-XII
type: Concept
notation: LCP-SO2-BAT25-XII
definition: 1. Energy industries: 1.1, Combustion of fuels in installations with a total rated thermal input of 50 MW or more, only when this activity takes place in combustion plants with a total rated thermal input of 50 MW or more; Techniques (a)-(h) (see table) for Existing plant; Reducing sulphur dioxide (SO2) emissions to air. The BAT-AEL emission level is < 20�85 mg/Nm3.
status: valid
status modified: 2026-05-06
accepted date: 2026-05-06
in scheme: BATAEL values as defined into the EC BAT-Tool

Large combustion plants - SO2 - BAT29-I
type: Concept
notation: LCP-SO2-BAT29-I
definition: 1. Energy industries: 1.1, Combustion of fuels in installations with a total rated thermal input of 50 MW or more, only when this activity takes place in combustion plants with a total rated thermal input of 50 MW or more; Techniques (a)-(f) (see table) for New plant; Reducing sulphur dioxide (SO2) emissions to air. The BAT-AEL emission level is 50�175 mg/Nm3.
status: valid
status modified: 2026-05-06
accepted date: 2026-05-06
in scheme: BATAEL values as defined into the EC BAT-Tool

Large combustion plants - SO2 - BAT29-II
type: Concept
notation: LCP-SO2-BAT29-II
definition: 1. Energy industries: 1.1, Combustion of fuels in installations with a total rated thermal input of 50 MW or more, only when this activity takes place in combustion plants with a total rated thermal input of 50 MW or more; Techniques (a)-(f) (see table) for Existing plant; Reducing sulphur dioxide (SO2) emissions to air. The BAT-AEL emission level is 50�175 mg/Nm3.
status: valid
status modified: 2026-05-06
accepted date: 2026-05-06
in scheme: BATAEL values as defined into the EC BAT-Tool

Large combustion plants - SO2 - BAT29-III
type: Concept
notation: LCP-SO2-BAT29-III
definition: 1. Energy industries: 1.1, Combustion of fuels in installations with a total rated thermal input of 50 MW or more, only when this activity takes place in combustion plants with a total rated thermal input of 50 MW or more; Techniques (a)-(f) (see table) for New plant; Reducing sulphur dioxide (SO2) emissions to air. The BAT-AEL emission level is 150�200 mg/Nm3.
status: valid
status modified: 2026-05-06
accepted date: 2026-05-06
in scheme: BATAEL values as defined into the EC BAT-Tool

Large combustion plants - SO2 - BAT29-IV
type: Concept
notation: LCP-SO2-BAT29-IV
definition: 1. Energy industries: 1.1, Combustion of fuels in installations with a total rated thermal input of 50 MW or more, only when this activity takes place in combustion plants with a total rated thermal input of 50 MW or more; Techniques (a)-(f) (see table) for Existing plant; Reducing sulphur dioxide (SO2) emissions to air. The BAT-AEL emission level is 150�200 mg/Nm3.
status: valid
status modified: 2026-05-06
accepted date: 2026-05-06
in scheme: BATAEL values as defined into the EC BAT-Tool

Large combustion plants - SO2 - BAT29-V
type: Concept
notation: LCP-SO2-BAT29-V
definition: 1. Energy industries: 1.1, Combustion of fuels in installations with a total rated thermal input of 50 MW or more, only when this activity takes place in combustion plants with a total rated thermal input of 50 MW or more; Techniques (a)-(f) (see table) for New plant; Reducing sulphur dioxide (SO2) emissions to air. The BAT-AEL emission level is 35�50 mg/Nm3.
status: valid
status modified: 2026-05-06
accepted date: 2026-05-06
in scheme: BATAEL values as defined into the EC BAT-Tool

Large combustion plants - SO2 - BAT29-VI
type: Concept
notation: LCP-SO2-BAT29-VI
definition: 1. Energy industries: 1.1, Combustion of fuels in installations with a total rated thermal input of 50 MW or more, only when this activity takes place in combustion plants with a total rated thermal input of 50 MW or more; Techniques (a)-(f) (see table) for Existing plant; Reducing sulphur dioxide (SO2) emissions to air. The BAT-AEL emission level is 50�110 mg/Nm3.
status: valid
status modified: 2026-05-06
accepted date: 2026-05-06
in scheme: BATAEL values as defined into the EC BAT-Tool

Large combustion plants - SO2 - BAT29-VII
type: Concept
notation: LCP-SO2-BAT29-VII
definition: 1. Energy industries: 1.1, Combustion of fuels in installations with a total rated thermal input of 50 MW or more, only when this activity takes place in combustion plants with a total rated thermal input of 50 MW or more; Techniques (a)-(f) (see table) for New plant; Reducing sulphur dioxide (SO2) emissions to air. The BAT-AEL emission level is 50�120 mg/Nm3.
status: valid
status modified: 2026-05-06
accepted date: 2026-05-06
in scheme: BATAEL values as defined into the EC BAT-Tool

Large combustion plants - SO2 - BAT29-VIII
type: Concept
notation: LCP-SO2-BAT29-VIII
definition: 1. Energy industries: 1.1, Combustion of fuels in installations with a total rated thermal input of 50 MW or more, only when this activity takes place in combustion plants with a total rated thermal input of 50 MW or more; Techniques (a)-(f) (see table) for Existing plant; Reducing sulphur dioxide (SO2) emissions to air. The BAT-AEL emission level is 150�165 mg/Nm3.
status: valid
status modified: 2026-05-06
accepted date: 2026-05-06
in scheme: BATAEL values as defined into the EC BAT-Tool

Large combustion plants - SO2 - BAT34-I
type: Concept
notation: LCP-SO2-BAT34-I
definition: 1. Energy industries: 1.1, Combustion of fuels in installations with a total rated thermal input of 50 MW or more, only when this activity takes place in combustion plants with a total rated thermal input of 50 MW or more; Techniques (a)-(c) (see table) for New combustion plant (all sizes); Reducing sulphur dioxide (SO2) emissions to air. The BAT-AEL emission level is 45�100 mg/Nm3.
status: valid
status modified: 2026-05-06
accepted date: 2026-05-06
in scheme: BATAEL values as defined into the EC BAT-Tool

Large combustion plants - SO2 - BAT34-II
type: Concept
notation: LCP-SO2-BAT34-II
definition: 1. Energy industries: 1.1, Combustion of fuels in installations with a total rated thermal input of 50 MW or more, only when this activity takes place in combustion plants with a total rated thermal input of 50 MW or more; Techniques (a)-(c) (see table) for Existing combustion plant (all sizes); Reducing sulphur dioxide (SO2) emissions to air. The BAT-AEL emission level is 100�200 mg/Nm3.
status: valid
status modified: 2026-05-06
accepted date: 2026-05-06
in scheme: BATAEL values as defined into the EC BAT-Tool

Large combustion plants - SO2 - BAT34-III
type: Concept
notation: LCP-SO2-BAT34-III
definition: 1. Energy industries: 1.1, Combustion of fuels in installations with a total rated thermal input of 50 MW or more, only when this activity takes place in combustion plants with a total rated thermal input of 50 MW or more; Techniques (a)-(c) (see table) for New combustion plant (all sizes); Reducing sulphur dioxide (SO2) emissions to air. The BAT-AEL emission level is 60�110 mg/Nm3.
status: valid
status modified: 2026-05-06
accepted date: 2026-05-06
in scheme: BATAEL values as defined into the EC BAT-Tool

Large combustion plants - SO2 - BAT34-IV
type: Concept
notation: LCP-SO2-BAT34-IV
definition: 1. Energy industries: 1.1, Combustion of fuels in installations with a total rated thermal input of 50 MW or more, only when this activity takes place in combustion plants with a total rated thermal input of 50 MW or more; Techniques (a)-(c) (see table) for Existing combustion plant (all sizes); Reducing sulphur dioxide (SO2) emissions to air. The BAT-AEL emission level is 105�235 mg/Nm3.
status: valid
status modified: 2026-05-06
accepted date: 2026-05-06
in scheme: BATAEL values as defined into the EC BAT-Tool

Large combustion plants - SO2 - BAT39-I
type: Concept
notation: LCP-SO2-BAT39-I
definition: 1. Energy industries: 1.1, Combustion of fuels in installations with a total rated thermal input of 50 MW or more, only when this activity takes place in combustion plants with a total rated thermal input of 50 MW or more; Technique (a) (see table) for new and existing plants; Reducing sulphur dioxide (SO2) emissions to air. The BAT-AEL emission level is 35�60 mg/Nm3.
status: valid
status modified: 2026-05-06
accepted date: 2026-05-06
in scheme: BATAEL values as defined into the EC BAT-Tool

Large combustion plants - SO2 - BAT39-II
type: Concept
notation: LCP-SO2-BAT39-II
definition: 1. Energy industries: 1.1, Combustion of fuels in installations with a total rated thermal input of 50 MW or more, only when this activity takes place in combustion plants with a total rated thermal input of 50 MW or more; Technique (a) (see table) for new and existing plants; Reducing sulphur dioxide (SO2) emissions to air. The BAT-AEL emission level is 50�66 mg/Nm3.
status: valid
status modified: 2026-05-06
accepted date: 2026-05-06
in scheme: BATAEL values as defined into the EC BAT-Tool

Large combustion plants - SO2 - BAT50-I
type: Concept
notation: LCP-SO2-BAT50-I
definition: 1. Energy industries: 1.1, Combustion of fuels in installations with a total rated thermal input of 50 MW or more, only when this activity takes place in combustion plants with a total rated thermal input of 50 MW or more; Techniques (a)-(b) (see table) in boilers; Reducing sulphur dioxide (SO2) emissions to air. The BAT-AEL emission level is 25�150 mg/Nm3.
status: valid
status modified: 2026-05-06
accepted date: 2026-05-06
in scheme: BATAEL values as defined into the EC BAT-Tool

Large combustion plants - SO2 - BAT50-II
type: Concept
notation: LCP-SO2-BAT50-II
definition: 1. Energy industries: 1.1, Combustion of fuels in installations with a total rated thermal input of 50 MW or more, only when this activity takes place in combustion plants with a total rated thermal input of 50 MW or more; Techniques (a)-(b) (see table) in boilers; Reducing sulphur dioxide (SO2) emissions to air. The BAT-AEL emission level is 50�200 mg/Nm3.
status: valid
status modified: 2026-05-06
accepted date: 2026-05-06
in scheme: BATAEL values as defined into the EC BAT-Tool

Large combustion plants - SO2 - BAT50-III
type: Concept
notation: LCP-SO2-BAT50-III
definition: 1. Energy industries: 1.1, Combustion of fuels in installations with a total rated thermal input of 50 MW or more, only when this activity takes place in combustion plants with a total rated thermal input of 50 MW or more; Techniques (a)-(b) (see table) in combined-cycle gas turbines (CCGTs); Reducing sulphur dioxide (SO2) emissions to air. The BAT-AEL emission level is 10�45 mg/Nm3.
status: valid
status modified: 2026-05-06
accepted date: 2026-05-06
in scheme: BATAEL values as defined into the EC BAT-Tool

Large combustion plants - SO2 - BAT50-IV
type: Concept
notation: LCP-SO2-BAT50-IV
definition: 1. Energy industries: 1.1, Combustion of fuels in installations with a total rated thermal input of 50 MW or more, only when this activity takes place in combustion plants with a total rated thermal input of 50 MW or more; Techniques (a)-(b) (see table) in combined-cycle gas turbines (CCGTs); Reducing sulphur dioxide (SO2) emissions to air. The BAT-AEL emission level is 20�70 mg/Nm3.
status: valid
status modified: 2026-05-06
accepted date: 2026-05-06
in scheme: BATAEL values as defined into the EC BAT-Tool

Large combustion plants - SO2 - BAT57-I
type: Concept
notation: LCP-SO2-BAT57-I
definition: 1. Energy industries: 1.1, Combustion of fuels in installations with a total rated thermal input of 50 MW or more, only when this activity takes place in combustion plants with a total rated thermal input of 50 MW or more; Techniques (a)-(g) (see table). for New and existing boilers; Reducing sulphur dioxide (SO2) emissions to air. The BAT-AEL emission level is 10�110 mg/Nm3.
status: valid
status modified: 2026-05-06
accepted date: 2026-05-06
in scheme: BATAEL values as defined into the EC BAT-Tool

Large combustion plants - SO2 - BAT57-II
type: Concept
notation: LCP-SO2-BAT57-II
definition: 1. Energy industries: 1.1, Combustion of fuels in installations with a total rated thermal input of 50 MW or more, only when this activity takes place in combustion plants with a total rated thermal input of 50 MW or more; Techniques (a)-(g) (see table). for New and existing boilers; Reducing sulphur dioxide (SO2) emissions to air. The BAT-AEL emission level is 90�200 mg/Nm3.
status: valid
status modified: 2026-05-06
accepted date: 2026-05-06
in scheme: BATAEL values as defined into the EC BAT-Tool

Large combustion plants - SO2 - BAT74
type: Concept
notation: LCP-SO2-BAT74
definition: 1. Energy industries: 1.4, Gasification of coal or other fuels in installations with a total rated thermal input of 20 MW or more, only when this activity is directly associated to a combustion plant; Acid gas removal (see table); Reducing sulphur dioxide (SO2) emissions to air. The BAT-AEL emission level is 3�16 mg/Nm3.
status: valid
status modified: 2026-05-06
accepted date: 2026-05-06
in scheme: BATAEL values as defined into the EC BAT-Tool

Large combustion plants - SO3 - BAT15-VII
type: Concept
notation: LCP-SO3-BAT15-VII
definition: 1.� Energy industries; 5.� Waste management: 1.1, Combustion of fuels in installations with a total rated thermal input of 50 MW or more, only when this activity takes place in combustion plants with a total rated thermal input of 50 MW or more; 1.4, Gasification of coal or other fuels in installations with a total rated thermal input of 20 MW or more, only when this activity is directly associated to a combustion plant; 5.2, Disposal or recovery of waste in waste co-incineration plants for non-hazardous waste with a capacity exceeding 3 tonnes per hour or for hazardous waste with a capacity exceeding 10 tonnes per day, only when this activity takes place in combustion plants covered under 1.1 above. Reducing sulphite to water. The BAT-AEL emission level is 1�20 mg/l .
status: valid
status modified: 2026-05-06
accepted date: 2026-05-06
in scheme: BATAEL values as defined into the EC BAT-Tool

Large combustion plants - SO4 - BAT15-V
type: Concept
notation: LCP-SO4-BAT15-V
definition: 1.� Energy industries; 5.� Waste management: 1.1, Combustion of fuels in installations with a total rated thermal input of 50 MW or more, only when this activity takes place in combustion plants with a total rated thermal input of 50 MW or more; 1.4, Gasification of coal or other fuels in installations with a total rated thermal input of 20 MW or more, only when this activity is directly associated to a combustion plant; 5.2, Disposal or recovery of waste in waste co-incineration plants for non-hazardous waste with a capacity exceeding 3 tonnes per hour or for hazardous waste with a capacity exceeding 10 tonnes per day, only when this activity takes place in combustion plants covered under 1.1 above. Reducing sulphates to water. The BAT-AEL emission level is 1,3�2,0 g/l .
status: valid
status modified: 2026-05-06
accepted date: 2026-05-06
in scheme: BATAEL values as defined into the EC BAT-Tool

Large combustion plants - TOC - BAT15-I
type: Concept
notation: LCP-TOC-BAT15-I
definition: 1.� Energy industries; 5.� Waste management: 1.1, Combustion of fuels in installations with a total rated thermal input of 50 MW or more, only when this activity takes place in combustion plants with a total rated thermal input of 50 MW or more; 1.4, Gasification of coal or other fuels in installations with a total rated thermal input of 20 MW or more, only when this activity is directly associated to a combustion plant; 5.2, Disposal or recovery of waste in waste co-incineration plants for non-hazardous waste with a capacity exceeding 3 tonnes per hour or for hazardous waste with a capacity exceeding 10 tonnes per day, only when this activity takes place in combustion plants covered under 1.1 above. Reducing total organic carbon (TOC) to water. The BAT-AEL emission level is 20�50 mg/l .
status: valid
status modified: 2026-05-06
accepted date: 2026-05-06
in scheme: BATAEL values as defined into the EC BAT-Tool

Large combustion plants - TVOC - BAT15-XVI
type: Concept
notation: LCP-TVOC-BAT15-XVI
definition: 1. Energy industries: 1.1, Combustion of fuels in installations with a total rated thermal input of 50 MW or more, only when this activity takes place in combustion plants with a total rated thermal input of 50 MW or more; Techniques (a)-(c) (see table); Reducing TVOC emissions to air. The BAT-AEL emission level is 0,6�12 mg/Nm3 .
status: valid
status modified: 2026-05-06
accepted date: 2026-05-06
in scheme: BATAEL values as defined into the EC BAT-Tool

Large combustion plants - TVOC - BAT71-II
type: Concept
notation: LCP-TVOC-BAT71-II
definition: 1. Energy industries: 1.1, Combustion of fuels in installations with a total rated thermal input of 50 MW or more, only when this activity takes place in combustion plants with a total rated thermal input of 50 MW or more; Use a combination of the techniques given in BAT 6, BAT 26 and techniques (a)-(c) (see table); Reducing TVOC emissions to air. The BAT-AEL emission level is <0,1-5 mg/Nm3.
status: valid
status modified: 2026-05-06
accepted date: 2026-05-06
in scheme: BATAEL values as defined into the EC BAT-Tool

Large combustion plants - TVOC - BAT71-III
type: Concept
notation: LCP-TVOC-BAT71-III
definition: 1. Energy industries: 1.1, Combustion of fuels in installations with a total rated thermal input of 50 MW or more, only when this activity takes place in combustion plants with a total rated thermal input of 50 MW or more; Use a combination of the techniques given in BAT 6, BAT 26 and techniques (a)-(c) (see table); Reducing TVOC emissions to air. The BAT-AEL emission level is 0,5-10 mg/Nm3.
status: valid
status modified: 2026-05-06
accepted date: 2026-05-06
in scheme: BATAEL values as defined into the EC BAT-Tool

Production of Large Volume Organic Chemicals - Benzene - BAT57-I
type: Concept
notation: LVOC-Benzene-BAT57-I
definition: 4. Chemical industry: 4.1, Production of organic chemicals, such as: (b) oxygen-containing hydrocarbons such as alcohols, aldehydes, ketones, carboxylic acids, esters and mixtures of esters, acetates, ethers, peroxides and epoxy resins; Techniques (a)-(d) (see table); Reducing benzene emissions to air. The BAT-AEL emission level is < 1 mg/Nm3.
status: valid
status modified: 2026-05-06
accepted date: 2026-05-06
in scheme: BATAEL values as defined into the EC BAT-Tool

Production of Large Volume Organic Chemicals - Cl2 - BAT66-IV
type: Concept
notation: LVOC-Cl2-BAT66-IV
definition: 4. Chemical industry: 4.1, Production of organic chemicals, such as: (d) nitrogenous hydrocarbons such as amines, amides, nitrous compounds, nitro compounds or nitrate compounds, nitriles, cyanates, isocyanates; Treat combined waste gas streams using a thermal oxidiser followed by caustic scrubbing; Reducing chlorides emissions to air. The BAT-AEL emission level is < 1 mg/Nm3.
status: valid
status modified: 2026-05-06
accepted date: 2026-05-06
in scheme: BATAEL values as defined into the EC BAT-Tool

Large combustion plants - TSS - BAT15-III
type: Concept
notation: LCP-TSS-BAT15-III
definition: 1.� Energy industries; 5.� Waste management: 1.1, Combustion of fuels in installations with a total rated thermal input of 50 MW or more, only when this activity takes place in combustion plants with a total rated thermal input of 50 MW or more; 1.4, Gasification of coal or other fuels in installations with a total rated thermal input of 20 MW or more, only when this activity is directly associated to a combustion plant; 5.2, Disposal or recovery of waste in waste co-incineration plants for non-hazardous waste with a capacity exceeding 3 tonnes per hour or for hazardous waste with a capacity exceeding 10 tonnes per day, only when this activity takes place in combustion plants covered under 1.1 above. Reducing total suspended solids to water. The BAT-AEL emission level is 10�30 mg/l .
status: valid
status modified: 2026-05-06
accepted date: 2026-05-06
in scheme: BATAEL values as defined into the EC BAT-Tool

Large combustion plants - Zn - BAT15-XV
type: Concept
notation: LCP-Zn-BAT15-XV
definition: 1.� Energy industries; 5.� Waste management: 1.1, Combustion of fuels in installations with a total rated thermal input of 50 MW or more, only when this activity takes place in combustion plants with a total rated thermal input of 50 MW or more; 1.4, Gasification of coal or other fuels in installations with a total rated thermal input of 20 MW or more, only when this activity is directly associated to a combustion plant; 5.2, Disposal or recovery of waste in waste co-incineration plants for non-hazardous waste with a capacity exceeding 3 tonnes per hour or for hazardous waste with a capacity exceeding 10 tonnes per day, only when this activity takes place in combustion plants covered under 1.1 above. Reducing zinc to water. The BAT-AEL emission level is 50�200 �g/l .
status: valid
status modified: 2026-05-06
accepted date: 2026-05-06
in scheme: BATAEL values as defined into the EC BAT-Tool

Production of Large Volume Organic Chemicals - Cl2 - BAT67-IV
type: Concept
notation: LVOC-Cl2-BAT67-IV
definition: 4. Chemical industry: 4.1, Production of organic chemicals, such as: (d) nitrogenous hydrocarbons such as amines, amides, nitrous compounds, nitro compounds or nitrate compounds, nitriles, cyanates, isocyanates; Treat combined waste gas streams using a thermal oxidiser followed by caustic scrubbing; Reducing chlorides emissions to air. The BAT-AEL emission level is < 1 mg/Nm3.
status: valid
status modified: 2026-05-06
accepted date: 2026-05-06
in scheme: BATAEL values as defined into the EC BAT-Tool

Production of Large Volume Organic Chemicals - Cl2 - BAT76-III
type: Concept
notation: LVOC-Cl2-BAT76-III
definition: 4. Chemical industry: 4.1, Production of organic chemicals, such as: (f) halogenic hydrocarbons; treat the combined waste gas streams from EDC and/or VCM production by using a thermal oxidiser followed by two-stage wet scrubbing; Reducing chlorides emissions to air. The BAT-AEL emission level is < 1�4 mg/Nm3, at 11 vol-% O2.
status: valid
status modified: 2026-05-06
accepted date: 2026-05-06
in scheme: BATAEL values as defined into the EC BAT-Tool

Production of Large Volume Organic Chemicals - Cl2 - BAT77-III
type: Concept
notation: LVOC-Cl2-BAT77-III
definition: 4. Chemical industry: 4.1, Production of organic chemicals, such as: (f) halogenic hydrocarbons; treat the combined waste gas streams from EDC and/or VCM production by using a thermal oxidiser followed by two-stage wet scrubbing; Reducing chlorides emissions to air. The BAT-AEL emission level is < 1�4 mg/Nm3, at 11 vol-% O2.
status: valid
status modified: 2026-05-06
accepted date: 2026-05-06
in scheme: BATAEL values as defined into the EC BAT-Tool

Production of Large Volume Organic Chemicals - Cu - BAT80-I
type: Concept
notation: LVOC-Cu-BAT80-I
definition: 4. Chemical industry: 4.1, Production of organic chemicals, such as: (f) halogenic hydrocarbons Reducing copper to water. The BAT-AEL emission level is 0,04�0,2 g/t EDC produced by oxychlorination .
status: valid
status modified: 2026-05-06
accepted date: 2026-05-06
in scheme: BATAEL values as defined into the EC BAT-Tool

Production of Large Volume Organic Chemicals - EDC - BAT80-II
type: Concept
notation: LVOC-EDC-BAT80-II
definition: 4. Chemical industry: 4.1, Production of organic chemicals, such as: (f) halogenic hydrocarbons Reducing EDC to water. The BAT-AEL emission level is 0,01�0,05 g/t EDC purified .
status: valid
status modified: 2026-05-06
accepted date: 2026-05-06
in scheme: BATAEL values as defined into the EC BAT-Tool

Production of Large Volume Organic Chemicals - EDCVCM - BAT76-II
type: Concept
notation: LVOC-EDCVCM-BAT76-II
definition: 4. Chemical industry: 4.1, Production of organic chemicals, such as: (f) halogenic hydrocarbons; treat the combined waste gas streams from EDC and/or VCM production by using a thermal oxidiser followed by two-stage wet scrubbing; Reducing EDC and VCM emissions to air. The BAT-AEL emission level is < 1 mg/Nm3, at 11 vol-% O2.
status: valid
status modified: 2026-05-06
accepted date: 2026-05-06
in scheme: BATAEL values as defined into the EC BAT-Tool

Production of Large Volume Organic Chemicals - EDCVCM - BAT77-II
type: Concept
notation: LVOC-EDCVCM-BAT77-II
definition: 4. Chemical industry: 4.1, Production of organic chemicals, such as: (f) halogenic hydrocarbons; treat the combined waste gas streams from EDC and/or VCM production by using a thermal oxidiser followed by two-stage wet scrubbing; Reducing EDC and VCM emissions to air. The BAT-AEL emission level is < 1 mg/Nm3, at 11 vol-% O2.
status: valid
status modified: 2026-05-06
accepted date: 2026-05-06
in scheme: BATAEL values as defined into the EC BAT-Tool

Production of Large Volume Organic Chemicals - Formaldehyde - BAT45-II
type: Concept
notation: LVOC-Formaldehyde-BAT45-II
definition: 4. Chemical industry: 4.1, Production of organic chemicals, such as: (b) oxygen-containing hydrocarbons such as alcohols, aldehydes, ketones, carboxylic acids, esters and mixtures of esters, acetates, ethers, peroxides and epoxy resins; Techniques (a)-(c) (see table); Reducing formaldehyde emissions to air. The BAT-AEL emission level is 2�5 mg/Nm3.
status: valid
status modified: 2026-05-06
accepted date: 2026-05-06
in scheme: BATAEL values as defined into the EC BAT-Tool

Production of Large Volume Organic Chemicals - HCl - BAT66-V
type: Concept
notation: LVOC-HCl-BAT66-V
definition: 4. Chemical industry: 4.1, Production of organic chemicals, such as: (d) nitrogenous hydrocarbons such as amines, amides, nitrous compounds, nitro compounds or nitrate compounds, nitriles, cyanates, isocyanates; Treat combined waste gas streams using a thermal oxidiser followed by caustic scrubbing; Reducing hydrogen chloride emissions to air. The BAT-AEL emission level is 2�10 mg/Nm3.
status: valid
status modified: 2026-05-06
accepted date: 2026-05-06
in scheme: BATAEL values as defined into the EC BAT-Tool

Production of Large Volume Organic Chemicals - HCl - BAT67-V
type: Concept
notation: LVOC-HCl-BAT67-V
definition: 4. Chemical industry: 4.1, Production of organic chemicals, such as: (d) nitrogenous hydrocarbons such as amines, amides, nitrous compounds, nitro compounds or nitrate compounds, nitriles, cyanates, isocyanates; Treat combined waste gas streams using a thermal oxidiser followed by caustic scrubbing; Reducing hydrogen chloride emissions to air. The BAT-AEL emission level is 2�10 mg/Nm3.
status: valid
status modified: 2026-05-06
accepted date: 2026-05-06
in scheme: BATAEL values as defined into the EC BAT-Tool

Production of Large Volume Organic Chemicals - HCl - BAT76-IV
type: Concept
notation: LVOC-HCl-BAT76-IV
definition: 4. Chemical industry: 4.1, Production of organic chemicals, such as: (f) halogenic hydrocarbons; treat the combined waste gas streams from EDC and/or VCM production by using a thermal oxidiser followed by two-stage wet scrubbing; Reducing hydrogen chloride emissions to air. The BAT-AEL emission level is 2�10 mg/Nm3, at 11 vol-% O2.
status: valid
status modified: 2026-05-06
accepted date: 2026-05-06
in scheme: BATAEL values as defined into the EC BAT-Tool

Production of Large Volume Organic Chemicals - HCl - BAT77-IV
type: Concept
notation: LVOC-HCl-BAT77-IV
definition: 4. Chemical industry: 4.1, Production of organic chemicals, such as: (f) halogenic hydrocarbons; treat the combined waste gas streams from EDC and/or VCM production by using a thermal oxidiser followed by two-stage wet scrubbing; Reducing hydrogen chloride emissions to air. The BAT-AEL emission level is 2�10 mg/Nm3, at 11 vol-% O2.
status: valid
status modified: 2026-05-06
accepted date: 2026-05-06
in scheme: BATAEL values as defined into the EC BAT-Tool

Production of Large Volume Organic Chemicals - NH3 - BAT4-III
type: Concept
notation: LVOC-NH3-BAT4-III
definition: 4. Chemical industry: 4.1, Production of organic chemicals, such as: (a) simple hydrocarbons (linear or cyclic, saturated or unsaturated, aliphatic or�aromatic); Techniques (a)-(h) (see table) and optimise the design and/or operation of SCR or SNCR; Reducing ammonia (NH3) emissions to air. The BAT-AEL emission level is < 5�15 mg/Nm�, at 3 vol-% O2.
status: valid
status modified: 2026-05-06
accepted date: 2026-05-06
in scheme: BATAEL values as defined into the EC BAT-Tool

Production of Large Volume Organic Chemicals - NOx - BAT4-I
type: Concept
notation: LVOC-NOx-BAT4-I
definition: 4. Chemical industry: 4.1, Production of organic chemicals, such as: (a) simple hydrocarbons (linear or cyclic, saturated or unsaturated, aliphatic or�aromatic); Techniques (a)-(h) (see table) and optimise the design and/or operation of SCR or SNCR for New furnace; Reducing nitrogen oxides (NOx) emissions to air. The BAT-AEL emission level is 60�100 mg/Nm�, at 3 vol-% O2.
status: valid
status modified: 2026-05-06
accepted date: 2026-05-06
in scheme: BATAEL values as defined into the EC BAT-Tool

Production of Large Volume Organic Chemicals - NOx - BAT4-II
type: Concept
notation: LVOC-NOx-BAT4-II
definition: 4. Chemical industry: 4.1, Production of organic chemicals, such as: (a) simple hydrocarbons (linear or cyclic, saturated or unsaturated, aliphatic or�aromatic); Techniques (a)-(h) (see table) and optimise the design and/or operation of SCR or SNCR for Existing furnace; Reducing nitrogen oxides (NOx) emissions to air. The BAT-AEL emission level is 70�200 mg/Nm�, at 3 vol-% O2.
status: valid
status modified: 2026-05-06
accepted date: 2026-05-06
in scheme: BATAEL values as defined into the EC BAT-Tool

Production of Large Volume Organic Chemicals - PCDD.F - BAT66-VI
type: Concept
notation: LVOC-PCDD.F-BAT66-VI
definition: 4. Chemical industry: 4.1, Production of organic chemicals, such as: (d) nitrogenous hydrocarbons such as amines, amides, nitrous compounds, nitro compounds or nitrate compounds, nitriles, cyanates, isocyanates; Treat combined waste gas streams using a thermal oxidiser followed by caustic scrubbing; Reducing PCDD/F emissions to air. The BAT-AEL emission level is 0,025�0,08 ng I-TEQ/Nm3 .
status: valid
status modified: 2026-05-06
accepted date: 2026-05-06
in scheme: BATAEL values as defined into the EC BAT-Tool

Production of Large Volume Organic Chemicals - PCDD.F - BAT67-VI
type: Concept
notation: LVOC-PCDD.F-BAT67-VI
definition: 4. Chemical industry: 4.1, Production of organic chemicals, such as: (d) nitrogenous hydrocarbons such as amines, amides, nitrous compounds, nitro compounds or nitrate compounds, nitriles, cyanates, isocyanates; Treat combined waste gas streams using a thermal oxidiser followed by caustic scrubbing; Reducing PCDD/F emissions to air. The BAT-AEL emission level is 0,025�0,08 ng I-TEQ/Nm3 .
status: valid
status modified: 2026-05-06
accepted date: 2026-05-06
in scheme: BATAEL values as defined into the EC BAT-Tool

Production of Large Volume Organic Chemicals - PCDD.F - BAT76-V
type: Concept
notation: LVOC-PCDD.F-BAT76-V
definition: 4. Chemical industry: 4.1, Production of organic chemicals, such as: (f) halogenic hydrocarbons; treat the combined waste gas streams from EDC and/or VCM production by using a thermal oxidiser followed by two-stage wet scrubbing; Reducing PCDD/F emissions to air. The BAT-AEL emission level is 0,025�0,08 ng I-TEQ/Nm3.
status: valid
status modified: 2026-05-06
accepted date: 2026-05-06
in scheme: BATAEL values as defined into the EC BAT-Tool

Production of Large Volume Organic Chemicals - PCDD.F - BAT77-V
type: Concept
notation: LVOC-PCDD.F-BAT77-V
definition: 4. Chemical industry: 4.1, Production of organic chemicals, such as: (f) halogenic hydrocarbons; treat the combined waste gas streams from EDC and/or VCM production by using a thermal oxidiser followed by two-stage wet scrubbing; Reducing PCDD/F emissions to air. The BAT-AEL emission level is 0,025�0,08 ng I-TEQ/Nm3.
status: valid
status modified: 2026-05-06
accepted date: 2026-05-06
in scheme: BATAEL values as defined into the EC BAT-Tool

Production of Large Volume Organic Chemicals - PCDD.F - BAT80-III
type: Concept
notation: LVOC-PCDD.F-BAT80-III
definition: 4. Chemical industry: 4.1, Production of organic chemicals, such as: (f) halogenic hydrocarbons Reducing PCDD/F to water. The BAT-AEL emission level is 0,1� 0,3 �g I-TEQ/t EDC produced by oxychlorination .
status: valid
status modified: 2026-05-06
accepted date: 2026-05-06
in scheme: BATAEL values as defined into the EC BAT-Tool

Production of Large Volume Organic Chemicals - TVOC - BAT45-I
type: Concept
notation: LVOC-TVOC-BAT45-I
definition: 4. Chemical industry: 4.1, Production of organic chemicals, such as: (b) oxygen-containing hydrocarbons such as alcohols, aldehydes, ketones, carboxylic acids, esters and mixtures of esters, acetates, ethers, peroxides and epoxy resins; Techniques (a)-(c) (see table); Reducing TVOC emissions to air. The BAT-AEL emission level is < 5�30 mg/Nm3.
status: valid
status modified: 2026-05-06
accepted date: 2026-05-06
in scheme: BATAEL values as defined into the EC BAT-Tool

Production of Large Volume Organic Chemicals - TVOC - BAT51
type: Concept
notation: LVOC-TVOC-BAT51
definition: 4. Chemical industry: 4.1, Production of organic chemicals, such as: (b) oxygen-containing hydrocarbons such as alcohols, aldehydes, ketones, carboxylic acids, esters and mixtures of esters, acetates, ethers, peroxides and epoxy resins; Techniques (a)-(c) (see table); Reducing TVOC emissions to air. The BAT-AEL emission level is 1�10 g/t of EO produced .
status: valid
status modified: 2026-05-06
accepted date: 2026-05-06
in scheme: BATAEL values as defined into the EC BAT-Tool

Production of Large Volume Organic Chemicals - TVOC - BAT57-II
type: Concept
notation: LVOC-TVOC-BAT57-II
definition: 4. Chemical industry: 4.1, Production of organic chemicals, such as: (b) oxygen-containing hydrocarbons such as alcohols, aldehydes, ketones, carboxylic acids, esters and mixtures of esters, acetates, ethers, peroxides and epoxy resins; Techniques (a)-(d) (see table); Reducing TVOC emissions to air. The BAT-AEL emission level is 5�30 mg/Nm3.
status: valid
status modified: 2026-05-06
accepted date: 2026-05-06
in scheme: BATAEL values as defined into the EC BAT-Tool

Production of Large Volume Organic Chemicals - TVOC - BAT66-I
type: Concept
notation: LVOC-TVOC-BAT66-I
definition: 4. Chemical industry: 4.1, Production of organic chemicals, such as: (d) nitrogenous hydrocarbons such as amines, amides, nitrous compounds, nitro compounds or nitrate compounds, nitriles, cyanates, isocyanates; Treat combined waste gas streams using a thermal oxidiser followed by caustic scrubbing; Reducing TVOC emissions to air. The BAT-AEL emission level is 1�5 mg/Nm3.
status: valid
status modified: 2026-05-06
accepted date: 2026-05-06
in scheme: BATAEL values as defined into the EC BAT-Tool

Production of Large Volume Organic Chemicals - TVOC - BAT67-I
type: Concept
notation: LVOC-TVOC-BAT67-I
definition: 4. Chemical industry: 4.1, Production of organic chemicals, such as: (d) nitrogenous hydrocarbons such as amines, amides, nitrous compounds, nitro compounds or nitrate compounds, nitriles, cyanates, isocyanates; Treat combined waste gas streams using a thermal oxidiser followed by caustic scrubbing; Reducing TVOC emissions to air. The BAT-AEL emission level is 1�5 mg/Nm3.
status: valid
status modified: 2026-05-06
accepted date: 2026-05-06
in scheme: BATAEL values as defined into the EC BAT-Tool

Production of Large Volume Organic Chemicals - TVOC - BAT76-I
type: Concept
notation: LVOC-TVOC-BAT76-I
definition: 4. Chemical industry: 4.1, Production of organic chemicals, such as: (f) halogenic hydrocarbons; treat the combined waste gas streams from EDC and/or VCM production by using a thermal oxidiser followed by two-stage wet scrubbing; Reducing TVOC emissions to air. The BAT-AEL emission level is 0,5�5 mg/Nm3, at 11 vol-% O2.
status: valid
status modified: 2026-05-06
accepted date: 2026-05-06
in scheme: BATAEL values as defined into the EC BAT-Tool

Production of Large Volume Organic Chemicals - TVOC - BAT77-I
type: Concept
notation: LVOC-TVOC-BAT77-I
definition: 4. Chemical industry: 4.1, Production of organic chemicals, such as: (f) halogenic hydrocarbons; treat the combined waste gas streams from EDC and/or VCM production by using a thermal oxidiser followed by two-stage wet scrubbing; Reducing TVOC emissions to air. The BAT-AEL emission level is 0,5�5 mg/Nm3, at 11 vol-% O2.
status: valid
status modified: 2026-05-06
accepted date: 2026-05-06
in scheme: BATAEL values as defined into the EC BAT-Tool

Production of Large Volume Organic Chemicals - TVOC - BAT86
type: Concept
notation: LVOC-TVOC-BAT86
definition: 4. Chemical industry: 4.2. Production of inorganic chemicals, such as: (e) non-metals, metal oxides or other inorganic compounds such as calcium carbide, silicon, silicon carbide; Techniques (a)-(d) (see table); Reducing TVOC emissions to air. The BAT-AEL emission level is 5�25 mg/Nm3 .
status: valid
status modified: 2026-05-06
accepted date: 2026-05-06
in scheme: BATAEL values as defined into the EC BAT-Tool

Production of Large Volume Organic Chemicals - Tetrachloromethane - BAT66-II
type: Concept
notation: LVOC-Tetrachloromethane-BAT66-II
definition: 4. Chemical industry: 4.1, Production of organic chemicals, such as: (d) nitrogenous hydrocarbons such as amines, amides, nitrous compounds, nitro compounds or nitrate compounds, nitriles, cyanates, isocyanates; Treat combined waste gas streams using a thermal oxidiser followed by caustic scrubbing; Reducing tertachloromethane emissions to air. The BAT-AEL emission level is ? 0,5 g/t MDI produced .
status: valid
status modified: 2026-05-06
accepted date: 2026-05-06
in scheme: BATAEL values as defined into the EC BAT-Tool

Production of Large Volume Organic Chemicals - Tetrachloromethane - BAT66-III
type: Concept
notation: LVOC-Tetrachloromethane-BAT66-III
definition: 4. Chemical industry: 4.1, Production of organic chemicals, such as: (d) nitrogenous hydrocarbons such as amines, amides, nitrous compounds, nitro compounds or nitrate compounds, nitriles, cyanates, isocyanates; Treat combined waste gas streams using a thermal oxidiser followed by caustic scrubbing; Reducing tertachloromethane emissions to air. The BAT-AEL emission level is ? 0,7 g/t TDI produced .
status: valid
status modified: 2026-05-06
accepted date: 2026-05-06
in scheme: BATAEL values as defined into the EC BAT-Tool

Production of Large Volume Organic Chemicals - Tetrachloromethane - BAT67-II
type: Concept
notation: LVOC-Tetrachloromethane-BAT67-II
definition: 4. Chemical industry: 4.1, Production of organic chemicals, such as: (d) nitrogenous hydrocarbons such as amines, amides, nitrous compounds, nitro compounds or nitrate compounds, nitriles, cyanates, isocyanates; Treat combined waste gas streams using a thermal oxidiser followed by caustic scrubbing; Reducing tertachloromethane emissions to air. The BAT-AEL emission level is ? 0,5 g/t MDI produced .
status: valid
status modified: 2026-05-06
accepted date: 2026-05-06
in scheme: BATAEL values as defined into the EC BAT-Tool

Production of Large Volume Organic Chemicals - Tetrachloromethane - BAT67-III
type: Concept
notation: LVOC-Tetrachloromethane-BAT67-III
definition: 4. Chemical industry: 4.1, Production of organic chemicals, such as: (d) nitrogenous hydrocarbons such as amines, amides, nitrous compounds, nitro compounds or nitrate compounds, nitriles, cyanates, isocyanates; Treat combined waste gas streams using a thermal oxidiser followed by caustic scrubbing; Reducing tertachloromethane emissions to air. The BAT-AEL emission level is ? 0,7 g/t TDI produced .
status: valid
status modified: 2026-05-06
accepted date: 2026-05-06
in scheme: BATAEL values as defined into the EC BAT-Tool

Non-Ferrous Metals industries - Ag - BAT17-I
type: Concept
notation: NFM-Ag-BAT17-I
definition: 2, Production and processing of metals: 2.5, Processing of non-ferrous metals Reducing mercury to water. The BAT-AEL emission level is ? 0,6 mg/l.
status: valid
status modified: 2026-05-06
accepted date: 2026-05-06
in scheme: BATAEL values as defined into the EC BAT-Tool

Non-Ferrous Metals industries - As - BAT17-II
type: Concept
notation: NFM-As-BAT17-II
definition: 2, Production and processing of metals: 2.5, Processing of non-ferrous metals Reducing arsenic to water. The BAT-AEL emission level is ? 0,1 mg/l.
status: valid
status modified: 2026-05-06
accepted date: 2026-05-06
in scheme: BATAEL values as defined into the EC BAT-Tool

Non-Ferrous Metals industries - As - BAT17-III
type: Concept
notation: NFM-As-BAT17-III
definition: 2, Production and processing of metals: 2.5, Processing of non-ferrous metals Reducing arsenic to water. The BAT-AEL emission level is ? 0,3 mg/l.
status: valid
status modified: 2026-05-06
accepted date: 2026-05-06
in scheme: BATAEL values as defined into the EC BAT-Tool

Non-Ferrous Metals industries - AsH3SbH3 - BAT114-III
type: Concept
notation: NFM-AsH3SbH3-BAT114-III
definition: 2, Production and processing of metals: 2.5: Processing of non-ferrous metals: (a) production of non-ferrous crude metals from ore, concentrates or secondary raw materials by metallurgical, chemical or electrolytic processes; Techniques (a)-(c) (see table incl. footnote); Reducing arsenic and antimony emissions to air. The BAT-AEL emission level is ? 0,5 mg/Nm3.
status: valid
status modified: 2026-05-06
accepted date: 2026-05-06
in scheme: BATAEL values as defined into the EC BAT-Tool

Non-Ferrous Metals industries - BaP - BAT178-II
type: Concept
notation: NFM-BaP-BAT178-II
definition: 6.� Other activities: 6.8: Production of carbon (hard-burnt coal) or electrographite by means of incineration or graphitisation; Bag filter; Reducing benzo[a]pyrene emissions to air. The BAT-AEL emission level is ? 0,01 mg/Nm3.
status: valid
status modified: 2026-05-06
accepted date: 2026-05-06
in scheme: BATAEL values as defined into the EC BAT-Tool

Non-Ferrous Metals industries - BaP - BAT179-II
type: Concept
notation: NFM-BaP-BAT179-II
definition: 6.� Other activities: 6.8: Production of carbon (hard-burnt coal) or electrographite by means of incineration or graphitisation; Techniques (a)-(d) (see table incl. footnote); Reducing benzo[a]pyrene emissions to air. The BAT-AEL emission level is 0,001-0,01 mg/Nm3.
status: valid
status modified: 2026-05-06
accepted date: 2026-05-06
in scheme: BATAEL values as defined into the EC BAT-Tool

Non-Ferrous Metals industries - BaP - BAT180-II
type: Concept
notation: NFM-BaP-BAT180-II
definition: 6.� Other activities: 6.8: Production of carbon (hard-burnt coal) or electrographite by means of incineration or graphitisation; Techniques (a)-(c) (see table incl. footnote); Reducing benzo[a]pyrene emissions to air. The BAT-AEL emission level is 0,005-0,015 mg/Nm3.
status: valid
status modified: 2026-05-06
accepted date: 2026-05-06
in scheme: BATAEL values as defined into the EC BAT-Tool

Non-Ferrous Metals industries - BaP - BAT181-II
type: Concept
notation: NFM-BaP-BAT181-II
definition: 6.� Other activities: 6.8: Production of carbon (hard-burnt coal) or electrographite by means of incineration or graphitisation; Techniques (a)-(c) (see table incl. footnote); Reducing benzo[a]pyrene emissions to air. The BAT-AEL emission level is 0,001-0,01 mg/Nm3.
status: valid
status modified: 2026-05-06
accepted date: 2026-05-06
in scheme: BATAEL values as defined into the EC BAT-Tool

Non-Ferrous Metals industries - BaP - BAT59-II
type: Concept
notation: NFM-BaP-BAT59-II
definition: 2, Production and processing of metals: 2.5, Processing of non-ferrous metals: (a) production of non-ferrous crude metals from ore, concentrates or secondary raw materials by metallurgical, chemical or electrolytic processes; Techniques (a)-(c) (see table incl. footnote) in a paste plant (hot pitch storage, paste mixing, cooling and forming); Reducing benzo[a]pyrene emissions to air. The BAT-AEL emission level is 0,001 - 0,01 mg/Nm3.
status: valid
status modified: 2026-05-06
accepted date: 2026-05-06
in scheme: BATAEL values as defined into the EC BAT-Tool

Non-Ferrous Metals industries - BaP - BAT60-II
type: Concept
notation: NFM-BaP-BAT60-II
definition: 2, Production and processing of metals: 2.5, Processing of non-ferrous metals: (a) production of non-ferrous crude metals from ore, concentrates or secondary raw materials by metallurgical, chemical or electrolytic processes; Techniques (a)-(d) (see table incl. footnote); Reducing benzo[a]pyrene emissions to air. The BAT-AEL emission level is 0,001-0,01 mg/Nm3.
status: valid
status modified: 2026-05-06
accepted date: 2026-05-06
in scheme: BATAEL values as defined into the EC BAT-Tool

Non-Ferrous Metals industries - BaP - BAT61-II
type: Concept
notation: NFM-BaP-BAT61-II
definition: 2, Production and processing of metals: 2.5, Processing of non-ferrous metals: (a) production of non-ferrous crude metals from ore, concentrates or secondary raw materials by metallurgical, chemical or electrolytic processes; Use a pre-filtration unit and a regenerative thermal oxidiser followed by a dry scrubber (e.g. lime bed); Reducing benzo[a]pyrene emissions to air. The BAT-AEL emission level is 0,001-0,01 mg/Nm3.
status: valid
status modified: 2026-05-06
accepted date: 2026-05-06
in scheme: BATAEL values as defined into the EC BAT-Tool

Non-Ferrous Metals industries - CO - BAT17-VII
type: Concept
notation: NFM-CO-BAT17-VII
definition: 2, Production and processing of metals: 2.5, Processing of non-ferrous metals Reducing silver to water. The BAT-AEL emission level is ? 0,1 mg/l.
status: valid
status modified: 2026-05-06
accepted date: 2026-05-06
in scheme: BATAEL values as defined into the EC BAT-Tool

Non-Ferrous Metals industries - CO - BAT17-VIII
type: Concept
notation: NFM-CO-BAT17-VIII
definition: 2, Production and processing of metals: 2.5, Processing of non-ferrous metals Reducing silver to water. The BAT-AEL emission level is 0,1-0,5 mg/l.
status: valid
status modified: 2026-05-06
accepted date: 2026-05-06
in scheme: BATAEL values as defined into the EC BAT-Tool

Non-Ferrous Metals industries - Cd - BAT132-II
type: Concept
notation: NFM-Cd-BAT132-II
definition: 2, Production and processing of metals: 2.5, Processing of non-ferrous metals: (b) melting, including the alloyage, of non-ferrous metals, including recovered products and operation of non-ferrous metal foundries, with a melting capacity exceeding 4 tonnes per day for lead and cadmium or 20 tonnes per day for all other metals; Techniques (a)-(c) (see table incl. footnote); Reducing cadmium emissions to air. The BAT-AEL emission level is ? 0,1 mg/Nm3.
status: valid
status modified: 2026-05-06
accepted date: 2026-05-06
in scheme: BATAEL values as defined into the EC BAT-Tool

Non-Ferrous Metals industries - Cd - BAT17-IV
type: Concept
notation: NFM-Cd-BAT17-IV
definition: 2, Production and processing of metals: 2.5, Processing of non-ferrous metals Reducing cadmium to water. The BAT-AEL emission level is 0,02�0,1 mg/l.
status: valid
status modified: 2026-05-06
accepted date: 2026-05-06
in scheme: BATAEL values as defined into the EC BAT-Tool

Non-Ferrous Metals industries - Cd - BAT17-V
type: Concept
notation: NFM-Cd-BAT17-V
definition: 2, Production and processing of metals: 2.5, Processing of non-ferrous metals Reducing cadmium to water. The BAT-AEL emission level is ? 0,1 mg/l.
status: valid
status modified: 2026-05-06
accepted date: 2026-05-06
in scheme: BATAEL values as defined into the EC BAT-Tool

Non-Ferrous Metals industries - Cd - BAT17-VI
type: Concept
notation: NFM-Cd-BAT17-VI
definition: 2, Production and processing of metals: 2.5, Processing of non-ferrous metals Reducing cadmium to water. The BAT-AEL emission level is ? 0,05 mg/l.
status: valid
status modified: 2026-05-06
accepted date: 2026-05-06
in scheme: BATAEL values as defined into the EC BAT-Tool

Non-Ferrous Metals industries - Cl2 - BAT144-II
type: Concept
notation: NFM-Cl2-BAT144-II
definition: 2, Production and processing of metals: 2.5, Processing of non-ferrous metals: (a) production of non-ferrous crude metals from ore, concentrates or secondary raw materials by metallurgical, chemical or electrolytic processes; Alkaline scrubber; Reducing chlorides emissions to air. The BAT-AEL emission level is 0,5-2 mg/Nm3.
status: valid
status modified: 2026-05-06
accepted date: 2026-05-06
in scheme: BATAEL values as defined into the EC BAT-Tool

Non-Ferrous Metals industries - Cl2 - BAT172-II
type: Concept
notation: NFM-Cl2-BAT172-II
definition: 2, Production and processing of metals: 2.5, Processing of non-ferrous metals: (a) production of non-ferrous crude metals from ore, concentrates or secondary raw materials by metallurgical, chemical or electrolytic processes; Wet scrubber; Reducing chlorides emissions to air. The BAT-AEL emission level is ? 1 mg/Nm3.
status: valid
status modified: 2026-05-06
accepted date: 2026-05-06
in scheme: BATAEL values as defined into the EC BAT-Tool

Non-Ferrous Metals industries - Cl2 - BAT84-II
type: Concept
notation: NFM-Cl2-BAT84-II
definition: 2, Production and processing of metals: 2.5, Processing of non-ferrous metals: (b) melting, including the alloyage, of non-ferrous metals, including recovered products and operation of non-ferrous metal foundries, with a melting capacity exceeding 4 tonnes per day for lead and cadmium or 20 tonnes per day for all other metals; Techniques (a)-(d) (see table); Reducing chlorides emissions to air. The BAT-AEL emission level is ? 1 mg/Nm3.
status: valid
status modified: 2026-05-06
accepted date: 2026-05-06
in scheme: BATAEL values as defined into the EC BAT-Tool

Non-Ferrous Metals industries - Cr - BAT17-IX
type: Concept
notation: NFM-Cr-BAT17-IX
definition: 2, Production and processing of metals: 2.5, Processing of non-ferrous metals Reducing cobalt to water. The BAT-AEL emission level is ? 0,2 mg/l.
status: valid
status modified: 2026-05-06
accepted date: 2026-05-06
in scheme: BATAEL values as defined into the EC BAT-Tool

Non-Ferrous Metals industries - Cr - BAT17-X
type: Concept
notation: NFM-Cr-BAT17-X
definition: 2, Production and processing of metals: 2.5, Processing of non-ferrous metals Reducing chromium to water. The BAT-AEL emission level is ? 0,05 mg/l.
status: valid
status modified: 2026-05-06
accepted date: 2026-05-06
in scheme: BATAEL values as defined into the EC BAT-Tool

Non-Ferrous Metals industries - Cu - BAT17-XI
type: Concept
notation: NFM-Cu-BAT17-XI
definition: 2, Production and processing of metals: 2.5, Processing of non-ferrous metals Reducing copper to water. The BAT-AEL emission level is 0,05-0,5 mg/l.
status: valid
status modified: 2026-05-06
accepted date: 2026-05-06
in scheme: BATAEL values as defined into the EC BAT-Tool

Non-Ferrous Metals industries - Cu - BAT17-XII
type: Concept
notation: NFM-Cu-BAT17-XII
definition: 2, Production and processing of metals: 2.5, Processing of non-ferrous metals Reducing copper to water. The BAT-AEL emission level is ? 0,2 mg/l.
status: valid
status modified: 2026-05-06
accepted date: 2026-05-06
in scheme: BATAEL values as defined into the EC BAT-Tool

Non-Ferrous Metals industries - Cu - BAT17-XIII
type: Concept
notation: NFM-Cu-BAT17-XIII
definition: 2, Production and processing of metals: 2.5, Processing of non-ferrous metals Reducing copper to water. The BAT-AEL emission level is ? 0,1 mg/l.
status: valid
status modified: 2026-05-06
accepted date: 2026-05-06
in scheme: BATAEL values as defined into the EC BAT-Tool

Non-Ferrous Metals industries - Cu - BAT17-XIV
type: Concept
notation: NFM-Cu-BAT17-XIV
definition: 2, Production and processing of metals: 2.5, Processing of non-ferrous metals Reducing copper to water. The BAT-AEL emission level is ? 0,3 mg/l.
status: valid
status modified: 2026-05-06
accepted date: 2026-05-06
in scheme: BATAEL values as defined into the EC BAT-Tool

Non-Ferrous Metals industries - Cu - BAT17-XV
type: Concept
notation: NFM-Cu-BAT17-XV
definition: 2, Production and processing of metals: 2.5, Processing of non-ferrous metals Reducing copper to water. The BAT-AEL emission level is ? 0,5 mg/l.
status: valid
status modified: 2026-05-06
accepted date: 2026-05-06
in scheme: BATAEL values as defined into the EC BAT-Tool

Non-Ferrous Metals industries - Dust - BAT113
type: Concept
notation: NFM-Dust-BAT113
definition: 2, Production and processing of metals: 2.5: Processing of non-ferrous metals; Bag filter; Reducing dust emissions to air. The BAT-AEL emission level is ? 5 mg/Nm3.
status: valid
status modified: 2026-05-06
accepted date: 2026-05-06
in scheme: BATAEL values as defined into the EC BAT-Tool

Non-Ferrous Metals industries - Dust - BAT119
type: Concept
notation: NFM-Dust-BAT119
definition: 2, Production and processing of metals: 2.5, Processing of non-ferrous metals: (a) production of non-ferrous crude metals from ore, concentrates or secondary raw materials by metallurgical, chemical or electrolytic processes; Bag filter; Reducing dust emissions to air. The BAT-AEL emission level is 2 - 5 mg/Nm3.
status: valid
status modified: 2026-05-06
accepted date: 2026-05-06
in scheme: BATAEL values as defined into the EC BAT-Tool

Non-Ferrous Metals industries - Dust - BAT121
type: Concept
notation: NFM-Dust-BAT121
definition: 2, Production and processing of metals: 2.5, Processing of non-ferrous metals; Bag filter; Reducing dust emissions to air. The BAT-AEL emission level is ? 5 mg/Nm3.
status: valid
status modified: 2026-05-06
accepted date: 2026-05-06
in scheme: BATAEL values as defined into the EC BAT-Tool

Non-Ferrous Metals industries - Dust - BAT122
type: Concept
notation: NFM-Dust-BAT122
definition: 2, Production and processing of metals: 2.5, Processing of non-ferrous metals: (b) melting, including the alloyage, of non-ferrous metals, including recovered products and operation of non-ferrous metal foundries, with a melting capacity exceeding 4 tonnes per day for lead and cadmium or 20 tonnes per day for all other metals; Bag filter; Reducing dust emissions to air. The BAT-AEL emission level is 2 - 5 mg/Nm3.
status: valid
status modified: 2026-05-06
accepted date: 2026-05-06
in scheme: BATAEL values as defined into the EC BAT-Tool

Non-Ferrous Metals industries - Dust - BAT128
type: Concept
notation: NFM-Dust-BAT128
definition: 2, Production and processing of metals: 2.5, Processing of non-ferrous metals: (b) melting, including the alloyage, of non-ferrous metals, including recovered products and operation of non-ferrous metal foundries, with a melting capacity exceeding 4 tonnes per day for lead and cadmium or 20 tonnes per day for all other metals; Bag filter; Reducing dust emissions to air. The BAT-AEL emission level is ? 5 mg/Nm3.
status: valid
status modified: 2026-05-06
accepted date: 2026-05-06
in scheme: BATAEL values as defined into the EC BAT-Tool

Non-Ferrous Metals industries - Dust - BAT132-I
type: Concept
notation: NFM-Dust-BAT132-I
definition: 2, Production and processing of metals: 2.5, Processing of non-ferrous metals: (b) melting, including the alloyage, of non-ferrous metals, including recovered products and operation of non-ferrous metal foundries, with a melting capacity exceeding 4 tonnes per day for lead and cadmium or 20 tonnes per day for all other metals; Techniques (a)-(c) (see table incl. footnote); Reducing dust emissions to air. The BAT-AEL emission level is 2 - 3 mg/Nm3.
status: valid
status modified: 2026-05-06
accepted date: 2026-05-06
in scheme: BATAEL values as defined into the EC BAT-Tool

Non-Ferrous Metals industries - Dust - BAT140
type: Concept
notation: NFM-Dust-BAT140
definition: 2, Production and processing of metals: 2.5, Processing of non-ferrous metals: (a) production of non-ferrous crude metals from ore, concentrates or secondary raw materials by metallurgical, chemical or electrolytic processes; Techniques (a)-(b) (see table incl. footnote); Reducing dust emissions to air. The BAT-AEL emission level is 2 - 5 mg/Nm3.
status: valid
status modified: 2026-05-06
accepted date: 2026-05-06
in scheme: BATAEL values as defined into the EC BAT-Tool

Non-Ferrous Metals industries - Dust - BAT158-I
type: Concept
notation: NFM-Dust-BAT158-I
definition: 2, Production and processing of metals: 2.5, Processing of non-ferrous metals: (a) production of non-ferrous crude metals from ore, concentrates or secondary raw materials by metallurgical, chemical or electrolytic processes; Bag filter; Reducing dust emissions to air. The BAT-AEL emission level is 2 - 5 mg/Nm3.
status: valid
status modified: 2026-05-06
accepted date: 2026-05-06
in scheme: BATAEL values as defined into the EC BAT-Tool

Non-Ferrous Metals industries - Dust - BAT158-II
type: Concept
notation: NFM-Dust-BAT158-II
definition: 2, Production and processing of metals: 2.5, Processing of non-ferrous metals: (a) production of non-ferrous crude metals from ore, concentrates or secondary raw materials by metallurgical, chemical or electrolytic processes; Bag filter; Reducing dust emissions to air. The BAT-AEL emission level is 2 - 5 mg/Nm3.
status: valid
status modified: 2026-05-06
accepted date: 2026-05-06
in scheme: BATAEL values as defined into the EC BAT-Tool

Non-Ferrous Metals industries - Dust - BAT158-III
type: Concept
notation: NFM-Dust-BAT158-III
definition: 2, Production and processing of metals: 2.5, Processing of non-ferrous metals: (a) production of non-ferrous crude metals from ore, concentrates or secondary raw materials by metallurgical, chemical or electrolytic processes; Bag filter; Reducing dust emissions to air. The BAT-AEL emission level is 2 - 5 mg/Nm3.
status: valid
status modified: 2026-05-06
accepted date: 2026-05-06
in scheme: BATAEL values as defined into the EC BAT-Tool

Non-Ferrous Metals industries - Dust - BAT158-IV
type: Concept
notation: NFM-Dust-BAT158-IV
definition: 2, Production and processing of metals: 2.5, Processing of non-ferrous metals: (a) production of non-ferrous crude metals from ore, concentrates or secondary raw materials by metallurgical, chemical or electrolytic processes; Bag filter; Reducing dust emissions to air. The BAT-AEL emission level is 2 - 5 mg/Nm3.
status: valid
status modified: 2026-05-06
accepted date: 2026-05-06
in scheme: BATAEL values as defined into the EC BAT-Tool

Non-Ferrous Metals industries - Dust - BAT171
type: Concept
notation: NFM-Dust-BAT171
definition: 2, Production and processing of metals: 2.5, Processing of non-ferrous metals: (a) production of non-ferrous crude metals from ore, concentrates or secondary raw materials by metallurgical, chemical or electrolytic processes; Bag filter or a combination of an ESP and a bag filter; Reducing dust emissions to air. The BAT-AEL emission level is 2 - 5 mg/Nm3.
status: valid
status modified: 2026-05-06
accepted date: 2026-05-06
in scheme: BATAEL values as defined into the EC BAT-Tool

Non-Ferrous Metals industries - Dust - BAT178-I
type: Concept
notation: NFM-Dust-BAT178-I
definition: 6.� Other activities: 6.8: Production of carbon (hard-burnt coal) or electrographite by means of incineration or graphitisation; Bag filter; Reducing dust emissions to air. The BAT-AEL emission level is 2 - 5 mg/Nm3.
status: valid
status modified: 2026-05-06
accepted date: 2026-05-06
in scheme: BATAEL values as defined into the EC BAT-Tool

Non-Ferrous Metals industries - Dust - BAT179-I
type: Concept
notation: NFM-Dust-BAT179-I
definition: 6.� Other activities: 6.8: Production of carbon (hard-burnt coal) or electrographite by means of incineration or graphitisation; Techniques (a)-(d) (see table incl. footnote); Reducing dust emissions to air. The BAT-AEL emission level is 2 - 10 mg/Nm3.
status: valid
status modified: 2026-05-06
accepted date: 2026-05-06
in scheme: BATAEL values as defined into the EC BAT-Tool

Non-Ferrous Metals industries - Dust - BAT180-I
type: Concept
notation: NFM-Dust-BAT180-I
definition: 6.� Other activities: 6.8: Production of carbon (hard-burnt coal) or electrographite by means of incineration or graphitisation; Techniques (a)-(c) (see table incl. footnote); Reducing dust emissions to air. The BAT-AEL emission level is 2 - 10 mg/Nm3.
status: valid
status modified: 2026-05-06
accepted date: 2026-05-06
in scheme: BATAEL values as defined into the EC BAT-Tool

Non-Ferrous Metals industries - Dust - BAT181-I
type: Concept
notation: NFM-Dust-BAT181-I
definition: 6.� Other activities: 6.8: Production of carbon (hard-burnt coal) or electrographite by means of incineration or graphitisation; Techniques (a)-(c) (see table incl. footnote); Reducing dust emissions to air. The BAT-AEL emission level is 2 - 10 mg/Nm3.
status: valid
status modified: 2026-05-06
accepted date: 2026-05-06
in scheme: BATAEL values as defined into the EC BAT-Tool

Non-Ferrous Metals industries - Dust - BAT37
type: Concept
notation: NFM-Dust-BAT37
definition: 2, Production and processing of metals: 2.5, Processing of non-ferrous metals: (b) melting, including the alloyage, of non-ferrous metals, including recovered products and operation of non-ferrous metal foundries, with a melting capacity exceeding 4 tonnes per day for lead and cadmium or 20 tonnes per day for all other metals; Bag filter for reception, storage, handling, transport, metering, mixing, blending, crushing, drying, cutting and screening of raw materials, and the pyrolytic treatment of copper turnings in primary and secondary copper production; Reducing dust emissions to air. The BAT-AEL emission level is 2 - 5 mg/Nm3.
status: valid
status modified: 2026-05-06
accepted date: 2026-05-06
in scheme: BATAEL values as defined into the EC BAT-Tool

Non-Ferrous Metals industries - Dust - BAT38
type: Concept
notation: NFM-Dust-BAT38
definition: 2, Production and processing of metals: 2.5, Processing of non-ferrous metals: (b) melting, including the alloyage, of non-ferrous metals, including recovered products and operation of non-ferrous metal foundries, with a melting capacity exceeding 4 tonnes per day for lead and cadmium or 20 tonnes per day for all other metals; Bag filter for concentrate drying in primary copper production; Reducing dust emissions to air. The BAT-AEL emission level is 3 - 5 mg/Nm3.
status: valid
status modified: 2026-05-06
accepted date: 2026-05-06
in scheme: BATAEL values as defined into the EC BAT-Tool

Non-Ferrous Metals industries - Dust - BAT39
type: Concept
notation: NFM-Dust-BAT39
definition: 2, Production and processing of metals: 2.5, Processing of non-ferrous metals: (b) melting, including the alloyage, of non-ferrous metals, including recovered products and operation of non-ferrous metal foundries, with a melting capacity exceeding 4 tonnes per day for lead and cadmium or 20 tonnes per day for all other metals; Bag filter and/or a wet scrubber for primary copper smelter and converter (emissions other than those that are routed to the sulphuric acid or liquid SO 2 plant or power plant); Reducing dust emissions to air. The BAT-AEL emission level is 2 - 5 mg/Nm3.
status: valid
status modified: 2026-05-06
accepted date: 2026-05-06
in scheme: BATAEL values as defined into the EC BAT-Tool

Non-Ferrous Metals industries - Dust - BAT40
type: Concept
notation: NFM-Dust-BAT40
definition: 2, Production and processing of metals: 2.5, Processing of non-ferrous metals: (b) melting, including the alloyage, of non-ferrous metals, including recovered products and operation of non-ferrous metal foundries, with a melting capacity exceeding 4 tonnes per day for lead and cadmium or 20 tonnes per day for all other metals; Bag filter for secondary copper smelter and converter and processing of secondary copper intermediates (emissions other than those that are routed to the sulphuric acid plant); Reducing dust emissions to air. The BAT-AEL emission level is 2 - 4 mg/Nm3.
status: valid
status modified: 2026-05-06
accepted date: 2026-05-06
in scheme: BATAEL values as defined into the EC BAT-Tool

Non-Ferrous Metals industries - Dust - BAT41
type: Concept
notation: NFM-Dust-BAT41
definition: 2, Production and processing of metals: 2.5, Processing of non-ferrous metals: (b) melting, including the alloyage, of non-ferrous metals, including recovered products and operation of non-ferrous metal foundries, with a melting capacity exceeding 4 tonnes per day for lead and cadmium or 20 tonnes per day for all other metals; Bag filter for secondary copper holding furnace; Reducing dust emissions to air. The BAT-AEL emission level is ? 5 mg/Nm3.
status: valid
status modified: 2026-05-06
accepted date: 2026-05-06
in scheme: BATAEL values as defined into the EC BAT-Tool

Non-Ferrous Metals industries - Dust - BAT42
type: Concept
notation: NFM-Dust-BAT42
definition: 2, Production and processing of metals: 2.5, Processing of non-ferrous metals: (b) melting, including the alloyage, of non-ferrous metals, including recovered products and operation of non-ferrous metal foundries, with a melting capacity exceeding 4 tonnes per day for lead and cadmium or 20 tonnes per day for all other metals; Bag filter or a scrubber in combination with an ESP for copper-rich slag furnace processing; Reducing dust emissions to air. The BAT-AEL emission level is 2 - 5 mg/Nm3.
status: valid
status modified: 2026-05-06
accepted date: 2026-05-06
in scheme: BATAEL values as defined into the EC BAT-Tool

Non-Ferrous Metals industries - Dust - BAT43
type: Concept
notation: NFM-Dust-BAT43
definition: 2, Production and processing of metals: 2.5, Processing of non-ferrous metals: (b) melting, including the alloyage, of non-ferrous metals, including recovered products and operation of non-ferrous metal foundries, with a melting capacity exceeding 4 tonnes per day for lead and cadmium or 20 tonnes per day for all other metals; Bag filter or a scrubber in combination with an ESP for anode furnace (in primary and secondary copper production); Reducing dust emissions to air. The BAT-AEL emission level is 2 - 5 mg/Nm3.
status: valid
status modified: 2026-05-06
accepted date: 2026-05-06
in scheme: BATAEL values as defined into the EC BAT-Tool

Non-Ferrous Metals industries - Dust - BAT44
type: Concept
notation: NFM-Dust-BAT44
definition: 2, Production and processing of metals: 2.5, Processing of non-ferrous metals: (b) melting, including the alloyage, of non-ferrous metals, including recovered products and operation of non-ferrous metal foundries, with a melting capacity exceeding 4 tonnes per day for lead and cadmium or 20 tonnes per day for all other metals; Bag filter or, in the case of off-gases with a water content close to the dew point, a wet scrubber or a demister for anode casting (in primary and secondary copper production); Reducing dust emissions to air. The BAT-AEL emission level is ? 5-15 mg/Nm3.
status: valid
status modified: 2026-05-06
accepted date: 2026-05-06
in scheme: BATAEL values as defined into the EC BAT-Tool

Non-Ferrous Metals industries - Dust - BAT45
type: Concept
notation: NFM-Dust-BAT45
definition: 2, Production and processing of metals: 2.5, Processing of non-ferrous metals: (b) melting, including the alloyage, of non-ferrous metals, including recovered products and operation of non-ferrous metal foundries, with a melting capacity exceeding 4 tonnes per day for lead and cadmium or 20 tonnes per day for all other metals; Bag filter for copper melting furnace; Reducing dust emissions to air. The BAT-AEL emission level is 2 - 5 mg/Nm3.
status: valid
status modified: 2026-05-06
accepted date: 2026-05-06
in scheme: BATAEL values as defined into the EC BAT-Tool

Non-Ferrous Metals industries - Dust - BAT59-I
type: Concept
notation: NFM-Dust-BAT59-I
definition: 2, Production and processing of metals: 2.5, Processing of non-ferrous metals: (a) production of non-ferrous crude metals from ore, concentrates or secondary raw materials by metallurgical, chemical or electrolytic processes; Techniques (a)-(c) (see table incl. footnote) in a a paste plant (hot pitch storage, paste mixing, cooling and forming, removing coke dust from operations such as coke storage and grindin); Reducing dust emissions to air. The BAT-AEL emission level is 2 - 5 mg/Nm3.
status: valid
status modified: 2026-05-06
accepted date: 2026-05-06
in scheme: BATAEL values as defined into the EC BAT-Tool

Non-Ferrous Metals industries - Dust - BAT60-I
type: Concept
notation: NFM-Dust-BAT60-I
definition: 2, Production and processing of metals: 2.5, Processing of non-ferrous metals: (a) production of non-ferrous crude metals from ore, concentrates or secondary raw materials by metallurgical, chemical or electrolytic processes; Techniques (a)-(d) (see table incl. footnote); Reducing dust emissions to air. The BAT-AEL emission level is 2 - 5 mg/Nm3.
status: valid
status modified: 2026-05-06
accepted date: 2026-05-06
in scheme: BATAEL values as defined into the EC BAT-Tool

Non-Ferrous Metals industries - Dust - BAT61-I
type: Concept
notation: NFM-Dust-BAT61-I
definition: 2, Production and processing of metals: 2.5, Processing of non-ferrous metals: (a) production of non-ferrous crude metals from ore, concentrates or secondary raw materials by metallurgical, chemical or electrolytic processes; Use a pre-filtration unit and a regenerative thermal oxidiser followed by a dry scrubber (e.g. lime bed); Reducing dust emissions to air. The BAT-AEL emission level is 2 - 5 mg/Nm3.
status: valid
status modified: 2026-05-06
accepted date: 2026-05-06
in scheme: BATAEL values as defined into the EC BAT-Tool

Non-Ferrous Metals industries - Dust - BAT64-I
type: Concept
notation: NFM-Dust-BAT64-I
definition: 2, Production and processing of metals: 2.5, Processing of non-ferrous metals: (a) production of non-ferrous crude metals from ore, concentrates or secondary raw materials by metallurgical, chemical or electrolytic processes; See three tables; Reducing dust emissions to air. The BAT-AEL emission level is ? 1,2 kg/t Al.
status: valid
status modified: 2026-05-06
accepted date: 2026-05-06
in scheme: BATAEL values as defined into the EC BAT-Tool

Non-Ferrous Metals industries - Dust - BAT64-II
type: Concept
notation: NFM-Dust-BAT64-II
definition: 2, Production and processing of metals: 2.5, Processing of non-ferrous metals: (a) production of non-ferrous crude metals from ore, concentrates or secondary raw materials by metallurgical, chemical or electrolytic processes; See three tables; Reducing dust emissions to air. The BAT-AEL emission level is ? 0,6 kg/t Al.
status: valid
status modified: 2026-05-06
accepted date: 2026-05-06
in scheme: BATAEL values as defined into the EC BAT-Tool

Non-Ferrous Metals industries - Dust - BAT66
type: Concept
notation: NFM-Dust-BAT66
definition: 2, Production and processing of metals: 2.5, Processing of non-ferrous metals: (a) production of non-ferrous crude metals from ore, concentrates or secondary raw materials by metallurgical, chemical or electrolytic processes; Bag filter; Reducing dust emissions to air. The BAT-AEL emission level is ? 5-10 mg/Nm3.
status: valid
status modified: 2026-05-06
accepted date: 2026-05-06
in scheme: BATAEL values as defined into the EC BAT-Tool

Non-Ferrous Metals industries - Dust - BAT67-I
type: Concept
notation: NFM-Dust-BAT67-I
definition: 2, Production and processing of metals: 2.5, Processing of non-ferrous metals: (a) production of non-ferrous crude metals from ore, concentrates or secondary raw materials by metallurgical, chemical or electrolytic processes; Techniques (a)-(b) (see table incl. footnote); Reducing dust emissions to air. The BAT-AEL emission level is 2 - 5 mg/Nm3.
status: valid
status modified: 2026-05-06
accepted date: 2026-05-06
in scheme: BATAEL values as defined into the EC BAT-Tool

Non-Ferrous Metals industries - Dust - BAT68
type: Concept
notation: NFM-Dust-BAT68
definition: 2, Production and processing of metals: 2.5, Processing of non-ferrous metals: (a) production of non-ferrous crude metals from ore, concentrates or secondary raw materials by metallurgical, chemical or electrolytic processes; Techniques (a)-(b) (see table incl. footnote); Reducing dust emissions to air. The BAT-AEL emission level is 2 - 25 mg/Nm3.
status: valid
status modified: 2026-05-06
accepted date: 2026-05-06
in scheme: BATAEL values as defined into the EC BAT-Tool

Non-Ferrous Metals industries - Dust - BAT80
type: Concept
notation: NFM-Dust-BAT80
definition: 2, Production and processing of metals: 2.5, Processing of non-ferrous metals: (a) production of non-ferrous crude metals from ore, concentrates or secondary raw materials by metallurgical, chemical or electrolytic processes; Bag filter; Reducing dust emissions to air. The BAT-AEL emission level is ? 5 mg/Nm3.
status: valid
status modified: 2026-05-06
accepted date: 2026-05-06
in scheme: BATAEL values as defined into the EC BAT-Tool

Non-Ferrous Metals industries - Dust - BAT81
type: Concept
notation: NFM-Dust-BAT81
definition: 2, Production and processing of metals: 2.5, Processing of non-ferrous metals: (b) melting, including the alloyage, of non-ferrous metals, including recovered products and operation of non-ferrous metal foundries, with a melting capacity exceeding 4 tonnes per day for lead and cadmium or 20 tonnes per day for all other metals; Bag filter; Reducing dust emissions to air. The BAT-AEL emission level is 2 - 5 mg/Nm3.
status: valid
status modified: 2026-05-06
accepted date: 2026-05-06
in scheme: BATAEL values as defined into the EC BAT-Tool

Non-Ferrous Metals industries - Dust - BAT82
type: Concept
notation: NFM-Dust-BAT82
definition: 2, Production and processing of metals: 2.5, Processing of non-ferrous metals: (b) melting, including the alloyage, of non-ferrous metals, including recovered products and operation of non-ferrous metal foundries, with a melting capacity exceeding 4 tonnes per day for lead and cadmium or 20 tonnes per day for all other metals; Techniques (a)-(c) (see table); Reducing dust emissions to air. The BAT-AEL emission level is 2 - 5 mg/Nm3.
status: valid
status modified: 2026-05-06
accepted date: 2026-05-06
in scheme: BATAEL values as defined into the EC BAT-Tool

Non-Ferrous Metals industries - Dust - BAT88
type: Concept
notation: NFM-Dust-BAT88
definition: 2, Production and processing of metals: 2.5, Processing of non-ferrous metals; Bag filter; Reducing dust emissions to air. The BAT-AEL emission level is 2 - 5 mg/Nm3.
status: valid
status modified: 2026-05-06
accepted date: 2026-05-06
in scheme: BATAEL values as defined into the EC BAT-Tool

Non-Ferrous Metals industries - Dust - BAT94
type: Concept
notation: NFM-Dust-BAT94
definition: 2, Production and processing of metals: 2.5, Processing of non-ferrous metals: (a) production of non-ferrous crude metals from ore, concentrates or secondary raw materials by metallurgical, chemical or electrolytic processes; Bag filter; Reducing dust emissions to air. The BAT-AEL emission level is ? 5 mg/Nm3.
status: valid
status modified: 2026-05-06
accepted date: 2026-05-06
in scheme: BATAEL values as defined into the EC BAT-Tool

Non-Ferrous Metals industries - Dust - BAT95
type: Concept
notation: NFM-Dust-BAT95
definition: 2, Production and processing of metals: 2.5, Processing of non-ferrous metals: (a) production of non-ferrous crude metals from ore, concentrates or secondary raw materials by metallurgical, chemical or electrolytic processes; Bag filter or a wet scrubber; Reducing dust emissions to air. The BAT-AEL emission level is ? 5 mg/Nm3.
status: valid
status modified: 2026-05-06
accepted date: 2026-05-06
in scheme: BATAEL values as defined into the EC BAT-Tool

Non-Ferrous Metals industries - Dust - BAT96-I
type: Concept
notation: NFM-Dust-BAT96-I
definition: 2, Production and processing of metals: 2.5: Processing of non-ferrous metals; Bag filter; Reducing dust emissions to air. The BAT-AEL emission level is 2 - 4 mg/Nm3.
status: valid
status modified: 2026-05-06
accepted date: 2026-05-06
in scheme: BATAEL values as defined into the EC BAT-Tool

Non-Ferrous Metals industries - Dust - BAT97-I
type: Concept
notation: NFM-Dust-BAT97-I
definition: 2, Production and processing of metals: 2.5, Processing of non-ferrous metals: (b) melting, including the alloyage, of non-ferrous metals, including recovered products and operation of non-ferrous metal foundries, with a melting capacity exceeding 4 tonnes per day for lead and cadmium or 20 tonnes per day for all other metals; Techniques (a)-(b) (see table); Reducing dust emissions to air. The BAT-AEL emission level is 2 - 4 mg/Nm3.
status: valid
status modified: 2026-05-06
accepted date: 2026-05-06
in scheme: BATAEL values as defined into the EC BAT-Tool

Non-Ferrous Metals industries - F - BAT60-IV
type: Concept
notation: NFM-F-BAT60-IV
definition: 2, Production and processing of metals: 2.5, Processing of non-ferrous metals: (a) production of non-ferrous crude metals from ore, concentrates or secondary raw materials by metallurgical, chemical or electrolytic processes; Techniques (a)-(d) (see table incl. footnote); Reducing total fluorides emissions to air. The BAT-AEL emission level is ? 0,8 mg/Nm3.
status: valid
status modified: 2026-05-06
accepted date: 2026-05-06
in scheme: BATAEL values as defined into the EC BAT-Tool

Non-Ferrous Metals industries - F - BAT64-III
type: Concept
notation: NFM-F-BAT64-III
definition: 2, Production and processing of metals: 2.5, Processing of non-ferrous metals: (a) production of non-ferrous crude metals from ore, concentrates or secondary raw materials by metallurgical, chemical or electrolytic processes; See three tables; Reducing total fluorides emissions to air. The BAT-AEL emission level is ? 0,6 kg/t Al.
status: valid
status modified: 2026-05-06
accepted date: 2026-05-06
in scheme: BATAEL values as defined into the EC BAT-Tool

Non-Ferrous Metals industries - F - BAT64-IV
type: Concept
notation: NFM-F-BAT64-IV
definition: 2, Production and processing of metals: 2.5, Processing of non-ferrous metals: (a) production of non-ferrous crude metals from ore, concentrates or secondary raw materials by metallurgical, chemical or electrolytic processes; See three tables; Reducing total fluorides emissions to air. The BAT-AEL emission level is ? 0,35 kg/t Al.
status: valid
status modified: 2026-05-06
accepted date: 2026-05-06
in scheme: BATAEL values as defined into the EC BAT-Tool

Non-Ferrous Metals industries - F - BAT67-III
type: Concept
notation: NFM-F-BAT67-III
definition: 2, Production and processing of metals: 2.5, Processing of non-ferrous metals: (a) production of non-ferrous crude metals from ore, concentrates or secondary raw materials by metallurgical, chemical or electrolytic processes; Techniques (a)-(b) (see table incl. footnote); Reducing total fluorides emissions to air. The BAT-AEL emission level is ? 1,5 mg/Nm3.
status: valid
status modified: 2026-05-06
accepted date: 2026-05-06
in scheme: BATAEL values as defined into the EC BAT-Tool

Non-Ferrous Metals industries - H2S - BAT89-III
type: Concept
notation: NFM-H2S-BAT89-III
definition: 2, Production and processing of metals: 2.5, Processing of non-ferrous metals; Techniques (a)-(c) (see table incl. footnote); Reducing hydrogen sulphide emissions to air. The BAT-AEL emission level is ? 2 mg/Nm3.
status: valid
status modified: 2026-05-06
accepted date: 2026-05-06
in scheme: BATAEL values as defined into the EC BAT-Tool

Non-Ferrous Metals industries - H2SO4 - BAT114-II
type: Concept
notation: NFM-H2SO4-BAT114-II
definition: 2, Production and processing of metals: 2.5: Processing of non-ferrous metals: (a) production of non-ferrous crude metals from ore, concentrates or secondary raw materials by metallurgical, chemical or electrolytic processes; Techniques (a)-(c) (see table incl. footnote); Reducing sulphuric acid emissions to air. The BAT-AEL emission level is < 10 mg/Nm3.
status: valid
status modified: 2026-05-06
accepted date: 2026-05-06
in scheme: BATAEL values as defined into the EC BAT-Tool

Non-Ferrous Metals industries - HCl - BAT124-I
type: Concept
notation: NFM-HCl-BAT124-I
definition: 2, Production and processing of metals: 2.5, Processing of non-ferrous metals: (b) melting, including the alloyage, of non-ferrous metals, including recovered products and operation of non-ferrous metal foundries, with a melting capacity exceeding 4 tonnes per day for lead and cadmium or 20 tonnes per day for all other metals; Techniques (a)-(b) (see table incl. footnote); Reducing hydrogen chloride emissions to air. The BAT-AEL emission level is ? 1,5 mg/Nm3.
status: valid
status modified: 2026-05-06
accepted date: 2026-05-06
in scheme: BATAEL values as defined into the EC BAT-Tool

Non-Ferrous Metals industries - HCl - BAT144-I
type: Concept
notation: NFM-HCl-BAT144-I
definition: 2, Production and processing of metals: 2.5, Processing of non-ferrous metals: (a) production of non-ferrous crude metals from ore, concentrates or secondary raw materials by metallurgical, chemical or electrolytic processes; Alkaline scrubber; Reducing hydrogen chloride emissions to air. The BAT-AEL emission level is ? 5-10 mg/Nm3.
status: valid
status modified: 2026-05-06
accepted date: 2026-05-06
in scheme: BATAEL values as defined into the EC BAT-Tool

Non-Ferrous Metals industries - HCl - BAT84-I
type: Concept
notation: NFM-HCl-BAT84-I
definition: 2, Production and processing of metals: 2.5, Processing of non-ferrous metals: (b) melting, including the alloyage, of non-ferrous metals, including recovered products and operation of non-ferrous metal foundries, with a melting capacity exceeding 4 tonnes per day for lead and cadmium or 20 tonnes per day for all other metals; Techniques (a)-(d) (see table); Reducing hydrogen chloride emissions to air. The BAT-AEL emission level is ? 5-10 mg/Nm3.
status: valid
status modified: 2026-05-06
accepted date: 2026-05-06
in scheme: BATAEL values as defined into the EC BAT-Tool

Non-Ferrous Metals industries - HF - BAT124-II
type: Concept
notation: NFM-HF-BAT124-II
definition: 2, Production and processing of metals: 2.5, Processing of non-ferrous metals: (b) melting, including the alloyage, of non-ferrous metals, including recovered products and operation of non-ferrous metal foundries, with a melting capacity exceeding 4 tonnes per day for lead and cadmium or 20 tonnes per day for all other metals; Techniques (a)-(b) (see table incl. footnote); Reducing hydrogen fluoride emissions to air. The BAT-AEL emission level is ? 0,3 mg/Nm3.
status: valid
status modified: 2026-05-06
accepted date: 2026-05-06
in scheme: BATAEL values as defined into the EC BAT-Tool

Non-Ferrous Metals industries - HF - BAT60-III
type: Concept
notation: NFM-HF-BAT60-III
definition: 2, Production and processing of metals: 2.5, Processing of non-ferrous metals: (a) production of non-ferrous crude metals from ore, concentrates or secondary raw materials by metallurgical, chemical or electrolytic processes; Techniques (a)-(d) (see table incl. footnote); Reducing hydrogen fluoride emissions to air. The BAT-AEL emission level is 0,3-0,5 mg/Nm3.
status: valid
status modified: 2026-05-06
accepted date: 2026-05-06
in scheme: BATAEL values as defined into the EC BAT-Tool

Non-Ferrous Metals industries - HF - BAT61-III
type: Concept
notation: NFM-HF-BAT61-III
definition: 2, Production and processing of metals: 2.5, Processing of non-ferrous metals: (a) production of non-ferrous crude metals from ore, concentrates or secondary raw materials by metallurgical, chemical or electrolytic processes; Use a pre-filtration unit and a regenerative thermal oxidiser followed by a dry scrubber (e.g. lime bed); Reducing hydrogen fluoride emissions to air. The BAT-AEL emission level is ? 3 mg/Nm3.
status: valid
status modified: 2026-05-06
accepted date: 2026-05-06
in scheme: BATAEL values as defined into the EC BAT-Tool

Non-Ferrous Metals industries - HF - BAT67-II
type: Concept
notation: NFM-HF-BAT67-II
definition: 2, Production and processing of metals: 2.5, Processing of non-ferrous metals: (a) production of non-ferrous crude metals from ore, concentrates or secondary raw materials by metallurgical, chemical or electrolytic processes; Techniques (a)-(b) (see table incl. footnote); Reducing hydrogen fluoride emissions to air. The BAT-AEL emission level is ? 1,0 mg/Nm3.
status: valid
status modified: 2026-05-06
accepted date: 2026-05-06
in scheme: BATAEL values as defined into the EC BAT-Tool

Non-Ferrous Metals industries - HF - BAT84-III
type: Concept
notation: NFM-HF-BAT84-III
definition: 2, Production and processing of metals: 2.5, Processing of non-ferrous metals: (b) melting, including the alloyage, of non-ferrous metals, including recovered products and operation of non-ferrous metal foundries, with a melting capacity exceeding 4 tonnes per day for lead and cadmium or 20 tonnes per day for all other metals; Techniques (a)-(d) (see table incl. footnote); Reducing hydrogen fluoride emissions to air. The BAT-AEL emission level is ? 1 mg/Nm3.
status: valid
status modified: 2026-05-06
accepted date: 2026-05-06
in scheme: BATAEL values as defined into the EC BAT-Tool

Non-Ferrous Metals industries - Hg - BAT11
type: Concept
notation: NFM-Hg-BAT11
definition: 2, Production and processing of metals: 2.1, Metal ore (including sulphide ore) roasting or sintering; 2.5, Processing of non-ferrous metals; Techniques: (a)-(b) (see table); Reducing sulphur dioxide (SO2) emissions to air. The BAT-AEL emission level is 0,01 - 0,05 mg/Nm3.
status: valid
status modified: 2026-05-06
accepted date: 2026-05-06
in scheme: BATAEL values as defined into the EC BAT-Tool

Non-Ferrous Metals industries - Hg - BAT17-XVI
type: Concept
notation: NFM-Hg-BAT17-XVI
definition: 2, Production and processing of metals: 2.5, Processing of non-ferrous metals Reducing mercury to water. The BAT-AEL emission level is 0,005�0,02 mg/l.
status: valid
status modified: 2026-05-06
accepted date: 2026-05-06
in scheme: BATAEL values as defined into the EC BAT-Tool

Non-Ferrous Metals industries - Hg - BAT17-XVII
type: Concept
notation: NFM-Hg-BAT17-XVII
definition: 2, Production and processing of metals: 2.5, Processing of non-ferrous metals Reducing mercury to water. The BAT-AEL emission level is ? 0,05 mg/l.
status: valid
status modified: 2026-05-06
accepted date: 2026-05-06
in scheme: BATAEL values as defined into the EC BAT-Tool

Non-Ferrous Metals industries - NH3 - BAT145
type: Concept
notation: NFM-NH3-BAT145
definition: 2, Production and processing of metals: 2.5, Processing of non-ferrous metals: (a) production of non-ferrous crude metals from ore, concentrates or secondary raw materials by metallurgical, chemical or electrolytic processes; Wet scrubber with sulphuric acid; Reducing ammonia (NH3) emissions to air. The BAT-AEL emission level is 1 - 3 mg/Nm3.
status: valid
status modified: 2026-05-06
accepted date: 2026-05-06
in scheme: BATAEL values as defined into the EC BAT-Tool

Non-Ferrous Metals industries - NH3 - BAT89-I
type: Concept
notation: NFM-NH3-BAT89-I
definition: 2, Production and processing of metals: 2.5, Processing of non-ferrous metals; Techniques (a)-(c) (see table incl. footnote); Reducing ammonia (NH3) emissions to air. The BAT-AEL emission level is ? 10 mg/Nm3.
status: valid
status modified: 2026-05-06
accepted date: 2026-05-06
in scheme: BATAEL values as defined into the EC BAT-Tool

Non-Ferrous Metals industries - NOx - BAT141
type: Concept
notation: NFM-NOx-BAT141
definition: 2, Production and processing of metals: 2.5, Processing of non-ferrous metals: (a) production of non-ferrous crude metals from ore, concentrates or secondary raw materials by metallurgical, chemical or electrolytic processes; Techniques (a)-(b) (see table incl. footnote); Reducing nitrogen oxides (NOx) emissions to air. The BAT-AEL emission level is 70 - 150 mg/Nm3.
status: valid
status modified: 2026-05-06
accepted date: 2026-05-06
in scheme: BATAEL values as defined into the EC BAT-Tool

Non-Ferrous Metals industries - Ni - BAT17-XIX
type: Concept
notation: NFM-Ni-BAT17-XIX
definition: 2, Production and processing of metals: 2.5, Processing of non-ferrous metals Reducing nickel to water. The BAT-AEL emission level is ? 0,1 mg/l.
status: valid
status modified: 2026-05-06
accepted date: 2026-05-06
in scheme: BATAEL values as defined into the EC BAT-Tool

Non-Ferrous Metals industries - Ni - BAT17-XVIII
type: Concept
notation: NFM-Ni-BAT17-XVIII
definition: 2, Production and processing of metals: 2.5, Processing of non-ferrous metals Reducing nickel to water. The BAT-AEL emission level is ? 0,5 mg/l.
status: valid
status modified: 2026-05-06
accepted date: 2026-05-06
in scheme: BATAEL values as defined into the EC BAT-Tool

Non-Ferrous Metals industries - Ni - BAT17-XX
type: Concept
notation: NFM-Ni-BAT17-XX
definition: 2, Production and processing of metals: 2.5, Processing of non-ferrous metals Reducing nickel to water. The BAT-AEL emission level is ? 2 mg/l.
status: valid
status modified: 2026-05-06
accepted date: 2026-05-06
in scheme: BATAEL values as defined into the EC BAT-Tool

Non-Ferrous Metals industries - Ni - BAT172-I
type: Concept
notation: NFM-Ni-BAT172-I
definition: 2, Production and processing of metals: 2.5, Processing of non-ferrous metals: (a) production of non-ferrous crude metals from ore, concentrates or secondary raw materials by metallurgical, chemical or electrolytic processes; Wet scrubber; Reducing nickel emissions to air. The BAT-AEL emission level is ? 1 mg/Nm3.
status: valid
status modified: 2026-05-06
accepted date: 2026-05-06
in scheme: BATAEL values as defined into the EC BAT-Tool

Non-Ferrous Metals industries - Ni - BAT173
type: Concept
notation: NFM-Ni-BAT173
definition: 2, Production and processing of metals: 2.5, Processing of non-ferrous metals: (a) production of non-ferrous crude metals from ore, concentrates or secondary raw materials by metallurgical, chemical or electrolytic processes; Bag filter; Reducing nickel emissions to air. The BAT-AEL emission level is ? 1 mg/Nm3.
status: valid
status modified: 2026-05-06
accepted date: 2026-05-06
in scheme: BATAEL values as defined into the EC BAT-Tool

Non-Ferrous Metals industries - PCDD.F - BAT123-II
type: Concept
notation: NFM-PCDD.F-BAT123-II
definition: 2, Production and processing of metals: 2.5, Processing of non-ferrous metals: (b) melting, including the alloyage, of non-ferrous metals, including recovered products and operation of non-ferrous metal foundries, with a melting capacity exceeding 4 tonnes per day for lead and cadmium or 20 tonnes per day for all other metals; Techniques (a)-(c) (see table incl. footnote); Reducing PCDD/F emissions to air. The BAT-AEL emission level is ? 0,1 ng I-TEQ/Nm3 .
status: valid
status modified: 2026-05-06
accepted date: 2026-05-06
in scheme: BATAEL values as defined into the EC BAT-Tool

Non-Ferrous Metals industries - PCDD.F - BAT146
type: Concept
notation: NFM-PCDD.F-BAT146
definition: 2, Production and processing of metals: 2.5, Processing of non-ferrous metals: (a) production of non-ferrous crude metals from ore, concentrates or secondary raw materials by metallurgical, chemical or electrolytic processes; Techniques (a)-(h) (see table incl. footnote); Reducing PCDD/F emissions to air. The BAT-AEL emission level is ? 0,1 ng I-TEQ/Nm3 .
status: valid
status modified: 2026-05-06
accepted date: 2026-05-06
in scheme: BATAEL values as defined into the EC BAT-Tool

Non-Ferrous Metals industries - PCDD.F - BAT159
type: Concept
notation: NFM-PCDD.F-BAT159
definition: 2, Production and processing of metals: 2.5, Processing of non-ferrous metals: (a) production of non-ferrous crude metals from ore, concentrates or secondary raw materials by metallurgical, chemical or electrolytic processes; Inject adsorbents and to use an ESP and/or a bag filter; Reducing PCDD/F emissions to air. The BAT-AEL emission level is ? 0,05 ng I-TEQ/Nm3.
status: valid
status modified: 2026-05-06
accepted date: 2026-05-06
in scheme: BATAEL values as defined into the EC BAT-Tool

Non-Ferrous Metals industries - PCDD.F - BAT48
type: Concept
notation: NFM-PCDD.F-BAT48
definition: 2, Production and processing of metals: 2.5, Processing of non-ferrous metals; Techniques (a)-(j) (see table incl. footnote); Reducing PCDD/F emissions to air. The BAT-AEL emission level is ? 0,1 ng I-TEQ/Nm3 .
status: valid
status modified: 2026-05-06
accepted date: 2026-05-06
in scheme: BATAEL values as defined into the EC BAT-Tool

Non-Ferrous Metals industries - PCDD.F - BAT83-II
type: Concept
notation: NFM-PCDD.F-BAT83-II
definition: 2, Production and processing of metals: 2.5, Processing of non-ferrous metals: (b) melting, including the alloyage, of non-ferrous metals, including recovered products and operation of non-ferrous metal foundries, with a melting capacity exceeding 4 tonnes per day for lead and cadmium or 20 tonnes per day for all other metals; Techniques (a)-(e) (see table); Reducing PCDD/F emissions to air. The BAT-AEL emission level is ? 0,1 ng I-TEQ/Nm3 .
status: valid
status modified: 2026-05-06
accepted date: 2026-05-06
in scheme: BATAEL values as defined into the EC BAT-Tool

Non-Ferrous Metals industries - PCDD.F - BAT99
type: Concept
notation: NFM-PCDD.F-BAT99
definition: 2, Production and processing of metals: 2.5, Processing of non-ferrous metals: (b) melting, including the alloyage, of non-ferrous metals, including recovered products and operation of non-ferrous metal foundries, with a melting capacity exceeding 4 tonnes per day for lead and cadmium or 20 tonnes per day for all other metals; Techniques (a)-(j) (see table incl. footnote); Reducing PCDD/F emissions to air. The BAT-AEL emission level is ? 0,1 ng I-TEQ/Nm3 .
status: valid
status modified: 2026-05-06
accepted date: 2026-05-06
in scheme: BATAEL values as defined into the EC BAT-Tool

Non-Ferrous Metals industries - PH3 - BAT89-II
type: Concept
notation: NFM-PH3-BAT89-II
definition: 2, Production and processing of metals: 2.5, Processing of non-ferrous metals; Techniques (a)-(c) (see table incl. footnote); Reducing phosphene emissions to air. The BAT-AEL emission level is ? 0,5 mg/Nm3.
status: valid
status modified: 2026-05-06
accepted date: 2026-05-06
in scheme: BATAEL values as defined into the EC BAT-Tool

Non-Ferrous Metals industries - Pb - BAT17-XXI
type: Concept
notation: NFM-Pb-BAT17-XXI
definition: 2, Production and processing of metals: 2.5, Processing of non-ferrous metals Reducing lead to water. The BAT-AEL emission level is ? 0,5 mg/l.
status: valid
status modified: 2026-05-06
accepted date: 2026-05-06
in scheme: BATAEL values as defined into the EC BAT-Tool

Non-Ferrous Metals industries - Pb - BAT17-XXII
type: Concept
notation: NFM-Pb-BAT17-XXII
definition: 2, Production and processing of metals: 2.5, Processing of non-ferrous metals Reducing lead to water. The BAT-AEL emission level is ? 0,2 mg/l.
status: valid
status modified: 2026-05-06
accepted date: 2026-05-06
in scheme: BATAEL values as defined into the EC BAT-Tool

Non-Ferrous Metals industries - Pb - BAT96-II
type: Concept
notation: NFM-Pb-BAT96-II
definition: 2, Production and processing of metals: 2.5: Processing of non-ferrous metals; Bag filter; Reducing lead emissions to air. The BAT-AEL emission level is ? 1 mg/Nm3.
status: valid
status modified: 2026-05-06
accepted date: 2026-05-06
in scheme: BATAEL values as defined into the EC BAT-Tool

Non-Ferrous Metals industries - Pb - BAT97-II
type: Concept
notation: NFM-Pb-BAT97-II
definition: 2, Production and processing of metals: 2.5, Processing of non-ferrous metals: (b) melting, including the alloyage, of non-ferrous metals, including recovered products and operation of non-ferrous metal foundries, with a melting capacity exceeding 4 tonnes per day for lead and cadmium or 20 tonnes per day for all other metals; Techniques (a)-(b) (see table); Reducing lead emissions to air. The BAT-AEL emission level is ? 1 mg/Nm3.
status: valid
status modified: 2026-05-06
accepted date: 2026-05-06
in scheme: BATAEL values as defined into the EC BAT-Tool

Non-Ferrous Metals industries - SO2 - BAT100
type: Concept
notation: NFM-SO2-BAT100
definition: 2, Production and processing of metals: 2.5, Processing of non-ferrous metals: (b) melting, including the alloyage, of non-ferrous metals, including recovered products and operation of non-ferrous metal foundries, with a melting capacity exceeding 4 tonnes per day for lead and cadmium or 20 tonnes per day for all other metals; Techniques (a)-(d) (see table incl. footnotes); Reducing sulphur dioxide (SO2) emissions to air. The BAT-AEL emission level is 50-350 mg/Nm3.
status: valid
status modified: 2026-05-06
accepted date: 2026-05-06
in scheme: BATAEL values as defined into the EC BAT-Tool

Non-Ferrous Metals industries - SO2 - BAT120
type: Concept
notation: NFM-SO2-BAT120
definition: 2, Production and processing of metals: 2.5, Processing of non-ferrous metals: (a) production of non-ferrous crude metals from ore, concentrates or secondary raw materials by metallurgical, chemical or electrolytic processes; Wet desulphurisation technique; Reducing sulphur dioxide (SO2) emissions to air. The BAT-AEL emission level is ? 500 mg/Nm3.
status: valid
status modified: 2026-05-06
accepted date: 2026-05-06
in scheme: BATAEL values as defined into the EC BAT-Tool

Non-Ferrous Metals industries - SO2 - BAT142
type: Concept
notation: NFM-SO2-BAT142
definition: 2, Production and processing of metals: 2.5, Processing of non-ferrous metals: (a) production of non-ferrous crude metals from ore, concentrates or secondary raw materials by metallurgical, chemical or electrolytic processes; Techniques (a)-(b) (see table incl. footnote); Reducing sulphur dioxide (SO2) emissions to air. The BAT-AEL emission level is 50 - 480 mg/Nm3.
status: valid
status modified: 2026-05-06
accepted date: 2026-05-06
in scheme: BATAEL values as defined into the EC BAT-Tool

Non-Ferrous Metals industries - SO2 - BAT143
type: Concept
notation: NFM-SO2-BAT143
definition: 2, Production and processing of metals: 2.5, Processing of non-ferrous metals: (a) production of non-ferrous crude metals from ore, concentrates or secondary raw materials by metallurgical, chemical or electrolytic processes; Wet scrubber; Reducing sulphur dioxide (SO2) emissions to air. The BAT-AEL emission level is 50 - 100 mg/Nm3.
status: valid
status modified: 2026-05-06
accepted date: 2026-05-06
in scheme: BATAEL values as defined into the EC BAT-Tool

Non-Ferrous Metals industries - SO2 - BAT49-I
type: Concept
notation: NFM-SO2-BAT49-I
definition: 2, Production and processing of metals: 2.5, Processing of non-ferrous metals: (a) production of non-ferrous crude metals from ore, concentrates or secondary raw materials by metallurgical, chemical or electrolytic processes; Techniques (a)-(c) (see table incl. footnote) in primary copper production; Reducing sulphur dioxide (SO2) emissions to air. The BAT-AEL emission level is 50-500 mg/Nm3.
status: valid
status modified: 2026-05-06
accepted date: 2026-05-06
in scheme: BATAEL values as defined into the EC BAT-Tool

Non-Ferrous Metals industries - SO2 - BAT49-II
type: Concept
notation: NFM-SO2-BAT49-II
definition: 2, Production and processing of metals: 2.5, Processing of non-ferrous metals: (a) production of non-ferrous crude metals from ore, concentrates or secondary raw materials by metallurgical, chemical or electrolytic processes; Techniques (a)-(c) (see table incl. footnote) in secondary copper production; Reducing sulphur dioxide (SO2) emissions to air. The BAT-AEL emission level is 50-300 mg/Nm3.
status: valid
status modified: 2026-05-06
accepted date: 2026-05-06
in scheme: BATAEL values as defined into the EC BAT-Tool

Non-Ferrous Metals industries - SO2 - BAT69
type: Concept
notation: NFM-SO2-BAT69
definition: 2, Production and processing of metals: 2.5, Processing of non-ferrous metals: (a) production of non-ferrous crude metals from ore, concentrates or secondary raw materials by metallurgical, chemical or electrolytic processes; Techniques (a)-(b) (see table incl. footnote); Reducing sulphur dioxide (SO2) emissions to air. The BAT-AEL emission level is ? 2,5-15 kg/ t Al.
status: valid
status modified: 2026-05-06
accepted date: 2026-05-06
in scheme: BATAEL values as defined into the EC BAT-Tool

Non-Ferrous Metals industries - TVOC - BAT123-I
type: Concept
notation: NFM-TVOC-BAT123-I
definition: 2, Production and processing of metals: 2.5, Processing of non-ferrous metals: (b) melting, including the alloyage, of non-ferrous metals, including recovered products and operation of non-ferrous metal foundries, with a melting capacity exceeding 4 tonnes per day for lead and cadmium or 20 tonnes per day for all other metals; Techniques (a)-(c) (see table incl. footnote); Reducing TVOC emissions to air. The BAT-AEL emission level is 2 - 20 mg/Nm3.
status: valid
status modified: 2026-05-06
accepted date: 2026-05-06
in scheme: BATAEL values as defined into the EC BAT-Tool

Non-Ferrous Metals industries - TVOC - BAT183
type: Concept
notation: NFM-TVOC-BAT183
definition: 6.� Other activities: 6.8: Production of carbon (hard-burnt coal) or electrographite by means of incineration or graphitisation; Techniques (a)-(b) (see table incl. footnote); Reducing TVOC emissions to air. The BAT-AEL emission level is ? 10-40 mg/Nm3.
status: valid
status modified: 2026-05-06
accepted date: 2026-05-06
in scheme: BATAEL values as defined into the EC BAT-Tool

Non-Ferrous Metals industries - TVOC - BAT46
type: Concept
notation: NFM-TVOC-BAT46
definition: 2, Production and processing of metals: 2.5, Processing of non-ferrous metals; Techniques (a)-(e) (see table incl. footnote); Reducing TVOC emissions to air. The BAT-AEL emission level is 3 - 30 mg/Nm3.
status: valid
status modified: 2026-05-06
accepted date: 2026-05-06
in scheme: BATAEL values as defined into the EC BAT-Tool

Non-Ferrous Metals industries - TVOC - BAT83-I
type: Concept
notation: NFM-TVOC-BAT83-I
definition: 2, Production and processing of metals: 2.5, Processing of non-ferrous metals: (b) melting, including the alloyage, of non-ferrous metals, including recovered products and operation of non-ferrous metal foundries, with a melting capacity exceeding 4 tonnes per day for lead and cadmium or 20 tonnes per day for all other metals; Techniques (a)-(e) (see table); Reducing TVOC emissions to air. The BAT-AEL emission level is ? 10-30 mg/Nm3.
status: valid
status modified: 2026-05-06
accepted date: 2026-05-06
in scheme: BATAEL values as defined into the EC BAT-Tool

Non-Ferrous Metals industries - TVOC - BAT98
type: Concept
notation: NFM-TVOC-BAT98
definition: 2, Production and processing of metals: 2.5, Processing of non-ferrous metals: (b) melting, including the alloyage, of non-ferrous metals, including recovered products and operation of non-ferrous metal foundries, with a melting capacity exceeding 4 tonnes per day for lead and cadmium or 20 tonnes per day for all other metals; Techniques (a)-(c) (see table incl. footnotes); Reducing TVOC emissions to air. The BAT-AEL emission level is 10 - 40 mg/Nm3.
status: valid
status modified: 2026-05-06
accepted date: 2026-05-06
in scheme: BATAEL values as defined into the EC BAT-Tool

Non-Ferrous Metals industries - Zn - BAT114-I
type: Concept
notation: NFM-Zn-BAT114-I
definition: 2, Production and processing of metals: 2.5: Processing of non-ferrous metals: (a) production of non-ferrous crude metals from ore, concentrates or secondary raw materials by metallurgical, chemical or electrolytic processes; Techniques (a)-(c) (see table incl. footnote); Reducing zinc emissions to air. The BAT-AEL emission level is ? 1 mg/Nm3.
status: valid
status modified: 2026-05-06
accepted date: 2026-05-06
in scheme: BATAEL values as defined into the EC BAT-Tool

Non-Ferrous Metals industries - Zn - BAT17-XXIII
type: Concept
notation: NFM-Zn-BAT17-XXIII
definition: 2, Production and processing of metals: 2.5, Processing of non-ferrous metals Reducing zinc to water. The BAT-AEL emission level is ? 1 mg/l.
status: valid
status modified: 2026-05-06
accepted date: 2026-05-06
in scheme: BATAEL values as defined into the EC BAT-Tool

Non-Ferrous Metals industries - Zn - BAT17-XXIV
type: Concept
notation: NFM-Zn-BAT17-XXIV
definition: 2, Production and processing of metals: 2.5, Processing of non-ferrous metals Reducing zinc to water. The BAT-AEL emission level is ? 0,4 mg/l.
status: valid
status modified: 2026-05-06
accepted date: 2026-05-06
in scheme: BATAEL values as defined into the EC BAT-Tool

Production of pulp, paper and board - AOX - BAT19-VI
type: Concept
notation: PP-AOX-BAT19-VI
definition: 6. Other activities: 6.1 Production in industrial installations of: (a) pulp from timber or other fibrous materials; (b) paper or card board; Reducing adsorbable organically bound halogens (AOX) to water. The BAT-AEL emission level is 0 - 0,2 kg/ADt.
status: valid
status modified: 2026-05-06
accepted date: 2026-05-06
in scheme: BATAEL values as defined into the EC BAT-Tool

Production of pulp, paper and board - AOX - BAT33-IX
type: Concept
notation: PP-AOX-BAT33-IX
definition: 6. Other activities: 6.1 Production in industrial installations of: (a) pulp from timber or other fibrous materials; (b) paper or card board; Reducing Adsorbable Organically Bound Halogens (AOX) to water. The BAT-AEL emission level is 0,5 � 1,5 mg/l.
status: valid
status modified: 2026-05-06
accepted date: 2026-05-06
in scheme: BATAEL values as defined into the EC BAT-Tool

Production of pulp, paper and board - AOX - BAT45-V
type: Concept
notation: PP-AOX-BAT45-V
definition: 6. Other activities: 6.1 Production in industrial installations of: (a) pulp from timber or other fibrous materials; (b) paper or card board; Reducing adsorbable organically bound halogens (AOX) to water. The BAT-AEL emission level is < 0,05 kg/t.
status: valid
status modified: 2026-05-06
accepted date: 2026-05-06
in scheme: BATAEL values as defined into the EC BAT-Tool

Production of pulp, paper and board - AOX - BAT45-XIV
type: Concept
notation: PP-AOX-BAT45-XIV
definition: 6. Other activities: 6.1 Production in industrial installations of: (a) pulp from timber or other fibrous materials; (b) paper or card board; Reducing adsorbable organically bound halogens (AOX) to water. The BAT-AEL emission level is < 0,05 kg/t.
status: valid
status modified: 2026-05-06
accepted date: 2026-05-06
in scheme: BATAEL values as defined into the EC BAT-Tool

Production of pulp, paper and board - AOX - BAT50-VI
type: Concept
notation: PP-AOX-BAT50-VI
definition: 6. Other activities: 6.1 Production in industrial installations of: (a) pulp from timber or other fibrous materials; (b) paper or card board; Reducing Adsorbable Organically Bound Halogens (AOX) to water. The BAT-AEL emission level is 0,05 kg/t.
status: valid
status modified: 2026-05-06
accepted date: 2026-05-06
in scheme: BATAEL values as defined into the EC BAT-Tool

Production of pulp, paper and board - AOX - BAT50-XI
type: Concept
notation: PP-AOX-BAT50-XI
definition: 6. Other activities: 6.1 Production in industrial installations of: (a) pulp from timber or other fibrous materials; (b) paper or card board; Reducing Adsorbable Organically Bound Halogens (AOX) to water. The BAT-AEL emission level is 0,05 kg/t .
status: valid
status modified: 2026-05-06
accepted date: 2026-05-06
in scheme: BATAEL values as defined into the EC BAT-Tool

Production of pulp, paper and board - COD - BAT19-I
type: Concept
notation: PP-COD-BAT19-I
definition: 6. Other activities: 6.1 Production in industrial installations of: (a) pulp from timber or other fibrous materials; (b) paper or card board; Reducing chemical oxygen demand (COD) to water. The BAT-AEL emission level is 7 - 20 kg/ADt.
status: valid
status modified: 2026-05-06
accepted date: 2026-05-06
in scheme: BATAEL values as defined into the EC BAT-Tool

Production of pulp, paper and board - COD - BAT19-VII
type: Concept
notation: PP-COD-BAT19-VII
definition: 6. Other activities: 6.1 Production in industrial installations of: (a) pulp from timber or other fibrous materials; (b) paper or card board; Reducing chemical oxygen demand (COD) to water. The BAT-AEL emission level is 2,5 - 8 kg/ADt.
status: valid
status modified: 2026-05-06
accepted date: 2026-05-06
in scheme: BATAEL values as defined into the EC BAT-Tool

Production of pulp, paper and board - COD - BAT33-I
type: Concept
notation: PP-COD-BAT33-I
definition: 6. Other activities: 6.1 Production in industrial installations of: (a) pulp from timber or other fibrous materials; (b) paper or card board; Reducing chemical oxygen demand (COD) to water. The BAT-AEL emission level is 10 � 30 kg/ADt.
status: valid
status modified: 2026-05-06
accepted date: 2026-05-06
in scheme: BATAEL values as defined into the EC BAT-Tool

Production of pulp, paper and board - COD - BAT33-II
type: Concept
notation: PP-COD-BAT33-II
definition: 6. Other activities: 6.1 Production in industrial installations of: (a) pulp from timber or other fibrous materials; (b) paper or card board; Reducing chemical oxygen demand (COD) to water. The BAT-AEL emission level is 20 � 35 kg/ADt.
status: valid
status modified: 2026-05-06
accepted date: 2026-05-06
in scheme: BATAEL values as defined into the EC BAT-Tool

Production of pulp, paper and board - COD - BAT33-X
type: Concept
notation: PP-COD-BAT33-X
definition: 6. Other activities: 6.1 Production in industrial installations of: (a) pulp from timber or other fibrous materials; (b) paper or card board; Reducing chemical oxygen demand (COD) to water. The BAT-AEL emission level is 3,2 � 11 kg/ADt.
status: valid
status modified: 2026-05-06
accepted date: 2026-05-06
in scheme: BATAEL values as defined into the EC BAT-Tool

Production of pulp, paper and board - COD - BAT40-I
type: Concept
notation: PP-COD-BAT40-I
definition: 6. Other activities: 6.1 Production in industrial installations of: (a) pulp from timber or other fibrous materials; (b) paper or card board; Reducing chemical oxygen demand (COD) to water. The BAT-AEL emission level is 0,9 � 4,5 kg/t.
status: valid
status modified: 2026-05-06
accepted date: 2026-05-06
in scheme: BATAEL values as defined into the EC BAT-Tool

Production of pulp, paper and board - COD - BAT40-V
type: Concept
notation: PP-COD-BAT40-V
definition: 6. Other activities: 6.1 Production in industrial installations of: (a) pulp from timber or other fibrous materials; (b) paper or card board; Reducing chemical oxygen demand (COD) to water. The BAT-AEL emission level is 12 � 20 kg/ADt.
status: valid
status modified: 2026-05-06
accepted date: 2026-05-06
in scheme: BATAEL values as defined into the EC BAT-Tool

Production of pulp, paper and board - COD - BAT45-I
type: Concept
notation: PP-COD-BAT45-I
definition: 6. Other activities: 6.1 Production in industrial installations of: (a) pulp from timber or other fibrous materials; (b) paper or card board; Reducing chemical oxygen demand (COD) to water. The BAT-AEL emission level is 0,4 - 1,4 kg/t.
status: valid
status modified: 2026-05-06
accepted date: 2026-05-06
in scheme: BATAEL values as defined into the EC BAT-Tool

Production of pulp, paper and board - COD - BAT45-VI
type: Concept
notation: PP-COD-BAT45-VI
definition: 6. Other activities: 6.1 Production in industrial installations of: (a) pulp from timber or other fibrous materials; (b) paper or card board; Reducing chemical oxygen demand (COD) to water. The BAT-AEL emission level is 0,9 - 3 kg/t.
status: valid
status modified: 2026-05-06
accepted date: 2026-05-06
in scheme: BATAEL values as defined into the EC BAT-Tool

Production of pulp, paper and board - COD - BAT45-VII
type: Concept
notation: PP-COD-BAT45-VII
definition: 6. Other activities: 6.1 Production in industrial installations of: (a) pulp from timber or other fibrous materials; (b) paper or card board; Reducing chemical oxygen demand (COD) to water. The BAT-AEL emission level is 0,9 - 4 kg/t.
status: valid
status modified: 2026-05-06
accepted date: 2026-05-06
in scheme: BATAEL values as defined into the EC BAT-Tool

Production of pulp, paper and board - COD - BAT50-I
type: Concept
notation: PP-COD-BAT50-I
definition: 6. Other activities: 6.1 Production in industrial installations of: (a) pulp from timber or other fibrous materials; (b) paper or card board; Reducing chemical oxygen demand (COD) to water. The BAT-AEL emission level is 0,15 � 1,5 kg/t.
status: valid
status modified: 2026-05-06
accepted date: 2026-05-06
in scheme: BATAEL values as defined into the EC BAT-Tool

Production of pulp, paper and board - COD - BAT50-VII
type: Concept
notation: PP-COD-BAT50-VII
definition: 6. Other activities: 6.1 Production in industrial installations of: (a) pulp from timber or other fibrous materials; (b) paper or card board; Reducing chemical oxygen demand (COD) to water. The BAT-AEL emission level is 0,3 � 5 kg/t .
status: valid
status modified: 2026-05-06
accepted date: 2026-05-06
in scheme: BATAEL values as defined into the EC BAT-Tool

Production of pulp, paper and board - Dust - BAT23-I
type: Concept
notation: PP-Dust-BAT23-I
definition: 6. Other activities: 6.1 Production in industrial installations of: (a) pulp from timber or other fibrous materials; (b) paper or card board; Use an electrostatic precipitator (ESP) or a combination of ESP and wet scrubber: see description (Section 1.7.1.1) for New or major refurbishment; Reducing dust emissions to air. The BAT-AEL emission level is 10 � 25 mg/Nm3 at 6 % O2 .
status: valid
status modified: 2026-05-06
accepted date: 2026-05-06
in scheme: BATAEL values as defined into the EC BAT-Tool

Production of pulp, paper and board - Dust - BAT23-II
type: Concept
notation: PP-Dust-BAT23-II
definition: 6. Other activities: 6.1 Production in industrial installations of: (a) pulp from timber or other fibrous materials; (b) paper or card board; Use an electrostatic precipitator (ESP) or a combination of ESP and wet scrubber: see description (Section 1.7.1.1) for Existing; Reducing dust emissions to air. The BAT-AEL emission level is 0,02 � 0,20 kg dust/ADt.
status: valid
status modified: 2026-05-06
accepted date: 2026-05-06
in scheme: BATAEL values as defined into the EC BAT-Tool

Production of pulp, paper and board - Dust - BAT23-III
type: Concept
notation: PP-Dust-BAT23-III
definition: 6. Other activities: 6.1 Production in industrial installations of: (a) pulp from timber or other fibrous materials; (b) paper or card board; Use an electrostatic precipitator (ESP) or a combination of ESP and wet scrubber: see description (Section 1.7.1.1) for New or major refurbishment; Reducing dust emissions to air. The BAT-AEL emission level is 10 � 40 mg/Nm3 at 6 % O2 .
status: valid
status modified: 2026-05-06
accepted date: 2026-05-06
in scheme: BATAEL values as defined into the EC BAT-Tool

Production of pulp, paper and board - Dust - BAT23-IV
type: Concept
notation: PP-Dust-BAT23-IV
definition: 6. Other activities: 6.1 Production in industrial installations of: (a) pulp from timber or other fibrous materials; (b) paper or card board; Use an electrostatic precipitator (ESP) or a combination of ESP and wet scrubber: see description (Section 1.7.1.1) for Existing; Reducing dust emissions to air. The BAT-AEL emission level is 0,02 � 0,3 kg dust/ADt.
status: valid
status modified: 2026-05-06
accepted date: 2026-05-06
in scheme: BATAEL values as defined into the EC BAT-Tool

Production of pulp, paper and board - Dust - BAT27-I
type: Concept
notation: PP-Dust-BAT27-I
definition: 6. Other activities: 6.1 Production in industrial installations of: (a) pulp from timber or other fibrous materials; (b) paper or card board; Use an electrostatic precipitator (ESP) or a combination of ESP and wet scrubber: see description (Section 1.7.1.1.) for New or major refurbishments; Reducing dust emissions to air. The BAT-AEL emission level is 10 � 25 mg/Nm3 at 6 % O2.
status: valid
status modified: 2026-05-06
accepted date: 2026-05-06
in scheme: BATAEL values as defined into the EC BAT-Tool

Production of pulp, paper and board - Dust - BAT27-II
type: Concept
notation: PP-Dust-BAT27-II
definition: 6. Other activities: 6.1 Production in industrial installations of: (a) pulp from timber or other fibrous materials; (b) paper or card board; Use an electrostatic precipitator (ESP) or a combination of ESP and wet scrubber: see description (Section 1.7.1.1.) for New or major refurbishments; Reducing dust emissions to air. The BAT-AEL emission level is 0,005 � 0,02 kg dust/ADt .
status: valid
status modified: 2026-05-06
accepted date: 2026-05-06
in scheme: BATAEL values as defined into the EC BAT-Tool

Production of pulp, paper and board - Dust - BAT27-III
type: Concept
notation: PP-Dust-BAT27-III
definition: 6. Other activities: 6.1 Production in industrial installations of: (a) pulp from timber or other fibrous materials; (b) paper or card board; Use an electrostatic precipitator (ESP) or a combination of ESP and wet scrubber: see description (Section 1.7.1.1.) for Existing; Reducing dust emissions to air. The BAT-AEL emission level is 10 � 30 mg/Nm3 at 6 % O2.
status: valid
status modified: 2026-05-06
accepted date: 2026-05-06
in scheme: BATAEL values as defined into the EC BAT-Tool

Production of pulp, paper and board - Dust - BAT27-IV
type: Concept
notation: PP-Dust-BAT27-IV
definition: 6. Other activities: 6.1 Production in industrial installations of: (a) pulp from timber or other fibrous materials; (b) paper or card board; Use an electrostatic precipitator (ESP) or a combination of ESP and wet scrubber: see description (Section 1.7.1.1.) for Existing; Reducing dust emissions to air. The BAT-AEL emission level is 0,005 � 0,03 kg dust/ADt .
status: valid
status modified: 2026-05-06
accepted date: 2026-05-06
in scheme: BATAEL values as defined into the EC BAT-Tool

Production of pulp, paper and board - Dust - BAT37-I
type: Concept
notation: PP-Dust-BAT37-I
definition: 6. Other activities: 6.1 Production in industrial installations of: (a) pulp from timber or other fibrous materials; (b) paper or card board; Techniques (a)-(b) (see table) and limit �acid operation� of the scrubbers to the minimum required to ensure their proper functioning; Reducing dust emissions to air. The BAT-AEL emission level is 5 � 20 mg/Nm3 at 5 % O2.
status: valid
status modified: 2026-05-06
accepted date: 2026-05-06
in scheme: BATAEL values as defined into the EC BAT-Tool

Production of pulp, paper and board - N - BAT33-V
type: Concept
notation: PP-N-BAT33-V
definition: 6. Other activities: 6.1 Production in industrial installations of: (a) pulp from timber or other fibrous materials; (b) paper or card board; Reducing total nitrogen to water. The BAT-AEL emission level is 0,15 � 0,3 kg/ADt.
status: valid
status modified: 2026-05-06
accepted date: 2026-05-06
in scheme: BATAEL values as defined into the EC BAT-Tool

Production of pulp, paper and board - N - BAT33-VI
type: Concept
notation: PP-N-BAT33-VI
definition: 6. Other activities: 6.1 Production in industrial installations of: (a) pulp from timber or other fibrous materials; (b) paper or card board; Reducing total nitrogen to water. The BAT-AEL emission level is 0,1 � 0,25 kg/ADt.
status: valid
status modified: 2026-05-06
accepted date: 2026-05-06
in scheme: BATAEL values as defined into the EC BAT-Tool

Production of pulp, paper and board - N - BAT33-XII
type: Concept
notation: PP-N-BAT33-XII
definition: 6. Other activities: 6.1 Production in industrial installations of: (a) pulp from timber or other fibrous materials; (b) paper or card board; Reducing total nitrogen to water. The BAT-AEL emission level is 0,1 � 0,2 kg/ADt.
status: valid
status modified: 2026-05-06
accepted date: 2026-05-06
in scheme: BATAEL values as defined into the EC BAT-Tool

Production of pulp, paper and board - N - BAT40-III
type: Concept
notation: PP-N-BAT40-III
definition: 6. Other activities: 6.1 Production in industrial installations of: (a) pulp from timber or other fibrous materials; (b) paper or card board; Reducing total nitrogen to water. The BAT-AEL emission level is 0,03 � 0,1 kg/t.
status: valid
status modified: 2026-05-06
accepted date: 2026-05-06
in scheme: BATAEL values as defined into the EC BAT-Tool

Production of pulp, paper and board - N - BAT40-VII
type: Concept
notation: PP-N-BAT40-VII
definition: 6. Other activities: 6.1 Production in industrial installations of: (a) pulp from timber or other fibrous materials; (b) paper or card board; Reducing total nitrogen to water. The BAT-AEL emission level is 0,15 � 0,18 kg/ADt.
status: valid
status modified: 2026-05-06
accepted date: 2026-05-06
in scheme: BATAEL values as defined into the EC BAT-Tool

Production of pulp, paper and board - N - BAT50-III
type: Concept
notation: PP-N-BAT50-III
definition: 6. Other activities: 6.1 Production in industrial installations of: (a) pulp from timber or other fibrous materials; (b) paper or card board; Reducing total nitrogen to water. The BAT-AEL emission level is 0,01 � 0,1 kg/t.
status: valid
status modified: 2026-05-06
accepted date: 2026-05-06
in scheme: BATAEL values as defined into the EC BAT-Tool

Production of pulp, paper and board - N - BAT50-IV
type: Concept
notation: PP-N-BAT50-IV
definition: 6. Other activities: 6.1 Production in industrial installations of: (a) pulp from timber or other fibrous materials; (b) paper or card board; Reducing total nitrogen to water. The BAT-AEL emission level is 0,01 � 0,15 kg/t.
status: valid
status modified: 2026-05-06
accepted date: 2026-05-06
in scheme: BATAEL values as defined into the EC BAT-Tool

Production of pulp, paper and board - N - BAT50-IX
type: Concept
notation: PP-N-BAT50-IX
definition: 6. Other activities: 6.1 Production in industrial installations of: (a) pulp from timber or other fibrous materials; (b) paper or card board; Reducing total nitrogen to water. The BAT-AEL emission level is 0,015 � 0,4 kg/t .
status: valid
status modified: 2026-05-06
accepted date: 2026-05-06
in scheme: BATAEL values as defined into the EC BAT-Tool

Production of pulp, paper and board - NH3 - BAT36-III
type: Concept
notation: PP-NH3-BAT36-III
definition: 6. Other activities: 6.1 Production in industrial installations of: (a) pulp from timber or other fibrous materials; (b) paper or card board; Techniques (a)-(c) (see table); Reducing ammonia (NH3) emissions to air. The BAT-AEL emission level is < 5 mg/Nm3 at 5 % O2.
status: valid
status modified: 2026-05-06
accepted date: 2026-05-06
in scheme: BATAEL values as defined into the EC BAT-Tool

Production of pulp, paper and board - NO2 - BAT22-I
type: Concept
notation: PP-NO2-BAT22-I
definition: 6. Other activities: 6.1 Production in industrial installations of: (a) pulp from timber or other fibrous materials; (b) paper or card board; Techniques (a)-(c) (see table); Reducing nitrous oxides (NOx) emissions to air. The BAT-AEL emission level is 120 � 200 mg/Nm3 at 6 % O2.
status: valid
status modified: 2026-05-06
accepted date: 2026-05-06
in scheme: BATAEL values as defined into the EC BAT-Tool

Production of pulp, paper and board - NO2 - BAT22-II
type: Concept
notation: PP-NO2-BAT22-II
definition: 6. Other activities: 6.1 Production in industrial installations of: (a) pulp from timber or other fibrous materials; (b) paper or card board; Techniques (a)-(c) (see table); Reducing nitrous oxides (NOx) emissions to air. The BAT-AEL emission level is 0,8 � 1,4 kg NOx/ADt.
status: valid
status modified: 2026-05-06
accepted date: 2026-05-06
in scheme: BATAEL values as defined into the EC BAT-Tool

Production of pulp, paper and board - NO2 - BAT22-III
type: Concept
notation: PP-NO2-BAT22-III
definition: 6. Other activities: 6.1 Production in industrial installations of: (a) pulp from timber or other fibrous materials; (b) paper or card board; Techniques (a)-(c) (see table); Reducing nitrous oxides (NOx) emissions to air. The BAT-AEL emission level is 1,0 � 1,6 kg NOx/ADt.
status: valid
status modified: 2026-05-06
accepted date: 2026-05-06
in scheme: BATAEL values as defined into the EC BAT-Tool

Production of pulp, paper and board - NO2 - BAT22-IV
type: Concept
notation: PP-NO2-BAT22-IV
definition: 6. Other activities: 6.1 Production in industrial installations of: (a) pulp from timber or other fibrous materials; (b) paper or card board; Techniques (a)-(c) (see table); Reducing nitrous oxides (NOx) emissions to air. The BAT-AEL emission level is 120 � 200 mg/Nm3 at 6 % O2.
status: valid
status modified: 2026-05-06
accepted date: 2026-05-06
in scheme: BATAEL values as defined into the EC BAT-Tool

Production of pulp, paper and board - NO2 - BAT22-V
type: Concept
notation: PP-NO2-BAT22-V
definition: 6. Other activities: 6.1 Production in industrial installations of: (a) pulp from timber or other fibrous materials; (b) paper or card board; Techniques (a)-(c) (see table); Reducing nitrous oxides (NOx) emissions to air. The BAT-AEL emission level is 0,8 � 1,4 kg NOx/ADt.
status: valid
status modified: 2026-05-06
accepted date: 2026-05-06
in scheme: BATAEL values as defined into the EC BAT-Tool

Production of pulp, paper and board - NO2 - BAT22-VI
type: Concept
notation: PP-NO2-BAT22-VI
definition: 6. Other activities: 6.1 Production in industrial installations of: (a) pulp from timber or other fibrous materials; (b) paper or card board; Techniques (a)-(c) (see table); Reducing nitrous oxides (NOx) emissions to air. The BAT-AEL emission level is 1,0 � 1,7 kg NOx/ADt.
status: valid
status modified: 2026-05-06
accepted date: 2026-05-06
in scheme: BATAEL values as defined into the EC BAT-Tool

Production of pulp, paper and board - NO2 - BAT26-I
type: Concept
notation: PP-NO2-BAT26-I
definition: 6. Other activities: 6.1 Production in industrial installations of: (a) pulp from timber or other fibrous materials; (b) paper or card board; Techniques (a)-(d) (see table); Reducing nitrogen oxides (NOx) emissions to air. The BAT-AEL emission level is 100 � 200 mg/Nm3 at 6 % O2 .
status: valid
status modified: 2026-05-06
accepted date: 2026-05-06
in scheme: BATAEL values as defined into the EC BAT-Tool

Production of pulp, paper and board - NO2 - BAT26-II
type: Concept
notation: PP-NO2-BAT26-II
definition: 6. Other activities: 6.1 Production in industrial installations of: (a) pulp from timber or other fibrous materials; (b) paper or card board; Techniques (a)-(d) (see table); Reducing nitrogen oxides (NOx) emissions to air. The BAT-AEL emission level is 0,1 � 0,2 kg NOx/ADt .
status: valid
status modified: 2026-05-06
accepted date: 2026-05-06
in scheme: BATAEL values as defined into the EC BAT-Tool

Production of pulp, paper and board - NO2 - BAT26-III
type: Concept
notation: PP-NO2-BAT26-III
definition: 6. Other activities: 6.1 Production in industrial installations of: (a) pulp from timber or other fibrous materials; (b) paper or card board; Techniques (a)-(d) (see table); Reducing nitrogen oxides (NOx) emissions to air. The BAT-AEL emission level is 100 � 350 mg/Nm3 at 6 % O2 .
status: valid
status modified: 2026-05-06
accepted date: 2026-05-06
in scheme: BATAEL values as defined into the EC BAT-Tool

Production of pulp, paper and board - NO2 - BAT26-IV
type: Concept
notation: PP-NO2-BAT26-IV
definition: 6. Other activities: 6.1 Production in industrial installations of: (a) pulp from timber or other fibrous materials; (b) paper or card board; Techniques (a)-(d) (see table); Reducing nitrogen oxides (NOx) emissions to air. The BAT-AEL emission level is 0,1 � 0,3 kg NOx/ADt .
status: valid
status modified: 2026-05-06
accepted date: 2026-05-06
in scheme: BATAEL values as defined into the EC BAT-Tool

Production of pulp, paper and board - NO2 - BAT29-I
type: Concept
notation: PP-NO2-BAT29-I
definition: 6. Other activities: 6.1 Production in industrial installations of: (a) pulp from timber or other fibrous materials; (b) paper or card board; Techniques (a)-(b) (see table); Reducing nitrogen oxides (NOx) emissions to air. The BAT-AEL emission level is 50 � 400 mg/Nm3 at 9 % O2.
status: valid
status modified: 2026-05-06
accepted date: 2026-05-06
in scheme: BATAEL values as defined into the EC BAT-Tool

Production of pulp, paper and board - NO2 - BAT29-II
type: Concept
notation: PP-NO2-BAT29-II
definition: 6. Other activities: 6.1 Production in industrial installations of: (a) pulp from timber or other fibrous materials; (b) paper or card board; Techniques (a)-(b) (see table); Reducing nitrogen oxides (NOx) emissions to air. The BAT-AEL emission level is 0,01 � 0,1 kg NOx/ADt .
status: valid
status modified: 2026-05-06
accepted date: 2026-05-06
in scheme: BATAEL values as defined into the EC BAT-Tool

Production of pulp, paper and board - NO2 - BAT36-I
type: Concept
notation: PP-NO2-BAT36-I
definition: 6. Other activities: 6.1 Production in industrial installations of: (a) pulp from timber or other fibrous materials; (b) paper or card board; Techniques (a)-(c) (see table); Reducing nitrogen oxides (NOx) emissions to air. The BAT-AEL emission level is 100 � 350 mg/Nm3 at 5 % O2 .
status: valid
status modified: 2026-05-06
accepted date: 2026-05-06
in scheme: BATAEL values as defined into the EC BAT-Tool

Production of pulp, paper and board - NO2 - BAT36-II
type: Concept
notation: PP-NO2-BAT36-II
definition: 6. Other activities: 6.1 Production in industrial installations of: (a) pulp from timber or other fibrous materials; (b) paper or card board; Techniques (a)-(c) (see table); Reducing nitrogen oxides (NOx) emissions to air. The BAT-AEL emission level is 100 � 270 mg/Nm3 at 5 % O2.
status: valid
status modified: 2026-05-06
accepted date: 2026-05-06
in scheme: BATAEL values as defined into the EC BAT-Tool

Production of pulp, paper and board - S - BAT21-V
type: Concept
notation: PP-S-BAT21-V
definition: 6. Other activities: 6.1 Production in industrial installations of: (a) pulp from timber or other fibrous materials; (b) paper or card board; Techniques (a)-(c) (see table); Reducing total reduced sulphur (TRS) emissions to air. The BAT-AEL emission level is 1 � 10 mg/Nm3 at 6 % O2.
status: valid
status modified: 2026-05-06
accepted date: 2026-05-06
in scheme: BATAEL values as defined into the EC BAT-Tool

Production of pulp, paper and board - S - BAT21-VI
type: Concept
notation: PP-S-BAT21-VI
definition: 6. Other activities: 6.1 Production in industrial installations of: (a) pulp from timber or other fibrous materials; (b) paper or card board; Techniques (a)-(c) (see table); Reducing total reduced sulphur (TRS) emissions to air. The BAT-AEL emission level is 1 � 5 mg/Nm3 at 6 % O2.
status: valid
status modified: 2026-05-06
accepted date: 2026-05-06
in scheme: BATAEL values as defined into the EC BAT-Tool

Production of pulp, paper and board - S - BAT21-VII
type: Concept
notation: PP-S-BAT21-VII
definition: 6. Other activities: 6.1 Production in industrial installations of: (a) pulp from timber or other fibrous materials; (b) paper or card board; Techniques (a)-(c) (see table); Reducing gaseous S emissions to air. The BAT-AEL emission level is 0,03 � 0,17 kg S/ADt.
status: valid
status modified: 2026-05-06
accepted date: 2026-05-06
in scheme: BATAEL values as defined into the EC BAT-Tool

Production of pulp, paper and board - S - BAT21-VIII
type: Concept
notation: PP-S-BAT21-VIII
definition: 6. Other activities: 6.1 Production in industrial installations of: (a) pulp from timber or other fibrous materials; (b) paper or card board; Techniques (a)-(c) (see table); Reducing gaseous S emissions to air. The BAT-AEL emission level is 0,03 � 0,13 kg S/ADt.
status: valid
status modified: 2026-05-06
accepted date: 2026-05-06
in scheme: BATAEL values as defined into the EC BAT-Tool

Production of pulp, paper and board - S - BAT24-III
type: Concept
notation: PP-S-BAT24-III
definition: 6. Other activities: 6.1 Production in industrial installations of: (a) pulp from timber or other fibrous materials; (b) paper or card board; Techniques (a)-(d) (see table); Reducing gaseous S emissions to air. The BAT-AEL emission level is 0,005 � 0,07 kg S/ADt.
status: valid
status modified: 2026-05-06
accepted date: 2026-05-06
in scheme: BATAEL values as defined into the EC BAT-Tool

Production of pulp, paper and board - S - BAT24-IV
type: Concept
notation: PP-S-BAT24-IV
definition: 6. Other activities: 6.1 Production in industrial installations of: (a) pulp from timber or other fibrous materials; (b) paper or card board; Techniques (a)-(d) (see table); Reducing gaseous S emissions to air. The BAT-AEL emission level is 0,055 � 0,12 kg S/ADt.
status: valid
status modified: 2026-05-06
accepted date: 2026-05-06
in scheme: BATAEL values as defined into the EC BAT-Tool

Production of pulp, paper and board - S - BAT28-II
type: Concept
notation: PP-S-BAT28-II
definition: 6. Other activities: 6.1 Production in industrial installations of: (a) pulp from timber or other fibrous materials; (b) paper or card board; Use an alkaline SO2 scrubber; Reducing TRS emissions to air. The BAT-AEL emission level is 1 � 5 mg/Nm3 at 9 % O2.
status: valid
status modified: 2026-05-06
accepted date: 2026-05-06
in scheme: BATAEL values as defined into the EC BAT-Tool

Production of pulp, paper and board - S - BAT28-III
type: Concept
notation: PP-S-BAT28-III
definition: 6. Other activities: 6.1 Production in industrial installations of: (a) pulp from timber or other fibrous materials; (b) paper or card board; Use an alkaline SO2 scrubber; Reducing gaseous S emissions to air. The BAT-AEL emission level is 0,002 � 0,05 kg S/ADt.
status: valid
status modified: 2026-05-06
accepted date: 2026-05-06
in scheme: BATAEL values as defined into the EC BAT-Tool

Production of pulp, paper and board - SO2 - BAT21-I
type: Concept
notation: PP-SO2-BAT21-I
definition: 6. Other activities: 6.1 Production in industrial installations of: (a) pulp from timber or other fibrous materials; (b) paper or card board; Techniques (a)-(c) (see table); Reducing sulphur dioxide (SO2) emissions to air. The BAT-AEL emission level is 10 � 70 mg/Nm3 at 6 % O2.
status: valid
status modified: 2026-05-06
accepted date: 2026-05-06
in scheme: BATAEL values as defined into the EC BAT-Tool

Production of pulp, paper and board - SO2 - BAT21-II
type: Concept
notation: PP-SO2-BAT21-II
definition: 6. Other activities: 6.1 Production in industrial installations of: (a) pulp from timber or other fibrous materials; (b) paper or card board; Techniques (a)-(c) (see table); Reducing sulphur dioxide (SO2) emissions to air. The BAT-AEL emission level is 5 � 50 mg/Nm3 at 6 % O2.
status: valid
status modified: 2026-05-06
accepted date: 2026-05-06
in scheme: BATAEL values as defined into the EC BAT-Tool

Production of pulp, paper and board - SO2 - BAT21-III
type: Concept
notation: PP-SO2-BAT21-III
definition: 6. Other activities: 6.1 Production in industrial installations of: (a) pulp from timber or other fibrous materials; (b) paper or card board; Techniques (a)-(c) (see table); Reducing sulphur dioxide (SO2) emissions to air. The BAT-AEL emission level is 10 � 50 mg/Nm3 at 6 % O2.
status: valid
status modified: 2026-05-06
accepted date: 2026-05-06
in scheme: BATAEL values as defined into the EC BAT-Tool

Production of pulp, paper and board - SO2 - BAT21-IV
type: Concept
notation: PP-SO2-BAT21-IV
definition: 6. Other activities: 6.1 Production in industrial installations of: (a) pulp from timber or other fibrous materials; (b) paper or card board; Techniques (a)-(c) (see table); Reducing sulphur dioxide (SO2) emissions to air. The BAT-AEL emission level is 5 � 25 mg/Nm3 at 6 % O2.
status: valid
status modified: 2026-05-06
accepted date: 2026-05-06
in scheme: BATAEL values as defined into the EC BAT-Tool

Production of pulp, paper and board - SO2 - BAT24-I
type: Concept
notation: PP-SO2-BAT24-I
definition: 6. Other activities: 6.1 Production in industrial installations of: (a) pulp from timber or other fibrous materials; (b) paper or card board; Techniques (a)-(d) (see table); Reducing sulphur dioxide (SO2) emissions to air. The BAT-AEL emission level is 5 � 70 mg SO2/Nm3 at 6 % O2.
status: valid
status modified: 2026-05-06
accepted date: 2026-05-06
in scheme: BATAEL values as defined into the EC BAT-Tool

Production of pulp, paper and board - SO2 - BAT24-II
type: Concept
notation: PP-SO2-BAT24-II
definition: 6. Other activities: 6.1 Production in industrial installations of: (a) pulp from timber or other fibrous materials; (b) paper or card board; Techniques (a)-(d) (see table); Reducing sulphur dioxide (SO2) emissions to air. The BAT-AEL emission level is 55 � 120 mg SO2/Nm3 at 6 % O2.
status: valid
status modified: 2026-05-06
accepted date: 2026-05-06
in scheme: BATAEL values as defined into the EC BAT-Tool

Production of pulp, paper and board - SO2 - BAT28-I
type: Concept
notation: PP-SO2-BAT28-I
definition: 6. Other activities: 6.1 Production in industrial installations of: (a) pulp from timber or other fibrous materials; (b) paper or card board; Use an alkaline SO2 scrubber; Reducing sulphur dioxide (SO2) emissions to air. The BAT-AEL emission level is 20 � 120 mg/Nm3 at 9 % O2.
status: valid
status modified: 2026-05-06
accepted date: 2026-05-06
in scheme: BATAEL values as defined into the EC BAT-Tool

Production of pulp, paper and board - SO2 - BAT37-II
type: Concept
notation: PP-SO2-BAT37-II
definition: 6. Other activities: 6.1 Production in industrial installations of: (a) pulp from timber or other fibrous materials; (b) paper or card board; Techniques (a)-(b) (see table) and limit �acid operation� of the scrubbers to the minimum required to ensure their proper functioning; Reducing sulphur dioxide (SO2) emissions to air. The BAT-AEL emission level is 100 � 300 mg/Nm3 at 5 % O2.
status: valid
status modified: 2026-05-06
accepted date: 2026-05-06
in scheme: BATAEL values as defined into the EC BAT-Tool

Production of pulp, paper and board - SO2 - BAT37-III
type: Concept
notation: PP-SO2-BAT37-III
definition: 6. Other activities: 6.1 Production in industrial installations of: (a) pulp from timber or other fibrous materials; (b) paper or card board; Techniques (a)-(b) (see table) and limit �acid operation� of the scrubbers to the minimum required to ensure their proper functioning; Reducing sulphur dioxide (SO2) emissions to air. The BAT-AEL emission level is 50 � 250 mg/Nm3 at 5 % O2.
status: valid
status modified: 2026-05-06
accepted date: 2026-05-06
in scheme: BATAEL values as defined into the EC BAT-Tool

Production of pulp, paper and board - TN - BAT19-III
type: Concept
notation: PP-TN-BAT19-III
definition: 6. Other activities: 6.1 Production in industrial installations of: (a) pulp from timber or other fibrous materials; (b) paper or card board; Reducing total nitrogen to water. The BAT-AEL emission level is 0,05 - 0,25 kg/ADt.
status: valid
status modified: 2026-05-06
accepted date: 2026-05-06
in scheme: BATAEL values as defined into the EC BAT-Tool

Production of pulp, paper and board - TN - BAT19-IX
type: Concept
notation: PP-TN-BAT19-IX
definition: 6. Other activities: 6.1 Production in industrial installations of: (a) pulp from timber or other fibrous materials; (b) paper or card board; Reducing total nitrogen to water. The BAT-AEL emission level is 0,1 - 0,2 kg/ADt.
status: valid
status modified: 2026-05-06
accepted date: 2026-05-06
in scheme: BATAEL values as defined into the EC BAT-Tool

Production of pulp, paper and board - TN - BAT45-III
type: Concept
notation: PP-TN-BAT45-III
definition: 6. Other activities: 6.1 Production in industrial installations of: (a) pulp from timber or other fibrous materials; (b) paper or card board; Reducing total nitrogen to water. The BAT-AEL emission level is 0,008 - 0,09 kg/t.
status: valid
status modified: 2026-05-06
accepted date: 2026-05-06
in scheme: BATAEL values as defined into the EC BAT-Tool

Production of pulp, paper and board - TN - BAT45-X
type: Concept
notation: PP-TN-BAT45-X
definition: 6. Other activities: 6.1 Production in industrial installations of: (a) pulp from timber or other fibrous materials; (b) paper or card board; Reducing total nitrogen to water. The BAT-AEL emission level is 0,01 - 0,1 kg/t.
status: valid
status modified: 2026-05-06
accepted date: 2026-05-06
in scheme: BATAEL values as defined into the EC BAT-Tool

Production of pulp, paper and board - TN - BAT45-XI
type: Concept
notation: PP-TN-BAT45-XI
definition: 6. Other activities: 6.1 Production in industrial installations of: (a) pulp from timber or other fibrous materials; (b) paper or card board; Reducing total nitrogen to water. The BAT-AEL emission level is 0,01 - 0,15 kg/t.
status: valid
status modified: 2026-05-06
accepted date: 2026-05-06
in scheme: BATAEL values as defined into the EC BAT-Tool

Production of pulp, paper and board - TP - BAT19-IV
type: Concept
notation: PP-TP-BAT19-IV
definition: 6. Other activities: 6.1 Production in industrial installations of: (a) pulp from timber or other fibrous materials; (b) paper or card board; Reducing total phosphorus to water. The BAT-AEL emission level is 0,01 - 0,03 kg/ADt.
status: valid
status modified: 2026-05-06
accepted date: 2026-05-06
in scheme: BATAEL values as defined into the EC BAT-Tool

Production of pulp, paper and board - TP - BAT19-V
type: Concept
notation: PP-TP-BAT19-V
definition: 6. Other activities: 6.1 Production in industrial installations of: (a) pulp from timber or other fibrous materials; (b) paper or card board; Reducing total phosphorus to water. The BAT-AEL emission level is 0,02 - 0,11 kg/ADt.
status: valid
status modified: 2026-05-06
accepted date: 2026-05-06
in scheme: BATAEL values as defined into the EC BAT-Tool

Production of pulp, paper and board - TP - BAT19-X
type: Concept
notation: PP-TP-BAT19-X
definition: 6. Other activities: 6.1 Production in industrial installations of: (a) pulp from timber or other fibrous materials; (b) paper or card board; Reducing total phosphorus to water. The BAT-AEL emission level is 0,01 - 0,02 kg/ADt.
status: valid
status modified: 2026-05-06
accepted date: 2026-05-06
in scheme: BATAEL values as defined into the EC BAT-Tool

Production of pulp, paper and board - TP - BAT33-VII
type: Concept
notation: PP-TP-BAT33-VII
definition: 6. Other activities: 6.1 Production in industrial installations of: (a) pulp from timber or other fibrous materials; (b) paper or card board; Reducing total phosphorous to water. The BAT-AEL emission level is 0,01 � 0,05 kg/ADt.
status: valid
status modified: 2026-05-06
accepted date: 2026-05-06
in scheme: BATAEL values as defined into the EC BAT-Tool

Production of pulp, paper and board - TP - BAT33-VIII
type: Concept
notation: PP-TP-BAT33-VIII
definition: 6. Other activities: 6.1 Production in industrial installations of: (a) pulp from timber or other fibrous materials; (b) paper or card board; Reducing total phosphorous to water. The BAT-AEL emission level is 0,01 � 0,07 kg/ADt.
status: valid
status modified: 2026-05-06
accepted date: 2026-05-06
in scheme: BATAEL values as defined into the EC BAT-Tool

Production of pulp, paper and board - TP - BAT33-XIII
type: Concept
notation: PP-TP-BAT33-XIII
definition: 6. Other activities: 6.1 Production in industrial installations of: (a) pulp from timber or other fibrous materials; (b) paper or card board; Reducing total phosphorus to water. The BAT-AEL emission level is 0,01 � 0,02 kg/ADt.
status: valid
status modified: 2026-05-06
accepted date: 2026-05-06
in scheme: BATAEL values as defined into the EC BAT-Tool

Production of pulp, paper and board - TP - BAT40-IV
type: Concept
notation: PP-TP-BAT40-IV
definition: 6. Other activities: 6.1 Production in industrial installations of: (a) pulp from timber or other fibrous materials; (b) paper or card board; Reducing total phosphorus to water. The BAT-AEL emission level is 0,001 � 0,01 kg/t.
status: valid
status modified: 2026-05-06
accepted date: 2026-05-06
in scheme: BATAEL values as defined into the EC BAT-Tool

Production of pulp, paper and board - TP - BAT40-VIII
type: Concept
notation: PP-TP-BAT40-VIII
definition: 6. Other activities: 6.1 Production in industrial installations of: (a) pulp from timber or other fibrous materials; (b) paper or card board; Reducing total phosphorus to water. The BAT-AEL emission level is 0,001 � 0,01 kg/ADt.
status: valid
status modified: 2026-05-06
accepted date: 2026-05-06
in scheme: BATAEL values as defined into the EC BAT-Tool

Production of pulp, paper and board - TP - BAT45-IV
type: Concept
notation: PP-TP-BAT45-IV
definition: 6. Other activities: 6.1 Production in industrial installations of: (a) pulp from timber or other fibrous materials; (b) paper or card board; Reducing total phosphorus to water. The BAT-AEL emission level is 0,001 - 0,005 kg/t.
status: valid
status modified: 2026-05-06
accepted date: 2026-05-06
in scheme: BATAEL values as defined into the EC BAT-Tool

Production of pulp, paper and board - TP - BAT45-XII
type: Concept
notation: PP-TP-BAT45-XII
definition: 6. Other activities: 6.1 Production in industrial installations of: (a) pulp from timber or other fibrous materials; (b) paper or card board; Reducing total phosphorus to water. The BAT-AEL emission level is 0,002 - 0,01 kg/t.
status: valid
status modified: 2026-05-06
accepted date: 2026-05-06
in scheme: BATAEL values as defined into the EC BAT-Tool

Production of pulp, paper and board - TP - BAT45-XIII
type: Concept
notation: PP-TP-BAT45-XIII
definition: 6. Other activities: 6.1 Production in industrial installations of: (a) pulp from timber or other fibrous materials; (b) paper or card board; Reducing total phosphorus to water. The BAT-AEL emission level is 0,002 - 0,015 kg/t.
status: valid
status modified: 2026-05-06
accepted date: 2026-05-06
in scheme: BATAEL values as defined into the EC BAT-Tool

Production of pulp, paper and board - TP - BAT50-V
type: Concept
notation: PP-TP-BAT50-V
definition: 6. Other activities: 6.1 Production in industrial installations of: (a) pulp from timber or other fibrous materials; (b) paper or card board; Reducing total phosphorus to water. The BAT-AEL emission level is 0,003 � 0,012 kg/t.
status: valid
status modified: 2026-05-06
accepted date: 2026-05-06
in scheme: BATAEL values as defined into the EC BAT-Tool

Production of pulp, paper and board - TP - BAT50-X
type: Concept
notation: PP-TP-BAT50-X
definition: 6. Other activities: 6.1 Production in industrial installations of: (a) pulp from timber or other fibrous materials; (b) paper or card board; Reducing total phosphorus to water. The BAT-AEL emission level is 0,002 � 0,04 kg/t .
status: valid
status modified: 2026-05-06
accepted date: 2026-05-06
in scheme: BATAEL values as defined into the EC BAT-Tool

Production of pulp, paper and board - TRS - BAT20
type: Concept
notation: PP-TRS-BAT20
definition: 6. Other activities: 6.1 Production in industrial installations of: (a) pulp from timber or other fibrous materials; (b) paper or card board; Techniques (a)-(c) (see table incl. footnotes); Reducing total reduced sulphur (TRS) emissions to air. The BAT-AEL emission level is 0,05 - 0,2 kg/Adt.
status: valid
status modified: 2026-05-06
accepted date: 2026-05-06
in scheme: BATAEL values as defined into the EC BAT-Tool

Production of pulp, paper and board - TRS - BAT25-I
type: Concept
notation: PP-TRS-BAT25-I
definition: 6. Other activities: 6.1 Production in industrial installations of: (a) pulp from timber or other fibrous materials; (b) paper or card board; Techniques (a)-(c) (see table incl. footnotes); Reducing total reduced sulphur (TRS) emissions to air. The BAT-AEL emission level is < 1 - 10 mg S/Nm3.
status: valid
status modified: 2026-05-06
accepted date: 2026-05-06
in scheme: BATAEL values as defined into the EC BAT-Tool

Production of pulp, paper and board - TRS - BAT25-II
type: Concept
notation: PP-TRS-BAT25-II
definition: 6. Other activities: 6.1 Production in industrial installations of: (a) pulp from timber or other fibrous materials; (b) paper or card board; Techniques (a)-(c) (see table incl. footnotes); Reducing total reduced sulphur (TRS) emissions to air. The BAT-AEL emission level is < 1 - 40 mg S/Nm3.
status: valid
status modified: 2026-05-06
accepted date: 2026-05-06
in scheme: BATAEL values as defined into the EC BAT-Tool

Production of pulp, paper and board - TSS - BAT19-II
type: Concept
notation: PP-TSS-BAT19-II
definition: 6. Other activities: 6.1 Production in industrial installations of: (a) pulp from timber or other fibrous materials; (b) paper or card board; Reducing total suspended solids (TSS) to water. The BAT-AEL emission level is 0,3 - 1,5 kg/ADt.
status: valid
status modified: 2026-05-06
accepted date: 2026-05-06
in scheme: BATAEL values as defined into the EC BAT-Tool

Production of pulp, paper and board - TSS - BAT19-VIII
type: Concept
notation: PP-TSS-BAT19-VIII
definition: 6. Other activities: 6.1 Production in industrial installations of: (a) pulp from timber or other fibrous materials; (b) paper or card board; Reducing total suspended solids (TSS) to water. The BAT-AEL emission level is 0,3 - 1 kg/ADt.
status: valid
status modified: 2026-05-06
accepted date: 2026-05-06
in scheme: BATAEL values as defined into the EC BAT-Tool

Production of pulp, paper and board - TSS - BAT33-III
type: Concept
notation: PP-TSS-BAT33-III
definition: 6. Other activities: 6.1 Production in industrial installations of: (a) pulp from timber or other fibrous materials; (b) paper or card board; Reducing total suspended solids (TSS) to water. The BAT-AEL emission level is 0,4 � 1,5 kg/ADt.
status: valid
status modified: 2026-05-06
accepted date: 2026-05-06
in scheme: BATAEL values as defined into the EC BAT-Tool

Production of pulp, paper and board - TSS - BAT33-IV
type: Concept
notation: PP-TSS-BAT33-IV
definition: 6. Other activities: 6.1 Production in industrial installations of: (a) pulp from timber or other fibrous materials; (b) paper or card board; Reducing total suspended solids (TSS) to water. The BAT-AEL emission level is 0,5 � 2,0 kg/ADt.
status: valid
status modified: 2026-05-06
accepted date: 2026-05-06
in scheme: BATAEL values as defined into the EC BAT-Tool

Production of pulp, paper and board - TSS - BAT33-XI
type: Concept
notation: PP-TSS-BAT33-XI
definition: 6. Other activities: 6.1 Production in industrial installations of: (a) pulp from timber or other fibrous materials; (b) paper or card board; Reducing total suspended solids (TSS) to water. The BAT-AEL emission level is 0,5 � 1,3 kg/ADt.
status: valid
status modified: 2026-05-06
accepted date: 2026-05-06
in scheme: BATAEL values as defined into the EC BAT-Tool

Production of pulp, paper and board - TSS - BAT40-II
type: Concept
notation: PP-TSS-BAT40-II
definition: 6. Other activities: 6.1 Production in industrial installations of: (a) pulp from timber or other fibrous materials; (b) paper or card board; Reducing total suspended solids (TSS) to water. The BAT-AEL emission level is 0,06 � 0,45 kg/t.
status: valid
status modified: 2026-05-06
accepted date: 2026-05-06
in scheme: BATAEL values as defined into the EC BAT-Tool

Production of pulp, paper and board - TSS - BAT40-VI
type: Concept
notation: PP-TSS-BAT40-VI
definition: 6. Other activities: 6.1 Production in industrial installations of: (a) pulp from timber or other fibrous materials; (b) paper or card board; Reducing total suspended solids (TSS) to water. The BAT-AEL emission level is 0,5 � 0,9 kg/ADt.
status: valid
status modified: 2026-05-06
accepted date: 2026-05-06
in scheme: BATAEL values as defined into the EC BAT-Tool

Production of pulp, paper and board - TSS - BAT45-II
type: Concept
notation: PP-TSS-BAT45-II
definition: 6. Other activities: 6.1 Production in industrial installations of: (a) pulp from timber or other fibrous materials; (b) paper or card board; Reducing total suspended solids (TSS) to water. The BAT-AEL emission level is 0,02 - 0,2 kg/t.
status: valid
status modified: 2026-05-06
accepted date: 2026-05-06
in scheme: BATAEL values as defined into the EC BAT-Tool

Production of pulp, paper and board - TSS - BAT45-IX
type: Concept
notation: PP-TSS-BAT45-IX
definition: 6. Other activities: 6.1 Production in industrial installations of: (a) pulp from timber or other fibrous materials; (b) paper or card board; Reducing total suspended solids (TSS) to water. The BAT-AEL emission level is 0,1 - 0,4 kg/t.
status: valid
status modified: 2026-05-06
accepted date: 2026-05-06
in scheme: BATAEL values as defined into the EC BAT-Tool

Production of pulp, paper and board - TSS - BAT45-VIII
type: Concept
notation: PP-TSS-BAT45-VIII
definition: 6. Other activities: 6.1 Production in industrial installations of: (a) pulp from timber or other fibrous materials; (b) paper or card board; Reducing total suspended solids (TSS) to water. The BAT-AEL emission level is 0,08 - 0,3 kg/t.
status: valid
status modified: 2026-05-06
accepted date: 2026-05-06
in scheme: BATAEL values as defined into the EC BAT-Tool

Production of pulp, paper and board - TSS - BAT50-II
type: Concept
notation: PP-TSS-BAT50-II
definition: 6. Other activities: 6.1 Production in industrial installations of: (a) pulp from timber or other fibrous materials; (b) paper or card board; Reducing total suspended solids (TSS) to water. The BAT-AEL emission level is 0,02 � 0,35 kg/t.
status: valid
status modified: 2026-05-06
accepted date: 2026-05-06
in scheme: BATAEL values as defined into the EC BAT-Tool

Production of pulp, paper and board - TSS - BAT50-VIII
type: Concept
notation: PP-TSS-BAT50-VIII
definition: 6. Other activities: 6.1 Production in industrial installations of: (a) pulp from timber or other fibrous materials; (b) paper or card board; Reducing total suspended solids (TSS) to water. The BAT-AEL emission level is 0,10 � 1 kg/t .
status: valid
status modified: 2026-05-06
accepted date: 2026-05-06
in scheme: BATAEL values as defined into the EC BAT-Tool

Refining of mineral oil and gas - Benzene - BAT12-IX
type: Concept
notation: REF-Benzene-BAT12-IX
definition: Energy industries : 1.2 Refining of mineral oil and gas Reducing benzene to water. The BAT-AEL emission level is 0,001 - 0,05 mg/l.
status: valid
status modified: 2026-05-06
accepted date: 2026-05-06
in scheme: BATAEL values as defined into the EC BAT-Tool

Refining of mineral oil and gas - Benzene - BAT52-II
type: Concept
notation: REF-Benzene-BAT52-II
definition: Energy industries : 1.2 Refining of mineral oil and gas; Techniques (i) - (v) (see table); Reducing benzene emissions to air. The BAT-AEL emission level is < 1 mg/Nm3.
status: valid
status modified: 2026-05-06
accepted date: 2026-05-06
in scheme: BATAEL values as defined into the EC BAT-Tool

Refining of mineral oil and gas - CO - BAT27
type: Concept
notation: REF-CO-BAT27
definition: Energy industries : 1.2 Refining of mineral oil and gas; Partial combustion mode ; Reducing carbon monoxide (CO) emissions to air. The BAT-AEL emission level is ? 100 mg/Nm3.
status: valid
status modified: 2026-05-06
accepted date: 2026-05-06
in scheme: BATAEL values as defined into the EC BAT-Tool

Refining of mineral oil and gas - CO - BAT37
type: Concept
notation: REF-CO-BAT37
definition: Energy industries : 1.2 Refining of mineral oil and gas; Combustion operation control; Reducing carbon monoxide (CO) emissions to air. The BAT-AEL emission level is ? 100 mg/Nm3.
status: valid
status modified: 2026-05-06
accepted date: 2026-05-06
in scheme: BATAEL values as defined into the EC BAT-Tool

Refining of mineral oil and gas - COD - BAT12-III
type: Concept
notation: REF-COD-BAT12-III
definition: Energy industries : 1.2 Refining of mineral oil and gas Reducing chemical oxygen demand (COD) to water. The BAT-AEL emission level is 30 - 125 mg/l.
status: valid
status modified: 2026-05-06
accepted date: 2026-05-06
in scheme: BATAEL values as defined into the EC BAT-Tool

Refining of mineral oil and gas - Cd - BAT12-VI
type: Concept
notation: REF-Cd-BAT12-VI
definition: Energy industries : 1.2 Refining of mineral oil and gas Reducing cadmium to water. The BAT-AEL emission level is 0,002 - 0,008 mg/l.
status: valid
status modified: 2026-05-06
accepted date: 2026-05-06
in scheme: BATAEL values as defined into the EC BAT-Tool

Refining of mineral oil and gas - Dust - BAT25-I
type: Concept
notation: REF-Dust-BAT25-I
definition: Energy industries : 1.2 Refining of mineral oil and gas; Techniques I - II (see table); for New unit; Reducing dust emissions to air. The BAT-AEL emission level is 10 - 25 mg/Nm3.
status: valid
status modified: 2026-05-06
accepted date: 2026-05-06
in scheme: BATAEL values as defined into the EC BAT-Tool

Refining of mineral oil and gas - Dust - BAT25-II
type: Concept
notation: REF-Dust-BAT25-II
definition: Energy industries : 1.2 Refining of mineral oil and gas; Techniques I - II (see table); for Existing unit; Reducing dust emissions to air. The BAT-AEL emission level is 10 - 50 mg/Nm3.
status: valid
status modified: 2026-05-06
accepted date: 2026-05-06
in scheme: BATAEL values as defined into the EC BAT-Tool

Refining of mineral oil and gas - Dust - BAT32
type: Concept
notation: REF-Dust-BAT32
definition: Energy industries : 1.2 Refining of mineral oil and gas; Techniques (i) - (ii) (see table); Reducing dust emissions to air. The BAT-AEL emission level is 10 - 50 mg/Nm3.
status: valid
status modified: 2026-05-06
accepted date: 2026-05-06
in scheme: BATAEL values as defined into the EC BAT-Tool

Refining of mineral oil and gas - Dust - BAT35-I
type: Concept
notation: REF-Dust-BAT35-I
definition: Energy industries : 1.2 Refining of mineral oil and gas; Multi-fuel firing for Existing unit; Reducing dust emissions to air. The BAT-AEL emission level is 5 - 50 mg/Nm3.
status: valid
status modified: 2026-05-06
accepted date: 2026-05-06
in scheme: BATAEL values as defined into the EC BAT-Tool

Refining of mineral oil and gas - Dust - BAT35-II
type: Concept
notation: REF-Dust-BAT35-II
definition: Energy industries : 1.2 Refining of mineral oil and gas; Multi-fuel firing for New unit < 50 MW; Reducing dust emissions to air. The BAT-AEL emission level is 5 - 25 mg/Nm3.
status: valid
status modified: 2026-05-06
accepted date: 2026-05-06
in scheme: BATAEL values as defined into the EC BAT-Tool

Refining of mineral oil and gas - HOI - BAT12-I
type: Concept
notation: REF-HOI-BAT12-I
definition: Energy industries : 1.2 Refining of mineral oil and gas Reducing hydrocarbon oil index (HOI) to water. The BAT-AEL emission level is 0,1 - 2,5 mg/l.
status: valid
status modified: 2026-05-06
accepted date: 2026-05-06
in scheme: BATAEL values as defined into the EC BAT-Tool

Refining of mineral oil and gas - Hg - BAT12-VIII
type: Concept
notation: REF-Hg-BAT12-VIII
definition: Energy industries : 1.2 Refining of mineral oil and gas Reducing mercury to water. The BAT-AEL emission level is 0,0001 - 0,001 mg/l.
status: valid
status modified: 2026-05-06
accepted date: 2026-05-06
in scheme: BATAEL values as defined into the EC BAT-Tool

Refining of mineral oil and gas - N - BAT12-IV
type: Concept
notation: REF-N-BAT12-IV
definition: Energy industries : 1.2 Refining of mineral oil and gas Reducing total nitrogen to water. The BAT-AEL emission level is 1 - 25 mg/l.
status: valid
status modified: 2026-05-06
accepted date: 2026-05-06
in scheme: BATAEL values as defined into the EC BAT-Tool

Refining of mineral oil and gas - NH3 - BAT8
type: Concept
notation: REF-NH3-BAT8
definition: 1, Energy industries : 1.2 Refining of mineral oil and gas; SCR/SNCR; Reducing ammonia (NH3) emissions to air. The BAT-AEL emission level is < 5 - 15 mg/Nm3.
status: valid
status modified: 2026-05-06
accepted date: 2026-05-06
in scheme: BATAEL values as defined into the EC BAT-Tool

Refining of mineral oil and gas - NMVOC - BAT52-I
type: Concept
notation: REF-NMVOC-BAT52-I
definition: Energy industries : 1.2 Refining of mineral oil and gas; Techniques (i) - (v) (see table); Reducing NMVOC emissions to air. The BAT-AEL emission level is 0,15 - 10 g/Nm3.
status: valid
status modified: 2026-05-06
accepted date: 2026-05-06
in scheme: BATAEL values as defined into the EC BAT-Tool

Refining of mineral oil and gas - NO2 - BAT24-I
type: Concept
notation: REF-NO2-BAT24-I
definition: Energy industries : 1.2 Refining of mineral oil and gas; All combustion modes for New unit; Reducing nitrogen oxides (NOx) emissions to air. The BAT-AEL emission level is < 30 - 100 mg/Nm3.
status: valid
status modified: 2026-05-06
accepted date: 2026-05-06
in scheme: BATAEL values as defined into the EC BAT-Tool

Refining of mineral oil and gas - NO2 - BAT24-II
type: Concept
notation: REF-NO2-BAT24-II
definition: Energy industries : 1.2 Refining of mineral oil and gas; Full combustion mode for Existing unit; Reducing nitrogen oxides (NOx) emissions to air. The BAT-AEL emission level is < 100 - 300 mg/Nm3.
status: valid
status modified: 2026-05-06
accepted date: 2026-05-06
in scheme: BATAEL values as defined into the EC BAT-Tool

Refining of mineral oil and gas - NO2 - BAT24-III
type: Concept
notation: REF-NO2-BAT24-III
definition: Energy industries : 1.2 Refining of mineral oil and gas; Partial combustion mode for Existing unit; Reducing nitrogen oxides (NOx) emissions to air. The BAT-AEL emission level is 100 - 400 mg/Nm3.
status: valid
status modified: 2026-05-06
accepted date: 2026-05-06
in scheme: BATAEL values as defined into the EC BAT-Tool

Refining of mineral oil and gas - NO2 - BAT34-I
type: Concept
notation: REF-NO2-BAT34-I
definition: Energy industries : 1.2 Refining of mineral oil and gas; Combustion unit for Existing turbine; Reducing nitrogen oxides (NOx) emissions to air. The BAT-AEL emission level is 40 - 120 mg/Nm3.
status: valid
status modified: 2026-05-06
accepted date: 2026-05-06
in scheme: BATAEL values as defined into the EC BAT-Tool

Refining of mineral oil and gas - NO2 - BAT34-II
type: Concept
notation: REF-NO2-BAT34-II
definition: Energy industries : 1.2 Refining of mineral oil and gas; Gas turbine (including combined cycle gas turbine � CCGT) and integrated gasification combined cycle turbine (IGCC)) for New turbine; Reducing nitrogen oxides (NOx) emissions to air. The BAT-AEL emission level is 20 - 50 mg/Nm3.
status: valid
status modified: 2026-05-06
accepted date: 2026-05-06
in scheme: BATAEL values as defined into the EC BAT-Tool

Refining of mineral oil and gas - NO2 - BAT34-III
type: Concept
notation: REF-NO2-BAT34-III
definition: Energy industries : 1.2 Refining of mineral oil and gas; Gas firing with exception of gas turbines for Existing unit; Reducing nitrogen oxides (NOx) emissions to air. The BAT-AEL emission level is 30 - 150 mg/Nm3.
status: valid
status modified: 2026-05-06
accepted date: 2026-05-06
in scheme: BATAEL values as defined into the EC BAT-Tool

Refining of mineral oil and gas - NO2 - BAT34-IV
type: Concept
notation: REF-NO2-BAT34-IV
definition: Energy industries : 1.2 Refining of mineral oil and gas; Gas firing with exception of gas turbines for New unit; Reducing nitrogen oxides (NOx) emissions to air. The BAT-AEL emission level is 30 - 100 mg/Nm3.
status: valid
status modified: 2026-05-06
accepted date: 2026-05-06
in scheme: BATAEL values as defined into the EC BAT-Tool

Refining of mineral oil and gas - NO2 - BAT34-V
type: Concept
notation: REF-NO2-BAT34-V
definition: Energy industries : 1.2 Refining of mineral oil and gas; Multi-fuel fired combustion unit for Existing unit - should cover both new and existing ones; Reducing nitrogen oxides (NOx) emissions to air. The BAT-AEL emission level is 30 - 300 mg/Nm3.
status: valid
status modified: 2026-05-06
accepted date: 2026-05-06
in scheme: BATAEL values as defined into the EC BAT-Tool

Refining of mineral oil and gas - Ni - BAT12-VII
type: Concept
notation: REF-Ni-BAT12-VII
definition: Energy industries : 1.2 Refining of mineral oil and gas Reducing nickel to water. The BAT-AEL emission level is 0,005 - 0,1 mg/l.
status: valid
status modified: 2026-05-06
accepted date: 2026-05-06
in scheme: BATAEL values as defined into the EC BAT-Tool

Refining of mineral oil and gas - Pb - BAT12-V
type: Concept
notation: REF-Pb-BAT12-V
definition: Energy industries : 1.2 Refining of mineral oil and gas Reducing lead to water. The BAT-AEL emission level is 0,005 - 0,03 mg/l.
status: valid
status modified: 2026-05-06
accepted date: 2026-05-06
in scheme: BATAEL values as defined into the EC BAT-Tool

Refining of mineral oil and gas - SO2 - BAT26-I
type: Concept
notation: REF-SO2-BAT26-I
definition: Energy industries : 1.2 Refining of mineral oil and gas; Techniques I - II (see table); for New units; Reducing sulphur dioxide (SO2) emissions to air. The BAT-AEL emission level is ? 300 - mg/Nm3.
status: valid
status modified: 2026-05-06
accepted date: 2026-05-06
in scheme: BATAEL values as defined into the EC BAT-Tool

Refining of mineral oil and gas - SO2 - BAT26-II
type: Concept
notation: REF-SO2-BAT26-II
definition: Energy industries : 1.2 Refining of mineral oil and gas; Full combustion mode for Existing units; Reducing sulphur dioxide (SO2) emissions to air. The BAT-AEL emission level is < 100 - 800 mg/Nm3.
status: valid
status modified: 2026-05-06
accepted date: 2026-05-06
in scheme: BATAEL values as defined into the EC BAT-Tool

Refining of mineral oil and gas - SO2 - BAT26-III
type: Concept
notation: REF-SO2-BAT26-III
definition: Energy industries : 1.2 Refining of mineral oil and gas; Partial combustion mode for Existing units; Reducing sulphur dioxide (SO2) emissions to air. The BAT-AEL emission level is < 100 - 1200 mg/Nm3.
status: valid
status modified: 2026-05-06
accepted date: 2026-05-06
in scheme: BATAEL values as defined into the EC BAT-Tool

Refining of mineral oil and gas - SO2 - BAT36-I
type: Concept
notation: REF-SO2-BAT36-I
definition: Energy industries : 1.2 Refining of mineral oil and gas; RFG; Reducing sulphur dioxide (SO2) emissions to air. The BAT-AEL emission level is 5 - 35 mg/Nm3.
status: valid
status modified: 2026-05-06
accepted date: 2026-05-06
in scheme: BATAEL values as defined into the EC BAT-Tool

Refining of mineral oil and gas - SO2 - BAT36-II
type: Concept
notation: REF-SO2-BAT36-II
definition: Energy industries : 1.2 Refining of mineral oil and gas; Multi-fuel fired combustion units, with the exception of gas turbines and stationary gas engines for Existing units; Reducing sulphur dioxide (SO2) emissions to air. The BAT-AEL emission level is 35 - 600 mg/Nm3.
status: valid
status modified: 2026-05-06
accepted date: 2026-05-06
in scheme: BATAEL values as defined into the EC BAT-Tool

Refining of mineral oil and gas - TSS - BAT12-II
type: Concept
notation: REF-TSS-BAT12-II
definition: Energy industries : 1.2 Refining of mineral oil and gas Reducing total suspended solids (TSS) to water. The BAT-AEL emission level is 5 - 25 mg/l.
status: valid
status modified: 2026-05-06
accepted date: 2026-05-06
in scheme: BATAEL values as defined into the EC BAT-Tool

Surface Treatment using organic solvents including preservation of wood and wood products with chemicals - BAT 21
type: Concept
notation: STS-AOX-BAT21-I
definition: 6, Other activities: 6.7 Surface treatment of substances, objects or products using organic solvents, in particular for dressing, printing, coating, degreasing, waterproofing, sizing, painting, cleaning or impregnating, with an organic solvent consumption capacity of more than 150 kg per hour or more than 200 tonnes per year. 6.10: Preservation of wood and wood products with chemicals with a production capacity exceeding 75 m3 per day other than exclusively treating against sapstain. 6.11: Independently operated treatment of waste water not covered by Directive 91/271/EEC provided that the main pollutant load originates from activities specified in point 6.7 or 6.10 of Annex I to Directive 2010/75/EU; Reducing adsorbable organically bound halogens to water. The BAT-AEL emission level is 0.1�0.4 mg/l.
status: valid
status modified: 2026-05-06
accepted date: 2026-05-06
in scheme: BATAEL values as defined into the EC BAT-Tool

Surface Treatment using organic solvents including preservation of wood and wood products with chemicals - BAT 21
type: Concept
notation: STS-AOX-BAT21-II
definition: 6, Other activities: 6.7 Surface treatment of substances, objects or products using organic solvents, in particular for dressing, printing, coating, degreasing, waterproofing, sizing, painting, cleaning or impregnating, with an organic solvent consumption capacity of more than 150 kg per hour or more than 200 tonnes per year. 6.10: Preservation of wood and wood products with chemicals with a production capacity exceeding 75 m3 per day other than exclusively treating against sapstain. 6.11: Independently operated treatment of waste water not covered by Directive 91/271/EEC provided that the main pollutant load originates from activities specified in point 6.7 or 6.10 of Annex I to Directive 2010/75/EU; Reducing adsorbable organically bound halogens to water. The BAT-AEL emission level is 0.1�0.4 mg/l.
status: valid
status modified: 2026-05-06
accepted date: 2026-05-06
in scheme: BATAEL values as defined into the EC BAT-Tool

Surface Treatment using organic solvents including preservation of wood and wood products with chemicals - BAT 21
type: Concept
notation: STS-COD-BAT21-I
definition: 6, Other activities: 6.7 Surface treatment of substances, objects or products using organic solvents, in particular for dressing, printing, coating, degreasing, waterproofing, sizing, painting, cleaning or impregnating, with an organic solvent consumption capacity of more than 150 kg per hour or more than 200 tonnes per year. 6.10: Preservation of wood and wood products with chemicals with a production capacity exceeding 75 m3 per day other than exclusively treating against sapstain. 6.11: Independently operated treatment of waste water not covered by Directive 91/271/EEC provided that the main pollutant load originates from activities specified in point 6.7 or 6.10 of Annex I to Directive 2010/75/EU; Reducing chemical oxygen demand (COD) to water. The BAT-AEL emission level is 30�150 mg/l.
status: valid
status modified: 2026-05-06
accepted date: 2026-05-06
in scheme: BATAEL values as defined into the EC BAT-Tool

Surface Treatment using organic solvents including preservation of wood and wood products with chemicals - BAT 21
type: Concept
notation: STS-Cr-BAT21-I
definition: 6, Other activities: 6.7 Surface treatment of substances, objects or products using organic solvents, in particular for dressing, printing, coating, degreasing, waterproofing, sizing, painting, cleaning or impregnating, with an organic solvent consumption capacity of more than 150 kg per hour or more than 200 tonnes per year. 6.10: Preservation of wood and wood products with chemicals with a production capacity exceeding 75 m3 per day other than exclusively treating against sapstain. 6.11: Independently operated treatment of waste water not covered by Directive 91/271/EEC provided that the main pollutant load originates from activities specified in point 6.7 or 6.10 of Annex I to Directive 2010/75/EU; Reducing total chromium to water. The BAT-AEL emission level is 0.01�0.15 mg/l.
status: valid
status modified: 2026-05-06
accepted date: 2026-05-06
in scheme: BATAEL values as defined into the EC BAT-Tool

Surface Treatment using organic solvents including preservation of wood and wood products with chemicals - BAT 21
type: Concept
notation: STS-Cr-BAT21-II
definition: 6, Other activities: 6.7 Surface treatment of substances, objects or products using organic solvents, in particular for dressing, printing, coating, degreasing, waterproofing, sizing, painting, cleaning or impregnating, with an organic solvent consumption capacity of more than 150 kg per hour or more than 200 tonnes per year. 6.10: Preservation of wood and wood products with chemicals with a production capacity exceeding 75 m3 per day other than exclusively treating against sapstain. 6.11: Independently operated treatment of waste water not covered by Directive 91/271/EEC provided that the main pollutant load originates from activities specified in point 6.7 or 6.10 of Annex I to Directive 2010/75/EU; Reducing total chromium to water. The BAT-AEL emission level is 0.01�0.15 mg/l.
status: valid
status modified: 2026-05-06
accepted date: 2026-05-06
in scheme: BATAEL values as defined into the EC BAT-Tool

Tanning of Hides and Skins - BOD5 - BAT10-III
type: Concept
notation: TAN-BOD5-BAT10-III
definition: 6, Other activities: 6,3 Tanning of hides and skins where the treatment capacity exceeds 12�tonnes of finished products per day Reducing biological oxygen demand for 5 days (BOD5) to water. The BAT-AEL emission level is 15 - 25 mg/l.
status: valid
status modified: 2026-05-06
accepted date: 2026-05-06
in scheme: BATAEL values as defined into the EC BAT-Tool

Tanning of Hides and Skins - BOD5 - BAT10-IV
type: Concept
notation: TAN-BOD5-BAT10-IV
definition: 6, Other activities: 6,11 Independently operated treatment of waste water not covered by Directive 91/271/EEC and discharged by an installation undertaking activities covered under 6.3 Reducing biological oxygen demand for 5 days (BOD5) to water. The BAT-AEL emission level is 15 - 25 mg/l.
status: valid
status modified: 2026-05-06
accepted date: 2026-05-06
in scheme: BATAEL values as defined into the EC BAT-Tool

Tanning of Hides and Skins - COD - BAT10-I
type: Concept
notation: TAN-COD-BAT10-I
definition: 6, Other activities: 6,3 Tanning of hides and skins where the treatment capacity exceeds 12�tonnes of finished products per day Reducing chemical oxygen demand (COD) to water. The BAT-AEL emission level is 200 - 500 mg/l.
status: valid
status modified: 2026-05-06
accepted date: 2026-05-06
in scheme: BATAEL values as defined into the EC BAT-Tool

Tanning of Hides and Skins - COD - BAT10-II
type: Concept
notation: TAN-COD-BAT10-II
definition: 6, Other activities: 6,11 Independently operated treatment of waste water not covered by Directive 91/271/EEC and discharged by an installation undertaking activities covered under 6.3 Reducing chemical oxygen demand (COD) to water. The BAT-AEL emission level is 200 - 500 mg/l.
status: valid
status modified: 2026-05-06
accepted date: 2026-05-06
in scheme: BATAEL values as defined into the EC BAT-Tool

Tanning of Hides and Skins - Cr - BAT10-IX
type: Concept
notation: TAN-Cr-BAT10-IX
definition: 6, Other activities: 6,3 Tanning of hides and skins where the treatment capacity exceeds 12�tonnes of finished products per day Reducing total chromium to water. The BAT-AEL emission level is < 0,3 - 1 mg/l.
status: valid
status modified: 2026-05-06
accepted date: 2026-05-06
in scheme: BATAEL values as defined into the EC BAT-Tool

Tanning of Hides and Skins - Cr - BAT10-X
type: Concept
notation: TAN-Cr-BAT10-X
definition: 6, Other activities: 6,11 Independently operated treatment of waste water not covered by Directive 91/271/EEC and discharged by an installation undertaking activities covered under 6.3 Reducing total chromium to water. The BAT-AEL emission level is < 0,3 - 1 mg/l.
status: valid
status modified: 2026-05-06
accepted date: 2026-05-06
in scheme: BATAEL values as defined into the EC BAT-Tool

Surface Treatment using organic solvents including preservation of wood and wood products with chemicals - BAT 21
type: Concept
notation: STS-CrVI-BAT21-I
definition: 6, Other activities: 6.7 Surface treatment of substances, objects or products using organic solvents, in particular for dressing, printing, coating, degreasing, waterproofing, sizing, painting, cleaning or impregnating, with an organic solvent consumption capacity of more than 150 kg per hour or more than 200 tonnes per year. 6.10: Preservation of wood and wood products with chemicals with a production capacity exceeding 75 m3 per day other than exclusively treating against sapstain. 6.11: Independently operated treatment of waste water not covered by Directive 91/271/EEC provided that the main pollutant load originates from activities specified in point 6.7 or 6.10 of Annex I to Directive 2010/75/EU; Reducing hexavalent chromium to water. The BAT-AEL emission level is 0.01�0.05 mg/l.
status: valid
status modified: 2026-05-06
accepted date: 2026-05-06
in scheme: BATAEL values as defined into the EC BAT-Tool

Surface Treatment using organic solvents including preservation of wood and wood products with chemicals - BAT 21
type: Concept
notation: STS-CrVI-BAT21-II
definition: 6, Other activities: 6.7 Surface treatment of substances, objects or products using organic solvents, in particular for dressing, printing, coating, degreasing, waterproofing, sizing, painting, cleaning or impregnating, with an organic solvent consumption capacity of more than 150 kg per hour or more than 200 tonnes per year. 6.10: Preservation of wood and wood products with chemicals with a production capacity exceeding 75 m3 per day other than exclusively treating against sapstain. 6.11: Independently operated treatment of waste water not covered by Directive 91/271/EEC provided that the main pollutant load originates from activities specified in point 6.7 or 6.10 of Annex I to Directive 2010/75/EU; Reducing hexavalent chromium to water. The BAT-AEL emission level is 0.01�0.05 mg/l.
status: valid
status modified: 2026-05-06
accepted date: 2026-05-06
in scheme: BATAEL values as defined into the EC BAT-Tool

Surface Treatment using organic solvents including preservation of wood and wood products with chemicals - BAT 18
type: Concept
notation: STS-Dust-BAT18
definition: 6, Other activities: 6.7 Surface treatment of substances, objects or products using organic solvents, in particular for dressing, printing, coating, degreasing, waterproofing, sizing, painting, cleaning or impregnating, with an organic solvent consumption capacity of more than 150 kg per hour or more than 200 tonnes per year. 6.10: Preservation of wood and wood products with chemicals with a production capacity exceeding 75 m3 per day other than exclusively treating against sapstain. 6.11: Independently operated treatment of waste water not covered by Directive 91/271/EEC provided that the main pollutant load originates from activities specified in point 6.7 or 6.10 of Annex I to Directive 2010/75/EU; Reducing dust emissions to air. The BAT-AEL emission level is < 1-3 mg/Nm3.
status: valid
status modified: 2026-05-06
accepted date: 2026-05-06
in scheme: BATAEL values as defined into the EC BAT-Tool

Surface Treatment using organic solvents including preservation of wood and wood products with chemicals - BAT 21
type: Concept
notation: STS-F-BAT21-I
definition: 6, Other activities: 6.7 Surface treatment of substances, objects or products using organic solvents, in particular for dressing, printing, coating, degreasing, waterproofing, sizing, painting, cleaning or impregnating, with an organic solvent consumption capacity of more than 150 kg per hour or more than 200 tonnes per year. 6.10: Preservation of wood and wood products with chemicals with a production capacity exceeding 75 m3 per day other than exclusively treating against sapstain. 6.11: Independently operated treatment of waste water not covered by Directive 91/271/EEC provided that the main pollutant load originates from activities specified in point 6.7 or 6.10 of Annex I to Directive 2010/75/EU; Reducing fluorides to water. The BAT-AEL emission level is 2�25 mg/l.
status: valid
status modified: 2026-05-06
accepted date: 2026-05-06
in scheme: BATAEL values as defined into the EC BAT-Tool

Surface Treatment using organic solvents including preservation of wood and wood products with chemicals - BAT 21
type: Concept
notation: STS-F-BAT21-II
definition: 6, Other activities: 6.7 Surface treatment of substances, objects or products using organic solvents, in particular for dressing, printing, coating, degreasing, waterproofing, sizing, painting, cleaning or impregnating, with an organic solvent consumption capacity of more than 150 kg per hour or more than 200 tonnes per year. 6.10: Preservation of wood and wood products with chemicals with a production capacity exceeding 75 m3 per day other than exclusively treating against sapstain. 6.11: Independently operated treatment of waste water not covered by Directive 91/271/EEC provided that the main pollutant load originates from activities specified in point 6.7 or 6.10 of Annex I to Directive 2010/75/EU; Reducing fluorides to water. The BAT-AEL emission level is 2�25 mg/l.
status: valid
status modified: 2026-05-06
accepted date: 2026-05-06
in scheme: BATAEL values as defined into the EC BAT-Tool

Surface Treatment using organic solvents including preservation of wood and wood products with chemicals - BAT 17
type: Concept
notation: STS-NOX-BAT17
definition: 6, Other activities: 6.7 Surface treatment of substances, objects or products using organic solvents, in particular for dressing, printing, coating, degreasing, waterproofing, sizing, painting, cleaning or impregnating, with an organic solvent consumption capacity of more than 150 kg per hour or more than 200 tonnes per year. 6.10: Preservation of wood and wood products with chemicals with a production capacity exceeding 75 m3 per day other than exclusively treating against sapstain. 6.11: Independently operated treatment of waste water not covered by Directive 91/271/EEC provided that the main pollutant load originates from activities specified in point 6.7 or 6.10 of Annex I to Directive 2010/75/EU; Reducing nitrous oxides (Nox) emissions to air. The BAT-AEL emission level is 20�130 mg/Nm3.
status: valid
status modified: 2026-05-06
accepted date: 2026-05-06
in scheme: BATAEL values as defined into the EC BAT-Tool

Tanning of Hides and Skins - Cr - BAT11-I
type: Concept
notation: TAN-Cr-BAT11-I
definition: 6, Other activities: 6,3 Tanning of hides and skins where the treatment capacity exceeds 12�tonnes of finished products per day Reducing total chromium to water. The BAT-AEL emission level is < 0,3 - 1 mg/l.
status: valid
status modified: 2026-05-06
accepted date: 2026-05-06
in scheme: BATAEL values as defined into the EC BAT-Tool

Tanning of Hides and Skins - Cr - BAT11-II
type: Concept
notation: TAN-Cr-BAT11-II
definition: 6, Other activities: 6,11 Independently operated treatment of waste water not covered by Directive 91/271/EEC and discharged by an installation undertaking activities covered under 6.3 Reducing total chromium to water. The BAT-AEL emission level is < 0,3 - 1 mg/l.
status: valid
status modified: 2026-05-06
accepted date: 2026-05-06
in scheme: BATAEL values as defined into the EC BAT-Tool

Tanning of Hides and Skins - Cr - BAT11-III
type: Concept
notation: TAN-Cr-BAT11-III
definition: 6, Other activities: 6,3 Tanning of hides and skins where the treatment capacity exceeds 12�tonnes of finished products per day Reducing total chromium to water. The BAT-AEL emission level is < 0,3 - 1 mg/l.
status: valid
status modified: 2026-05-06
accepted date: 2026-05-06
in scheme: BATAEL values as defined into the EC BAT-Tool

Tanning of Hides and Skins - Cr - BAT12-I
type: Concept
notation: TAN-Cr-BAT12-I
definition: 6, Other activities: 6,3 Tanning of hides and skins where the treatment capacity exceeds 12�tonnes of finished products per day Reducing total chromium to water. The BAT-AEL emission level is < 0,3 - 1 mg/l.
status: valid
status modified: 2026-05-06
accepted date: 2026-05-06
in scheme: BATAEL values as defined into the EC BAT-Tool

Tanning of Hides and Skins - N - BAT10-VII
type: Concept
notation: TAN-N-BAT10-VII
definition: 6, Other activities: 6,3 Tanning of hides and skins where the treatment capacity exceeds 12�tonnes of finished products per day Reducing ammoniacal nitrogen (NH4-N) to water. The BAT-AEL emission level is < 10 mg/l.
status: valid
status modified: 2026-05-06
accepted date: 2026-05-06
in scheme: BATAEL values as defined into the EC BAT-Tool

Surface Treatment using organic solvents including preservation of wood and wood products with chemicals - BAT 52
type: Concept
notation: STS-NOX-BAT52
definition: 6, Other activities: 6.7 Surface treatment of substances, objects or products using organic solvents, in particular for dressing, printing, coating, degreasing, waterproofing, sizing, painting, cleaning or impregnating, with an organic solvent consumption capacity of more than 150 kg per hour or more than 200 tonnes per year. 6.10: Preservation of wood and wood products with chemicals with a production capacity exceeding 75 m3 per day other than exclusively treating against sapstain. 6.11: Independently operated treatment of waste water not covered by Directive 91/271/EEC provided that the main pollutant load originates from activities specified in point 6.7 or 6.10 of Annex I to Directive 2010/75/EU; Reducing nitrous oxides (Nox) emissions to air. The BAT-AEL emission level is 20�130 mg/Nm3.
status: valid
status modified: 2026-05-06
accepted date: 2026-05-06
in scheme: BATAEL values as defined into the EC BAT-Tool

Surface Treatment using organic solvents including preservation of wood and wood products with chemicals - BAT 21
type: Concept
notation: STS-Ni-BAT21-I
definition: 6, Other activities: 6.7 Surface treatment of substances, objects or products using organic solvents, in particular for dressing, printing, coating, degreasing, waterproofing, sizing, painting, cleaning or impregnating, with an organic solvent consumption capacity of more than 150 kg per hour or more than 200 tonnes per year. 6.10: Preservation of wood and wood products with chemicals with a production capacity exceeding 75 m3 per day other than exclusively treating against sapstain. 6.11: Independently operated treatment of waste water not covered by Directive 91/271/EEC provided that the main pollutant load originates from activities specified in point 6.7 or 6.10 of Annex I to Directive 2010/75/EU; Reducing nickel to water. The BAT-AEL emission level is 0.05�0.4 mg/l.
status: valid
status modified: 2026-05-06
accepted date: 2026-05-06
in scheme: BATAEL values as defined into the EC BAT-Tool

Surface Treatment using organic solvents including preservation of wood and wood products with chemicals - BAT 21
type: Concept
notation: STS-Ni-BAT21-II
definition: 6, Other activities: 6.7 Surface treatment of substances, objects or products using organic solvents, in particular for dressing, printing, coating, degreasing, waterproofing, sizing, painting, cleaning or impregnating, with an organic solvent consumption capacity of more than 150 kg per hour or more than 200 tonnes per year. 6.10: Preservation of wood and wood products with chemicals with a production capacity exceeding 75 m3 per day other than exclusively treating against sapstain. 6.11: Independently operated treatment of waste water not covered by Directive 91/271/EEC provided that the main pollutant load originates from activities specified in point 6.7 or 6.10 of Annex I to Directive 2010/75/EU; Reducing nickel to water. The BAT-AEL emission level is 0.05�0.4 mg/l.
status: valid
status modified: 2026-05-06
accepted date: 2026-05-06
in scheme: BATAEL values as defined into the EC BAT-Tool

Surface Treatment using organic solvents including preservation of wood and wood products with chemicals - BAT 51
type: Concept
notation: STS-PAH-BAT51
definition: 6, Other activities: 6.7 Surface treatment of substances, objects or products using organic solvents, in particular for dressing, printing, coating, degreasing, waterproofing, sizing, painting, cleaning or impregnating, with an organic solvent consumption capacity of more than 150 kg per hour or more than 200 tonnes per year. 6.10: Preservation of wood and wood products with chemicals with a production capacity exceeding 75 m3 per day other than exclusively treating against sapstain. 6.11: Independently operated treatment of waste water not covered by Directive 91/271/EEC provided that the main pollutant load originates from activities specified in point 6.7 or 6.10 of Annex I to Directive 2010/75/EU; Reducing polycyclic aromatic hydrocarbons emissions to air. The BAT-AEL emission level is < 1 mg/Nm3.
status: valid
status modified: 2026-05-06
accepted date: 2026-05-06
in scheme: BATAEL values as defined into the EC BAT-Tool

Surface Treatment using organic solvents including preservation of wood and wood products with chemicals - BAT 21
type: Concept
notation: STS-TSS-BAT21
definition: 6, Other activities: 6.7 Surface treatment of substances, objects or products using organic solvents, in particular for dressing, printing, coating, degreasing, waterproofing, sizing, painting, cleaning or impregnating, with an organic solvent consumption capacity of more than 150 kg per hour or more than 200 tonnes per year. 6.10: Preservation of wood and wood products with chemicals with a production capacity exceeding 75 m3 per day other than exclusively treating against sapstain. 6.11: Independently operated treatment of waste water not covered by Directive 91/271/EEC provided that the main pollutant load originates from activities specified in point 6.7 or 6.10 of Annex I to Directive 2010/75/EU; Reducing total suspended solids to water. The BAT-AEL emission level is 5�30 mg/l.
status: valid
status modified: 2026-05-06
accepted date: 2026-05-06
in scheme: BATAEL values as defined into the EC BAT-Tool

Surface Treatment using organic solvents including preservation of wood and wood products with chemicals - BAT 24
type: Concept
notation: STS-TVOC-BAT24-I
definition: 6, Other activities: 6.7 Surface treatment of substances, objects or products using organic solvents, in particular for dressing, printing, coating, degreasing, waterproofing, sizing, painting, cleaning or impregnating, with an organic solvent consumption capacity of more than 150 kg per hour or more than 200 tonnes per year. 6.10: Preservation of wood and wood products with chemicals with a production capacity exceeding 75 m3 per day other than exclusively treating against sapstain. 6.11: Independently operated treatment of waste water not covered by Directive 91/271/EEC provided that the main pollutant load originates from activities specified in point 6.7 or 6.10 of Annex I to Directive 2010/75/EU; Reducing total volatile organic compounds emissions to air. The BAT-AEL emission level is 8�15 g VOCs per m2 of surface area.
status: valid
status modified: 2026-05-06
accepted date: 2026-05-06
in scheme: BATAEL values as defined into the EC BAT-Tool

Tanning of Hides and Skins - N - BAT10-VIII
type: Concept
notation: TAN-N-BAT10-VIII
definition: 6, Other activities: 6,11 Independently operated treatment of waste water not covered by Directive 91/271/EEC and discharged by an installation undertaking activities covered under 6.3 Reducing ammoniacal nitrogen (NH4-N) to water. The BAT-AEL emission level is < 10 mg/l.
status: valid
status modified: 2026-05-06
accepted date: 2026-05-06
in scheme: BATAEL values as defined into the EC BAT-Tool

Tanning of Hides and Skins - PM - BAT20
type: Concept
notation: TAN-PM-BAT20
definition: 6, Other activities: 6,3 Tanning of hides and skins where the treatment capacity exceeds 12�tonnes of finished products per day; Extraction ventilation system with bag filters or wet scrubbers; Reducing particulate matter emissions to air. The BAT-AEL emission level is 3 - 6 mg/Nm3.
status: valid
status modified: 2026-05-06
accepted date: 2026-05-06
in scheme: BATAEL values as defined into the EC BAT-Tool

Tanning of Hides and Skins - S - BAT10-XI
type: Concept
notation: TAN-S-BAT10-XI
definition: 6, Other activities: 6,3 Tanning of hides and skins where the treatment capacity exceeds 12�tonnes of finished products per day Reducing sulphide to water. The BAT-AEL emission level is < 1 mg/l.
status: valid
status modified: 2026-05-06
accepted date: 2026-05-06
in scheme: BATAEL values as defined into the EC BAT-Tool

Tanning of Hides and Skins - S - BAT10-XII
type: Concept
notation: TAN-S-BAT10-XII
definition: 6, Other activities: 6,11 Independently operated treatment of waste water not covered by Directive 91/271/EEC and discharged by an installation undertaking activities covered under 6.3 Reducing sulphide to water. The BAT-AEL emission level is < 1 mg/l.
status: valid
status modified: 2026-05-06
accepted date: 2026-05-06
in scheme: BATAEL values as defined into the EC BAT-Tool

Tanning of Hides and Skins - S - BAT12-II
type: Concept
notation: TAN-S-BAT12-II
definition: 6, Other activities: 6,3 Tanning of hides and skins where the treatment capacity exceeds 12�tonnes of finished products per day Reducing sulphide to water. The BAT-AEL emission level is < 1 mg/l.
status: valid
status modified: 2026-05-06
accepted date: 2026-05-06
in scheme: BATAEL values as defined into the EC BAT-Tool

Surface Treatment using organic solvents including preservation of wood and wood products with chemicals - BAT 24
type: Concept
notation: STS-TVOC-BAT24-II
definition: 6, Other activities: 6.7 Surface treatment of substances, objects or products using organic solvents, in particular for dressing, printing, coating, degreasing, waterproofing, sizing, painting, cleaning or impregnating, with an organic solvent consumption capacity of more than 150 kg per hour or more than 200 tonnes per year. 6.10: Preservation of wood and wood products with chemicals with a production capacity exceeding 75 m3 per day other than exclusively treating against sapstain. 6.11: Independently operated treatment of waste water not covered by Directive 91/271/EEC provided that the main pollutant load originates from activities specified in point 6.7 or 6.10 of Annex I to Directive 2010/75/EU; Reducing total volatile organic compounds emissions to air. The BAT-AEL emission level is 8�30 g VOCs per m2 of surface area.
status: valid
status modified: 2026-05-06
accepted date: 2026-05-06
in scheme: BATAEL values as defined into the EC BAT-Tool

Surface Treatment using organic solvents including preservation of wood and wood products with chemicals - BAT 24
type: Concept
notation: STS-TVOC-BAT24-III
definition: 6, Other activities: 6.7 Surface treatment of substances, objects or products using organic solvents, in particular for dressing, printing, coating, degreasing, waterproofing, sizing, painting, cleaning or impregnating, with an organic solvent consumption capacity of more than 150 kg per hour or more than 200 tonnes per year. 6.10: Preservation of wood and wood products with chemicals with a production capacity exceeding 75 m3 per day other than exclusively treating against sapstain. 6.11: Independently operated treatment of waste water not covered by Directive 91/271/EEC provided that the main pollutant load originates from activities specified in point 6.7 or 6.10 of Annex I to Directive 2010/75/EU; Reducing total volatile organic compounds emissions to air. The BAT-AEL emission level is 10�20 g VOCs per m2 of surface area.
status: valid
status modified: 2026-05-06
accepted date: 2026-05-06
in scheme: BATAEL values as defined into the EC BAT-Tool

Surface Treatment using organic solvents including preservation of wood and wood products with chemicals - BAT 24
type: Concept
notation: STS-TVOC-BAT24-IV
definition: 6, Other activities: 6.7 Surface treatment of substances, objects or products using organic solvents, in particular for dressing, printing, coating, degreasing, waterproofing, sizing, painting, cleaning or impregnating, with an organic solvent consumption capacity of more than 150 kg per hour or more than 200 tonnes per year. 6.10: Preservation of wood and wood products with chemicals with a production capacity exceeding 75 m3 per day other than exclusively treating against sapstain. 6.11: Independently operated treatment of waste water not covered by Directive 91/271/EEC provided that the main pollutant load originates from activities specified in point 6.7 or 6.10 of Annex I to Directive 2010/75/EU; Reducing total volatile organic compounds emissions to air. The BAT-AEL emission level is 10�40 g VOCs per m2 of surface area.
status: valid
status modified: 2026-05-06
accepted date: 2026-05-06
in scheme: BATAEL values as defined into the EC BAT-Tool

Surface Treatment using organic solvents including preservation of wood and wood products with chemicals - BAT 24
type: Concept
notation: STS-TVOC-BAT24-IX
definition: 6, Other activities: 6.7 Surface treatment of substances, objects or products using organic solvents, in particular for dressing, printing, coating, degreasing, waterproofing, sizing, painting, cleaning or impregnating, with an organic solvent consumption capacity of more than 150 kg per hour or more than 200 tonnes per year. 6.10: Preservation of wood and wood products with chemicals with a production capacity exceeding 75 m3 per day other than exclusively treating against sapstain. 6.11: Independently operated treatment of waste water not covered by Directive 91/271/EEC provided that the main pollutant load originates from activities specified in point 6.7 or 6.10 of Annex I to Directive 2010/75/EU; Reducing total volatile organic compounds emissions to air. The BAT-AEL emission level is < 100 g VOCs per m2 of surface area.
status: valid
status modified: 2026-05-06
accepted date: 2026-05-06
in scheme: BATAEL values as defined into the EC BAT-Tool

Surface Treatment using organic solvents including preservation of wood and wood products with chemicals - BAT 24
type: Concept
notation: STS-TVOC-BAT24-V
definition: 6, Other activities: 6.7 Surface treatment of substances, objects or products using organic solvents, in particular for dressing, printing, coating, degreasing, waterproofing, sizing, painting, cleaning or impregnating, with an organic solvent consumption capacity of more than 150 kg per hour or more than 200 tonnes per year. 6.10: Preservation of wood and wood products with chemicals with a production capacity exceeding 75 m3 per day other than exclusively treating against sapstain. 6.11: Independently operated treatment of waste water not covered by Directive 91/271/EEC provided that the main pollutant load originates from activities specified in point 6.7 or 6.10 of Annex I to Directive 2010/75/EU; Reducing total volatile organic compounds emissions to air. The BAT-AEL emission level is 8�20 g VOCs per m2 of surface area.
status: valid
status modified: 2026-05-06
accepted date: 2026-05-06
in scheme: BATAEL values as defined into the EC BAT-Tool

Tanning of Hides and Skins - SS - BAT10-V
type: Concept
notation: TAN-SS-BAT10-V
definition: 6, Other activities: 6,3 Tanning of hides and skins where the treatment capacity exceeds 12�tonnes of finished products per day Reducing suspended solids to water. The BAT-AEL emission level is < 35 mg/l.
status: valid
status modified: 2026-05-06
accepted date: 2026-05-06
in scheme: BATAEL values as defined into the EC BAT-Tool

Tanning of Hides and Skins - SS - BAT10-VI
type: Concept
notation: TAN-SS-BAT10-VI
definition: 6, Other activities: 6,11 Independently operated treatment of waste water not covered by Directive 91/271/EEC and discharged by an installation undertaking activities covered under 6.3 Reducing suspended solids to water. The BAT-AEL emission level is < 35 mg/l.
status: valid
status modified: 2026-05-06
accepted date: 2026-05-06
in scheme: BATAEL values as defined into the EC BAT-Tool

Tanning of Hides and Skins - TC - BAT19
type: Concept
notation: TAN-TC-BAT19
definition: 6, Other activities: 6,3 Tanning of hides and skins where the treatment capacity exceeds 12�tonnes of finished products per day; Techniques (a)-(b) (see table); Reducing volatile organic compounds (VOC) emissions to air. The BAT-AEL emission level is 9 - 23 g/m2.
status: valid
status modified: 2026-05-06
accepted date: 2026-05-06
in scheme: BATAEL values as defined into the EC BAT-Tool

Production of Wood-based Panels - C - BAT17-IV
type: Concept
notation: WBP-C-BAT17-IV
definition: 6, Other activities: 6,1 Production in industrial installations of: (c) one or more of the following wood-based panels: oriented strand board, particleboard or fibreboard with a production capacity exceeding 600 m3 per day; For PB and all dryer types; Reducing total Volatile Organic Compounds (TVOC) emissions to air. The BAT-AEL emission level is < 20 - 200 mg/Nm3.
status: valid
status modified: 2026-05-06
accepted date: 2026-05-06
in scheme: BATAEL values as defined into the EC BAT-Tool

Production of Wood-based Panels - C - BAT17-V
type: Concept
notation: WBP-C-BAT17-V
definition: 6, Other activities: 6,1 Production in industrial installations of: (c) one or more of the following wood-based panels: oriented strand board, particleboard or fibreboard with a production capacity exceeding 600 m3 per day; For OSB and all dryer types; Reducing total Volatile Organic Compounds (TVOC) emissions to air. The BAT-AEL emission level is 10 - 400 mg/Nm3.
status: valid
status modified: 2026-05-06
accepted date: 2026-05-06
in scheme: BATAEL values as defined into the EC BAT-Tool

Production of Wood-based Panels - C - BAT17-VI
type: Concept
notation: WBP-C-BAT17-VI
definition: 6, Other activities: 6,1 Production in industrial installations of: (c) one or more of the following wood-based panels: oriented strand board, particleboard or fibreboard with a production capacity exceeding 600 m3 per day; For fibre and all dryer types; Reducing total Volatile Organic Compounds (TVOC) emissions to air. The BAT-AEL emission level is < 20 - 120 mg/Nm3.
status: valid
status modified: 2026-05-06
accepted date: 2026-05-06
in scheme: BATAEL values as defined into the EC BAT-Tool

Surface Treatment using organic solvents including preservation of wood and wood products with chemicals - BAT 24
type: Concept
notation: STS-TVOC-BAT24-VI
definition: 6, Other activities: 6.7 Surface treatment of substances, objects or products using organic solvents, in particular for dressing, printing, coating, degreasing, waterproofing, sizing, painting, cleaning or impregnating, with an organic solvent consumption capacity of more than 150 kg per hour or more than 200 tonnes per year. 6.10: Preservation of wood and wood products with chemicals with a production capacity exceeding 75 m3 per day other than exclusively treating against sapstain. 6.11: Independently operated treatment of waste water not covered by Directive 91/271/EEC provided that the main pollutant load originates from activities specified in point 6.7 or 6.10 of Annex I to Directive 2010/75/EU; Reducing total volatile organic compounds emissions to air. The BAT-AEL emission level is 8�40 g VOCs per m2 of surface area.
status: valid
status modified: 2026-05-06
accepted date: 2026-05-06
in scheme: BATAEL values as defined into the EC BAT-Tool

Surface Treatment using organic solvents including preservation of wood and wood products with chemicals - BAT 24
type: Concept
notation: STS-TVOC-BAT24-VII
definition: 6, Other activities: 6.7 Surface treatment of substances, objects or products using organic solvents, in particular for dressing, printing, coating, degreasing, waterproofing, sizing, painting, cleaning or impregnating, with an organic solvent consumption capacity of more than 150 kg per hour or more than 200 tonnes per year. 6.10: Preservation of wood and wood products with chemicals with a production capacity exceeding 75 m3 per day other than exclusively treating against sapstain. 6.11: Independently operated treatment of waste water not covered by Directive 91/271/EEC provided that the main pollutant load originates from activities specified in point 6.7 or 6.10 of Annex I to Directive 2010/75/EU; Reducing total volatile organic compounds emissions to air. The BAT-AEL emission level is 10�40 g VOCs per m2 of surface area.
status: valid
status modified: 2026-05-06
accepted date: 2026-05-06
in scheme: BATAEL values as defined into the EC BAT-Tool

Surface Treatment using organic solvents including preservation of wood and wood products with chemicals - BAT 24
type: Concept
notation: STS-TVOC-BAT24-VIII
definition: 6, Other activities: 6.7 Surface treatment of substances, objects or products using organic solvents, in particular for dressing, printing, coating, degreasing, waterproofing, sizing, painting, cleaning or impregnating, with an organic solvent consumption capacity of more than 150 kg per hour or more than 200 tonnes per year. 6.10: Preservation of wood and wood products with chemicals with a production capacity exceeding 75 m3 per day other than exclusively treating against sapstain. 6.11: Independently operated treatment of waste water not covered by Directive 91/271/EEC provided that the main pollutant load originates from activities specified in point 6.7 or 6.10 of Annex I to Directive 2010/75/EU; Reducing total volatile organic compounds emissions to air. The BAT-AEL emission level is 10�50 g VOCs per m2 of surface area.
status: valid
status modified: 2026-05-06
accepted date: 2026-05-06
in scheme: BATAEL values as defined into the EC BAT-Tool

Surface Treatment using organic solvents including preservation of wood and wood products with chemicals - BAT 24
type: Concept
notation: STS-TVOC-BAT24-X
definition: 6, Other activities: 6.7 Surface treatment of substances, objects or products using organic solvents, in particular for dressing, printing, coating, degreasing, waterproofing, sizing, painting, cleaning or impregnating, with an organic solvent consumption capacity of more than 150 kg per hour or more than 200 tonnes per year. 6.10: Preservation of wood and wood products with chemicals with a production capacity exceeding 75 m3 per day other than exclusively treating against sapstain. 6.11: Independently operated treatment of waste water not covered by Directive 91/271/EEC provided that the main pollutant load originates from activities specified in point 6.7 or 6.10 of Annex I to Directive 2010/75/EU; Reducing total volatile organic compounds emissions to air. The BAT-AEL emission level is 90�150 g VOCs per m2 of surface area.
status: valid
status modified: 2026-05-06
accepted date: 2026-05-06
in scheme: BATAEL values as defined into the EC BAT-Tool

Surface Treatment using organic solvents including preservation of wood and wood products with chemicals - BAT 24
type: Concept
notation: STS-TVOC-BAT24-XI
definition: 6, Other activities: 6.7 Surface treatment of substances, objects or products using organic solvents, in particular for dressing, printing, coating, degreasing, waterproofing, sizing, painting, cleaning or impregnating, with an organic solvent consumption capacity of more than 150 kg per hour or more than 200 tonnes per year. 6.10: Preservation of wood and wood products with chemicals with a production capacity exceeding 75 m3 per day other than exclusively treating against sapstain. 6.11: Independently operated treatment of waste water not covered by Directive 91/271/EEC provided that the main pollutant load originates from activities specified in point 6.7 or 6.10 of Annex I to Directive 2010/75/EU; Reducing total volatile organic compounds emissions to air. The BAT-AEL emission level is < 0.05�0.2 kg VOCs per kg of solid mass.
status: valid
status modified: 2026-05-06
accepted date: 2026-05-06
in scheme: BATAEL values as defined into the EC BAT-Tool

Production of Wood-based Panels - C - BAT19-II
type: Concept
notation: WBP-C-BAT19-II
definition: 6, Other activities: 6,1 Production in industrial installations of: (c) one or more of the following wood-based panels: oriented strand board, particleboard or fibreboard with a production capacity exceeding 600 m3 per day; Techniques (a)-(f) (see table); Reducing total Volatile Organic Compounds (TVOC) emissions to air. The BAT-AEL emission level is 10 - 100 mg/Nm3.
status: valid
status modified: 2026-05-06
accepted date: 2026-05-06
in scheme: BATAEL values as defined into the EC BAT-Tool

Production of Wood-based Panels - C - BAT21-I
type: Concept
notation: WBP-C-BAT21-I
definition: 6, Other activities: 6,1 Production in industrial installations of: (c) one or more of the following wood-based panels: oriented strand board, particleboard or fibreboard with a production capacity exceeding 600 m3 per day; Techniques (a)-(e) (see table); Reducing total Volatile Organic Compounds (TVOC) emissions to air. The BAT-AEL emission level is 5 - 30 mg/Nm3.
status: valid
status modified: 2026-05-06
accepted date: 2026-05-06
in scheme: BATAEL values as defined into the EC BAT-Tool

Production of Wood-based Panels - CH2O - BAT17-IX
type: Concept
notation: WBP-CH2O-BAT17-IX
definition: 6, Other activities: 6,1 Production in industrial installations of: (c) one or more of the following wood-based panels: oriented strand board, particleboard or fibreboard with a production capacity exceeding 600 m3 per day; For fibre and all dryer types; Reducing formaldehyde emissions to air. The BAT-AEL emission level is < 5 - 15 mg/Nm3.
status: valid
status modified: 2026-05-06
accepted date: 2026-05-06
in scheme: BATAEL values as defined into the EC BAT-Tool

Production of Wood-based Panels - CH2O - BAT17-VII
type: Concept
notation: WBP-CH2O-BAT17-VII
definition: 6, Other activities: 6,1 Production in industrial installations of: (c) one or more of the following wood-based panels: oriented strand board, particleboard or fibreboard with a production capacity exceeding 600 m3 per day; For PB and all dryer types; Reducing formaldehyde emissions to air. The BAT-AEL emission level is < 5 - 10 mg/Nm3.
status: valid
status modified: 2026-05-06
accepted date: 2026-05-06
in scheme: BATAEL values as defined into the EC BAT-Tool

Production of Wood-based Panels - CH2O - BAT17-VIII
type: Concept
notation: WBP-CH2O-BAT17-VIII
definition: 6, Other activities: 6,1 Production in industrial installations of: (c) one or more of the following wood-based panels: oriented strand board, particleboard or fibreboard with a production capacity exceeding 600 m3 per day; For OSB and all dryer types; Reducing formaldehyde emissions to air. The BAT-AEL emission level is < 5 - 20 mg/Nm3.
status: valid
status modified: 2026-05-06
accepted date: 2026-05-06
in scheme: BATAEL values as defined into the EC BAT-Tool

Surface Treatment using organic solvents including preservation of wood and wood products with chemicals - BAT 24
type: Concept
notation: STS-TVOC-BAT24-XII
definition: 6, Other activities: 6.7 Surface treatment of substances, objects or products using organic solvents, in particular for dressing, printing, coating, degreasing, waterproofing, sizing, painting, cleaning or impregnating, with an organic solvent consumption capacity of more than 150 kg per hour or more than 200 tonnes per year. 6.10: Preservation of wood and wood products with chemicals with a production capacity exceeding 75 m3 per day other than exclusively treating against sapstain. 6.11: Independently operated treatment of waste water not covered by Directive 91/271/EEC provided that the main pollutant load originates from activities specified in point 6.7 or 6.10 of Annex I to Directive 2010/75/EU; Reducing total volatile organic compounds emissions to air. The BAT-AEL emission level is < 0.05�0.3 kg VOCs per kg of solid mass.
status: valid
status modified: 2026-05-06
accepted date: 2026-05-06
in scheme: BATAEL values as defined into the EC BAT-Tool

Surface Treatment using organic solvents including preservation of wood and wood products with chemicals - BAT 24
type: Concept
notation: STS-TVOC-BAT24-XIII
definition: 6, Other activities: 6.7 Surface treatment of substances, objects or products using organic solvents, in particular for dressing, printing, coating, degreasing, waterproofing, sizing, painting, cleaning or impregnating, with an organic solvent consumption capacity of more than 150 kg per hour or more than 200 tonnes per year. 6.10: Preservation of wood and wood products with chemicals with a production capacity exceeding 75 m3 per day other than exclusively treating against sapstain. 6.11: Independently operated treatment of waste water not covered by Directive 91/271/EEC provided that the main pollutant load originates from activities specified in point 6.7 or 6.10 of Annex I to Directive 2010/75/EU; Reducing total volatile organic compounds emissions to air. The BAT-AEL emission level is < 1�10 % of the solvent input.
status: valid
status modified: 2026-05-06
accepted date: 2026-05-06
in scheme: BATAEL values as defined into the EC BAT-Tool

Surface Treatment using organic solvents including preservation of wood and wood products with chemicals - BAT 24
type: Concept
notation: STS-TVOC-BAT24-XIV
definition: 6, Other activities: 6.7 Surface treatment of substances, objects or products using organic solvents, in particular for dressing, printing, coating, degreasing, waterproofing, sizing, painting, cleaning or impregnating, with an organic solvent consumption capacity of more than 150 kg per hour or more than 200 tonnes per year. 6.10: Preservation of wood and wood products with chemicals with a production capacity exceeding 75 m3 per day other than exclusively treating against sapstain. 6.11: Independently operated treatment of waste water not covered by Directive 91/271/EEC provided that the main pollutant load originates from activities specified in point 6.7 or 6.10 of Annex I to Directive 2010/75/EU; Reducing total volatile organic compounds emissions to air. The BAT-AEL emission level is 1�20 mg C/Nm3.
status: valid
status modified: 2026-05-06
accepted date: 2026-05-06
in scheme: BATAEL values as defined into the EC BAT-Tool

Surface Treatment using organic solvents including preservation of wood and wood products with chemicals - BAT 24
type: Concept
notation: STS-TVOC-BAT24-XV
definition: 6, Other activities: 6.7 Surface treatment of substances, objects or products using organic solvents, in particular for dressing, printing, coating, degreasing, waterproofing, sizing, painting, cleaning or impregnating, with an organic solvent consumption capacity of more than 150 kg per hour or more than 200 tonnes per year. 6.10: Preservation of wood and wood products with chemicals with a production capacity exceeding 75 m3 per day other than exclusively treating against sapstain. 6.11: Independently operated treatment of waste water not covered by Directive 91/271/EEC provided that the main pollutant load originates from activities specified in point 6.7 or 6.10 of Annex I to Directive 2010/75/EU; Reducing total volatile organic compounds emissions to air. The BAT-AEL emission level is 35 mg C/Nm3.
status: valid
status modified: 2026-05-06
accepted date: 2026-05-06
in scheme: BATAEL values as defined into the EC BAT-Tool

Surface Treatment using organic solvents including preservation of wood and wood products with chemicals - BAT 25
type: Concept
notation: STS-TVOC-BAT25
definition: 6, Other activities: 6.7 Surface treatment of substances, objects or products using organic solvents, in particular for dressing, printing, coating, degreasing, waterproofing, sizing, painting, cleaning or impregnating, with an organic solvent consumption capacity of more than 150 kg per hour or more than 200 tonnes per year. 6.10: Preservation of wood and wood products with chemicals with a production capacity exceeding 75 m3 per day other than exclusively treating against sapstain. 6.11: Independently operated treatment of waste water not covered by Directive 91/271/EEC provided that the main pollutant load originates from activities specified in point 6.7 or 6.10 of Annex I to Directive 2010/75/EU; Reducing total volatile organic compounds emissions to air. The BAT-AEL emission level is < 0.375 kg VOCs per kg of solid mass input.
status: valid
status modified: 2026-05-06
accepted date: 2026-05-06
in scheme: BATAEL values as defined into the EC BAT-Tool

Production of Wood-based Panels - CH2O - BAT19-III
type: Concept
notation: WBP-CH2O-BAT19-III
definition: 6, Other activities: 6,1 Production in industrial installations of: (c) one or more of the following wood-based panels: oriented strand board, particleboard or fibreboard with a production capacity exceeding 600 m3 per day; Techniques (a)-(f) (see table); Reducing formaldehyde emissions to air. The BAT-AEL emission level is 2 - 15 mg/Nm3.
status: valid
status modified: 2026-05-06
accepted date: 2026-05-06
in scheme: BATAEL values as defined into the EC BAT-Tool

Production of Wood-based Panels - CH2O - BAT21-II
type: Concept
notation: WBP-CH2O-BAT21-II
definition: 6, Other activities: 6,1 Production in industrial installations of: (c) one or more of the following wood-based panels: oriented strand board, particleboard or fibreboard with a production capacity exceeding 600 m3 per day; Techniques (a)-(e) (see table); Reducing formaldehyde emissions to air. The BAT-AEL emission level is < 5 - 10 mg/Nm3.
status: valid
status modified: 2026-05-06
accepted date: 2026-05-06
in scheme: BATAEL values as defined into the EC BAT-Tool

Production of Wood-based Panels - COD - BAT27-II
type: Concept
notation: WBP-COD-BAT27-II
definition: 6, Other activities: 6,1 Production in industrial installations of: (c) one or more of the following wood-based panels: oriented strand board, particleboard or fibreboard with a production capacity exceeding 600 m3 per day. Reducing chemical oxygen demand (COD) to water. The BAT-AEL emission level is 20 - 200 mg/l.
status: valid
status modified: 2026-05-06
accepted date: 2026-05-06
in scheme: BATAEL values as defined into the EC BAT-Tool

Production of Wood-based Panels - NO2 - BAT18
type: Concept
notation: WBP-NO2-BAT18
definition: 6, Other activities: 6,1 Production in industrial installations of: (c) one or more of the following wood-based panels: oriented strand board, particleboard or fibreboard with a production capacity exceeding 600 m3 per day; Techniques (a)-(b) (see table); Reducing nitrogen oxides (NOx) emissions to air. The BAT-AEL emission level is 30 - 250 mg/Nm3.
status: valid
status modified: 2026-05-06
accepted date: 2026-05-06
in scheme: BATAEL values as defined into the EC BAT-Tool

Production of Wood-based Panels - TPM - BAT17-I
type: Concept
notation: WBP-TPM-BAT17-I
definition: 6, Other activities: 6,1 Production in industrial installations of: (c) one or more of the following wood-based panels: oriented strand board, particleboard or fibreboard with a production capacity exceeding 600 m3 per day; For PB or OSB and directly heated dryer; Reducing dust emissions to air. The BAT-AEL emission level is 3 - 30 mg/Nm3.
status: valid
status modified: 2026-05-06
accepted date: 2026-05-06
in scheme: BATAEL values as defined into the EC BAT-Tool

Production of Wood-based Panels - TPM - BAT17-II
type: Concept
notation: WBP-TPM-BAT17-II
definition: 6, Other activities: 6,1 Production in industrial installations of: (c) one or more of the following wood-based panels: oriented strand board, particleboard or fibreboard with a production capacity exceeding 600 m3 per day; For PB or OSB and indirectly heated dryer; Reducing dust emissions to air. The BAT-AEL emission level is 3 - 10 mg/Nm3.
status: valid
status modified: 2026-05-06
accepted date: 2026-05-06
in scheme: BATAEL values as defined into the EC BAT-Tool

Surface Treatment using organic solvents including preservation of wood and wood products with chemicals - BAT 26
type: Concept
notation: STS-TVOC-BAT26-I
definition: 6, Other activities: 6.7 Surface treatment of substances, objects or products using organic solvents, in particular for dressing, printing, coating, degreasing, waterproofing, sizing, painting, cleaning or impregnating, with an organic solvent consumption capacity of more than 150 kg per hour or more than 200 tonnes per year. 6.10: Preservation of wood and wood products with chemicals with a production capacity exceeding 75 m3 per day other than exclusively treating against sapstain. 6.11: Independently operated treatment of waste water not covered by Directive 91/271/EEC provided that the main pollutant load originates from activities specified in point 6.7 or 6.10 of Annex I to Directive 2010/75/EU; Reducing total volatile organic compounds emissions to air. The BAT-AEL emission level is 0.2�0.58 kg VOCs per kg of solid mass input.
status: valid
status modified: 2026-05-06
accepted date: 2026-05-06
in scheme: BATAEL values as defined into the EC BAT-Tool

Surface Treatment using organic solvents including preservation of wood and wood products with chemicals - BAT 26
type: Concept
notation: STS-TVOC-BAT26-II
definition: 6, Other activities: 6.7 Surface treatment of substances, objects or products using organic solvents, in particular for dressing, printing, coating, degreasing, waterproofing, sizing, painting, cleaning or impregnating, with an organic solvent consumption capacity of more than 150 kg per hour or more than 200 tonnes per year. 6.10: Preservation of wood and wood products with chemicals with a production capacity exceeding 75 m3 per day other than exclusively treating against sapstain. 6.11: Independently operated treatment of waste water not covered by Directive 91/271/EEC provided that the main pollutant load originates from activities specified in point 6.7 or 6.10 of Annex I to Directive 2010/75/EU; Reducing total volatile organic compounds emissions to air. The BAT-AEL emission level is < 1�3 % of the solvent input.
status: valid
status modified: 2026-05-06
accepted date: 2026-05-06
in scheme: BATAEL values as defined into the EC BAT-Tool

Surface Treatment using organic solvents including preservation of wood and wood products with chemicals - BAT 26
type: Concept
notation: STS-TVOC-BAT26-III
definition: 6, Other activities: 6.7 Surface treatment of substances, objects or products using organic solvents, in particular for dressing, printing, coating, degreasing, waterproofing, sizing, painting, cleaning or impregnating, with an organic solvent consumption capacity of more than 150 kg per hour or more than 200 tonnes per year. 6.10: Preservation of wood and wood products with chemicals with a production capacity exceeding 75 m3 per day other than exclusively treating against sapstain. 6.11: Independently operated treatment of waste water not covered by Directive 91/271/EEC provided that the main pollutant load originates from activities specified in point 6.7 or 6.10 of Annex I to Directive 2010/75/EU; Reducing total volatile organic compounds emissions to air. The BAT-AEL emission level is 1�20 mg C/Nm3.
status: valid
status modified: 2026-05-06
accepted date: 2026-05-06
in scheme: BATAEL values as defined into the EC BAT-Tool

Surface Treatment using organic solvents including preservation of wood and wood products with chemicals - BAT 26
type: Concept
notation: STS-TVOC-BAT26-IV
definition: 6, Other activities: 6.7 Surface treatment of substances, objects or products using organic solvents, in particular for dressing, printing, coating, degreasing, waterproofing, sizing, painting, cleaning or impregnating, with an organic solvent consumption capacity of more than 150 kg per hour or more than 200 tonnes per year. 6.10: Preservation of wood and wood products with chemicals with a production capacity exceeding 75 m3 per day other than exclusively treating against sapstain. 6.11: Independently operated treatment of waste water not covered by Directive 91/271/EEC provided that the main pollutant load originates from activities specified in point 6.7 or 6.10 of Annex I to Directive 2010/75/EU; Reducing total volatile organic compounds emissions to air. The BAT-AEL emission level is 50 mg C/Nm3.
status: valid
status modified: 2026-05-06
accepted date: 2026-05-06
in scheme: BATAEL values as defined into the EC BAT-Tool

Surface Treatment using organic solvents including preservation of wood and wood products with chemicals - BAT 26
type: Concept
notation: STS-TVOC-BAT26-IX
definition: 6, Other activities: 6.7 Surface treatment of substances, objects or products using organic solvents, in particular for dressing, printing, coating, degreasing, waterproofing, sizing, painting, cleaning or impregnating, with an organic solvent consumption capacity of more than 150 kg per hour or more than 200 tonnes per year. 6.10: Preservation of wood and wood products with chemicals with a production capacity exceeding 75 m3 per day other than exclusively treating against sapstain. 6.11: Independently operated treatment of waste water not covered by Directive 91/271/EEC provided that the main pollutant load originates from activities specified in point 6.7 or 6.10 of Annex I to Directive 2010/75/EU; Reducing total volatile organic compounds emissions to air. The BAT-AEL emission level is 5�20 mg C/Nm3.
status: valid
status modified: 2026-05-06
accepted date: 2026-05-06
in scheme: BATAEL values as defined into the EC BAT-Tool

Production of Wood-based Panels - TPM - BAT17-III
type: Concept
notation: WBP-TPM-BAT17-III
definition: 6, Other activities: 6,1 Production in industrial installations of: (c) one or more of the following wood-based panels: oriented strand board, particleboard or fibreboard with a production capacity exceeding 600 m3 per day; For fibre and all dryer types; Reducing dust emissions to air. The BAT-AEL emission level is 3 - 20 mg/Nm3.
status: valid
status modified: 2026-05-06
accepted date: 2026-05-06
in scheme: BATAEL values as defined into the EC BAT-Tool

Production of Wood-based Panels - TPM - BAT19-I
type: Concept
notation: WBP-TPM-BAT19-I
definition: 6, Other activities: 6,1 Production in industrial installations of: (c) one or more of the following wood-based panels: oriented strand board, particleboard or fibreboard with a production capacity exceeding 600 m3 per day; Techniques (a)-(f) (see table); Reducing dust emissions to air. The BAT-AEL emission level is 3 - 15 mg/Nm3.
status: valid
status modified: 2026-05-06
accepted date: 2026-05-06
in scheme: BATAEL values as defined into the EC BAT-Tool

Production of Wood-based Panels - TPM - BAT20
type: Concept
notation: WBP-TPM-BAT20
definition: 6, Other activities: 6,1 Production in industrial installations of: (c) one or more of the following wood-based panels: oriented strand board, particleboard or fibreboard with a production capacity exceeding 600 m3 per day; Bag filter or cyclofilter; Reducing dust emissions to air. The BAT-AEL emission level is < 3 - 5 mg/Nm3.
status: valid
status modified: 2026-05-06
accepted date: 2026-05-06
in scheme: BATAEL values as defined into the EC BAT-Tool

Production of Wood-based Panels - TSS - BAT25
type: Concept
notation: WBP-TSS-BAT25
definition: 6, Other activities: 6,1 Production in industrial installations of: (c) one or more of the following wood-based panels: oriented strand board, particleboard or fibreboard with a production capacity exceeding 600 m3 per day. Reducing total suspended solids (TSS) to water. The BAT-AEL emission level is 10 - 40 mg/l.
status: valid
status modified: 2026-05-06
accepted date: 2026-05-06
in scheme: BATAEL values as defined into the EC BAT-Tool

Production of Wood-based Panels - TSS - BAT27-I
type: Concept
notation: WBP-TSS-BAT27-I
definition: 6, Other activities: 6,1 Production in industrial installations of: (c) one or more of the following wood-based panels: oriented strand board, particleboard or fibreboard with a production capacity exceeding 600 m3 per day. Reducing total suspended solids (TSS) to water. The BAT-AEL emission level is 5 - 35 mg/l.
status: valid
status modified: 2026-05-06
accepted date: 2026-05-06
in scheme: BATAEL values as defined into the EC BAT-Tool

Waste Incineration - As - BAT34-III
type: Concept
notation: WI-As-BAT34-III
definition: Waste management reducing arsenic to water. The BAT-AEL emission level is 0.01�0.05 mg/l.
status: valid
status modified: 2026-05-06
accepted date: 2026-05-06
in scheme: BATAEL values as defined into the EC BAT-Tool

Waste Incineration - As - BAT34-XVI
type: Concept
notation: WI-As-BAT34-XVI
definition: Waste management reducing arsenic to water. The BAT-AEL emission level is 0.01�0.05 mg/l.
status: valid
status modified: 2026-05-06
accepted date: 2026-05-06
in scheme: BATAEL values as defined into the EC BAT-Tool

Surface Treatment using organic solvents including preservation of wood and wood products with chemicals - BAT 26
type: Concept
notation: STS-TVOC-BAT26-V
definition: 6, Other activities: 6.7 Surface treatment of substances, objects or products using organic solvents, in particular for dressing, printing, coating, degreasing, waterproofing, sizing, painting, cleaning or impregnating, with an organic solvent consumption capacity of more than 150 kg per hour or more than 200 tonnes per year. 6.10: Preservation of wood and wood products with chemicals with a production capacity exceeding 75 m3 per day other than exclusively treating against sapstain. 6.11: Independently operated treatment of waste water not covered by Directive 91/271/EEC provided that the main pollutant load originates from activities specified in point 6.7 or 6.10 of Annex I to Directive 2010/75/EU; Reducing total volatile organic compounds emissions to air. The BAT-AEL emission level is < 1�3 % of the solvent input.
status: valid
status modified: 2026-05-06
accepted date: 2026-05-06
in scheme: BATAEL values as defined into the EC BAT-Tool

Surface Treatment using organic solvents including preservation of wood and wood products with chemicals - BAT 26
type: Concept
notation: STS-TVOC-BAT26-VI
definition: 6, Other activities: 6.7 Surface treatment of substances, objects or products using organic solvents, in particular for dressing, printing, coating, degreasing, waterproofing, sizing, painting, cleaning or impregnating, with an organic solvent consumption capacity of more than 150 kg per hour or more than 200 tonnes per year. 6.10: Preservation of wood and wood products with chemicals with a production capacity exceeding 75 m3 per day other than exclusively treating against sapstain. 6.11: Independently operated treatment of waste water not covered by Directive 91/271/EEC provided that the main pollutant load originates from activities specified in point 6.7 or 6.10 of Annex I to Directive 2010/75/EU; Reducing total volatile organic compounds emissions to air. The BAT-AEL emission level is 2�20 mg C/Nm3.
status: valid
status modified: 2026-05-06
accepted date: 2026-05-06
in scheme: BATAEL values as defined into the EC BAT-Tool

Surface Treatment using organic solvents including preservation of wood and wood products with chemicals - BAT 26
type: Concept
notation: STS-TVOC-BAT26-VII
definition: 6, Other activities: 6.7 Surface treatment of substances, objects or products using organic solvents, in particular for dressing, printing, coating, degreasing, waterproofing, sizing, painting, cleaning or impregnating, with an organic solvent consumption capacity of more than 150 kg per hour or more than 200 tonnes per year. 6.10: Preservation of wood and wood products with chemicals with a production capacity exceeding 75 m3 per day other than exclusively treating against sapstain. 6.11: Independently operated treatment of waste water not covered by Directive 91/271/EEC provided that the main pollutant load originates from activities specified in point 6.7 or 6.10 of Annex I to Directive 2010/75/EU; Reducing total volatile organic compounds emissions to air. The BAT-AEL emission level is 50 mg C/Nm3.
status: valid
status modified: 2026-05-06
accepted date: 2026-05-06
in scheme: BATAEL values as defined into the EC BAT-Tool

Surface Treatment using organic solvents including preservation of wood and wood products with chemicals - BAT 26
type: Concept
notation: STS-TVOC-BAT26-VIII
definition: 6, Other activities: 6.7 Surface treatment of substances, objects or products using organic solvents, in particular for dressing, printing, coating, degreasing, waterproofing, sizing, painting, cleaning or impregnating, with an organic solvent consumption capacity of more than 150 kg per hour or more than 200 tonnes per year. 6.10: Preservation of wood and wood products with chemicals with a production capacity exceeding 75 m3 per day other than exclusively treating against sapstain. 6.11: Independently operated treatment of waste water not covered by Directive 91/271/EEC provided that the main pollutant load originates from activities specified in point 6.7 or 6.10 of Annex I to Directive 2010/75/EU; Reducing total volatile organic compounds emissions to air. The BAT-AEL emission level is < 1�5 % of the solvent input.
status: valid
status modified: 2026-05-06
accepted date: 2026-05-06
in scheme: BATAEL values as defined into the EC BAT-Tool

Surface Treatment using organic solvents including preservation of wood and wood products with chemicals - BAT 26
type: Concept
notation: STS-TVOC-BAT26-X
definition: 6, Other activities: 6.7 Surface treatment of substances, objects or products using organic solvents, in particular for dressing, printing, coating, degreasing, waterproofing, sizing, painting, cleaning or impregnating, with an organic solvent consumption capacity of more than 150 kg per hour or more than 200 tonnes per year. 6.10: Preservation of wood and wood products with chemicals with a production capacity exceeding 75 m3 per day other than exclusively treating against sapstain. 6.11: Independently operated treatment of waste water not covered by Directive 91/271/EEC provided that the main pollutant load originates from activities specified in point 6.7 or 6.10 of Annex I to Directive 2010/75/EU; Reducing total volatile organic compounds emissions to air. The BAT-AEL emission level is 50 mg C/Nm3.
status: valid
status modified: 2026-05-06
accepted date: 2026-05-06
in scheme: BATAEL values as defined into the EC BAT-Tool

Waste Incineration - C - BAT30-I
type: Concept
notation: WI-C-BAT30-I
definition: Waste management reducing volatile organic compounds (VOC) emissions to air. The BAT-AEL emission level is < 3�10 mg/Nm3.
status: valid
status modified: 2026-05-06
accepted date: 2026-05-06
in scheme: BATAEL values as defined into the EC BAT-Tool

Waste Incineration - CO - BAT29-III
type: Concept
notation: WI-CO-BAT29-III
definition: Waste management reducing carbon monoxide emissions to air. The BAT-AEL emission level is 10�50mg/Nm3.
status: valid
status modified: 2026-05-06
accepted date: 2026-05-06
in scheme: BATAEL values as defined into the EC BAT-Tool

Waste Incineration - Cd - BAT34-IV
type: Concept
notation: WI-Cd-BAT34-IV
definition: Waste management reducing cadmium to water. The BAT-AEL emission level is 0.005�0.03 mg/l.
status: valid
status modified: 2026-05-06
accepted date: 2026-05-06
in scheme: BATAEL values as defined into the EC BAT-Tool

Waste Incineration - Cd - BAT34-XVII
type: Concept
notation: WI-Cd-BAT34-XVII
definition: Waste management reducing cadmium to water. The BAT-AEL emission level is 0.005�0.03 mg/l.
status: valid
status modified: 2026-05-06
accepted date: 2026-05-06
in scheme: BATAEL values as defined into the EC BAT-Tool

Waste Incineration - CdTl - BAT25-II
type: Concept
notation: WI-CdTl-BAT25-II
definition: Waste management reducing cadmium, thallium and their compounds emissions to air. The BAT-AEL emission level is 0.005�0.02 mg/Nm3.
status: valid
status modified: 2026-05-06
accepted date: 2026-05-06
in scheme: BATAEL values as defined into the EC BAT-Tool

Waste Incineration - Cr - BAT34-V
type: Concept
notation: WI-Cr-BAT34-V
definition: Waste management reducing chromium to water. The BAT-AEL emission level is 0.01�0.1 mg/l.
status: valid
status modified: 2026-05-06
accepted date: 2026-05-06
in scheme: BATAEL values as defined into the EC BAT-Tool

Waste Incineration - Cr - BAT34-XVIII
type: Concept
notation: WI-Cr-BAT34-XVIII
definition: Waste management reducing chromium to water. The BAT-AEL emission level is 0.01�0.1 mg/l.
status: valid
status modified: 2026-05-06
accepted date: 2026-05-06
in scheme: BATAEL values as defined into the EC BAT-Tool

Waste Incineration - Cu - BAT34-VI
type: Concept
notation: WI-Cu-BAT34-VI
definition: Waste management reducing copper to water. The BAT-AEL emission level is 0.03�0.15 mg/l.
status: valid
status modified: 2026-05-06
accepted date: 2026-05-06
in scheme: BATAEL values as defined into the EC BAT-Tool

Waste Incineration - Cu - BAT34-XIX
type: Concept
notation: WI-Cu-BAT34-XIX
definition: Waste management reducing copper to water. The BAT-AEL emission level is 0.03�0.15 mg/l.
status: valid
status modified: 2026-05-06
accepted date: 2026-05-06
in scheme: BATAEL values as defined into the EC BAT-Tool

Waste Incineration - Dust - BAT25-I
type: Concept
notation: WI-Dust-BAT25-I
definition: Waste management reducing dust emissions to air. The BAT-AEL emission level is 2�5 mg/Nm3.
status: valid
status modified: 2026-05-06
accepted date: 2026-05-06
in scheme: BATAEL values as defined into the EC BAT-Tool

Waste Incineration - Dust - BAT26
type: Concept
notation: WI-Dust-BAT26
definition: Waste management reducing dust emissions to air. The BAT-AEL emission level is 2-5 mg/Nm3.
status: valid
status modified: 2026-05-06
accepted date: 2026-05-06
in scheme: BATAEL values as defined into the EC BAT-Tool

Waste Incineration - HCI - BAT28-I
type: Concept
notation: WI-HCI-BAT28-I
definition: Waste management reducing hydrogen chloride emissions to air. The BAT-AEL emission level is < 2�8 mg/Nm3.
status: valid
status modified: 2026-05-06
accepted date: 2026-05-06
in scheme: BATAEL values as defined into the EC BAT-Tool

Waste Incineration - HCI - BAT28-II
type: Concept
notation: WI-HCI-BAT28-II
definition: Waste management reducing hydrogen chloride emissions to air. The BAT-AEL emission level is <2�6 mg/Nm3.
status: valid
status modified: 2026-05-06
accepted date: 2026-05-06
in scheme: BATAEL values as defined into the EC BAT-Tool

Surface Treatment using organic solvents including preservation of wood and wood products with chemicals - BAT 27
type: Concept
notation: STS-TVOC-BAT27-I
definition: 6, Other activities: 6.7 Surface treatment of substances, objects or products using organic solvents, in particular for dressing, printing, coating, degreasing, waterproofing, sizing, painting, cleaning or impregnating, with an organic solvent consumption capacity of more than 150 kg per hour or more than 200 tonnes per year. 6.10: Preservation of wood and wood products with chemicals with a production capacity exceeding 75 m3 per day other than exclusively treating against sapstain. 6.11: Independently operated treatment of waste water not covered by Directive 91/271/EEC provided that the main pollutant load originates from activities specified in point 6.7 or 6.10 of Annex I to Directive 2010/75/EU; Reducing total volatile organic compounds emissions to air. The BAT-AEL emission level is 1�3.3 g VOCs per kg of coated wire.
status: valid
status modified: 2026-05-06
accepted date: 2026-05-06
in scheme: BATAEL values as defined into the EC BAT-Tool

Surface Treatment using organic solvents including preservation of wood and wood products with chemicals - BAT 27
type: Concept
notation: STS-TVOC-BAT27-II
definition: 6, Other activities: 6.7 Surface treatment of substances, objects or products using organic solvents, in particular for dressing, printing, coating, degreasing, waterproofing, sizing, painting, cleaning or impregnating, with an organic solvent consumption capacity of more than 150 kg per hour or more than 200 tonnes per year. 6.10: Preservation of wood and wood products with chemicals with a production capacity exceeding 75 m3 per day other than exclusively treating against sapstain. 6.11: Independently operated treatment of waste water not covered by Directive 91/271/EEC provided that the main pollutant load originates from activities specified in point 6.7 or 6.10 of Annex I to Directive 2010/75/EU; Reducing total volatile organic compounds emissions to air. The BAT-AEL emission level is 5�40 mg C/Nm3.
status: valid
status modified: 2026-05-06
accepted date: 2026-05-06
in scheme: BATAEL values as defined into the EC BAT-Tool

Surface Treatment using organic solvents including preservation of wood and wood products with chemicals - BAT 27
type: Concept
notation: STS-TVOC-BAT27-III
definition: 6, Other activities: 6.7 Surface treatment of substances, objects or products using organic solvents, in particular for dressing, printing, coating, degreasing, waterproofing, sizing, painting, cleaning or impregnating, with an organic solvent consumption capacity of more than 150 kg per hour or more than 200 tonnes per year. 6.10: Preservation of wood and wood products with chemicals with a production capacity exceeding 75 m3 per day other than exclusively treating against sapstain. 6.11: Independently operated treatment of waste water not covered by Directive 91/271/EEC provided that the main pollutant load originates from activities specified in point 6.7 or 6.10 of Annex I to Directive 2010/75/EU; Reducing total volatile organic compounds emissions to air. The BAT-AEL emission level is < 1�3.5 g VOCs per m2 of coated/printed surface.
status: valid
status modified: 2026-05-06
accepted date: 2026-05-06
in scheme: BATAEL values as defined into the EC BAT-Tool

Surface Treatment using organic solvents including preservation of wood and wood products with chemicals - BAT 27
type: Concept
notation: STS-TVOC-BAT27-IV
definition: 6, Other activities: 6.7 Surface treatment of substances, objects or products using organic solvents, in particular for dressing, printing, coating, degreasing, waterproofing, sizing, painting, cleaning or impregnating, with an organic solvent consumption capacity of more than 150 kg per hour or more than 200 tonnes per year. 6.10: Preservation of wood and wood products with chemicals with a production capacity exceeding 75 m3 per day other than exclusively treating against sapstain. 6.11: Independently operated treatment of waste water not covered by Directive 91/271/EEC provided that the main pollutant load originates from activities specified in point 6.7 or 6.10 of Annex I to Directive 2010/75/EU; Reducing total volatile organic compounds emissions to air. The BAT-AEL emission level is < 1�12 % of the solvent input.
status: valid
status modified: 2026-05-06
accepted date: 2026-05-06
in scheme: BATAEL values as defined into the EC BAT-Tool

Surface Treatment using organic solvents including preservation of wood and wood products with chemicals - BAT 27
type: Concept
notation: STS-TVOC-BAT27-V
definition: 6, Other activities: 6.7 Surface treatment of substances, objects or products using organic solvents, in particular for dressing, printing, coating, degreasing, waterproofing, sizing, painting, cleaning or impregnating, with an organic solvent consumption capacity of more than 150 kg per hour or more than 200 tonnes per year. 6.10: Preservation of wood and wood products with chemicals with a production capacity exceeding 75 m3 per day other than exclusively treating against sapstain. 6.11: Independently operated treatment of waste water not covered by Directive 91/271/EEC provided that the main pollutant load originates from activities specified in point 6.7 or 6.10 of Annex I to Directive 2010/75/EU; Reducing total volatile organic compounds emissions to air. The BAT-AEL emission level is 1�20 mg C/Nm3.
status: valid
status modified: 2026-05-06
accepted date: 2026-05-06
in scheme: BATAEL values as defined into the EC BAT-Tool

Waste Incineration - HF - BAT28-III
type: Concept
notation: WI-HF-BAT28-III
definition: Waste management reducing hydrogen fluoride emissions to air. The BAT-AEL emission level is < 1 mg/Nm3.
status: valid
status modified: 2026-05-06
accepted date: 2026-05-06
in scheme: BATAEL values as defined into the EC BAT-Tool

Waste Incineration - HF - BAT28-IV
type: Concept
notation: WI-HF-BAT28-IV
definition: Waste management reducing hydrogen fluoride emissions to air. The BAT-AEL emission level is < 1 mg/Nm3.
status: valid
status modified: 2026-05-06
accepted date: 2026-05-06
in scheme: BATAEL values as defined into the EC BAT-Tool

Waste Incineration - Hg - BAT31-I
type: Concept
notation: WI-Hg-BAT31-I
definition: Waste management reducing sulphur dioxide (SO2) emissions to air. The BAT-AEL emission level is 1�10 �g/Nm3.
status: valid
status modified: 2026-05-06
accepted date: 2026-05-06
in scheme: BATAEL values as defined into the EC BAT-Tool

Waste Incineration - Hg - BAT31-II
type: Concept
notation: WI-Hg-BAT31-II
definition: Waste management reducing sulphur dioxide (SO2) emissions to air. The BAT-AEL emission level is < 5�20 �g/Nm3.
status: valid
status modified: 2026-05-06
accepted date: 2026-05-06
in scheme: BATAEL values as defined into the EC BAT-Tool

Waste Incineration - Hg - BAT34-VII
type: Concept
notation: WI-Hg-BAT34-VII
definition: Waste management reducing sulphur dioxide (SO2) to water. The BAT-AEL emission level is 0.001�0.01 mg/l.
status: valid
status modified: 2026-05-06
accepted date: 2026-05-06
in scheme: BATAEL values as defined into the EC BAT-Tool

Waste Incineration - Hg - BAT34-XX
type: Concept
notation: WI-Hg-BAT34-XX
definition: Waste management reducing sulphur dioxide (SO2) to water. The BAT-AEL emission level is 0.001�0.01 mg/l.
status: valid
status modified: 2026-05-06
accepted date: 2026-05-06
in scheme: BATAEL values as defined into the EC BAT-Tool

Waste Incineration - NH3 - BAT29-IV
type: Concept
notation: WI-NH3-BAT29-IV
definition: Waste management reducing total nitrogen emissions to air. The BAT-AEL emission level is 2�10 mg/Nm3.
status: valid
status modified: 2026-05-06
accepted date: 2026-05-06
in scheme: BATAEL values as defined into the EC BAT-Tool

Waste Incineration - NH4-N - BAT34-XIII
type: Concept
notation: WI-NH4-N-BAT34-XIII
definition: Waste management reducing total nitrogen to water. The BAT-AEL emission level is 10�30 mg/l.
status: valid
status modified: 2026-05-06
accepted date: 2026-05-06
in scheme: BATAEL values as defined into the EC BAT-Tool

Waste Incineration - NOx - BAT29-I
type: Concept
notation: WI-NOx-BAT29-I
definition: Waste management reducing nitrogen oxides emissions to air. The BAT-AEL emission level is 50�150 mg/Nm3.
status: valid
status modified: 2026-05-06
accepted date: 2026-05-06
in scheme: BATAEL values as defined into the EC BAT-Tool

Waste Incineration - NOx - BAT29-II
type: Concept
notation: WI-NOx-BAT29-II
definition: Waste management reducing nitrogen oxides emissions to air. The BAT-AEL emission level is 50�120 mg/Nm3.
status: valid
status modified: 2026-05-06
accepted date: 2026-05-06
in scheme: BATAEL values as defined into the EC BAT-Tool

Waste Incineration - Ni - BAT34-VIII
type: Concept
notation: WI-Ni-BAT34-VIII
definition: Waste management reducing nickel to water. The BAT-AEL emission level is 0.03�0.15 mg/l.
status: valid
status modified: 2026-05-06
accepted date: 2026-05-06
in scheme: BATAEL values as defined into the EC BAT-Tool

Waste Incineration - Ni - BAT34-XXI
type: Concept
notation: WI-Ni-BAT34-XXI
definition: Waste management reducing nickel to water. The BAT-AEL emission level is 0.03�0.15 mg/l.
status: valid
status modified: 2026-05-06
accepted date: 2026-05-06
in scheme: BATAEL values as defined into the EC BAT-Tool

Surface Treatment using organic solvents including preservation of wood and wood products with chemicals - BAT 28
type: Concept
notation: STS-TVOC-BAT28-I
definition: 6, Other activities: 6.7 Surface treatment of substances, objects or products using organic solvents, in particular for dressing, printing, coating, degreasing, waterproofing, sizing, painting, cleaning or impregnating, with an organic solvent consumption capacity of more than 150 kg per hour or more than 200 tonnes per year. 6.10: Preservation of wood and wood products with chemicals with a production capacity exceeding 75 m3 per day other than exclusively treating against sapstain. 6.11: Independently operated treatment of waste water not covered by Directive 91/271/EEC provided that the main pollutant load originates from activities specified in point 6.7 or 6.10 of Annex I to Directive 2010/75/EU; Reducing total volatile organic compounds emissions to air. The BAT-AEL emission level is < 0.01�0.04 kg VOCs per kg of ink input.
status: valid
status modified: 2026-05-06
accepted date: 2026-05-06
in scheme: BATAEL values as defined into the EC BAT-Tool

Surface Treatment using organic solvents including preservation of wood and wood products with chemicals - BAT 28
type: Concept
notation: STS-TVOC-BAT28-II
definition: 6, Other activities: 6.7 Surface treatment of substances, objects or products using organic solvents, in particular for dressing, printing, coating, degreasing, waterproofing, sizing, painting, cleaning or impregnating, with an organic solvent consumption capacity of more than 150 kg per hour or more than 200 tonnes per year. 6.10: Preservation of wood and wood products with chemicals with a production capacity exceeding 75 m3 per day other than exclusively treating against sapstain. 6.11: Independently operated treatment of waste water not covered by Directive 91/271/EEC provided that the main pollutant load originates from activities specified in point 6.7 or 6.10 of Annex I to Directive 2010/75/EU; Reducing total volatile organic compounds emissions to air. The BAT-AEL emission level is < 1�10 % of the solvent input.
status: valid
status modified: 2026-05-06
accepted date: 2026-05-06
in scheme: BATAEL values as defined into the EC BAT-Tool

Surface Treatment using organic solvents including preservation of wood and wood products with chemicals - BAT 28
type: Concept
notation: STS-TVOC-BAT28-III
definition: 6, Other activities: 6.7 Surface treatment of substances, objects or products using organic solvents, in particular for dressing, printing, coating, degreasing, waterproofing, sizing, painting, cleaning or impregnating, with an organic solvent consumption capacity of more than 150 kg per hour or more than 200 tonnes per year. 6.10: Preservation of wood and wood products with chemicals with a production capacity exceeding 75 m3 per day other than exclusively treating against sapstain. 6.11: Independently operated treatment of waste water not covered by Directive 91/271/EEC provided that the main pollutant load originates from activities specified in point 6.7 or 6.10 of Annex I to Directive 2010/75/EU; Reducing total volatile organic compounds emissions to air. The BAT-AEL emission level is 1�15 mg C/Nm3.
status: valid
status modified: 2026-05-06
accepted date: 2026-05-06
in scheme: BATAEL values as defined into the EC BAT-Tool

Surface Treatment using organic solvents including preservation of wood and wood products with chemicals - BAT 28
type: Concept
notation: STS-TVOC-BAT28-IV
definition: 6, Other activities: 6.7 Surface treatment of substances, objects or products using organic solvents, in particular for dressing, printing, coating, degreasing, waterproofing, sizing, painting, cleaning or impregnating, with an organic solvent consumption capacity of more than 150 kg per hour or more than 200 tonnes per year. 6.10: Preservation of wood and wood products with chemicals with a production capacity exceeding 75 m3 per day other than exclusively treating against sapstain. 6.11: Independently operated treatment of waste water not covered by Directive 91/271/EEC provided that the main pollutant load originates from activities specified in point 6.7 or 6.10 of Annex I to Directive 2010/75/EU; Reducing total volatile organic compounds emissions to air. The BAT-AEL emission level is < 0.1�0.3 kg VOCs per kg of solid mass input.
status: valid
status modified: 2026-05-06
accepted date: 2026-05-06
in scheme: BATAEL values as defined into the EC BAT-Tool

Surface Treatment using organic solvents including preservation of wood and wood products with chemicals - BAT 28
type: Concept
notation: STS-TVOC-BAT28-V
definition: 6, Other activities: 6.7 Surface treatment of substances, objects or products using organic solvents, in particular for dressing, printing, coating, degreasing, waterproofing, sizing, painting, cleaning or impregnating, with an organic solvent consumption capacity of more than 150 kg per hour or more than 200 tonnes per year. 6.10: Preservation of wood and wood products with chemicals with a production capacity exceeding 75 m3 per day other than exclusively treating against sapstain. 6.11: Independently operated treatment of waste water not covered by Directive 91/271/EEC provided that the main pollutant load originates from activities specified in point 6.7 or 6.10 of Annex I to Directive 2010/75/EU; Reducing total volatile organic compounds emissions to air. The BAT-AEL emission level is < 1�12 % of the solvent input.
status: valid
status modified: 2026-05-06
accepted date: 2026-05-06
in scheme: BATAEL values as defined into the EC BAT-Tool

Waste Incineration - PCDDF - BAT30-II
type: Concept
notation: WI-PCDDF-BAT30-II
definition: Waste management reducing polychlorinaned dibenzo- dioxins and - furans emissions to air. The BAT-AEL emission level is < 0.01�0.06 ng I-TEQ/Nm3 for the average over the sampling period < 0.01�0.08 ng I-TEQ/Nm3 for the long-term sampling period.
status: valid
status modified: 2026-05-06
accepted date: 2026-05-06
in scheme: BATAEL values as defined into the EC BAT-Tool

Waste Incineration - PCDDF - BAT30-III
type: Concept
notation: WI-PCDDF-BAT30-III
definition: Waste management reducing polychlorinaned dibenzo- dioxins and - furans emissions to air. The BAT-AEL emission level is < 0.01�0.04 ng I-TEQ/Nm3 for the average over the sampling period < 0.01�0.06 ng I-TEQ/Nm3 for the long-term sampling period.
status: valid
status modified: 2026-05-06
accepted date: 2026-05-06
in scheme: BATAEL values as defined into the EC BAT-Tool

Waste Incineration - PCDDF - BAT34-XV
type: Concept
notation: WI-PCDDF-BAT34-XV
definition: Waste management reducing polychlorinaned dibenzo- dioxins and - furans to water. The BAT-AEL emission level is 0.01�0.05 ng I-TEQ/l.
status: valid
status modified: 2026-05-06
accepted date: 2026-05-06
in scheme: BATAEL values as defined into the EC BAT-Tool

Waste Incineration - PCDDFdioxin - BAT30-IV
type: Concept
notation: WI-PCDDFdioxin-BAT30-IV
definition: Waste management reducing polychlorinaned dibenzo-dioxins and -furans + Polychlorinated biphenyls emissions to air. The BAT-AEL emission level is < 0.01�0.08 ng WHO-TEQ/Nm3 for the average over the sampling period < 0.01�0.1 ng WHO-TEQ/Nm3 for the long-term sampling period.
status: valid
status modified: 2026-05-06
accepted date: 2026-05-06
in scheme: BATAEL values as defined into the EC BAT-Tool

Waste Incineration - PCDDFdioxin - BAT30-V
type: Concept
notation: WI-PCDDFdioxin-BAT30-V
definition: Waste management reducing polychlorinaned dibenzo-dioxins and -furans + Polychlorinated biphenyls emissions to air. The BAT-AEL emission level is < 0.01�0.06 ng WHO-TEQ/Nm3 for the average over the sampling period < 0.01�0.08 ng WHO-TEQ/Nm3 for the long-term sampling period.
status: valid
status modified: 2026-05-06
accepted date: 2026-05-06
in scheme: BATAEL values as defined into the EC BAT-Tool

Waste Incineration - Pb - BAT34-IX
type: Concept
notation: WI-Pb-BAT34-IX
definition: Waste management reducing lead to water. The BAT-AEL emission level is 0.02�0.06 mg/l.
status: valid
status modified: 2026-05-06
accepted date: 2026-05-06
in scheme: BATAEL values as defined into the EC BAT-Tool

Waste Incineration - Pb - BAT34-XXII
type: Concept
notation: WI-Pb-BAT34-XXII
definition: Waste management reducing lead to water. The BAT-AEL emission level is 0.02�0.06 mg/l.
status: valid
status modified: 2026-05-06
accepted date: 2026-05-06
in scheme: BATAEL values as defined into the EC BAT-Tool

Waste Incineration - SO2 - BAT28-V
type: Concept
notation: WI-SO2-BAT28-V
definition: Waste management reducing sulphur dioxide (SO2) emissions to air. The BAT-AEL emission level is 5�40 mg/Nm3.
status: valid
status modified: 2026-05-06
accepted date: 2026-05-06
in scheme: BATAEL values as defined into the EC BAT-Tool

Surface Treatment using organic solvents including preservation of wood and wood products with chemicals - BAT 28
type: Concept
notation: STS-TVOC-BAT28-VI
definition: 6, Other activities: 6.7 Surface treatment of substances, objects or products using organic solvents, in particular for dressing, printing, coating, degreasing, waterproofing, sizing, painting, cleaning or impregnating, with an organic solvent consumption capacity of more than 150 kg per hour or more than 200 tonnes per year. 6.10: Preservation of wood and wood products with chemicals with a production capacity exceeding 75 m3 per day other than exclusively treating against sapstain. 6.11: Independently operated treatment of waste water not covered by Directive 91/271/EEC provided that the main pollutant load originates from activities specified in point 6.7 or 6.10 of Annex I to Directive 2010/75/EU; Reducing total volatile organic compounds emissions to air. The BAT-AEL emission level is 1�20 mg C/Nm3.
status: valid
status modified: 2026-05-06
accepted date: 2026-05-06
in scheme: BATAEL values as defined into the EC BAT-Tool

Surface Treatment using organic solvents including preservation of wood and wood products with chemicals - BAT 28
type: Concept
notation: STS-TVOC-BAT28-VII
definition: 6, Other activities: 6.7 Surface treatment of substances, objects or products using organic solvents, in particular for dressing, printing, coating, degreasing, waterproofing, sizing, painting, cleaning or impregnating, with an organic solvent consumption capacity of more than 150 kg per hour or more than 200 tonnes per year. 6.10: Preservation of wood and wood products with chemicals with a production capacity exceeding 75 m3 per day other than exclusively treating against sapstain. 6.11: Independently operated treatment of waste water not covered by Directive 91/271/EEC provided that the main pollutant load originates from activities specified in point 6.7 or 6.10 of Annex I to Directive 2010/75/EU; Reducing total volatile organic compounds emissions to air. The BAT-AEL emission level is 50 mg C/Nm3.
status: valid
status modified: 2026-05-06
accepted date: 2026-05-06
in scheme: BATAEL values as defined into the EC BAT-Tool

Surface Treatment using organic solvents including preservation of wood and wood products with chemicals - BAT 29
type: Concept
notation: STS-TVOC-BAT29-I
definition: 6, Other activities: 6.7 Surface treatment of substances, objects or products using organic solvents, in particular for dressing, printing, coating, degreasing, waterproofing, sizing, painting, cleaning or impregnating, with an organic solvent consumption capacity of more than 150 kg per hour or more than 200 tonnes per year. 6.10: Preservation of wood and wood products with chemicals with a production capacity exceeding 75 m3 per day other than exclusively treating against sapstain. 6.11: Independently operated treatment of waste water not covered by Directive 91/271/EEC provided that the main pollutant load originates from activities specified in point 6.7 or 6.10 of Annex I to Directive 2010/75/EU; Reducing total volatile organic compounds emissions to air. The BAT-AEL emission level is < 2.5 % of the solvent input.
status: valid
status modified: 2026-05-06
accepted date: 2026-05-06
in scheme: BATAEL values as defined into the EC BAT-Tool

Surface Treatment using organic solvents including preservation of wood and wood products with chemicals - BAT 29
type: Concept
notation: STS-TVOC-BAT29-II
definition: 6, Other activities: 6.7 Surface treatment of substances, objects or products using organic solvents, in particular for dressing, printing, coating, degreasing, waterproofing, sizing, painting, cleaning or impregnating, with an organic solvent consumption capacity of more than 150 kg per hour or more than 200 tonnes per year. 6.10: Preservation of wood and wood products with chemicals with a production capacity exceeding 75 m3 per day other than exclusively treating against sapstain. 6.11: Independently operated treatment of waste water not covered by Directive 91/271/EEC provided that the main pollutant load originates from activities specified in point 6.7 or 6.10 of Annex I to Directive 2010/75/EU; Reducing total volatile organic compounds emissions to air. The BAT-AEL emission level is 10�20 mg C/Nm3.
status: valid
status modified: 2026-05-06
accepted date: 2026-05-06
in scheme: BATAEL values as defined into the EC BAT-Tool

Surface Treatment using organic solvents including preservation of wood and wood products with chemicals - BAT 29
type: Concept
notation: STS-TVOC-BAT29-III
definition: 6, Other activities: 6.7 Surface treatment of substances, objects or products using organic solvents, in particular for dressing, printing, coating, degreasing, waterproofing, sizing, painting, cleaning or impregnating, with an organic solvent consumption capacity of more than 150 kg per hour or more than 200 tonnes per year. 6.10: Preservation of wood and wood products with chemicals with a production capacity exceeding 75 m3 per day other than exclusively treating against sapstain. 6.11: Independently operated treatment of waste water not covered by Directive 91/271/EEC provided that the main pollutant load originates from activities specified in point 6.7 or 6.10 of Annex I to Directive 2010/75/EU; Reducing total volatile organic compounds emissions to air. The BAT-AEL emission level is < 0.1 kg VOCs per kg of solid mass input.
status: valid
status modified: 2026-05-06
accepted date: 2026-05-06
in scheme: BATAEL values as defined into the EC BAT-Tool

Waste Incineration - SO2 - BAT28-VI
type: Concept
notation: WI-SO2-BAT28-VI
definition: Waste management reducing sulphur dioxide (SO2) emissions to air. The BAT-AEL emission level is 5�30 mg/Nm3.
status: valid
status modified: 2026-05-06
accepted date: 2026-05-06
in scheme: BATAEL values as defined into the EC BAT-Tool

Waste Incineration - SO4 - BAT34-XIV
type: Concept
notation: WI-SO4-BAT34-XIV
definition: Waste management reducing sulphates to water. The BAT-AEL emission level is 1400�1 000 mg/l.
status: valid
status modified: 2026-05-06
accepted date: 2026-05-06
in scheme: BATAEL values as defined into the EC BAT-Tool

Waste Incineration - Sb - BAT34-X
type: Concept
notation: WI-Sb-BAT34-X
definition: Waste management reducing antimony to water. The BAT-AEL emission level is 0.02�0.9 mg/l.
status: valid
status modified: 2026-05-06
accepted date: 2026-05-06
in scheme: BATAEL values as defined into the EC BAT-Tool

Waste Incineration - Sb - BAT34-XXIII
type: Concept
notation: WI-Sb-BAT34-XXIII
definition: Waste management reducing antimony to water. The BAT-AEL emission level is 0.02�0.9 mg/l.
status: valid
status modified: 2026-05-06
accepted date: 2026-05-06
in scheme: BATAEL values as defined into the EC BAT-Tool

Waste Incineration - SbAsPbCrCoCuMnNiV - BAT25-III
type: Concept
notation: WI-SbAsPbCrCoCuMnNiV-BAT25-III
definition: Waste management reducing metals emissions to air. The BAT-AEL emission level is 0.01�0.3 mg/Nm3.
status: valid
status modified: 2026-05-06
accepted date: 2026-05-06
in scheme: BATAEL values as defined into the EC BAT-Tool

Waste Incineration - TOC - BAT34-II
type: Concept
notation: WI-TOC-BAT34-II
definition: Waste management reducing total organic carbon (TOC) to water. The BAT-AEL emission level is 15�40 mg/l.
status: valid
status modified: 2026-05-06
accepted date: 2026-05-06
in scheme: BATAEL values as defined into the EC BAT-Tool

Waste Incineration - TSS - BAT34-I
type: Concept
notation: WI-TSS-BAT34-I
definition: Waste management reducing total suspended solids to water. The BAT-AEL emission level is 10�30 mg/l.
status: valid
status modified: 2026-05-06
accepted date: 2026-05-06
in scheme: BATAEL values as defined into the EC BAT-Tool

Waste Incineration - Tl - BAT34-XI
type: Concept
notation: WI-Tl-BAT34-XI
definition: Waste management reducing thallium to water. The BAT-AEL emission level is 0.005�0.03 mg/l.
status: valid
status modified: 2026-05-06
accepted date: 2026-05-06
in scheme: BATAEL values as defined into the EC BAT-Tool

Waste Incineration - Tl - BAT34-XXIV
type: Concept
notation: WI-Tl-BAT34-XXIV
definition: Waste management reducing thallium to water. The BAT-AEL emission level is 0.005�0.03 mg/l.
status: valid
status modified: 2026-05-06
accepted date: 2026-05-06
in scheme: BATAEL values as defined into the EC BAT-Tool

Waste Incineration - Zn - BAT34-XII
type: Concept
notation: WI-Zn-BAT34-XII
definition: Waste management reducing zinc to water. The BAT-AEL emission level is 0.01�0.5 mg/l.
status: valid
status modified: 2026-05-06
accepted date: 2026-05-06
in scheme: BATAEL values as defined into the EC BAT-Tool

Waste Incineration - Zn - BAT34-XXV
type: Concept
notation: WI-Zn-BAT34-XXV
definition: Waste management reducing zinc to water. The BAT-AEL emission level is 0.01�0.5 mg/l.
status: valid
status modified: 2026-05-06
accepted date: 2026-05-06
in scheme: BATAEL values as defined into the EC BAT-Tool

Surface Treatment using organic solvents including preservation of wood and wood products with chemicals - BAT 29
type: Concept
notation: STS-TVOC-BAT29-IV
definition: 6, Other activities: 6.7 Surface treatment of substances, objects or products using organic solvents, in particular for dressing, printing, coating, degreasing, waterproofing, sizing, painting, cleaning or impregnating, with an organic solvent consumption capacity of more than 150 kg per hour or more than 200 tonnes per year. 6.10: Preservation of wood and wood products with chemicals with a production capacity exceeding 75 m3 per day other than exclusively treating against sapstain. 6.11: Independently operated treatment of waste water not covered by Directive 91/271/EEC provided that the main pollutant load originates from activities specified in point 6.7 or 6.10 of Annex I to Directive 2010/75/EU; Reducing total volatile organic compounds emissions to air. The BAT-AEL emission level is < 0.25 kg VOCs per kg of solid mass input.
status: valid
status modified: 2026-05-06
accepted date: 2026-05-06
in scheme: BATAEL values as defined into the EC BAT-Tool

Surface Treatment using organic solvents including preservation of wood and wood products with chemicals - BAT 29
type: Concept
notation: STS-TVOC-BAT29-V
definition: 6, Other activities: 6.7 Surface treatment of substances, objects or products using organic solvents, in particular for dressing, printing, coating, degreasing, waterproofing, sizing, painting, cleaning or impregnating, with an organic solvent consumption capacity of more than 150 kg per hour or more than 200 tonnes per year. 6.10: Preservation of wood and wood products with chemicals with a production capacity exceeding 75 m3 per day other than exclusively treating against sapstain. 6.11: Independently operated treatment of waste water not covered by Directive 91/271/EEC provided that the main pollutant load originates from activities specified in point 6.7 or 6.10 of Annex I to Directive 2010/75/EU; Reducing total volatile organic compounds emissions to air. The BAT-AEL emission level is < 10 % of the solvent input.
status: valid
status modified: 2026-05-06
accepted date: 2026-05-06
in scheme: BATAEL values as defined into the EC BAT-Tool

Surface Treatment using organic solvents including preservation of wood and wood products with chemicals - BAT 29
type: Concept
notation: STS-TVOC-BAT29-VI
definition: 6, Other activities: 6.7 Surface treatment of substances, objects or products using organic solvents, in particular for dressing, printing, coating, degreasing, waterproofing, sizing, painting, cleaning or impregnating, with an organic solvent consumption capacity of more than 150 kg per hour or more than 200 tonnes per year. 6.10: Preservation of wood and wood products with chemicals with a production capacity exceeding 75 m3 per day other than exclusively treating against sapstain. 6.11: Independently operated treatment of waste water not covered by Directive 91/271/EEC provided that the main pollutant load originates from activities specified in point 6.7 or 6.10 of Annex I to Directive 2010/75/EU; Reducing total volatile organic compounds emissions to air. The BAT-AEL emission level is 5-20 mg C/Nm3.
status: valid
status modified: 2026-05-06
accepted date: 2026-05-06
in scheme: BATAEL values as defined into the EC BAT-Tool

Surface Treatment using organic solvents including preservation of wood and wood products with chemicals - BAT 51
type: Concept
notation: STS-TVOC-BAT51
definition: 6, Other activities: 6.7 Surface treatment of substances, objects or products using organic solvents, in particular for dressing, printing, coating, degreasing, waterproofing, sizing, painting, cleaning or impregnating, with an organic solvent consumption capacity of more than 150 kg per hour or more than 200 tonnes per year. 6.10: Preservation of wood and wood products with chemicals with a production capacity exceeding 75 m3 per day other than exclusively treating against sapstain. 6.11: Independently operated treatment of waste water not covered by Directive 91/271/EEC provided that the main pollutant load originates from activities specified in point 6.7 or 6.10 of Annex I to Directive 2010/75/EU; Reducing total volatile organic compounds emissions to air. The BAT-AEL emission level is < 4�20 mg C/Nm3.
status: valid
status modified: 2026-05-06
accepted date: 2026-05-06
in scheme: BATAEL values as defined into the EC BAT-Tool

Surface Treatment using organic solvents including preservation of wood and wood products with chemicals - BAT 21
type: Concept
notation: STS-Zn-BAT21-I
definition: 6, Other activities: 6.7 Surface treatment of substances, objects or products using organic solvents, in particular for dressing, printing, coating, degreasing, waterproofing, sizing, painting, cleaning or impregnating, with an organic solvent consumption capacity of more than 150 kg per hour or more than 200 tonnes per year. 6.10: Preservation of wood and wood products with chemicals with a production capacity exceeding 75 m3 per day other than exclusively treating against sapstain. 6.11: Independently operated treatment of waste water not covered by Directive 91/271/EEC provided that the main pollutant load originates from activities specified in point 6.7 or 6.10 of Annex I to Directive 2010/75/EU; Reducing zinc to water. The BAT-AEL emission level is 0.05�0.6 mg/l.
status: valid
status modified: 2026-05-06
accepted date: 2026-05-06
in scheme: BATAEL values as defined into the EC BAT-Tool

Surface Treatment using organic solvents including preservation of wood and wood products with chemicals - BAT 21
type: Concept
notation: STS-Zn-BAT21-II
definition: 6, Other activities: 6.7 Surface treatment of substances, objects or products using organic solvents, in particular for dressing, printing, coating, degreasing, waterproofing, sizing, painting, cleaning or impregnating, with an organic solvent consumption capacity of more than 150 kg per hour or more than 200 tonnes per year. 6.10: Preservation of wood and wood products with chemicals with a production capacity exceeding 75 m3 per day other than exclusively treating against sapstain. 6.11: Independently operated treatment of waste water not covered by Directive 91/271/EEC provided that the main pollutant load originates from activities specified in point 6.7 or 6.10 of Annex I to Directive 2010/75/EU; Reducing zinc to water. The BAT-AEL emission level is 0.05�0.6 mg/l.
status: valid
status modified: 2026-05-06
accepted date: 2026-05-06
in scheme: BATAEL values as defined into the EC BAT-Tool

Waste Treatment - AOX - BAT20-XIV
type: Concept
notation: WT-AOX-BAT20-XIV
definition: 5.� Waste management; 6. Other activities: 5.1. Disposal or recovery of hazardous waste with a capacity exceeding 10 tonnes per day involving one or more of the following activities: (a)-(j) (see scope); 5.3. (a) Disposal of non-hazardous waste with a capacity exceeding 50 tonnes per day involving one or more of the following activities, and excluding activities covered by Council Directive 91/271/EEC (1): (i)-(v) (see scope). (b) Recovery, or a mix of recovery and disposal, of non-hazardous waste with a capacity exceeding 75 tonnes per day involving one or more of the following activities, and excluding activities covered by Directive 91/271/EEC: (i)-(iv) (see scope). 5.5. Temporary storage of hazardous waste not covered under point 5.4 of Annex I to Directive 2010/75/EU pending any of the activities listed in points 5.1, 5.2, 5.4 and 5.6 of Annex I to Directive 2010/75/EU with a total capacity exceeding 50 tonnes, excluding temporary storage, pending collection, on the site where the waste is generated. 6.11. Independently operated treatment of waste water not covered by Directive 91/271/EEC and discharged by an installation undertaking activities covered under points 5.1, 5.3 or 5.5 as listed above. Reducing adsorbable organically bound halogens to water. The BAT-AEL emission level is 0,2-1 mg/l .
status: valid
status modified: 2026-05-06
accepted date: 2026-05-06
in scheme: BATAEL values as defined into the EC BAT-Tool

Waste Treatment - AOX - BAT20-XXXIV
type: Concept
notation: WT-AOX-BAT20-XXXIV
definition: 5.� Waste management; 6. Other activities: 5.1. Disposal or recovery of hazardous waste with a capacity exceeding 10 tonnes per day involving one or more of the following activities: (a)-(j) (see scope); 5.3. (a) Disposal of non-hazardous waste with a capacity exceeding 50 tonnes per day involving one or more of the following activities, and excluding activities covered by Council Directive 91/271/EEC (1): (i)-(v) (see scope). (b) Recovery, or a mix of recovery and disposal, of non-hazardous waste with a capacity exceeding 75 tonnes per day involving one or more of the following activities, and excluding activities covered by Directive 91/271/EEC: (i)-(iv) (see scope). 5.5. Temporary storage of hazardous waste not covered under point 5.4 of Annex I to Directive 2010/75/EU pending any of the activities listed in points 5.1, 5.2, 5.4 and 5.6 of Annex I to Directive 2010/75/EU with a total capacity exceeding 50 tonnes, excluding temporary storage, pending collection, on the site where the waste is generated. 6.11. Independently operated treatment of waste water not covered by Directive 91/271/EEC and discharged by an installation undertaking activities covered under points 5.1, 5.3 or 5.5 as listed above. Reducing adsorbable organically bound halogens to water. The BAT-AEL emission level is 0,2-1 mg/l .
status: valid
status modified: 2026-05-06
accepted date: 2026-05-06
in scheme: BATAEL values as defined into the EC BAT-Tool

Waste Treatment - As - BAT20-XLIII
type: Concept
notation: WT-As-BAT20-XLIII
definition: 5.� Waste management; 6. Other activities: 5.1. Disposal or recovery of hazardous waste with a capacity exceeding 10 tonnes per day involving one or more of the following activities: (a)-(j) (see scope); 5.3. (a) Disposal of non-hazardous waste with a capacity exceeding 50 tonnes per day involving one or more of the following activities, and excluding activities covered by Council Directive 91/271/EEC (1): (i)-(v) (see scope). (b) Recovery, or a mix of recovery and disposal, of non-hazardous waste with a capacity exceeding 75 tonnes per day involving one or more of the following activities, and excluding activities covered by Directive 91/271/EEC: (i)-(iv) (see scope). 5.5. Temporary storage of hazardous waste not covered under point 5.4 of Annex I to Directive 2010/75/EU pending any of the activities listed in points 5.1, 5.2, 5.4 and 5.6 of Annex I to Directive 2010/75/EU with a total capacity exceeding 50 tonnes, excluding temporary storage, pending collection, on the site where the waste is generated. 6.11. Independently operated treatment of waste water not covered by Directive 91/271/EEC and discharged by an installation undertaking activities covered under points 5.1, 5.3 or 5.5 as listed above. Reducing arsenic to water. The BAT-AEL emission level is 0,01-0,1 mg/l.
status: valid
status modified: 2026-05-06
accepted date: 2026-05-06
in scheme: BATAEL values as defined into the EC BAT-Tool

Waste Treatment - As - BAT20-XV
type: Concept
notation: WT-As-BAT20-XV
definition: 5.� Waste management; 6. Other activities: 5.1. Disposal or recovery of hazardous waste with a capacity exceeding 10 tonnes per day involving one or more of the following activities: (a)-(j) (see scope); 5.3. (a) Disposal of non-hazardous waste with a capacity exceeding 50 tonnes per day involving one or more of the following activities, and excluding activities covered by Council Directive 91/271/EEC (1): (i)-(v) (see scope). (b) Recovery, or a mix of recovery and disposal, of non-hazardous waste with a capacity exceeding 75 tonnes per day involving one or more of the following activities, and excluding activities covered by Directive 91/271/EEC: (i)-(iv) (see scope). 5.5. Temporary storage of hazardous waste not covered under point 5.4 of Annex I to Directive 2010/75/EU pending any of the activities listed in points 5.1, 5.2, 5.4 and 5.6 of Annex I to Directive 2010/75/EU with a total capacity exceeding 50 tonnes, excluding temporary storage, pending collection, on the site where the waste is generated. 6.11. Independently operated treatment of waste water not covered by Directive 91/271/EEC and discharged by an installation undertaking activities covered under points 5.1, 5.3 or 5.5 as listed above. Reducing arsenic to water. The BAT-AEL emission level is 0,01-0,05 mg/l .
status: valid
status modified: 2026-05-06
accepted date: 2026-05-06
in scheme: BATAEL values as defined into the EC BAT-Tool

Waste Treatment - As - BAT20-XXIII
type: Concept
notation: WT-As-BAT20-XXIII
definition: 5.� Waste management; 6. Other activities: 5.1. Disposal or recovery of hazardous waste with a capacity exceeding 10 tonnes per day involving one or more of the following activities: (a)-(j) (see scope); 5.3. (a) Disposal of non-hazardous waste with a capacity exceeding 50 tonnes per day involving one or more of the following activities, and excluding activities covered by Council Directive 91/271/EEC (1): (i)-(v) (see scope). (b) Recovery, or a mix of recovery and disposal, of non-hazardous waste with a capacity exceeding 75 tonnes per day involving one or more of the following activities, and excluding activities covered by Directive 91/271/EEC: (i)-(iv) (see scope). 5.5. Temporary storage of hazardous waste not covered under point 5.4 of Annex I to Directive 2010/75/EU pending any of the activities listed in points 5.1, 5.2, 5.4 and 5.6 of Annex I to Directive 2010/75/EU with a total capacity exceeding 50 tonnes, excluding temporary storage, pending collection, on the site where the waste is generated. 6.11. Independently operated treatment of waste water not covered by Directive 91/271/EEC and discharged by an installation undertaking activities covered under points 5.1, 5.3 or 5.5 as listed above. Reducing arsenic to water. The BAT-AEL emission level is 0,01-0,1 mg/l.
status: valid
status modified: 2026-05-06
accepted date: 2026-05-06
in scheme: BATAEL values as defined into the EC BAT-Tool

Waste Treatment - As - BAT20-XXXV
type: Concept
notation: WT-As-BAT20-XXXV
definition: 5.� Waste management; 6. Other activities: 5.1. Disposal or recovery of hazardous waste with a capacity exceeding 10 tonnes per day involving one or more of the following activities: (a)-(j) (see scope); 5.3. (a) Disposal of non-hazardous waste with a capacity exceeding 50 tonnes per day involving one or more of the following activities, and excluding activities covered by Council Directive 91/271/EEC (1): (i)-(v) (see scope). (b) Recovery, or a mix of recovery and disposal, of non-hazardous waste with a capacity exceeding 75 tonnes per day involving one or more of the following activities, and excluding activities covered by Directive 91/271/EEC: (i)-(iv) (see scope). 5.5. Temporary storage of hazardous waste not covered under point 5.4 of Annex I to Directive 2010/75/EU pending any of the activities listed in points 5.1, 5.2, 5.4 and 5.6 of Annex I to Directive 2010/75/EU with a total capacity exceeding 50 tonnes, excluding temporary storage, pending collection, on the site where the waste is generated. 6.11. Independently operated treatment of waste water not covered by Directive 91/271/EEC and discharged by an installation undertaking activities covered under points 5.1, 5.3 or 5.5 as listed above. Reducing arsenic to water. The BAT-AEL emission level is 0,01-0,05 mg/l.
status: valid
status modified: 2026-05-06
accepted date: 2026-05-06
in scheme: BATAEL values as defined into the EC BAT-Tool

Waste Treatment - CFCs - BAT29-II
type: Concept
notation: WT-CFCs-BAT29-II
definition: 5.� Waste management; 6. Other activities: 5.1. Disposal or recovery of hazardous waste with a capacity exceeding 10 tonnes per day involving one or more of the following activities: (a)-(j) (see scope); 5.3. (a) Disposal of non-hazardous waste with a capacity exceeding 50 tonnes per day involving one or more of the following activities, and excluding activities covered by Council Directive 91/271/EEC (1): (i)-(v) (see scope). (b) Recovery, or a mix of recovery and disposal, of non-hazardous waste with a capacity exceeding 75 tonnes per day involving one or more of the following activities, and excluding activities covered by Directive 91/271/EEC: (i)-(iv) (see scope). 5.5. Temporary storage of hazardous waste not covered under point 5.4 of Annex I to Directive 2010/75/EU pending any of the activities listed in points 5.1, 5.2, 5.4 and 5.6 of Annex I to Directive 2010/75/EU with a total capacity exceeding 50 tonnes, excluding temporary storage, pending collection, on the site where the waste is generated. 6.11. Independently operated treatment of waste water not covered by Directive 91/271/EEC and discharged by an installation undertaking activities covered under points 5.1, 5.3 or 5.5 as listed above; Apply BAT 14d, BAT 14h and use technique (a) and one or both of the techniques (b) and (c); Reducing CFCs emissions to air. The BAT-AEL emission level is 0,5-10 mg/Nm3 .
status: valid
status modified: 2026-05-06
accepted date: 2026-05-06
in scheme: BATAEL values as defined into the EC BAT-Tool

Waste Treatment - CN - BAT20-XIII
type: Concept
notation: WT-CN-BAT20-XIII
definition: 5.� Waste management; 6. Other activities: 5.1. Disposal or recovery of hazardous waste with a capacity exceeding 10 tonnes per day involving one or more of the following activities: (a)-(j) (see scope); 5.3. (a) Disposal of non-hazardous waste with a capacity exceeding 50 tonnes per day involving one or more of the following activities, and excluding activities covered by Council Directive 91/271/EEC (1): (i)-(v) (see scope). (b) Recovery, or a mix of recovery and disposal, of non-hazardous waste with a capacity exceeding 75 tonnes per day involving one or more of the following activities, and excluding activities covered by Directive 91/271/EEC: (i)-(iv) (see scope). 5.5. Temporary storage of hazardous waste not covered under point 5.4 of Annex I to Directive 2010/75/EU pending any of the activities listed in points 5.1, 5.2, 5.4 and 5.6 of Annex I to Directive 2010/75/EU with a total capacity exceeding 50 tonnes, excluding temporary storage, pending collection, on the site where the waste is generated. 6.11. Independently operated treatment of waste water not covered by Directive 91/271/EEC and discharged by an installation undertaking activities covered under points 5.1, 5.3 or 5.5 as listed above. Reducing free cyanide to water. The BAT-AEL emission level is 0,02-0,1 mg/l .
status: valid
status modified: 2026-05-06
accepted date: 2026-05-06
in scheme: BATAEL values as defined into the EC BAT-Tool

Waste Treatment - CN - BAT20-XXXIII
type: Concept
notation: WT-CN-BAT20-XXXIII
definition: 5.� Waste management; 6. Other activities: 5.1. Disposal or recovery of hazardous waste with a capacity exceeding 10 tonnes per day involving one or more of the following activities: (a)-(j) (see scope); 5.3. (a) Disposal of non-hazardous waste with a capacity exceeding 50 tonnes per day involving one or more of the following activities, and excluding activities covered by Council Directive 91/271/EEC (1): (i)-(v) (see scope). (b) Recovery, or a mix of recovery and disposal, of non-hazardous waste with a capacity exceeding 75 tonnes per day involving one or more of the following activities, and excluding activities covered by Directive 91/271/EEC: (i)-(iv) (see scope). 5.5. Temporary storage of hazardous waste not covered under point 5.4 of Annex I to Directive 2010/75/EU pending any of the activities listed in points 5.1, 5.2, 5.4 and 5.6 of Annex I to Directive 2010/75/EU with a total capacity exceeding 50 tonnes, excluding temporary storage, pending collection, on the site where the waste is generated. 6.11. Independently operated treatment of waste water not covered by Directive 91/271/EEC and discharged by an installation undertaking activities covered under points 5.1, 5.3 or 5.5 as listed above. Reducing free cyanide to water. The BAT-AEL emission level is 0,02-0,1 mg/l .
status: valid
status modified: 2026-05-06
accepted date: 2026-05-06
in scheme: BATAEL values as defined into the EC BAT-Tool

Waste Treatment - COD - BAT20-III
type: Concept
notation: WT-COD-BAT20-III
definition: 5.� Waste management; 6. Other activities: 5.1. Disposal or recovery of hazardous waste with a capacity exceeding 10 tonnes per day involving one or more of the following activities: (a)-(j) (see scope); 5.3. (a) Disposal of non-hazardous waste with a capacity exceeding 50 tonnes per day involving one or more of the following activities, and excluding activities covered by Council Directive 91/271/EEC (1): (i)-(v) (see scope). (b) Recovery, or a mix of recovery and disposal, of non-hazardous waste with a capacity exceeding 75 tonnes per day involving one or more of the following activities, and excluding activities covered by Directive 91/271/EEC: (i)-(iv) (see scope). 5.5. Temporary storage of hazardous waste not covered under point 5.4 of Annex I to Directive 2010/75/EU pending any of the activities listed in points 5.1, 5.2, 5.4 and 5.6 of Annex I to Directive 2010/75/EU with a total capacity exceeding 50 tonnes, excluding temporary storage, pending collection, on the site where the waste is generated. 6.11. Independently operated treatment of waste water not covered by Directive 91/271/EEC and discharged by an installation undertaking activities covered under points 5.1, 5.3 or 5.5 as listed above. Reducing chemical oxygen demand (COD) to water. The BAT-AEL emission level is 30-180 mg/l .
status: valid
status modified: 2026-05-06
accepted date: 2026-05-06
in scheme: BATAEL values as defined into the EC BAT-Tool

Waste Treatment - COD - BAT20-IV
type: Concept
notation: WT-COD-BAT20-IV
definition: 5.� Waste management; 6. Other activities: 5.1. Disposal or recovery of hazardous waste with a capacity exceeding 10 tonnes per day involving one or more of the following activities: (a)-(j) (see scope); 5.3. (a) Disposal of non-hazardous waste with a capacity exceeding 50 tonnes per day involving one or more of the following activities, and excluding activities covered by Council Directive 91/271/EEC (1): (i)-(v) (see scope). (b) Recovery, or a mix of recovery and disposal, of non-hazardous waste with a capacity exceeding 75 tonnes per day involving one or more of the following activities, and excluding activities covered by Directive 91/271/EEC: (i)-(iv) (see scope). 5.5. Temporary storage of hazardous waste not covered under point 5.4 of Annex I to Directive 2010/75/EU pending any of the activities listed in points 5.1, 5.2, 5.4 and 5.6 of Annex I to Directive 2010/75/EU with a total capacity exceeding 50 tonnes, excluding temporary storage, pending collection, on the site where the waste is generated. 6.11. Independently operated treatment of waste water not covered by Directive 91/271/EEC and discharged by an installation undertaking activities covered under points 5.1, 5.3 or 5.5 as listed above. Reducing chemical oxygen demand (COD) to water. The BAT-AEL emission level is 30-300 mg/l .
status: valid
status modified: 2026-05-06
accepted date: 2026-05-06
in scheme: BATAEL values as defined into the EC BAT-Tool

Waste Treatment - Cd - BAT20-XLIV
type: Concept
notation: WT-Cd-BAT20-XLIV
definition: 5.� Waste management; 6. Other activities: 5.1. Disposal or recovery of hazardous waste with a capacity exceeding 10 tonnes per day involving one or more of the following activities: (a)-(j) (see scope); 5.3. (a) Disposal of non-hazardous waste with a capacity exceeding 50 tonnes per day involving one or more of the following activities, and excluding activities covered by Council Directive 91/271/EEC (1): (i)-(v) (see scope). (b) Recovery, or a mix of recovery and disposal, of non-hazardous waste with a capacity exceeding 75 tonnes per day involving one or more of the following activities, and excluding activities covered by Directive 91/271/EEC: (i)-(iv) (see scope). 5.5. Temporary storage of hazardous waste not covered under point 5.4 of Annex I to Directive 2010/75/EU pending any of the activities listed in points 5.1, 5.2, 5.4 and 5.6 of Annex I to Directive 2010/75/EU with a total capacity exceeding 50 tonnes, excluding temporary storage, pending collection, on the site where the waste is generated. 6.11. Independently operated treatment of waste water not covered by Directive 91/271/EEC and discharged by an installation undertaking activities covered under points 5.1, 5.3 or 5.5 as listed above. Reducing cadmium to water. The BAT-AEL emission level is 0,01-0,1 mg/l.
status: valid
status modified: 2026-05-06
accepted date: 2026-05-06
in scheme: BATAEL values as defined into the EC BAT-Tool

Waste Treatment - Cd - BAT20-XVI
type: Concept
notation: WT-Cd-BAT20-XVI
definition: 5.� Waste management; 6. Other activities: 5.1. Disposal or recovery of hazardous waste with a capacity exceeding 10 tonnes per day involving one or more of the following activities: (a)-(j) (see scope); 5.3. (a) Disposal of non-hazardous waste with a capacity exceeding 50 tonnes per day involving one or more of the following activities, and excluding activities covered by Council Directive 91/271/EEC (1): (i)-(v) (see scope). (b) Recovery, or a mix of recovery and disposal, of non-hazardous waste with a capacity exceeding 75 tonnes per day involving one or more of the following activities, and excluding activities covered by Directive 91/271/EEC: (i)-(iv) (see scope). 5.5. Temporary storage of hazardous waste not covered under point 5.4 of Annex I to Directive 2010/75/EU pending any of the activities listed in points 5.1, 5.2, 5.4 and 5.6 of Annex I to Directive 2010/75/EU with a total capacity exceeding 50 tonnes, excluding temporary storage, pending collection, on the site where the waste is generated. 6.11. Independently operated treatment of waste water not covered by Directive 91/271/EEC and discharged by an installation undertaking activities covered under points 5.1, 5.3 or 5.5 as listed above. Reducing cadmium to water. The BAT-AEL emission level is 0,01-0,05 mg/l .
status: valid
status modified: 2026-05-06
accepted date: 2026-05-06
in scheme: BATAEL values as defined into the EC BAT-Tool

Waste Treatment - Cd - BAT20-XXIV
type: Concept
notation: WT-Cd-BAT20-XXIV
definition: 5.� Waste management; 6. Other activities: 5.1. Disposal or recovery of hazardous waste with a capacity exceeding 10 tonnes per day involving one or more of the following activities: (a)-(j) (see scope); 5.3. (a) Disposal of non-hazardous waste with a capacity exceeding 50 tonnes per day involving one or more of the following activities, and excluding activities covered by Council Directive 91/271/EEC (1): (i)-(v) (see scope). (b) Recovery, or a mix of recovery and disposal, of non-hazardous waste with a capacity exceeding 75 tonnes per day involving one or more of the following activities, and excluding activities covered by Directive 91/271/EEC: (i)-(iv) (see scope). 5.5. Temporary storage of hazardous waste not covered under point 5.4 of Annex I to Directive 2010/75/EU pending any of the activities listed in points 5.1, 5.2, 5.4 and 5.6 of Annex I to Directive 2010/75/EU with a total capacity exceeding 50 tonnes, excluding temporary storage, pending collection, on the site where the waste is generated. 6.11. Independently operated treatment of waste water not covered by Directive 91/271/EEC and discharged by an installation undertaking activities covered under points 5.1, 5.3 or 5.5 as listed above. Reducing cadmium to water. The BAT-AEL emission level is 0,01-0,1 mg/l.
status: valid
status modified: 2026-05-06
accepted date: 2026-05-06
in scheme: BATAEL values as defined into the EC BAT-Tool

Waste Treatment - Cd - BAT20-XXXVI
type: Concept
notation: WT-Cd-BAT20-XXXVI
definition: 5.� Waste management; 6. Other activities: 5.1. Disposal or recovery of hazardous waste with a capacity exceeding 10 tonnes per day involving one or more of the following activities: (a)-(j) (see scope); 5.3. (a) Disposal of non-hazardous waste with a capacity exceeding 50 tonnes per day involving one or more of the following activities, and excluding activities covered by Council Directive 91/271/EEC (1): (i)-(v) (see scope). (b) Recovery, or a mix of recovery and disposal, of non-hazardous waste with a capacity exceeding 75 tonnes per day involving one or more of the following activities, and excluding activities covered by Directive 91/271/EEC: (i)-(iv) (see scope). 5.5. Temporary storage of hazardous waste not covered under point 5.4 of Annex I to Directive 2010/75/EU pending any of the activities listed in points 5.1, 5.2, 5.4 and 5.6 of Annex I to Directive 2010/75/EU with a total capacity exceeding 50 tonnes, excluding temporary storage, pending collection, on the site where the waste is generated. 6.11. Independently operated treatment of waste water not covered by Directive 91/271/EEC and discharged by an installation undertaking activities covered under points 5.1, 5.3 or 5.5 as listed above. Reducing cadmium to water. The BAT-AEL emission level is 0,01-0,05 mg/l.
status: valid
status modified: 2026-05-06
accepted date: 2026-05-06
in scheme: BATAEL values as defined into the EC BAT-Tool

Waste Treatment - Cr - BAT20-XLV
type: Concept
notation: WT-Cr-BAT20-XLV
definition: 5.� Waste management; 6. Other activities: 5.1. Disposal or recovery of hazardous waste with a capacity exceeding 10 tonnes per day involving one or more of the following activities: (a)-(j) (see scope); 5.3. (a) Disposal of non-hazardous waste with a capacity exceeding 50 tonnes per day involving one or more of the following activities, and excluding activities covered by Council Directive 91/271/EEC (1): (i)-(v) (see scope). (b) Recovery, or a mix of recovery and disposal, of non-hazardous waste with a capacity exceeding 75 tonnes per day involving one or more of the following activities, and excluding activities covered by Directive 91/271/EEC: (i)-(iv) (see scope). 5.5. Temporary storage of hazardous waste not covered under point 5.4 of Annex I to Directive 2010/75/EU pending any of the activities listed in points 5.1, 5.2, 5.4 and 5.6 of Annex I to Directive 2010/75/EU with a total capacity exceeding 50 tonnes, excluding temporary storage, pending collection, on the site where the waste is generated. 6.11. Independently operated treatment of waste water not covered by Directive 91/271/EEC and discharged by an installation undertaking activities covered under points 5.1, 5.3 or 5.5 as listed above. Reducing chromium to water. The BAT-AEL emission level is 0,01-0,3 mg/l .
status: valid
status modified: 2026-05-06
accepted date: 2026-05-06
in scheme: BATAEL values as defined into the EC BAT-Tool

Waste Treatment - Cr - BAT20-XLVI
type: Concept
notation: WT-Cr-BAT20-XLVI
definition: 5.� Waste management; 6. Other activities: 5.1. Disposal or recovery of hazardous waste with a capacity exceeding 10 tonnes per day involving one or more of the following activities: (a)-(j) (see scope); 5.3. (a) Disposal of non-hazardous waste with a capacity exceeding 50 tonnes per day involving one or more of the following activities, and excluding activities covered by Council Directive 91/271/EEC (1): (i)-(v) (see scope). (b) Recovery, or a mix of recovery and disposal, of non-hazardous waste with a capacity exceeding 75 tonnes per day involving one or more of the following activities, and excluding activities covered by Directive 91/271/EEC: (i)-(iv) (see scope). 5.5. Temporary storage of hazardous waste not covered under point 5.4 of Annex I to Directive 2010/75/EU pending any of the activities listed in points 5.1, 5.2, 5.4 and 5.6 of Annex I to Directive 2010/75/EU with a total capacity exceeding 50 tonnes, excluding temporary storage, pending collection, on the site where the waste is generated. 6.11. Independently operated treatment of waste water not covered by Directive 91/271/EEC and discharged by an installation undertaking activities covered under points 5.1, 5.3 or 5.5 as listed above. Reducing hexavalent chromium to water. The BAT-AEL emission level is 0,01-0,1 mg/l.
status: valid
status modified: 2026-05-06
accepted date: 2026-05-06
in scheme: BATAEL values as defined into the EC BAT-Tool

Waste Treatment - Cr - BAT20-XVII
type: Concept
notation: WT-Cr-BAT20-XVII
definition: 5.� Waste management; 6. Other activities: 5.1. Disposal or recovery of hazardous waste with a capacity exceeding 10 tonnes per day involving one or more of the following activities: (a)-(j) (see scope); 5.3. (a) Disposal of non-hazardous waste with a capacity exceeding 50 tonnes per day involving one or more of the following activities, and excluding activities covered by Council Directive 91/271/EEC (1): (i)-(v) (see scope). (b) Recovery, or a mix of recovery and disposal, of non-hazardous waste with a capacity exceeding 75 tonnes per day involving one or more of the following activities, and excluding activities covered by Directive 91/271/EEC: (i)-(iv) (see scope). 5.5. Temporary storage of hazardous waste not covered under point 5.4 of Annex I to Directive 2010/75/EU pending any of the activities listed in points 5.1, 5.2, 5.4 and 5.6 of Annex I to Directive 2010/75/EU with a total capacity exceeding 50 tonnes, excluding temporary storage, pending collection, on the site where the waste is generated. 6.11. Independently operated treatment of waste water not covered by Directive 91/271/EEC and discharged by an installation undertaking activities covered under points 5.1, 5.3 or 5.5 as listed above. Reducing chromium to water. The BAT-AEL emission level is 0,01-0,15 mg/l .
status: valid
status modified: 2026-05-06
accepted date: 2026-05-06
in scheme: BATAEL values as defined into the EC BAT-Tool

Waste Treatment - Cr - BAT20-XXV
type: Concept
notation: WT-Cr-BAT20-XXV
definition: 5.� Waste management; 6. Other activities: 5.1. Disposal or recovery of hazardous waste with a capacity exceeding 10 tonnes per day involving one or more of the following activities: (a)-(j) (see scope); 5.3. (a) Disposal of non-hazardous waste with a capacity exceeding 50 tonnes per day involving one or more of the following activities, and excluding activities covered by Council Directive 91/271/EEC (1): (i)-(v) (see scope). (b) Recovery, or a mix of recovery and disposal, of non-hazardous waste with a capacity exceeding 75 tonnes per day involving one or more of the following activities, and excluding activities covered by Directive 91/271/EEC: (i)-(iv) (see scope). 5.5. Temporary storage of hazardous waste not covered under point 5.4 of Annex I to Directive 2010/75/EU pending any of the activities listed in points 5.1, 5.2, 5.4 and 5.6 of Annex I to Directive 2010/75/EU with a total capacity exceeding 50 tonnes, excluding temporary storage, pending collection, on the site where the waste is generated. 6.11. Independently operated treatment of waste water not covered by Directive 91/271/EEC and discharged by an installation undertaking activities covered under points 5.1, 5.3 or 5.5 as listed above. Reducing chromium to water. The BAT-AEL emission level is 0,01-0,3 mg/l .
status: valid
status modified: 2026-05-06
accepted date: 2026-05-06
in scheme: BATAEL values as defined into the EC BAT-Tool

Waste Treatment - Cr - BAT20-XXVI
type: Concept
notation: WT-Cr-BAT20-XXVI
definition: 5.� Waste management; 6. Other activities: 5.1. Disposal or recovery of hazardous waste with a capacity exceeding 10 tonnes per day involving one or more of the following activities: (a)-(j) (see scope); 5.3. (a) Disposal of non-hazardous waste with a capacity exceeding 50 tonnes per day involving one or more of the following activities, and excluding activities covered by Council Directive 91/271/EEC (1): (i)-(v) (see scope). (b) Recovery, or a mix of recovery and disposal, of non-hazardous waste with a capacity exceeding 75 tonnes per day involving one or more of the following activities, and excluding activities covered by Directive 91/271/EEC: (i)-(iv) (see scope). 5.5. Temporary storage of hazardous waste not covered under point 5.4 of Annex I to Directive 2010/75/EU pending any of the activities listed in points 5.1, 5.2, 5.4 and 5.6 of Annex I to Directive 2010/75/EU with a total capacity exceeding 50 tonnes, excluding temporary storage, pending collection, on the site where the waste is generated. 6.11. Independently operated treatment of waste water not covered by Directive 91/271/EEC and discharged by an installation undertaking activities covered under points 5.1, 5.3 or 5.5 as listed above. Reducing hexavalent chromium to water. The BAT-AEL emission level is 0,01-0,1 mg/l.
status: valid
status modified: 2026-05-06
accepted date: 2026-05-06
in scheme: BATAEL values as defined into the EC BAT-Tool

Waste Treatment - Cr - BAT20-XXXVII
type: Concept
notation: WT-Cr-BAT20-XXXVII
definition: 5.� Waste management; 6. Other activities: 5.1. Disposal or recovery of hazardous waste with a capacity exceeding 10 tonnes per day involving one or more of the following activities: (a)-(j) (see scope); 5.3. (a) Disposal of non-hazardous waste with a capacity exceeding 50 tonnes per day involving one or more of the following activities, and excluding activities covered by Council Directive 91/271/EEC (1): (i)-(v) (see scope). (b) Recovery, or a mix of recovery and disposal, of non-hazardous waste with a capacity exceeding 75 tonnes per day involving one or more of the following activities, and excluding activities covered by Directive 91/271/EEC: (i)-(iv) (see scope). 5.5. Temporary storage of hazardous waste not covered under point 5.4 of Annex I to Directive 2010/75/EU pending any of the activities listed in points 5.1, 5.2, 5.4 and 5.6 of Annex I to Directive 2010/75/EU with a total capacity exceeding 50 tonnes, excluding temporary storage, pending collection, on the site where the waste is generated. 6.11. Independently operated treatment of waste water not covered by Directive 91/271/EEC and discharged by an installation undertaking activities covered under points 5.1, 5.3 or 5.5 as listed above. Reducing chromium to water. The BAT-AEL emission level is 0,01-0,15 mg/l.
status: valid
status modified: 2026-05-06
accepted date: 2026-05-06
in scheme: BATAEL values as defined into the EC BAT-Tool

Waste Treatment - Cu - BAT20-XLVII
type: Concept
notation: WT-Cu-BAT20-XLVII
definition: 5.� Waste management; 6. Other activities: 5.1. Disposal or recovery of hazardous waste with a capacity exceeding 10 tonnes per day involving one or more of the following activities: (a)-(j) (see scope); 5.3. (a) Disposal of non-hazardous waste with a capacity exceeding 50 tonnes per day involving one or more of the following activities, and excluding activities covered by Council Directive 91/271/EEC (1): (i)-(v) (see scope). (b) Recovery, or a mix of recovery and disposal, of non-hazardous waste with a capacity exceeding 75 tonnes per day involving one or more of the following activities, and excluding activities covered by Directive 91/271/EEC: (i)-(iv) (see scope). 5.5. Temporary storage of hazardous waste not covered under point 5.4 of Annex I to Directive 2010/75/EU pending any of the activities listed in points 5.1, 5.2, 5.4 and 5.6 of Annex I to Directive 2010/75/EU with a total capacity exceeding 50 tonnes, excluding temporary storage, pending collection, on the site where the waste is generated. 6.11. Independently operated treatment of waste water not covered by Directive 91/271/EEC and discharged by an installation undertaking activities covered under points 5.1, 5.3 or 5.5 as listed above. Reducing copper to water. The BAT-AEL emission level is 0,05-0,5 mg/l .
status: valid
status modified: 2026-05-06
accepted date: 2026-05-06
in scheme: BATAEL values as defined into the EC BAT-Tool

Waste Treatment - Cu - BAT20-XVIII
type: Concept
notation: WT-Cu-BAT20-XVIII
definition: 5.� Waste management; 6. Other activities: 5.1. Disposal or recovery of hazardous waste with a capacity exceeding 10 tonnes per day involving one or more of the following activities: (a)-(j) (see scope); 5.3. (a) Disposal of non-hazardous waste with a capacity exceeding 50 tonnes per day involving one or more of the following activities, and excluding activities covered by Council Directive 91/271/EEC (1): (i)-(v) (see scope). (b) Recovery, or a mix of recovery and disposal, of non-hazardous waste with a capacity exceeding 75 tonnes per day involving one or more of the following activities, and excluding activities covered by Directive 91/271/EEC: (i)-(iv) (see scope). 5.5. Temporary storage of hazardous waste not covered under point 5.4 of Annex I to Directive 2010/75/EU pending any of the activities listed in points 5.1, 5.2, 5.4 and 5.6 of Annex I to Directive 2010/75/EU with a total capacity exceeding 50 tonnes, excluding temporary storage, pending collection, on the site where the waste is generated. 6.11. Independently operated treatment of waste water not covered by Directive 91/271/EEC and discharged by an installation undertaking activities covered under points 5.1, 5.3 or 5.5 as listed above. Reducing copper to water. The BAT-AEL emission level is 0,05-0,5 mg/l .
status: valid
status modified: 2026-05-06
accepted date: 2026-05-06
in scheme: BATAEL values as defined into the EC BAT-Tool

Waste Treatment - Cu - BAT20-XXVII
type: Concept
notation: WT-Cu-BAT20-XXVII
definition: 5.� Waste management; 6. Other activities: 5.1. Disposal or recovery of hazardous waste with a capacity exceeding 10 tonnes per day involving one or more of the following activities: (a)-(j) (see scope); 5.3. (a) Disposal of non-hazardous waste with a capacity exceeding 50 tonnes per day involving one or more of the following activities, and excluding activities covered by Council Directive 91/271/EEC (1): (i)-(v) (see scope). (b) Recovery, or a mix of recovery and disposal, of non-hazardous waste with a capacity exceeding 75 tonnes per day involving one or more of the following activities, and excluding activities covered by Directive 91/271/EEC: (i)-(iv) (see scope). 5.5. Temporary storage of hazardous waste not covered under point 5.4 of Annex I to Directive 2010/75/EU pending any of the activities listed in points 5.1, 5.2, 5.4 and 5.6 of Annex I to Directive 2010/75/EU with a total capacity exceeding 50 tonnes, excluding temporary storage, pending collection, on the site where the waste is generated. 6.11. Independently operated treatment of waste water not covered by Directive 91/271/EEC and discharged by an installation undertaking activities covered under points 5.1, 5.3 or 5.5 as listed above. Reducing copper to water. The BAT-AEL emission level is 0,05-0,5 mg/l .
status: valid
status modified: 2026-05-06
accepted date: 2026-05-06
in scheme: BATAEL values as defined into the EC BAT-Tool

Waste Treatment - Cu - BAT20-XXXVIII
type: Concept
notation: WT-Cu-BAT20-XXXVIII
definition: 5.� Waste management; 6. Other activities: 5.1. Disposal or recovery of hazardous waste with a capacity exceeding 10 tonnes per day involving one or more of the following activities: (a)-(j) (see scope); 5.3. (a) Disposal of non-hazardous waste with a capacity exceeding 50 tonnes per day involving one or more of the following activities, and excluding activities covered by Council Directive 91/271/EEC (1): (i)-(v) (see scope). (b) Recovery, or a mix of recovery and disposal, of non-hazardous waste with a capacity exceeding 75 tonnes per day involving one or more of the following activities, and excluding activities covered by Directive 91/271/EEC: (i)-(iv) (see scope). 5.5. Temporary storage of hazardous waste not covered under point 5.4 of Annex I to Directive 2010/75/EU pending any of the activities listed in points 5.1, 5.2, 5.4 and 5.6 of Annex I to Directive 2010/75/EU with a total capacity exceeding 50 tonnes, excluding temporary storage, pending collection, on the site where the waste is generated. 6.11. Independently operated treatment of waste water not covered by Directive 91/271/EEC and discharged by an installation undertaking activities covered under points 5.1, 5.3 or 5.5 as listed above. Reducing copper to water. The BAT-AEL emission level is 0,05-0,5 mg/l.
status: valid
status modified: 2026-05-06
accepted date: 2026-05-06
in scheme: BATAEL values as defined into the EC BAT-Tool

Waste Treatment - Dust - BAT25
type: Concept
notation: WT-Dust-BAT25
definition: 5.� Waste management; 6. Other activities: 5.1. Disposal or recovery of hazardous waste with a capacity exceeding 10 tonnes per day involving one or more of the following activities: (a)-(j) (see scope); 5.3. (a) Disposal of non-hazardous waste with a capacity exceeding 50 tonnes per day involving one or more of the following activities, and excluding activities covered by Council Directive 91/271/EEC (1): (i)-(v) (see scope). (b) Recovery, or a mix of recovery and disposal, of non-hazardous waste with a capacity exceeding 75 tonnes per day involving one or more of the following activities, and excluding activities covered by Directive 91/271/EEC: (i)-(iv) (see scope). 5.5. Temporary storage of hazardous waste not covered under point 5.4 of Annex I to Directive 2010/75/EU pending any of the activities listed in points 5.1, 5.2, 5.4 and 5.6 of Annex I to Directive 2010/75/EU with a total capacity exceeding 50 tonnes, excluding temporary storage, pending collection, on the site where the waste is generated. 6.11. Independently operated treatment of waste water not covered by Directive 91/271/EEC and discharged by an installation undertaking activities covered under points 5.1, 5.3 or 5.5 as listed above; Techniques (a)-(r) (see table incl. footnotes) for treatment of water-based liquid waste; Reducing dust emissions to air. The BAT-AEL emission level is 2-5 mg/Nm3 .
status: valid
status modified: 2026-05-06
accepted date: 2026-05-06
in scheme: BATAEL values as defined into the EC BAT-Tool

Waste Treatment - Dust - BAT34-III
type: Concept
notation: WT-Dust-BAT34-III
definition: 5.� Waste management; 6. Other activities: 5.1. Disposal or recovery of hazardous waste with a capacity exceeding 10 tonnes per day involving one or more of the following activities: (a)-(j) (see scope); 5.3. (a) Disposal of non-hazardous waste with a capacity exceeding 50 tonnes per day involving one or more of the following activities, and excluding activities covered by Council Directive 91/271/EEC (1): (i)-(v) (see scope). (b) Recovery, or a mix of recovery and disposal, of non-hazardous waste with a capacity exceeding 75 tonnes per day involving one or more of the following activities, and excluding activities covered by Directive 91/271/EEC: (i)-(iv) (see scope). 5.5. Temporary storage of hazardous waste not covered under point 5.4 of Annex I to Directive 2010/75/EU pending any of the activities listed in points 5.1, 5.2, 5.4 and 5.6 of Annex I to Directive 2010/75/EU with a total capacity exceeding 50 tonnes, excluding temporary storage, pending collection, on the site where the waste is generated. 6.11. Independently operated treatment of waste water not covered by Directive 91/271/EEC and discharged by an installation undertaking activities covered under points 5.1, 5.3 or 5.5 as listed above; Techniques (a)-(e) (see table); Reducing dust emissions to air. The BAT-AEL emission level is 2-5 mg/Nm3 .
status: valid
status modified: 2026-05-06
accepted date: 2026-05-06
in scheme: BATAEL values as defined into the EC BAT-Tool

Waste Treatment - Dust - BAT41
type: Concept
notation: WT-Dust-BAT41
definition: 5.� Waste management; 6. Other activities: 5.1. Disposal or recovery of hazardous waste with a capacity exceeding 10 tonnes per day involving one or more of the following activities: (a)-(j) (see scope); 5.3. (a) Disposal of non-hazardous waste with a capacity exceeding 50 tonnes per day involving one or more of the following activities, and excluding activities covered by Council Directive 91/271/EEC (1): (i)-(v) (see scope). (b) Recovery, or a mix of recovery and disposal, of non-hazardous waste with a capacity exceeding 75 tonnes per day involving one or more of the following activities, and excluding activities covered by Directive 91/271/EEC: (i)-(iv) (see scope). 5.5. Temporary storage of hazardous waste not covered under point 5.4 of Annex I to Directive 2010/75/EU pending any of the activities listed in points 5.1, 5.2, 5.4 and 5.6 of Annex I to Directive 2010/75/EU with a total capacity exceeding 50 tonnes, excluding temporary storage, pending collection, on the site where the waste is generated. 6.11. Independently operated treatment of waste water not covered by Directive 91/271/EEC and discharged by an installation undertaking activities covered under points 5.1, 5.3 or 5.5 as listed above; Reducing dust emissions to air. The BAT-AEL emission level is 2-5 mg/Nm3 .
status: valid
status modified: 2026-05-06
accepted date: 2026-05-06
in scheme: BATAEL values as defined into the EC BAT-Tool

Waste Treatment - HCl - BAT53-I
type: Concept
notation: WT-HCl-BAT53-I
definition: 5.� Waste management; 6. Other activities: 5.1. Disposal or recovery of hazardous waste with a capacity exceeding 10 tonnes per day involving one or more of the following activities: (a)-(j) (see scope); 5.3. (a) Disposal of non-hazardous waste with a capacity exceeding 50 tonnes per day involving one or more of the following activities, and excluding activities covered by Council Directive 91/271/EEC (1): (i)-(v) (see scope). (b) Recovery, or a mix of recovery and disposal, of non-hazardous waste with a capacity exceeding 75 tonnes per day involving one or more of the following activities, and excluding activities covered by Directive 91/271/EEC: (i)-(iv) (see scope). 5.5. Temporary storage of hazardous waste not covered under point 5.4 of Annex I to Directive 2010/75/EU pending any of the activities listed in points 5.1, 5.2, 5.4 and 5.6 of Annex I to Directive 2010/75/EU with a total capacity exceeding 50 tonnes, excluding temporary storage, pending collection, on the site where the waste is generated. 6.11. Independently operated treatment of waste water not covered by Directive 91/271/EEC and discharged by an installation undertaking activities covered under points 5.1, 5.3 or 5.5 as listed above; Reducing hydrogen chloride emissions to air. The BAT-AEL emission level is 1-5 mg/Nm3 .
status: valid
status modified: 2026-05-06
accepted date: 2026-05-06
in scheme: BATAEL values as defined into the EC BAT-Tool

Waste Treatment - HOI - BAT20-VI
type: Concept
notation: WT-HOI-BAT20-VI
definition: 5.� Waste management; 6. Other activities: 5.1. Disposal or recovery of hazardous waste with a capacity exceeding 10 tonnes per day involving one or more of the following activities: (a)-(j) (see scope); 5.3. (a) Disposal of non-hazardous waste with a capacity exceeding 50 tonnes per day involving one or more of the following activities, and excluding activities covered by Council Directive 91/271/EEC (1): (i)-(v) (see scope). (b) Recovery, or a mix of recovery and disposal, of non-hazardous waste with a capacity exceeding 75 tonnes per day involving one or more of the following activities, and excluding activities covered by Directive 91/271/EEC: (i)-(iv) (see scope). 5.5. Temporary storage of hazardous waste not covered under point 5.4 of Annex I to Directive 2010/75/EU pending any of the activities listed in points 5.1, 5.2, 5.4 and 5.6 of Annex I to Directive 2010/75/EU with a total capacity exceeding 50 tonnes, excluding temporary storage, pending collection, on the site where the waste is generated. 6.11. Independently operated treatment of waste water not covered by Directive 91/271/EEC and discharged by an installation undertaking activities covered under points 5.1, 5.3 or 5.5 as listed above. Reducing hydrocarbon oil index to water. The BAT-AEL emission level is 0,5-10 mg/l .
status: valid
status modified: 2026-05-06
accepted date: 2026-05-06
in scheme: BATAEL values as defined into the EC BAT-Tool

Waste Treatment - HOI - BAT20-XXXII
type: Concept
notation: WT-HOI-BAT20-XXXII
definition: 5.� Waste management; 6. Other activities: 5.1. Disposal or recovery of hazardous waste with a capacity exceeding 10 tonnes per day involving one or more of the following activities: (a)-(j) (see scope); 5.3. (a) Disposal of non-hazardous waste with a capacity exceeding 50 tonnes per day involving one or more of the following activities, and excluding activities covered by Council Directive 91/271/EEC (1): (i)-(v) (see scope). (b) Recovery, or a mix of recovery and disposal, of non-hazardous waste with a capacity exceeding 75 tonnes per day involving one or more of the following activities, and excluding activities covered by Directive 91/271/EEC: (i)-(iv) (see scope). 5.5. Temporary storage of hazardous waste not covered under point 5.4 of Annex I to Directive 2010/75/EU pending any of the activities listed in points 5.1, 5.2, 5.4 and 5.6 of Annex I to Directive 2010/75/EU with a total capacity exceeding 50 tonnes, excluding temporary storage, pending collection, on the site where the waste is generated. 6.11. Independently operated treatment of waste water not covered by Directive 91/271/EEC and discharged by an installation undertaking activities covered under points 5.1, 5.3 or 5.5 as listed above. Reducing hydrocarbon oil index to water. The BAT-AEL emission level is 0,5-10 mg/l .
status: valid
status modified: 2026-05-06
accepted date: 2026-05-06
in scheme: BATAEL values as defined into the EC BAT-Tool

Waste Treatment - Hg - BAT20-L
type: Concept
notation: WT-Hg-BAT20-L
definition: 5.� Waste management; 6. Other activities: 5.1. Disposal or recovery of hazardous waste with a capacity exceeding 10 tonnes per day involving one or more of the following activities: (a)-(j) (see scope); 5.3. (a) Disposal of non-hazardous waste with a capacity exceeding 50 tonnes per day involving one or more of the following activities, and excluding activities covered by Council Directive 91/271/EEC (1): (i)-(v) (see scope). (b) Recovery, or a mix of recovery and disposal, of non-hazardous waste with a capacity exceeding 75 tonnes per day involving one or more of the following activities, and excluding activities covered by Directive 91/271/EEC: (i)-(iv) (see scope). 5.5. Temporary storage of hazardous waste not covered under point 5.4 of Annex I to Directive 2010/75/EU pending any of the activities listed in points 5.1, 5.2, 5.4 and 5.6 of Annex I to Directive 2010/75/EU with a total capacity exceeding 50 tonnes, excluding temporary storage, pending collection, on the site where the waste is generated. 6.11. Independently operated treatment of waste water not covered by Directive 91/271/EEC and discharged by an installation undertaking activities covered under points 5.1, 5.3 or 5.5 as listed above. Reducing mercury to water. The BAT-AEL emission level is 1-10 �g/l .
status: valid
status modified: 2026-05-06
accepted date: 2026-05-06
in scheme: BATAEL values as defined into the EC BAT-Tool

Waste Treatment - Hg - BAT20-XLI
type: Concept
notation: WT-Hg-BAT20-XLI
definition: 5.� Waste management; 6. Other activities: 5.1. Disposal or recovery of hazardous waste with a capacity exceeding 10 tonnes per day involving one or more of the following activities: (a)-(j) (see scope); 5.3. (a) Disposal of non-hazardous waste with a capacity exceeding 50 tonnes per day involving one or more of the following activities, and excluding activities covered by Council Directive 91/271/EEC (1): (i)-(v) (see scope). (b) Recovery, or a mix of recovery and disposal, of non-hazardous waste with a capacity exceeding 75 tonnes per day involving one or more of the following activities, and excluding activities covered by Directive 91/271/EEC: (i)-(iv) (see scope). 5.5. Temporary storage of hazardous waste not covered under point 5.4 of Annex I to Directive 2010/75/EU pending any of the activities listed in points 5.1, 5.2, 5.4 and 5.6 of Annex I to Directive 2010/75/EU with a total capacity exceeding 50 tonnes, excluding temporary storage, pending collection, on the site where the waste is generated. 6.11. Independently operated treatment of waste water not covered by Directive 91/271/EEC and discharged by an installation undertaking activities covered under points 5.1, 5.3 or 5.5 as listed above. Reducing mercury to water. The BAT-AEL emission level is 0,5-5 �g/l .
status: valid
status modified: 2026-05-06
accepted date: 2026-05-06
in scheme: BATAEL values as defined into the EC BAT-Tool

Waste Treatment - Hg - BAT20-XXI
type: Concept
notation: WT-Hg-BAT20-XXI
definition: 5.� Waste management; 6. Other activities: 5.1. Disposal or recovery of hazardous waste with a capacity exceeding 10 tonnes per day involving one or more of the following activities: (a)-(j) (see scope); 5.3. (a) Disposal of non-hazardous waste with a capacity exceeding 50 tonnes per day involving one or more of the following activities, and excluding activities covered by Council Directive 91/271/EEC (1): (i)-(v) (see scope). (b) Recovery, or a mix of recovery and disposal, of non-hazardous waste with a capacity exceeding 75 tonnes per day involving one or more of the following activities, and excluding activities covered by Directive 91/271/EEC: (i)-(iv) (see scope). 5.5. Temporary storage of hazardous waste not covered under point 5.4 of Annex I to Directive 2010/75/EU pending any of the activities listed in points 5.1, 5.2, 5.4 and 5.6 of Annex I to Directive 2010/75/EU with a total capacity exceeding 50 tonnes, excluding temporary storage, pending collection, on the site where the waste is generated. 6.11. Independently operated treatment of waste water not covered by Directive 91/271/EEC and discharged by an installation undertaking activities covered under points 5.1, 5.3 or 5.5 as listed above. Reducing mercury to water. The BAT-AEL emission level is 0,5-5 �g/l .
status: valid
status modified: 2026-05-06
accepted date: 2026-05-06
in scheme: BATAEL values as defined into the EC BAT-Tool

Waste Treatment - Hg - BAT20-XXX
type: Concept
notation: WT-Hg-BAT20-XXX
definition: 5.� Waste management; 6. Other activities: 5.1. Disposal or recovery of hazardous waste with a capacity exceeding 10 tonnes per day involving one or more of the following activities: (a)-(j) (see scope); 5.3. (a) Disposal of non-hazardous waste with a capacity exceeding 50 tonnes per day involving one or more of the following activities, and excluding activities covered by Council Directive 91/271/EEC (1): (i)-(v) (see scope). (b) Recovery, or a mix of recovery and disposal, of non-hazardous waste with a capacity exceeding 75 tonnes per day involving one or more of the following activities, and excluding activities covered by Directive 91/271/EEC: (i)-(iv) (see scope). 5.5. Temporary storage of hazardous waste not covered under point 5.4 of Annex I to Directive 2010/75/EU pending any of the activities listed in points 5.1, 5.2, 5.4 and 5.6 of Annex I to Directive 2010/75/EU with a total capacity exceeding 50 tonnes, excluding temporary storage, pending collection, on the site where the waste is generated. 6.11. Independently operated treatment of waste water not covered by Directive 91/271/EEC and discharged by an installation undertaking activities covered under points 5.1, 5.3 or 5.5 as listed above. Reducing mercury to water. The BAT-AEL emission level is 1-10 �g/l .
status: valid
status modified: 2026-05-06
accepted date: 2026-05-06
in scheme: BATAEL values as defined into the EC BAT-Tool

Waste Treatment - Hg - BAT32
type: Concept
notation: WT-Hg-BAT32
definition: 5.� Waste management; 6. Other activities: 5.1. Disposal or recovery of hazardous waste with a capacity exceeding 10 tonnes per day involving one or more of the following activities: (a)-(j) (see scope); 5.3. (a) Disposal of non-hazardous waste with a capacity exceeding 50 tonnes per day involving one or more of the following activities, and excluding activities covered by Council Directive 91/271/EEC (1): (i)-(v) (see scope). (b) Recovery, or a mix of recovery and disposal, of non-hazardous waste with a capacity exceeding 75 tonnes per day involving one or more of the following activities, and excluding activities covered by Directive 91/271/EEC: (i)-(iv) (see scope). 5.5. Temporary storage of hazardous waste not covered under point 5.4 of Annex I to Directive 2010/75/EU pending any of the activities listed in points 5.1, 5.2, 5.4 and 5.6 of Annex I to Directive 2010/75/EU with a total capacity exceeding 50 tonnes, excluding temporary storage, pending collection, on the site where the waste is generated. 6.11. Independently operated treatment of waste water not covered by Directive 91/271/EEC and discharged by an installation undertaking activities covered under points 5.1, 5.3 or 5.5 as listed above; Techniques (a)-(d) (see table); Reducing mercury emissions to air. The BAT-AEL emission level is 2-7 �g/Nm3 .
status: valid
status modified: 2026-05-06
accepted date: 2026-05-06
in scheme: BATAEL values as defined into the EC BAT-Tool

Waste Treatment - NH3 - BAT34-I
type: Concept
notation: WT-NH3-BAT34-I
definition: 5.� Waste management; 6. Other activities: 5.1. Disposal or recovery of hazardous waste with a capacity exceeding 10 tonnes per day involving one or more of the following activities: (a)-(j) (see scope); 5.3. (a) Disposal of non-hazardous waste with a capacity exceeding 50 tonnes per day involving one or more of the following activities, and excluding activities covered by Council Directive 91/271/EEC (1): (i)-(v) (see scope). (b) Recovery, or a mix of recovery and disposal, of non-hazardous waste with a capacity exceeding 75 tonnes per day involving one or more of the following activities, and excluding activities covered by Directive 91/271/EEC: (i)-(iv) (see scope). 5.5. Temporary storage of hazardous waste not covered under point 5.4 of Annex I to Directive 2010/75/EU pending any of the activities listed in points 5.1, 5.2, 5.4 and 5.6 of Annex I to Directive 2010/75/EU with a total capacity exceeding 50 tonnes, excluding temporary storage, pending collection, on the site where the waste is generated. 6.11. Independently operated treatment of waste water not covered by Directive 91/271/EEC and discharged by an installation undertaking activities covered under points 5.1, 5.3 or 5.5 as listed above; Collect mercury emissions at source, send them to abatement and carry out adequate monitoring (see description); Reducing ammonia (NH3) emissions to air. The BAT-AEL emission level is 0,3-20 mg/Nm3 .
status: valid
status modified: 2026-05-06
accepted date: 2026-05-06
in scheme: BATAEL values as defined into the EC BAT-Tool

Waste Treatment - Ni - BAT20-XL
type: Concept
notation: WT-Ni-BAT20-XL
definition: 5.� Waste management; 6. Other activities: 5.1. Disposal or recovery of hazardous waste with a capacity exceeding 10 tonnes per day involving one or more of the following activities: (a)-(j) (see scope); 5.3. (a) Disposal of non-hazardous waste with a capacity exceeding 50 tonnes per day involving one or more of the following activities, and excluding activities covered by Council Directive 91/271/EEC (1): (i)-(v) (see scope). (b) Recovery, or a mix of recovery and disposal, of non-hazardous waste with a capacity exceeding 75 tonnes per day involving one or more of the following activities, and excluding activities covered by Directive 91/271/EEC: (i)-(iv) (see scope). 5.5. Temporary storage of hazardous waste not covered under point 5.4 of Annex I to Directive 2010/75/EU pending any of the activities listed in points 5.1, 5.2, 5.4 and 5.6 of Annex I to Directive 2010/75/EU with a total capacity exceeding 50 tonnes, excluding temporary storage, pending collection, on the site where the waste is generated. 6.11. Independently operated treatment of waste water not covered by Directive 91/271/EEC and discharged by an installation undertaking activities covered under points 5.1, 5.3 or 5.5 as listed above. Reducing nickel to water. The BAT-AEL emission level is 0,05-0,5 mg/l .
status: valid
status modified: 2026-05-06
accepted date: 2026-05-06
in scheme: BATAEL values as defined into the EC BAT-Tool

Waste Treatment - Ni - BAT20-XLIX
type: Concept
notation: WT-Ni-BAT20-XLIX
definition: 5.� Waste management; 6. Other activities: 5.1. Disposal or recovery of hazardous waste with a capacity exceeding 10 tonnes per day involving one or more of the following activities: (a)-(j) (see scope); 5.3. (a) Disposal of non-hazardous waste with a capacity exceeding 50 tonnes per day involving one or more of the following activities, and excluding activities covered by Council Directive 91/271/EEC (1): (i)-(v) (see scope). (b) Recovery, or a mix of recovery and disposal, of non-hazardous waste with a capacity exceeding 75 tonnes per day involving one or more of the following activities, and excluding activities covered by Directive 91/271/EEC: (i)-(iv) (see scope). 5.5. Temporary storage of hazardous waste not covered under point 5.4 of Annex I to Directive 2010/75/EU pending any of the activities listed in points 5.1, 5.2, 5.4 and 5.6 of Annex I to Directive 2010/75/EU with a total capacity exceeding 50 tonnes, excluding temporary storage, pending collection, on the site where the waste is generated. 6.11. Independently operated treatment of waste water not covered by Directive 91/271/EEC and discharged by an installation undertaking activities covered under points 5.1, 5.3 or 5.5 as listed above. Reducing nickel to water. The BAT-AEL emission level is 0,05-1 mg/l .
status: valid
status modified: 2026-05-06
accepted date: 2026-05-06
in scheme: BATAEL values as defined into the EC BAT-Tool

Waste Treatment - Ni - BAT20-XX
type: Concept
notation: WT-Ni-BAT20-XX
definition: 5.� Waste management; 6. Other activities: 5.1. Disposal or recovery of hazardous waste with a capacity exceeding 10 tonnes per day involving one or more of the following activities: (a)-(j) (see scope); 5.3. (a) Disposal of non-hazardous waste with a capacity exceeding 50 tonnes per day involving one or more of the following activities, and excluding activities covered by Council Directive 91/271/EEC (1): (i)-(v) (see scope). (b) Recovery, or a mix of recovery and disposal, of non-hazardous waste with a capacity exceeding 75 tonnes per day involving one or more of the following activities, and excluding activities covered by Directive 91/271/EEC: (i)-(iv) (see scope). 5.5. Temporary storage of hazardous waste not covered under point 5.4 of Annex I to Directive 2010/75/EU pending any of the activities listed in points 5.1, 5.2, 5.4 and 5.6 of Annex I to Directive 2010/75/EU with a total capacity exceeding 50 tonnes, excluding temporary storage, pending collection, on the site where the waste is generated. 6.11. Independently operated treatment of waste water not covered by Directive 91/271/EEC and discharged by an installation undertaking activities covered under points 5.1, 5.3 or 5.5 as listed above. Reducing nickel to water. The BAT-AEL emission level is 0,05-0,5 mg/l .
status: valid
status modified: 2026-05-06
accepted date: 2026-05-06
in scheme: BATAEL values as defined into the EC BAT-Tool

Waste Treatment - Ni - BAT20-XXIX
type: Concept
notation: WT-Ni-BAT20-XXIX
definition: 5.� Waste management; 6. Other activities: 5.1. Disposal or recovery of hazardous waste with a capacity exceeding 10 tonnes per day involving one or more of the following activities: (a)-(j) (see scope); 5.3. (a) Disposal of non-hazardous waste with a capacity exceeding 50 tonnes per day involving one or more of the following activities, and excluding activities covered by Council Directive 91/271/EEC (1): (i)-(v) (see scope). (b) Recovery, or a mix of recovery and disposal, of non-hazardous waste with a capacity exceeding 75 tonnes per day involving one or more of the following activities, and excluding activities covered by Directive 91/271/EEC: (i)-(iv) (see scope). 5.5. Temporary storage of hazardous waste not covered under point 5.4 of Annex I to Directive 2010/75/EU pending any of the activities listed in points 5.1, 5.2, 5.4 and 5.6 of Annex I to Directive 2010/75/EU with a total capacity exceeding 50 tonnes, excluding temporary storage, pending collection, on the site where the waste is generated. 6.11. Independently operated treatment of waste water not covered by Directive 91/271/EEC and discharged by an installation undertaking activities covered under points 5.1, 5.3 or 5.5 as listed above. Reducing nickel to water. The BAT-AEL emission level is 0,05-1 mg/l .
status: valid
status modified: 2026-05-06
accepted date: 2026-05-06
in scheme: BATAEL values as defined into the EC BAT-Tool

Waste Treatment - Odour - BAT34-II
type: Concept
notation: WT-Odour-BAT34-II
definition: 5.� Waste management; 6. Other activities: 5.1. Disposal or recovery of hazardous waste with a capacity exceeding 10 tonnes per day involving one or more of the following activities: (a)-(j) (see scope); 5.3. (a) Disposal of non-hazardous waste with a capacity exceeding 50 tonnes per day involving one or more of the following activities, and excluding activities covered by Council Directive 91/271/EEC (1): (i)-(v) (see scope). (b) Recovery, or a mix of recovery and disposal, of non-hazardous waste with a capacity exceeding 75 tonnes per day involving one or more of the following activities, and excluding activities covered by Directive 91/271/EEC: (i)-(iv) (see scope). 5.5. Temporary storage of hazardous waste not covered under point 5.4 of Annex I to Directive 2010/75/EU pending any of the activities listed in points 5.1, 5.2, 5.4 and 5.6 of Annex I to Directive 2010/75/EU with a total capacity exceeding 50 tonnes, excluding temporary storage, pending collection, on the site where the waste is generated. 6.11. Independently operated treatment of waste water not covered by Directive 91/271/EEC and discharged by an installation undertaking activities covered under points 5.1, 5.3 or 5.5 as listed above; Techniques (a)-(e) (see table); Reducing odour concentration emissions to air. The BAT-AEL emission level is 200-1 000 ouE/Nm3 .
status: valid
status modified: 2026-05-06
accepted date: 2026-05-06
in scheme: BATAEL values as defined into the EC BAT-Tool

Waste Treatment - Pb - BAT20-XIX
type: Concept
notation: WT-Pb-BAT20-XIX
definition: 5.� Waste management; 6. Other activities: 5.1. Disposal or recovery of hazardous waste with a capacity exceeding 10 tonnes per day involving one or more of the following activities: (a)-(j) (see scope); 5.3. (a) Disposal of non-hazardous waste with a capacity exceeding 50 tonnes per day involving one or more of the following activities, and excluding activities covered by Council Directive 91/271/EEC (1): (i)-(v) (see scope). (b) Recovery, or a mix of recovery and disposal, of non-hazardous waste with a capacity exceeding 75 tonnes per day involving one or more of the following activities, and excluding activities covered by Directive 91/271/EEC: (i)-(iv) (see scope). 5.5. Temporary storage of hazardous waste not covered under point 5.4 of Annex I to Directive 2010/75/EU pending any of the activities listed in points 5.1, 5.2, 5.4 and 5.6 of Annex I to Directive 2010/75/EU with a total capacity exceeding 50 tonnes, excluding temporary storage, pending collection, on the site where the waste is generated. 6.11. Independently operated treatment of waste water not covered by Directive 91/271/EEC and discharged by an installation undertaking activities covered under points 5.1, 5.3 or 5.5 as listed above. Reducing lead to water. The BAT-AEL emission level is 0,05-0,1 mg/l .
status: valid
status modified: 2026-05-06
accepted date: 2026-05-06
in scheme: BATAEL values as defined into the EC BAT-Tool

Waste Treatment - Pb - BAT20-XLVIII
type: Concept
notation: WT-Pb-BAT20-XLVIII
definition: 5.� Waste management; 6. Other activities: 5.1. Disposal or recovery of hazardous waste with a capacity exceeding 10 tonnes per day involving one or more of the following activities: (a)-(j) (see scope); 5.3. (a) Disposal of non-hazardous waste with a capacity exceeding 50 tonnes per day involving one or more of the following activities, and excluding activities covered by Council Directive 91/271/EEC (1): (i)-(v) (see scope). (b) Recovery, or a mix of recovery and disposal, of non-hazardous waste with a capacity exceeding 75 tonnes per day involving one or more of the following activities, and excluding activities covered by Directive 91/271/EEC: (i)-(iv) (see scope). 5.5. Temporary storage of hazardous waste not covered under point 5.4 of Annex I to Directive 2010/75/EU pending any of the activities listed in points 5.1, 5.2, 5.4 and 5.6 of Annex I to Directive 2010/75/EU with a total capacity exceeding 50 tonnes, excluding temporary storage, pending collection, on the site where the waste is generated. 6.11. Independently operated treatment of waste water not covered by Directive 91/271/EEC and discharged by an installation undertaking activities covered under points 5.1, 5.3 or 5.5 as listed above. Reducing lead to water. The BAT-AEL emission level is 0,05-0,3 mg/l .
status: valid
status modified: 2026-05-06
accepted date: 2026-05-06
in scheme: BATAEL values as defined into the EC BAT-Tool

Waste Treatment - Pb - BAT20-XXVIII
type: Concept
notation: WT-Pb-BAT20-XXVIII
definition: 5.� Waste management; 6. Other activities: 5.1. Disposal or recovery of hazardous waste with a capacity exceeding 10 tonnes per day involving one or more of the following activities: (a)-(j) (see scope); 5.3. (a) Disposal of non-hazardous waste with a capacity exceeding 50 tonnes per day involving one or more of the following activities, and excluding activities covered by Council Directive 91/271/EEC (1): (i)-(v) (see scope). (b) Recovery, or a mix of recovery and disposal, of non-hazardous waste with a capacity exceeding 75 tonnes per day involving one or more of the following activities, and excluding activities covered by Directive 91/271/EEC: (i)-(iv) (see scope). 5.5. Temporary storage of hazardous waste not covered under point 5.4 of Annex I to Directive 2010/75/EU pending any of the activities listed in points 5.1, 5.2, 5.4 and 5.6 of Annex I to Directive 2010/75/EU with a total capacity exceeding 50 tonnes, excluding temporary storage, pending collection, on the site where the waste is generated. 6.11. Independently operated treatment of waste water not covered by Directive 91/271/EEC and discharged by an installation undertaking activities covered under points 5.1, 5.3 or 5.5 as listed above. Reducing lead to water. The BAT-AEL emission level is 0,05-0,3 mg/l .
status: valid
status modified: 2026-05-06
accepted date: 2026-05-06
in scheme: BATAEL values as defined into the EC BAT-Tool

Waste Treatment - Pb - BAT20-XXXIX
type: Concept
notation: WT-Pb-BAT20-XXXIX
definition: 5.� Waste management; 6. Other activities: 5.1. Disposal or recovery of hazardous waste with a capacity exceeding 10 tonnes per day involving one or more of the following activities: (a)-(j) (see scope); 5.3. (a) Disposal of non-hazardous waste with a capacity exceeding 50 tonnes per day involving one or more of the following activities, and excluding activities covered by Council Directive 91/271/EEC (1): (i)-(v) (see scope). (b) Recovery, or a mix of recovery and disposal, of non-hazardous waste with a capacity exceeding 75 tonnes per day involving one or more of the following activities, and excluding activities covered by Directive 91/271/EEC: (i)-(iv) (see scope). 5.5. Temporary storage of hazardous waste not covered under point 5.4 of Annex I to Directive 2010/75/EU pending any of the activities listed in points 5.1, 5.2, 5.4 and 5.6 of Annex I to Directive 2010/75/EU with a total capacity exceeding 50 tonnes, excluding temporary storage, pending collection, on the site where the waste is generated. 6.11. Independently operated treatment of waste water not covered by Directive 91/271/EEC and discharged by an installation undertaking activities covered under points 5.1, 5.3 or 5.5 as listed above. Reducing lead to water. The BAT-AEL emission level is 0,05-0,1 mg/l .
status: valid
status modified: 2026-05-06
accepted date: 2026-05-06
in scheme: BATAEL values as defined into the EC BAT-Tool

Waste Treatment - Phenols - BAT20-XI
type: Concept
notation: WT-Phenols-BAT20-XI
definition: 5.� Waste management; 6. Other activities: 5.1. Disposal or recovery of hazardous waste with a capacity exceeding 10 tonnes per day involving one or more of the following activities: (a)-(j) (see scope); 5.3. (a) Disposal of non-hazardous waste with a capacity exceeding 50 tonnes per day involving one or more of the following activities, and excluding activities covered by Council Directive 91/271/EEC (1): (i)-(v) (see scope). (b) Recovery, or a mix of recovery and disposal, of non-hazardous waste with a capacity exceeding 75 tonnes per day involving one or more of the following activities, and excluding activities covered by Directive 91/271/EEC: (i)-(iv) (see scope). 5.5. Temporary storage of hazardous waste not covered under point 5.4 of Annex I to Directive 2010/75/EU pending any of the activities listed in points 5.1, 5.2, 5.4 and 5.6 of Annex I to Directive 2010/75/EU with a total capacity exceeding 50 tonnes, excluding temporary storage, pending collection, on the site where the waste is generated. 6.11. Independently operated treatment of waste water not covered by Directive 91/271/EEC and discharged by an installation undertaking activities covered under points 5.1, 5.3 or 5.5 as listed above. Reducing phenol index to water. The BAT-AEL emission level is 0,05-0,2 mg/l .
status: valid
status modified: 2026-05-06
accepted date: 2026-05-06
in scheme: BATAEL values as defined into the EC BAT-Tool

Waste Treatment - Phenols - BAT20-XII
type: Concept
notation: WT-Phenols-BAT20-XII
definition: 5.� Waste management; 6. Other activities: 5.1. Disposal or recovery of hazardous waste with a capacity exceeding 10 tonnes per day involving one or more of the following activities: (a)-(j) (see scope); 5.3. (a) Disposal of non-hazardous waste with a capacity exceeding 50 tonnes per day involving one or more of the following activities, and excluding activities covered by Council Directive 91/271/EEC (1): (i)-(v) (see scope). (b) Recovery, or a mix of recovery and disposal, of non-hazardous waste with a capacity exceeding 75 tonnes per day involving one or more of the following activities, and excluding activities covered by Directive 91/271/EEC: (i)-(iv) (see scope). 5.5. Temporary storage of hazardous waste not covered under point 5.4 of Annex I to Directive 2010/75/EU pending any of the activities listed in points 5.1, 5.2, 5.4 and 5.6 of Annex I to Directive 2010/75/EU with a total capacity exceeding 50 tonnes, excluding temporary storage, pending collection, on the site where the waste is generated. 6.11. Independently operated treatment of waste water not covered by Directive 91/271/EEC and discharged by an installation undertaking activities covered under points 5.1, 5.3 or 5.5 as listed above. Reducing phenol index to water. The BAT-AEL emission level is 0,05-0,3 mg/l .
status: valid
status modified: 2026-05-06
accepted date: 2026-05-06
in scheme: BATAEL values as defined into the EC BAT-Tool

Waste Treatment - TN - BAT20-VII
type: Concept
notation: WT-TN-BAT20-VII
definition: 5.� Waste management; 6. Other activities: 5.1. Disposal or recovery of hazardous waste with a capacity exceeding 10 tonnes per day involving one or more of the following activities: (a)-(j) (see scope); 5.3. (a) Disposal of non-hazardous waste with a capacity exceeding 50 tonnes per day involving one or more of the following activities, and excluding activities covered by Council Directive 91/271/EEC (1): (i)-(v) (see scope). (b) Recovery, or a mix of recovery and disposal, of non-hazardous waste with a capacity exceeding 75 tonnes per day involving one or more of the following activities, and excluding activities covered by Directive 91/271/EEC: (i)-(iv) (see scope). 5.5. Temporary storage of hazardous waste not covered under point 5.4 of Annex I to Directive 2010/75/EU pending any of the activities listed in points 5.1, 5.2, 5.4 and 5.6 of Annex I to Directive 2010/75/EU with a total capacity exceeding 50 tonnes, excluding temporary storage, pending collection, on the site where the waste is generated. 6.11. Independently operated treatment of waste water not covered by Directive 91/271/EEC and discharged by an installation undertaking activities covered under points 5.1, 5.3 or 5.5 as listed above. Reducing total nitrogen to water. The BAT-AEL emission level is 1-25 mg/l .
status: valid
status modified: 2026-05-06
accepted date: 2026-05-06
in scheme: BATAEL values as defined into the EC BAT-Tool

Waste Treatment - TN - BAT20-VIII
type: Concept
notation: WT-TN-BAT20-VIII
definition: 5.� Waste management; 6. Other activities: 5.1. Disposal or recovery of hazardous waste with a capacity exceeding 10 tonnes per day involving one or more of the following activities: (a)-(j) (see scope); 5.3. (a) Disposal of non-hazardous waste with a capacity exceeding 50 tonnes per day involving one or more of the following activities, and excluding activities covered by Council Directive 91/271/EEC (1): (i)-(v) (see scope). (b) Recovery, or a mix of recovery and disposal, of non-hazardous waste with a capacity exceeding 75 tonnes per day involving one or more of the following activities, and excluding activities covered by Directive 91/271/EEC: (i)-(iv) (see scope). 5.5. Temporary storage of hazardous waste not covered under point 5.4 of Annex I to Directive 2010/75/EU pending any of the activities listed in points 5.1, 5.2, 5.4 and 5.6 of Annex I to Directive 2010/75/EU with a total capacity exceeding 50 tonnes, excluding temporary storage, pending collection, on the site where the waste is generated. 6.11. Independently operated treatment of waste water not covered by Directive 91/271/EEC and discharged by an installation undertaking activities covered under points 5.1, 5.3 or 5.5 as listed above. Reducing total nitrogen to water. The BAT-AEL emission level is 10-60 mg/l .
status: valid
status modified: 2026-05-06
accepted date: 2026-05-06
in scheme: BATAEL values as defined into the EC BAT-Tool

Waste Treatment - TOC - BAT20-I
type: Concept
notation: WT-TOC-BAT20-I
definition: 5.� Waste management; 6. Other activities: 5.1. Disposal or recovery of hazardous waste with a capacity exceeding 10 tonnes per day involving one or more of the following activities: (a)-(j) (see scope); 5.3. (a) Disposal of non-hazardous waste with a capacity exceeding 50 tonnes per day involving one or more of the following activities, and excluding activities covered by Council Directive 91/271/EEC (1): (i)-(v) (see scope). (b) Recovery, or a mix of recovery and disposal, of non-hazardous waste with a capacity exceeding 75 tonnes per day involving one or more of the following activities, and excluding activities covered by Directive 91/271/EEC: (i)-(iv) (see scope). 5.5. Temporary storage of hazardous waste not covered under point 5.4 of Annex I to Directive 2010/75/EU pending any of the activities listed in points 5.1, 5.2, 5.4 and 5.6 of Annex I to Directive 2010/75/EU with a total capacity exceeding 50 tonnes, excluding temporary storage, pending collection, on the site where the waste is generated. 6.11. Independently operated treatment of waste water not covered by Directive 91/271/EEC and discharged by an installation undertaking activities covered under points 5.1, 5.3 or 5.5 as listed above. Reducing total organic carbon to water. The BAT-AEL emission level is 10-60 mg/l .
status: valid
status modified: 2026-05-06
accepted date: 2026-05-06
in scheme: BATAEL values as defined into the EC BAT-Tool

Waste Treatment - TOC - BAT20-II
type: Concept
notation: WT-TOC-BAT20-II
definition: 5.� Waste management; 6. Other activities: 5.1. Disposal or recovery of hazardous waste with a capacity exceeding 10 tonnes per day involving one or more of the following activities: (a)-(j) (see scope); 5.3. (a) Disposal of non-hazardous waste with a capacity exceeding 50 tonnes per day involving one or more of the following activities, and excluding activities covered by Council Directive 91/271/EEC (1): (i)-(v) (see scope). (b) Recovery, or a mix of recovery and disposal, of non-hazardous waste with a capacity exceeding 75 tonnes per day involving one or more of the following activities, and excluding activities covered by Directive 91/271/EEC: (i)-(iv) (see scope). 5.5. Temporary storage of hazardous waste not covered under point 5.4 of Annex I to Directive 2010/75/EU pending any of the activities listed in points 5.1, 5.2, 5.4 and 5.6 of Annex I to Directive 2010/75/EU with a total capacity exceeding 50 tonnes, excluding temporary storage, pending collection, on the site where the waste is generated. 6.11. Independently operated treatment of waste water not covered by Directive 91/271/EEC and discharged by an installation undertaking activities covered under points 5.1, 5.3 or 5.5 as listed above. Reducing total organic carbon to water. The BAT-AEL emission level is 10-100 mg/l .
status: valid
status modified: 2026-05-06
accepted date: 2026-05-06
in scheme: BATAEL values as defined into the EC BAT-Tool

Waste Treatment - TP - BAT20-IX
type: Concept
notation: WT-TP-BAT20-IX
definition: 5.� Waste management; 6. Other activities: 5.1. Disposal or recovery of hazardous waste with a capacity exceeding 10 tonnes per day involving one or more of the following activities: (a)-(j) (see scope); 5.3. (a) Disposal of non-hazardous waste with a capacity exceeding 50 tonnes per day involving one or more of the following activities, and excluding activities covered by Council Directive 91/271/EEC (1): (i)-(v) (see scope). (b) Recovery, or a mix of recovery and disposal, of non-hazardous waste with a capacity exceeding 75 tonnes per day involving one or more of the following activities, and excluding activities covered by Directive 91/271/EEC: (i)-(iv) (see scope). 5.5. Temporary storage of hazardous waste not covered under point 5.4 of Annex I to Directive 2010/75/EU pending any of the activities listed in points 5.1, 5.2, 5.4 and 5.6 of Annex I to Directive 2010/75/EU with a total capacity exceeding 50 tonnes, excluding temporary storage, pending collection, on the site where the waste is generated. 6.11. Independently operated treatment of waste water not covered by Directive 91/271/EEC and discharged by an installation undertaking activities covered under points 5.1, 5.3 or 5.5 as listed above. Reducing total phosphorus to water. The BAT-AEL emission level is 0,3-2 mg/l .
status: valid
status modified: 2026-05-06
accepted date: 2026-05-06
in scheme: BATAEL values as defined into the EC BAT-Tool

Waste Treatment - TP - BAT20-X
type: Concept
notation: WT-TP-BAT20-X
definition: 5.� Waste management; 6. Other activities: 5.1. Disposal or recovery of hazardous waste with a capacity exceeding 10 tonnes per day involving one or more of the following activities: (a)-(j) (see scope); 5.3. (a) Disposal of non-hazardous waste with a capacity exceeding 50 tonnes per day involving one or more of the following activities, and excluding activities covered by Council Directive 91/271/EEC (1): (i)-(v) (see scope). (b) Recovery, or a mix of recovery and disposal, of non-hazardous waste with a capacity exceeding 75 tonnes per day involving one or more of the following activities, and excluding activities covered by Directive 91/271/EEC: (i)-(iv) (see scope). 5.5. Temporary storage of hazardous waste not covered under point 5.4 of Annex I to Directive 2010/75/EU pending any of the activities listed in points 5.1, 5.2, 5.4 and 5.6 of Annex I to Directive 2010/75/EU with a total capacity exceeding 50 tonnes, excluding temporary storage, pending collection, on the site where the waste is generated. 6.11. Independently operated treatment of waste water not covered by Directive 91/271/EEC and discharged by an installation undertaking activities covered under points 5.1, 5.3 or 5.5 as listed above. Reducing total phosphorus to water. The BAT-AEL emission level is 1-3 mg/l .
status: valid
status modified: 2026-05-06
accepted date: 2026-05-06
in scheme: BATAEL values as defined into the EC BAT-Tool

Waste Treatment - TSS - BAT20-V
type: Concept
notation: WT-TSS-BAT20-V
definition: 5.� Waste management; 6. Other activities: 5.1. Disposal or recovery of hazardous waste with a capacity exceeding 10 tonnes per day involving one or more of the following activities: (a)-(j) (see scope); 5.3. (a) Disposal of non-hazardous waste with a capacity exceeding 50 tonnes per day involving one or more of the following activities, and excluding activities covered by Council Directive 91/271/EEC (1): (i)-(v) (see scope). (b) Recovery, or a mix of recovery and disposal, of non-hazardous waste with a capacity exceeding 75 tonnes per day involving one or more of the following activities, and excluding activities covered by Directive 91/271/EEC: (i)-(iv) (see scope). 5.5. Temporary storage of hazardous waste not covered under point 5.4 of Annex I to Directive 2010/75/EU pending any of the activities listed in points 5.1, 5.2, 5.4 and 5.6 of Annex I to Directive 2010/75/EU with a total capacity exceeding 50 tonnes, excluding temporary storage, pending collection, on the site where the waste is generated. 6.11. Independently operated treatment of waste water not covered by Directive 91/271/EEC and discharged by an installation undertaking activities covered under points 5.1, 5.3 or 5.5 as listed above. Reducing total suspended solids to water. The BAT-AEL emission level is 5-60 mg/l .
status: valid
status modified: 2026-05-06
accepted date: 2026-05-06
in scheme: BATAEL values as defined into the EC BAT-Tool

Waste Treatment - TVOC - BAT29-I
type: Concept
notation: WT-TVOC-BAT29-I
definition: 5.� Waste management; 6. Other activities: 5.1. Disposal or recovery of hazardous waste with a capacity exceeding 10 tonnes per day involving one or more of the following activities: (a)-(j) (see scope); 5.3. (a) Disposal of non-hazardous waste with a capacity exceeding 50 tonnes per day involving one or more of the following activities, and excluding activities covered by Council Directive 91/271/EEC (1): (i)-(v) (see scope). (b) Recovery, or a mix of recovery and disposal, of non-hazardous waste with a capacity exceeding 75 tonnes per day involving one or more of the following activities, and excluding activities covered by Directive 91/271/EEC: (i)-(iv) (see scope). 5.5. Temporary storage of hazardous waste not covered under point 5.4 of Annex I to Directive 2010/75/EU pending any of the activities listed in points 5.1, 5.2, 5.4 and 5.6 of Annex I to Directive 2010/75/EU with a total capacity exceeding 50 tonnes, excluding temporary storage, pending collection, on the site where the waste is generated. 6.11. Independently operated treatment of waste water not covered by Directive 91/271/EEC and discharged by an installation undertaking activities covered under points 5.1, 5.3 or 5.5 as listed above; Techniques (a)-(d) (see table incl. footnote); Reducing TVOC emissions to air. The BAT-AEL emission level is 3-15 mg/Nm3 .
status: valid
status modified: 2026-05-06
accepted date: 2026-05-06
in scheme: BATAEL values as defined into the EC BAT-Tool

Waste Treatment - TVOC - BAT31
type: Concept
notation: WT-TVOC-BAT31
definition: 5.� Waste management; 6. Other activities: 5.1. Disposal or recovery of hazardous waste with a capacity exceeding 10 tonnes per day involving one or more of the following activities: (a)-(j) (see scope); 5.3. (a) Disposal of non-hazardous waste with a capacity exceeding 50 tonnes per day involving one or more of the following activities, and excluding activities covered by Council Directive 91/271/EEC (1): (i)-(v) (see scope). (b) Recovery, or a mix of recovery and disposal, of non-hazardous waste with a capacity exceeding 75 tonnes per day involving one or more of the following activities, and excluding activities covered by Directive 91/271/EEC: (i)-(iv) (see scope). 5.5. Temporary storage of hazardous waste not covered under point 5.4 of Annex I to Directive 2010/75/EU pending any of the activities listed in points 5.1, 5.2, 5.4 and 5.6 of Annex I to Directive 2010/75/EU with a total capacity exceeding 50 tonnes, excluding temporary storage, pending collection, on the site where the waste is generated. 6.11. Independently operated treatment of waste water not covered by Directive 91/271/EEC and discharged by an installation undertaking activities covered under points 5.1, 5.3 or 5.5 as listed above; Apply BAT 14d, BAT 14h and use technique (a) and one or both of the techniques (b) and (c); Reducing TVOC emissions to air. The BAT-AEL emission level is 10-30 mg/Nm3 .
status: valid
status modified: 2026-05-06
accepted date: 2026-05-06
in scheme: BATAEL values as defined into the EC BAT-Tool

Waste Treatment - TVOC - BAT34-IV
type: Concept
notation: WT-TVOC-BAT34-IV
definition: 5.� Waste management; 6. Other activities: 5.1. Disposal or recovery of hazardous waste with a capacity exceeding 10 tonnes per day involving one or more of the following activities: (a)-(j) (see scope); 5.3. (a) Disposal of non-hazardous waste with a capacity exceeding 50 tonnes per day involving one or more of the following activities, and excluding activities covered by Council Directive 91/271/EEC (1): (i)-(v) (see scope). (b) Recovery, or a mix of recovery and disposal, of non-hazardous waste with a capacity exceeding 75 tonnes per day involving one or more of the following activities, and excluding activities covered by Directive 91/271/EEC: (i)-(iv) (see scope). 5.5. Temporary storage of hazardous waste not covered under point 5.4 of Annex I to Directive 2010/75/EU pending any of the activities listed in points 5.1, 5.2, 5.4 and 5.6 of Annex I to Directive 2010/75/EU with a total capacity exceeding 50 tonnes, excluding temporary storage, pending collection, on the site where the waste is generated. 6.11. Independently operated treatment of waste water not covered by Directive 91/271/EEC and discharged by an installation undertaking activities covered under points 5.1, 5.3 or 5.5 as listed above; Techniques (a)-(e) (see table); Reducing TVOC emissions to air. The BAT-AEL emission level is 5-40 mg/Nm3 .
status: valid
status modified: 2026-05-06
accepted date: 2026-05-06
in scheme: BATAEL values as defined into the EC BAT-Tool

Waste Treatment - TVOC - BAT45
type: Concept
notation: WT-TVOC-BAT45
definition: 5.� Waste management; 6. Other activities: 5.1. Disposal or recovery of hazardous waste with a capacity exceeding 10 tonnes per day involving one or more of the following activities: (a)-(j) (see scope); 5.3. (a) Disposal of non-hazardous waste with a capacity exceeding 50 tonnes per day involving one or more of the following activities, and excluding activities covered by Council Directive 91/271/EEC (1): (i)-(v) (see scope). (b) Recovery, or a mix of recovery and disposal, of non-hazardous waste with a capacity exceeding 75 tonnes per day involving one or more of the following activities, and excluding activities covered by Directive 91/271/EEC: (i)-(iv) (see scope). 5.5. Temporary storage of hazardous waste not covered under point 5.4 of Annex I to Directive 2010/75/EU pending any of the activities listed in points 5.1, 5.2, 5.4 and 5.6 of Annex I to Directive 2010/75/EU with a total capacity exceeding 50 tonnes, excluding temporary storage, pending collection, on the site where the waste is generated. 6.11. Independently operated treatment of waste water not covered by Directive 91/271/EEC and discharged by an installation undertaking activities covered under points 5.1, 5.3 or 5.5 as listed above; Reducing TVOC emissions to air. The BAT-AEL emission level is 5-30 mg/Nm3 .
status: valid
status modified: 2026-05-06
accepted date: 2026-05-06
in scheme: BATAEL values as defined into the EC BAT-Tool

Waste Treatment - TVOC - BAT47
type: Concept
notation: WT-TVOC-BAT47
definition: 5.� Waste management; 6. Other activities: 5.1. Disposal or recovery of hazardous waste with a capacity exceeding 10 tonnes per day involving one or more of the following activities: (a)-(j) (see scope); 5.3. (a) Disposal of non-hazardous waste with a capacity exceeding 50 tonnes per day involving one or more of the following activities, and excluding activities covered by Council Directive 91/271/EEC (1): (i)-(v) (see scope). (b) Recovery, or a mix of recovery and disposal, of non-hazardous waste with a capacity exceeding 75 tonnes per day involving one or more of the following activities, and excluding activities covered by Directive 91/271/EEC: (i)-(iv) (see scope). 5.5. Temporary storage of hazardous waste not covered under point 5.4 of Annex I to Directive 2010/75/EU pending any of the activities listed in points 5.1, 5.2, 5.4 and 5.6 of Annex I to Directive 2010/75/EU with a total capacity exceeding 50 tonnes, excluding temporary storage, pending collection, on the site where the waste is generated. 6.11. Independently operated treatment of waste water not covered by Directive 91/271/EEC and discharged by an installation undertaking activities covered under points 5.1, 5.3 or 5.5 as listed above; Reducing TVOC emissions to air. The BAT-AEL emission level is 5-30 mg/Nm3 .
status: valid
status modified: 2026-05-06
accepted date: 2026-05-06
in scheme: BATAEL values as defined into the EC BAT-Tool

Waste Treatment - TVOC - BAT53-II
type: Concept
notation: WT-TVOC-BAT53-II
definition: 5.� Waste management; 6. Other activities: 5.1. Disposal or recovery of hazardous waste with a capacity exceeding 10 tonnes per day involving one or more of the following activities: (a)-(j) (see scope); 5.3. (a) Disposal of non-hazardous waste with a capacity exceeding 50 tonnes per day involving one or more of the following activities, and excluding activities covered by Council Directive 91/271/EEC (1): (i)-(v) (see scope). (b) Recovery, or a mix of recovery and disposal, of non-hazardous waste with a capacity exceeding 75 tonnes per day involving one or more of the following activities, and excluding activities covered by Directive 91/271/EEC: (i)-(iv) (see scope). 5.5. Temporary storage of hazardous waste not covered under point 5.4 of Annex I to Directive 2010/75/EU pending any of the activities listed in points 5.1, 5.2, 5.4 and 5.6 of Annex I to Directive 2010/75/EU with a total capacity exceeding 50 tonnes, excluding temporary storage, pending collection, on the site where the waste is generated. 6.11. Independently operated treatment of waste water not covered by Directive 91/271/EEC and discharged by an installation undertaking activities covered under points 5.1, 5.3 or 5.5 as listed above; Reducing TVOC emissions to air. The BAT-AEL emission level is 3-20 mg/Nm3 .
status: valid
status modified: 2026-05-06
accepted date: 2026-05-06
in scheme: BATAEL values as defined into the EC BAT-Tool

Waste Treatment - Zn - BAT20-LI
type: Concept
notation: WT-Zn-BAT20-LI
definition: 5.� Waste management; 6. Other activities: 5.1. Disposal or recovery of hazardous waste with a capacity exceeding 10 tonnes per day involving one or more of the following activities: (a)-(j) (see scope); 5.3. (a) Disposal of non-hazardous waste with a capacity exceeding 50 tonnes per day involving one or more of the following activities, and excluding activities covered by Council Directive 91/271/EEC (1): (i)-(v) (see scope). (b) Recovery, or a mix of recovery and disposal, of non-hazardous waste with a capacity exceeding 75 tonnes per day involving one or more of the following activities, and excluding activities covered by Directive 91/271/EEC: (i)-(iv) (see scope). 5.5. Temporary storage of hazardous waste not covered under point 5.4 of Annex I to Directive 2010/75/EU pending any of the activities listed in points 5.1, 5.2, 5.4 and 5.6 of Annex I to Directive 2010/75/EU with a total capacity exceeding 50 tonnes, excluding temporary storage, pending collection, on the site where the waste is generated. 6.11. Independently operated treatment of waste water not covered by Directive 91/271/EEC and discharged by an installation undertaking activities covered under points 5.1, 5.3 or 5.5 as listed above. Reducing zinc to water. The BAT-AEL emission level is 0,1-2 mg/l .
status: valid
status modified: 2026-05-06
accepted date: 2026-05-06
in scheme: BATAEL values as defined into the EC BAT-Tool

Waste Treatment - Zn - BAT20-XLII
type: Concept
notation: WT-Zn-BAT20-XLII
definition: 5.� Waste management; 6. Other activities: 5.1. Disposal or recovery of hazardous waste with a capacity exceeding 10 tonnes per day involving one or more of the following activities: (a)-(j) (see scope); 5.3. (a) Disposal of non-hazardous waste with a capacity exceeding 50 tonnes per day involving one or more of the following activities, and excluding activities covered by Council Directive 91/271/EEC (1): (i)-(v) (see scope). (b) Recovery, or a mix of recovery and disposal, of non-hazardous waste with a capacity exceeding 75 tonnes per day involving one or more of the following activities, and excluding activities covered by Directive 91/271/EEC: (i)-(iv) (see scope). 5.5. Temporary storage of hazardous waste not covered under point 5.4 of Annex I to Directive 2010/75/EU pending any of the activities listed in points 5.1, 5.2, 5.4 and 5.6 of Annex I to Directive 2010/75/EU with a total capacity exceeding 50 tonnes, excluding temporary storage, pending collection, on the site where the waste is generated. 6.11. Independently operated treatment of waste water not covered by Directive 91/271/EEC and discharged by an installation undertaking activities covered under points 5.1, 5.3 or 5.5 as listed above. Reducing zinc to water. The BAT-AEL emission level is 0,1-1 mg/l .
status: valid
status modified: 2026-05-06
accepted date: 2026-05-06
in scheme: BATAEL values as defined into the EC BAT-Tool

Waste Treatment - Zn - BAT20-XXII
type: Concept
notation: WT-Zn-BAT20-XXII
definition: 5.� Waste management; 6. Other activities: 5.1. Disposal or recovery of hazardous waste with a capacity exceeding 10 tonnes per day involving one or more of the following activities: (a)-(j) (see scope); 5.3. (a) Disposal of non-hazardous waste with a capacity exceeding 50 tonnes per day involving one or more of the following activities, and excluding activities covered by Council Directive 91/271/EEC (1): (i)-(v) (see scope). (b) Recovery, or a mix of recovery and disposal, of non-hazardous waste with a capacity exceeding 75 tonnes per day involving one or more of the following activities, and excluding activities covered by Directive 91/271/EEC: (i)-(iv) (see scope). 5.5. Temporary storage of hazardous waste not covered under point 5.4 of Annex I to Directive 2010/75/EU pending any of the activities listed in points 5.1, 5.2, 5.4 and 5.6 of Annex I to Directive 2010/75/EU with a total capacity exceeding 50 tonnes, excluding temporary storage, pending collection, on the site where the waste is generated. 6.11. Independently operated treatment of waste water not covered by Directive 91/271/EEC and discharged by an installation undertaking activities covered under points 5.1, 5.3 or 5.5 as listed above. Reducing zinc to water. The BAT-AEL emission level is 0,1-1 mg/l .
status: valid
status modified: 2026-05-06
accepted date: 2026-05-06
in scheme: BATAEL values as defined into the EC BAT-Tool

Waste Treatment - Zn - BAT20-XXXI
type: Concept
notation: WT-Zn-BAT20-XXXI
definition: 5.� Waste management; 6. Other activities: 5.1. Disposal or recovery of hazardous waste with a capacity exceeding 10 tonnes per day involving one or more of the following activities: (a)-(j) (see scope); 5.3. (a) Disposal of non-hazardous waste with a capacity exceeding 50 tonnes per day involving one or more of the following activities, and excluding activities covered by Council Directive 91/271/EEC (1): (i)-(v) (see scope). (b) Recovery, or a mix of recovery and disposal, of non-hazardous waste with a capacity exceeding 75 tonnes per day involving one or more of the following activities, and excluding activities covered by Directive 91/271/EEC: (i)-(iv) (see scope). 5.5. Temporary storage of hazardous waste not covered under point 5.4 of Annex I to Directive 2010/75/EU pending any of the activities listed in points 5.1, 5.2, 5.4 and 5.6 of Annex I to Directive 2010/75/EU with a total capacity exceeding 50 tonnes, excluding temporary storage, pending collection, on the site where the waste is generated. 6.11. Independently operated treatment of waste water not covered by Directive 91/271/EEC and discharged by an installation undertaking activities covered under points 5.1, 5.3 or 5.5 as listed above. Reducing zinc to water. The BAT-AEL emission level is 0,1-2 mg/l .
status: valid
status modified: 2026-05-06
accepted date: 2026-05-06
in scheme: BATAEL values as defined into the EC BAT-Tool

BAT Conclusion value
type: ConceptScheme
notation: BATConclusionValue
is part of: Industrial Emission Portal Regulation and Industrial Emission Directive
registration status: Public draft
user modified: antogfed
date modified: 2026-05-07 19:25:09.0
vocabulary type: Common
is numeric concept identifiers: false
is notations equal identifiers: false

BATCNOTYETADOPTED
type: Concept
notation: BATCNOTYETADOPTED
definition: This code list entry should be used where there will be a BATC for an activity but the BATC document has not yet been adopted. In some limited cases there is no relevant BATC available or planned for an activity and in these cases the alternative code list entry BATCNOTAPPLICABLE should be used
status: valid
status modified: 2026-05-06
accepted date: 2026-05-06
in scheme: BAT Conclusion value

Production of Chlor-alkali
type: Concept
notation: CAK
definition: Production of Chlor-alkali
status: valid
status modified: 2026-05-06
accepted date: 2026-05-06
in scheme: BAT Conclusion value

Ceramic Manufacturing Industry
type: Concept
notation: CER
definition: Ceramic Manufacturing Industry
status: valid
status modified: 2026-05-06
accepted date: 2026-05-06
in scheme: BAT Conclusion value

Production of Cement, Lime and Magnesium Oxide
type: Concept
notation: CLM
definition: Production of Cement, Lime and Magnesium Oxide
status: valid
status modified: 2026-05-06
accepted date: 2026-05-06
in scheme: BAT Conclusion value

Common Waste Water and Waste Gas Treatment/ Management Systems in the Chemical Sector
type: Concept
notation: CWW
definition: Common Waste Water and Waste Gas Treatment/ Management Systems in the Chemical Sector
status: valid
status modified: 2026-05-06
accepted date: 2026-05-06
in scheme: BAT Conclusion value

Food, Drink and Milk Industries
type: Concept
notation: FDM
definition: Food, Drink and Milk Industries
status: valid
status modified: 2026-05-06
accepted date: 2026-05-06
in scheme: BAT Conclusion value

Ferrous Metals Processing Industry
type: Concept
notation: FMP
definition: Ferrous Metals Processing Industry
status: valid
status modified: 2026-05-06
accepted date: 2026-05-06
in scheme: BAT Conclusion value

Manufacture of Glass
type: Concept
notation: GLS
definition: Manufacture of Glass
status: valid
status modified: 2026-05-06
accepted date: 2026-05-06
in scheme: BAT Conclusion value

Intensive Rearing of Poultry or Pigs
type: Concept
notation: IRPP
definition: Intensive Rearing of Poultry or Pigs
status: valid
status modified: 2026-05-06
accepted date: 2026-05-06
in scheme: BAT Conclusion value

Iron and Steel Production
type: Concept
notation: IS
definition: Iron and Steel Production
status: valid
status modified: 2026-05-06
accepted date: 2026-05-06
in scheme: BAT Conclusion value

Large Combustion Plants
type: Concept
notation: LCP
definition: Large Combustion Plants
status: valid
status modified: 2026-05-06
accepted date: 2026-05-06
in scheme: BAT Conclusion value

Large Volume Inorganic Chemicals
type: Concept
notation: LVIC
definition: This BATC will cover all activities involved in Large Volume Inorganic Chemicals.
status: valid
status modified: 2026-05-06
accepted date: 2026-05-06
in scheme: BAT Conclusion value

Production of Large Volume Organic Chemicals
type: Concept
notation: LVOC
definition: Production of Large Volume Organic Chemicals
status: valid
status modified: 2026-05-06
accepted date: 2026-05-06
in scheme: BAT Conclusion value

Non-ferrous Metals Industries
type: Concept
notation: NFM
definition: Non-ferrous Metals Industries
status: valid
status modified: 2026-05-06
accepted date: 2026-05-06
in scheme: BAT Conclusion value

NOBATCAPPLICABLE
type: Concept
notation: NOBATCAPPLICABLE
definition: In some circumstances there may be no applicable BATC for an IED permitted installation. In these cases this code list entry should be used.
status: valid
status modified: 2026-05-06
accepted date: 2026-05-06
in scheme: BAT Conclusion value

Production of Pulp, Paper and Board
type: Concept
notation: PP
definition: Production of Pulp, Paper and Board
status: valid
status modified: 2026-05-06
accepted date: 2026-05-06
in scheme: BAT Conclusion value

Refining of Mineral Oil and Gas
type: Concept
notation: REF
definition: Refining of Mineral Oil and Gas
status: valid
status modified: 2026-05-06
accepted date: 2026-05-06
in scheme: BAT Conclusion value

Slaughterhouses and Animals By-products Industries
type: Concept
notation: SA
definition: Slaughterhouses and Animals By-products Industries
status: valid
status modified: 2026-05-06
accepted date: 2026-05-06
in scheme: BAT Conclusion value

Smitheries and Foundries Industry
type: Concept
notation: SF
definition: Smitheries and Foundries Industry
status: valid
status modified: 2026-05-06
accepted date: 2026-05-06
in scheme: BAT Conclusion value

Surface Treatment Of Metals and Plastics
type: Concept
notation: STM
definition: Surface Treatment Of Metals and Plastics
status: valid
status modified: 2026-05-06
accepted date: 2026-05-06
in scheme: BAT Conclusion value

Surface Treatment Using Organic Solvents (including Wood and Wood Products Preservation with Chemicals)
type: Concept
notation: STS
definition: Surface Treatment Using Organic Solvents (including Wood and Wood Products Preservation with Chemicals)
status: valid
status modified: 2026-05-06
accepted date: 2026-05-06
in scheme: BAT Conclusion value

Tanning of Hides and Skins
type: Concept
notation: TAN
definition: Tanning of Hides and Skins
status: valid
status modified: 2026-05-06
accepted date: 2026-05-06
in scheme: BAT Conclusion value

Textiles Industry
type: Concept
notation: TXT
definition: Textiles Industry
status: valid
status modified: 2026-05-06
accepted date: 2026-05-06
in scheme: BAT Conclusion value

Wood-based Panels Production
type: Concept
notation: WBP
definition: Wood-based Panels Production
status: valid
status modified: 2026-05-06
accepted date: 2026-05-06
in scheme: BAT Conclusion value

Common Waste Gas Treatment in the Chemical Sector
type: Concept
notation: WGC
definition: Common Waste Gas Treatment in the Chemical Sector
status: valid
status modified: 2026-05-06
accepted date: 2026-05-06
in scheme: BAT Conclusion value

Waste Incineration
type: Concept
notation: WI
definition: Waste Incineration
status: valid
status modified: 2026-05-06
accepted date: 2026-05-06
in scheme: BAT Conclusion value

Waste Treatment
type: Concept
notation: WT
definition: Waste Treatment
status: valid
status modified: 2026-05-06
accepted date: 2026-05-06
in scheme: BAT Conclusion value

Type of combustion plant according to categories included in Article 72 of Directive 2010/75/EU
type: ConceptScheme
notation: CombustionPlantCategoryValue
is part of: Industrial Emission Portal Regulation and Industrial Emission Directive
registration status: Public draft
user modified: antogfed
date modified: 2026-05-07 19:25:34.0
vocabulary type: Common
is numeric concept identifiers: false
is notations equal identifiers: false

Boiler
type: Concept
notation: Boiler
definition: Boiler
status: valid
status modified: 2026-05-06
accepted date: 2026-05-06
in scheme: Type of combustion plant according to categories included in Article 72 of Directive 2010/75/EU

DieselEngine
type: Concept
notation: DieselEngine
definition: ‘diesel engine’ means an internal combustion engine which operates according to the diesel cycle and uses compression ignition to burn fuel
status: valid
status modified: 2026-05-06
accepted date: 2026-05-06
in scheme: Type of combustion plant according to categories included in Article 72 of Directive 2010/75/EU

GasEngine
type: Concept
notation: GasEngine
definition: ‘gas engine’ means an internal combustion engine which operates according to the Otto cycle and uses spark ignition or, in case of dual fuel engines, compression ignition to burn fuel;
status: valid
status modified: 2026-05-06
accepted date: 2026-05-06
in scheme: Type of combustion plant according to categories included in Article 72 of Directive 2010/75/EU

GasTurbine
type: Concept
notation: GasTurbine
definition: ‘gas turbine’ means any rotating machine which converts thermal energy into mechanical work, consisting mainly of a compressor, a thermal device in which fuel is oxidised in order to heat the working fluid, and a turbine
status: valid
status modified: 2026-05-06
accepted date: 2026-05-06
in scheme: Type of combustion plant according to categories included in Article 72 of Directive 2010/75/EU

Other (specifying the type)
type: Concept
notation: Others
definition: Other as referenced by Article 72(3b) of IED
status: valid
status modified: 2026-05-06
accepted date: 2026-05-06
in scheme: Type of combustion plant according to categories included in Article 72 of Directive 2010/75/EU

Type of competent authority for Production Installation to be used in the IED Implementation dataflow
type: ConceptScheme
notation: CompetentAuthorityTypeValue
is part of: Industrial Emission Portal Regulation and Industrial Emission Directive
registration status: Public draft
user modified: antogfed
date modified: 2026-05-07 19:25:48.0
vocabulary type: Common
is numeric concept identifiers: false
is notations equal identifiers: false

Inspection
type: Concept
notation: Inspection
definition: Competent authority in charge of inspection under IED
status: valid
status modified: 2026-05-06
accepted date: 2026-05-06
in scheme: Type of competent authority for Production Installation to be used in the IED Implementation dataflow

Inspection and permit
type: Concept
notation: InspectionAndPermit
definition: Competent authority in charge of both inspection and permit under IED
status: valid
status modified: 2026-05-06
accepted date: 2026-05-06
in scheme: Type of competent authority for Production Installation to be used in the IED Implementation dataflow

Permit
type: Concept
notation: Permit
definition: Competent authority in charge of permit under IED
status: valid
status modified: 2026-05-06
accepted date: 2026-05-06
in scheme: Type of competent authority for Production Installation to be used in the IED Implementation dataflow

The status of an entity with regards to its completion and use
type: ConceptScheme
notation: ConditionOfOperationValue
is part of: Industrial Emission Portal Regulation and Industrial Emission Directive
registration status: Public draft
user modified: antogfed
date modified: 2026-05-07 19:26:00.0
vocabulary type: Common
is numeric concept identifiers: false
is notations equal identifiers: false

Decommissioned
type: Concept
notation: decommissioned
definition: The entity is no longer used and is being or has been decommissioned/closed.
status: valid
status modified: 2026-05-06
accepted date: 2026-05-06
in scheme: The status of an entity with regards to its completion and use

Disused
type: Concept
notation: Disused
definition: The entity is no longer used, but is not being or has not been decommissioned.
status: valid
status modified: 2026-05-06
accepted date: 2026-05-06
in scheme: The status of an entity with regards to its completion and use

Functional
type: Concept
notation: functional
definition: The entity is functional.
status: valid
status modified: 2026-05-06
accepted date: 2026-05-06
in scheme: The status of an entity with regards to its completion and use

Not regulated
type: Concept
notation: not regulated
definition: The entity that was within the scope of EU law on industrial emissions is no longer within the scope of a relevant piece of EU law reporting to the EU Registry due to changes in its activity or decrease of capacity.
status: valid
status modified: 2026-05-06
accepted date: 2026-05-06
in scheme: The status of an entity with regards to its completion and use

Strict ISO-3166 of countries that will report to IEPR and IED
type: ConceptScheme
notation: CountryCodeValue
is part of: Industrial Emission Portal Regulation and Industrial Emission Directive
registration status: Public draft
user modified: antogfed
date modified: 2026-05-07 19:26:11.0
vocabulary type: Common
is numeric concept identifiers: false
is notations equal identifiers: false

Austria
type: Concept
notation: AT
status: valid
status modified: 2026-05-06
accepted date: 2026-05-06
in scheme: Strict ISO-3166 of countries that will report to IEPR and IED

Belgium
type: Concept
notation: BE
status: valid
status modified: 2026-05-06
accepted date: 2026-05-06
in scheme: Strict ISO-3166 of countries that will report to IEPR and IED

Bulgaria
type: Concept
notation: BG
status: valid
status modified: 2026-05-06
accepted date: 2026-05-06
in scheme: Strict ISO-3166 of countries that will report to IEPR and IED

Switzerland
type: Concept
notation: CH
status: valid
status modified: 2026-05-06
accepted date: 2026-05-06
in scheme: Strict ISO-3166 of countries that will report to IEPR and IED

Cyprus
type: Concept
notation: CY
status: valid
status modified: 2026-05-06
accepted date: 2026-05-06
in scheme: Strict ISO-3166 of countries that will report to IEPR and IED

Czech Republic
type: Concept
notation: CZ
status: valid
status modified: 2026-05-06
accepted date: 2026-05-06
in scheme: Strict ISO-3166 of countries that will report to IEPR and IED

Germany
type: Concept
notation: DE
status: valid
status modified: 2026-05-06
accepted date: 2026-05-06
in scheme: Strict ISO-3166 of countries that will report to IEPR and IED

Denmark
type: Concept
notation: DK
status: valid
status modified: 2026-05-06
accepted date: 2026-05-06
in scheme: Strict ISO-3166 of countries that will report to IEPR and IED

Estonia
type: Concept
notation: EE
status: valid
status modified: 2026-05-06
accepted date: 2026-05-06
in scheme: Strict ISO-3166 of countries that will report to IEPR and IED

Spain
type: Concept
notation: ES
status: valid
status modified: 2026-05-06
accepted date: 2026-05-06
in scheme: Strict ISO-3166 of countries that will report to IEPR and IED

Finland
type: Concept
notation: FI
status: valid
status modified: 2026-05-06
accepted date: 2026-05-06
in scheme: Strict ISO-3166 of countries that will report to IEPR and IED

France
type: Concept
notation: FR
status: valid
status modified: 2026-05-06
accepted date: 2026-05-06
in scheme: Strict ISO-3166 of countries that will report to IEPR and IED

United Kingdom
type: Concept
notation: GB
status: valid
status modified: 2026-05-06
accepted date: 2026-05-06
in scheme: Strict ISO-3166 of countries that will report to IEPR and IED

Greece
type: Concept
notation: GR
status: valid
status modified: 2026-05-06
accepted date: 2026-05-06
in scheme: Strict ISO-3166 of countries that will report to IEPR and IED

Croatia
type: Concept
notation: HR
status: valid
status modified: 2026-05-06
accepted date: 2026-05-06
in scheme: Strict ISO-3166 of countries that will report to IEPR and IED

Hungary
type: Concept
notation: HU
status: valid
status modified: 2026-05-06
accepted date: 2026-05-06
in scheme: Strict ISO-3166 of countries that will report to IEPR and IED

Ireland
type: Concept
notation: IE
status: valid
status modified: 2026-05-06
accepted date: 2026-05-06
in scheme: Strict ISO-3166 of countries that will report to IEPR and IED

Iceland
type: Concept
notation: IS
status: valid
status modified: 2026-05-06
accepted date: 2026-05-06
in scheme: Strict ISO-3166 of countries that will report to IEPR and IED

Italy
type: Concept
notation: IT
status: valid
status modified: 2026-05-06
accepted date: 2026-05-06
in scheme: Strict ISO-3166 of countries that will report to IEPR and IED

Liechtenstein
type: Concept
notation: LI
status: valid
status modified: 2026-05-06
accepted date: 2026-05-06
in scheme: Strict ISO-3166 of countries that will report to IEPR and IED

Lithuania
type: Concept
notation: LT
status: valid
status modified: 2026-05-06
accepted date: 2026-05-06
in scheme: Strict ISO-3166 of countries that will report to IEPR and IED

Luxembourg
type: Concept
notation: LU
status: valid
status modified: 2026-05-06
accepted date: 2026-05-06
in scheme: Strict ISO-3166 of countries that will report to IEPR and IED

Latvia
type: Concept
notation: LV
status: valid
status modified: 2026-05-06
accepted date: 2026-05-06
in scheme: Strict ISO-3166 of countries that will report to IEPR and IED

Montenegro
type: Concept
notation: ME
definition: Montenegro
status: valid
status modified: 2026-05-06
accepted date: 2026-05-06
in scheme: Strict ISO-3166 of countries that will report to IEPR and IED

Malta
type: Concept
notation: MT
status: valid
status modified: 2026-05-06
accepted date: 2026-05-06
in scheme: Strict ISO-3166 of countries that will report to IEPR and IED

Netherlands
type: Concept
notation: NL
status: valid
status modified: 2026-05-06
accepted date: 2026-05-06
in scheme: Strict ISO-3166 of countries that will report to IEPR and IED

Norway
type: Concept
notation: NO
status: valid
status modified: 2026-05-06
accepted date: 2026-05-06
in scheme: Strict ISO-3166 of countries that will report to IEPR and IED

Poland
type: Concept
notation: PL
status: valid
status modified: 2026-05-06
accepted date: 2026-05-06
in scheme: Strict ISO-3166 of countries that will report to IEPR and IED

Portugal
type: Concept
notation: PT
status: valid
status modified: 2026-05-06
accepted date: 2026-05-06
in scheme: Strict ISO-3166 of countries that will report to IEPR and IED

Romania
type: Concept
notation: RO
status: valid
status modified: 2026-05-06
accepted date: 2026-05-06
in scheme: Strict ISO-3166 of countries that will report to IEPR and IED

Serbia
type: Concept
notation: RS
status: valid
status modified: 2026-05-06
accepted date: 2026-05-06
in scheme: Strict ISO-3166 of countries that will report to IEPR and IED

Sweden
type: Concept
notation: SE
status: valid
status modified: 2026-05-06
accepted date: 2026-05-06
in scheme: Strict ISO-3166 of countries that will report to IEPR and IED

Slovenia
type: Concept
notation: SI
status: valid
status modified: 2026-05-06
accepted date: 2026-05-06
in scheme: Strict ISO-3166 of countries that will report to IEPR and IED

Slovakia
type: Concept
notation: SK
status: valid
status modified: 2026-05-06
accepted date: 2026-05-06
in scheme: Strict ISO-3166 of countries that will report to IEPR and IED

Kosovo under UNSCR 1244/99
type: Concept
notation: XK
status: valid
status modified: 2026-05-06
accepted date: 2026-05-06
in scheme: Strict ISO-3166 of countries that will report to IEPR and IED

Energy use as input to use to report energy use for Production Installation according to IEPR CID
type: ConceptScheme
notation: EnergyUseValue
is part of: Industrial Emission Portal Regulation and Industrial Emission Directive
registration status: Public draft
user modified: antogfed
date modified: 2026-05-07 19:26:23.0
vocabulary type: Common
is numeric concept identifiers: false
is notations equal identifiers: false

Biomass
type: Concept
notation: Biomass
definition: ‘biomass’ means any of the following: (a) products consisting of any vegetable matter from agriculture or forestry which can be used as a fuel for the purpose of recovering its energy content; (b) the following waste: (i) vegetable waste from agriculture and forestry; (ii) vegetable waste from the food processing industry, if the heat generated is recovered; (iii) fibrous vegetable waste from virgin pulp production and from production of paper from pulp, if itis co-incinerated at the place of production and the heat generated is recovered; (iv) cork waste; (v) wood waste with the exception of wood waste which may contain halogenated organic compounds or heavy metals as a result of treatment with wood preservatives or coating and which includes, in particular, such wood waste originating from construction and demolition waste
status: valid
status modified: 2026-05-07
accepted date: 2026-05-07
in scheme: Energy use as input to use to report energy use for Production Installation according to IEPR CID

Coal
type: Concept
notation: Coal
definition: Coal
status: valid
status modified: 2026-05-07
accepted date: 2026-05-07
in scheme: Energy use as input to use to report energy use for Production Installation according to IEPR CID

Heat provided or received from an external provider
type: Concept
notation: ExternalProvider
definition: Heat provided or received from an external provider
status: valid
status modified: 2026-05-07
accepted date: 2026-05-07
in scheme: Energy use as input to use to report energy use for Production Installation according to IEPR CID

Electricity from the grid
type: Concept
notation: Grid
definition: Electricity from the grid
status: valid
status modified: 2026-05-07
accepted date: 2026-05-07
in scheme: Energy use as input to use to report energy use for Production Installation according to IEPR CID

Lignite
type: Concept
notation: Lignite
definition: Lignite
status: valid
status modified: 2026-05-07
accepted date: 2026-05-07
in scheme: Energy use as input to use to report energy use for Production Installation according to IEPR CID

LiquidFuels
type: Concept
notation: LiquidFuels
definition: Liquid fuels
status: valid
status modified: 2026-05-07
accepted date: 2026-05-07
in scheme: Energy use as input to use to report energy use for Production Installation according to IEPR CID

NaturalGas
type: Concept
notation: NaturalGas
definition: Natural gas
status: valid
status modified: 2026-05-07
accepted date: 2026-05-07
in scheme: Energy use as input to use to report energy use for Production Installation according to IEPR CID

OtherGases
type: Concept
notation: OtherGases
definition: Other gases as referred to Article 72(3f) of IED
status: valid
status modified: 2026-05-07
accepted date: 2026-05-07
in scheme: Energy use as input to use to report energy use for Production Installation according to IEPR CID

OtherSolidFuels
type: Concept
notation: OtherSolidFuels
definition: Other solid fuels as referred to by Article 72(3f) of IED
status: valid
status modified: 2026-05-07
accepted date: 2026-05-07
in scheme: Energy use as input to use to report energy use for Production Installation according to IEPR CID

Peat
type: Concept
notation: Peat
definition: Peat
status: valid
status modified: 2026-05-07
accepted date: 2026-05-07
in scheme: Energy use as input to use to report energy use for Production Installation according to IEPR CID

Renewable energy
type: Concept
notation: RE
definition: Renewable energy
status: valid
status modified: 2026-05-07
accepted date: 2026-05-07
in scheme: Energy use as input to use to report energy use for Production Installation according to IEPR CID

Waste
type: Concept
notation: Waste
definition: Waste
status: valid
status modified: 2026-05-07
accepted date: 2026-05-07
in scheme: Energy use as input to use to report energy use for Production Installation according to IEPR CID

Categories of fuel input according to Article 72 of Directive 2010/75/EU
type: ConceptScheme
notation: FuelInputValue
is part of: Industrial Emission Portal Regulation and Industrial Emission Directive
registration status: Public draft
user modified: antogfed
date modified: 2026-05-07 19:26:36.0
vocabulary type: Common
is numeric concept identifiers: false
is notations equal identifiers: false

Biomass
type: Concept
notation: Biomass
definition: ‘biomass’ means any of the following: (a) products consisting of any vegetable matter from agriculture or forestry which can be used as a fuel for the purpose of recovering its energy content; (b) the following waste: (i) vegetable waste from agriculture and forestry; (ii) vegetable waste from the food processing industry, if the heat generated is recovered; (iii) fibrous vegetable waste from virgin pulp production and from production of paper from pulp, if itis co-incinerated at the place of production and the heat generated is recovered; (iv) cork waste; (v) wood waste with the exception of wood waste which may contain halogenated organic compounds or heavy metals as a result of treatment with wood preservatives or coating and which includes, in particular, such wood waste originating from construction and demolition waste
status: valid
status modified: 2026-05-06
accepted date: 2026-05-06
in scheme: Categories of fuel input according to Article 72 of Directive 2010/75/EU

Coal
type: Concept
notation: Coal
definition: Coal
status: valid
status modified: 2026-05-06
accepted date: 2026-05-06
in scheme: Categories of fuel input according to Article 72 of Directive 2010/75/EU

Lignite
type: Concept
notation: Lignite
definition: Lignite
status: valid
status modified: 2026-05-06
accepted date: 2026-05-06
in scheme: Categories of fuel input according to Article 72 of Directive 2010/75/EU

LiquidFuels
type: Concept
notation: LiquidFuels
definition: Liquid fuels
status: valid
status modified: 2026-05-06
accepted date: 2026-05-06
in scheme: Categories of fuel input according to Article 72 of Directive 2010/75/EU

NaturalGas
type: Concept
notation: NaturalGas
definition: Natural gas
status: valid
status modified: 2026-05-06
accepted date: 2026-05-06
in scheme: Categories of fuel input according to Article 72 of Directive 2010/75/EU

OtherGases
type: Concept
notation: OtherGases
definition: Other gases as referred to Article 72(3f) of IED
status: valid
status modified: 2026-05-06
accepted date: 2026-05-06
in scheme: Categories of fuel input according to Article 72 of Directive 2010/75/EU

OtherSolidFuels
type: Concept
notation: OtherSolidFuels
definition: Other solid fuels as referred to by Article 72(3f) of IED
status: valid
status modified: 2026-05-06
accepted date: 2026-05-06
in scheme: Categories of fuel input according to Article 72 of Directive 2010/75/EU

Peat
type: Concept
notation: Peat
definition: Peat
status: valid
status modified: 2026-05-06
accepted date: 2026-05-06
in scheme: Categories of fuel input according to Article 72 of Directive 2010/75/EU

List of activities defined in Annex I of the IEPR to be reported as main activity and other activities for Production Installation and as main activity for Production Facility
type: ConceptScheme
notation: IEPRActivityAnnexIValue
is part of: Industrial Emission Portal Regulation and Industrial Emission Directive
registration status: Public draft
user modified: antogfed
date modified: 2026-05-07 19:26:48.0
vocabulary type: Common
is numeric concept identifiers: false
is notations equal identifiers: false

Combustion of fuels in installations with a total rated thermal input of 50 MW or more
type: Concept
notation: A-1.1
definition: Combustion of fuels in installations with a total rated thermal input of 50 MW or more
status: valid
status modified: 2026-05-07
accepted date: 2026-05-07
in scheme: List of activities defined in Annex I of the IEPR to be reported as main activity and other activities for Production Installation and as main activity for Production Facility

Refining of mineral oil and gas
type: Concept
notation: A-1.2
definition: Refining of mineral oil and gas
status: valid
status modified: 2026-05-07
accepted date: 2026-05-07
in scheme: List of activities defined in Annex I of the IEPR to be reported as main activity and other activities for Production Installation and as main activity for Production Facility

Production of coke
type: Concept
notation: A-1.3
definition: Production of coke
status: valid
status modified: 2026-05-07
accepted date: 2026-05-07
in scheme: List of activities defined in Annex I of the IEPR to be reported as main activity and other activities for Production Installation and as main activity for Production Facility

Gasification or liquefaction of coal
type: Concept
notation: A-1.4(a)
definition: Gasification or liquefaction of coal
status: valid
status modified: 2026-05-07
accepted date: 2026-05-07
in scheme: List of activities defined in Annex I of the IEPR to be reported as main activity and other activities for Production Installation and as main activity for Production Facility

Gasification or liquefaction of fuels other than coal, in installations with a total rated thermal input of 20 MW or more
type: Concept
notation: A-1.4(b)
definition: Gasification or liquefaction of fuels other than coal, in installations with a total rated thermal input of 20 MW or more
status: valid
status modified: 2026-05-07
accepted date: 2026-05-07
in scheme: List of activities defined in Annex I of the IEPR to be reported as main activity and other activities for Production Installation and as main activity for Production Facility

Metal ore (including sulphide ore) roasting or sintering
type: Concept
notation: A-2.1
definition: Metal ore (including sulphide ore) roasting or sintering
status: valid
status modified: 2026-05-07
accepted date: 2026-05-07
in scheme: List of activities defined in Annex I of the IEPR to be reported as main activity and other activities for Production Installation and as main activity for Production Facility

Production of pig iron or steel (primary or secondary fusion) including continuous casting, with a capacity exceeding 2.5 tonnes per hour
type: Concept
notation: A-2.2
definition: Production of pig iron or steel (primary or secondary fusion) including continuous casting, with a capacity exceeding 2.5 tonnes per hour
status: valid
status modified: 2026-05-07
accepted date: 2026-05-07
in scheme: List of activities defined in Annex I of the IEPR to be reported as main activity and other activities for Production Installation and as main activity for Production Facility

Processing of ferrous metals: operation of hot-rolling mills with a capacity exceeding 20 tonnes of crude steel per hour
type: Concept
notation: A-2.3(a)
definition: Processing of ferrous metals: operation of hot-rolling mills with a capacity exceeding 20 tonnes of crude steel per hour
status: valid
status modified: 2026-05-07
accepted date: 2026-05-07
in scheme: List of activities defined in Annex I of the IEPR to be reported as main activity and other activities for Production Installation and as main activity for Production Facility

Processing of ferrous metals: operation of cold-rolling mills with a capacity exceeding 10 tonnes of crude steel per hour
type: Concept
notation: A-2.3(aa)
definition: Processing of ferrous metals: operation of cold-rolling mills with a capacity exceeding 10 tonnes of crude steel per hour
status: valid
status modified: 2026-05-07
accepted date: 2026-05-07
in scheme: List of activities defined in Annex I of the IEPR to be reported as main activity and other activities for Production Installation and as main activity for Production Facility

Processing of ferrous metals: operation of smitheries with hammers the energy of which exceeds 50 kilojoule per hammer
type: Concept
notation: A-2.3(b)
definition: Processing of ferrous metals: operation of smitheries with hammers the energy of which exceeds 50 kilojoule per hammer
status: valid
status modified: 2026-05-07
accepted date: 2026-05-07
in scheme: List of activities defined in Annex I of the IEPR to be reported as main activity and other activities for Production Installation and as main activity for Production Facility

Processing of ferrous metals: operation of smitheries with hammers the energy of which exceeds 30 mega-newton (MN) per press
type: Concept
notation: A-2.3(ba)
definition: Processing of ferrous metals: operation of smitheries with hammers the energy of which exceeds 30 mega-newton (MN) per press
status: valid
status modified: 2026-05-07
accepted date: 2026-05-07
in scheme: List of activities defined in Annex I of the IEPR to be reported as main activity and other activities for Production Installation and as main activity for Production Facility

Processing of ferrous metals: application of protective fused metal coats with an input exceeding 2 tonnes of crude steel per hour.
type: Concept
notation: A-2.3(c)
definition: Processing of ferrous metals: application of protective fused metal coats with an input exceeding 2 tonnes of crude steel per hour.
status: valid
status modified: 2026-05-07
accepted date: 2026-05-07
in scheme: List of activities defined in Annex I of the IEPR to be reported as main activity and other activities for Production Installation and as main activity for Production Facility

Operation of ferrous metal foundries with a production capacity exceeding 20 tonnes per day
type: Concept
notation: A-2.4
definition: Operation of ferrous metal foundries with a production capacity exceeding 20 tonnes per day
status: valid
status modified: 2026-05-07
accepted date: 2026-05-07
in scheme: List of activities defined in Annex I of the IEPR to be reported as main activity and other activities for Production Installation and as main activity for Production Facility

Processing of non-ferrous metals: production of non-ferrous crude metals from ore, concentrates or secondary raw materials by metallurgical, chemical or electrolytic processes
type: Concept
notation: A-2.5(a)
definition: Processing of non-ferrous metals: production of non-ferrous crude metals from ore, concentrates or secondary raw materials by metallurgical, chemical or electrolytic processes
status: valid
status modified: 2026-05-07
accepted date: 2026-05-07
in scheme: List of activities defined in Annex I of the IEPR to be reported as main activity and other activities for Production Installation and as main activity for Production Facility

A-2.5(b)
type: Concept
notation: A-2.5(b)
preferred label: Processing of non-ferrous metals: melting, including the alloyage, of non-ferrous metals, including recovered products and operation of non-ferrous metal foundries, with a melting capacity exceeding 4 tonnes per day for lead and cadmium or 20 tonnes per day for all other metals.
definition: Processing of non-ferrous metals: melting, including the alloyage, of non-ferrous metals, including recovered products and operation of non-ferrous metal foundries, with a melting capacity exceeding 4 tonnes per day for lead and cadmium or 20 tonnes per day for all other metals.
status: valid
status modified: 2026-05-07
accepted date: 2026-05-07
in scheme: List of activities defined in Annex I of the IEPR to be reported as main activity and other activities for Production Installation and as main activity for Production Facility

Surface treatment of metals or plastic materials using an electrolytic or chemical process where the volume of the treatment vats exceeds 30 m3
type: Concept
notation: A-2.6
definition: Surface treatment of metals or plastic materials using an electrolytic or chemical process where the volume of the treatment vats exceeds 30 m3
status: valid
status modified: 2026-05-07
accepted date: 2026-05-07
in scheme: List of activities defined in Annex I of the IEPR to be reported as main activity and other activities for Production Installation and as main activity for Production Facility

Manufacturing of batteries, other than exclusively assembling, with a production capacity of 15.000 tonnes of battery cells (cathode, anode, electrolyte, separator, capsule) or more per year.
type: Concept
notation: A-2.7
definition: Manufacturing of batteries, other than exclusively assembling, with a production capacity of 15.000 tonnes of battery cells (cathode, anode, electrolyte, separator, capsule) or more per year.
status: valid
status modified: 2026-05-07
accepted date: 2026-05-07
in scheme: List of activities defined in Annex I of the IEPR to be reported as main activity and other activities for Production Installation and as main activity for Production Facility

Production of cement clinker in rotary kilns with a production capacity exceeding 500 tonnes per day or in other kilns with a production capacity exceeding 50 tonnes per day
type: Concept
notation: A-3.1(a)
definition: Production of cement clinker in rotary kilns with a production capacity exceeding 500 tonnes per day or in other kilns with a production capacity exceeding 50 tonnes per day
status: valid
status modified: 2026-05-07
accepted date: 2026-05-07
in scheme: List of activities defined in Annex I of the IEPR to be reported as main activity and other activities for Production Installation and as main activity for Production Facility

Production of lime in kilns with a production capacity exceeding 50 tonnes per day
type: Concept
notation: A-3.1(b)
definition: Production of lime in kilns with a production capacity exceeding 50 tonnes per day
status: valid
status modified: 2026-05-07
accepted date: 2026-05-07
in scheme: List of activities defined in Annex I of the IEPR to be reported as main activity and other activities for Production Installation and as main activity for Production Facility

Production of magnesium oxide in kilns with a production capacity exceeding 50 tonnes per day
type: Concept
notation: A-3.1(c)
definition: Production of magnesium oxide in kilns with a production capacity exceeding 50 tonnes per day
status: valid
status modified: 2026-05-07
accepted date: 2026-05-07
in scheme: List of activities defined in Annex I of the IEPR to be reported as main activity and other activities for Production Installation and as main activity for Production Facility

Production of asbestos or the manufacture of asbestos based products
type: Concept
notation: A-3.2
definition: Production of asbestos or the manufacture of asbestos based products
status: valid
status modified: 2026-05-07
accepted date: 2026-05-07
in scheme: List of activities defined in Annex I of the IEPR to be reported as main activity and other activities for Production Installation and as main activity for Production Facility

Manufacture of glass including glass fibre with a melting capacity exceeding 20 tonnes per day
type: Concept
notation: A-3.3
definition: Manufacture of glass including glass fibre with a melting capacity exceeding 20 tonnes per day
status: valid
status modified: 2026-05-07
accepted date: 2026-05-07
in scheme: List of activities defined in Annex I of the IEPR to be reported as main activity and other activities for Production Installation and as main activity for Production Facility

Melting mineral substances including the production of mineral fibres with a melting capacity exceeding 20 tonnes per day
type: Concept
notation: A-3.4
definition: Melting mineral substances including the production of mineral fibres with a melting capacity exceeding 20 tonnes per day
status: valid
status modified: 2026-05-07
accepted date: 2026-05-07
in scheme: List of activities defined in Annex I of the IEPR to be reported as main activity and other activities for Production Installation and as main activity for Production Facility

Manufacture of ceramic products by firing, in particular roofing tiles, bricks, refractory bricks, tiles, stoneware or porcelain with: a production capacity exceeding 75 tonnes per day and/or
type: Concept
notation: A-3.5(a)
definition: Manufacture of ceramic products by firing, in particular roofing tiles, bricks, refractory bricks, tiles, stoneware or porcelain with: a production capacity exceeding 75 tonnes per day and/or
status: valid
status modified: 2026-05-07
accepted date: 2026-05-07
in scheme: List of activities defined in Annex I of the IEPR to be reported as main activity and other activities for Production Installation and as main activity for Production Facility

A-3.5(b)
type: Concept
notation: A-3.5(b)
preferred label: Manufacture of ceramic products by firing, in particular roofing tiles, bricks, refractory bricks, tiles, stoneware or porcelain with: a kiln capacity exceeding 4 m3 and with a setting density per kiln exceeding 300 kg/m3
definition: Manufacture of ceramic products by firing, in particular roofing tiles, bricks, refractory bricks, tiles, stoneware or porcelain with: a kiln capacity exceeding 4 m3 and with a setting density per kiln exceeding 300 kg/m3
status: valid
status modified: 2026-05-07
accepted date: 2026-05-07
in scheme: List of activities defined in Annex I of the IEPR to be reported as main activity and other activities for Production Installation and as main activity for Production Facility

A-3.6
type: Concept
notation: A-3.6
preferred label: Extraction including on-site treatment operations, such as comminution, size control, beneficiation and upgrading, of the following ores on an industrial scale: bauxite, chromium, cobalt, copper, gold, iron, lead, lithium, manganese, nickel, palladium, platinum, tin, tungsten and zinc
definition: Extraction including on-site treatment operations, such as comminution, size control, beneficiation and upgrading, of the following ores on an industrial scale: bauxite, chromium, cobalt, copper, gold, iron, lead, lithium, manganese, nickel, palladium, platinum, tin, tungsten and zinc
status: valid
status modified: 2026-05-07
accepted date: 2026-05-07
in scheme: List of activities defined in Annex I of the IEPR to be reported as main activity and other activities for Production Installation and as main activity for Production Facility

Production of organic chemicals, such as: simple hydrocarbons (linear or cyclic, saturated or unsaturated, aliphatic or aromatic)
type: Concept
notation: A-4.1(a)
definition: Production of organic chemicals, such as: simple hydrocarbons (linear or cyclic, saturated or unsaturated, aliphatic or aromatic)
status: valid
status modified: 2026-05-07
accepted date: 2026-05-07
in scheme: List of activities defined in Annex I of the IEPR to be reported as main activity and other activities for Production Installation and as main activity for Production Facility

A-4.1(b)
type: Concept
notation: A-4.1(b)
preferred label: Production of organic chemicals, such as: oxygen-containing hydrocarbons such as alcohols, aldehydes, ketones, carboxylic acids, esters and mixtures of esters, acetates, ethers, peroxides and epoxy resins
definition: Production of organic chemicals, such as: oxygen-containing hydrocarbons such as alcohols, aldehydes, ketones, carboxylic acids, esters and mixtures of esters, acetates, ethers, peroxides and epoxy resins
status: valid
status modified: 2026-05-07
accepted date: 2026-05-07
in scheme: List of activities defined in Annex I of the IEPR to be reported as main activity and other activities for Production Installation and as main activity for Production Facility

Production of organic chemicals, such as: sulphurous hydrocarbons
type: Concept
notation: A-4.1(c)
definition: Production of organic chemicals, such as: sulphurous hydrocarbons
status: valid
status modified: 2026-05-07
accepted date: 2026-05-07
in scheme: List of activities defined in Annex I of the IEPR to be reported as main activity and other activities for Production Installation and as main activity for Production Facility

Production of organic chemicals, such as: nitrogenous hydrocarbons such as amines, amides, nitrous compounds, nitro compounds or nitrate compounds, nitriles, cyanates, isocyanates
type: Concept
notation: A-4.1(d)
definition: Production of organic chemicals, such as: nitrogenous hydrocarbons such as amines, amides, nitrous compounds, nitro compounds or nitrate compounds, nitriles, cyanates, isocyanates
status: valid
status modified: 2026-05-07
accepted date: 2026-05-07
in scheme: List of activities defined in Annex I of the IEPR to be reported as main activity and other activities for Production Installation and as main activity for Production Facility

Production of organic chemicals, such as: phosphorus-containing hydrocarbons
type: Concept
notation: A-4.1(e)
definition: Production of organic chemicals, such as: phosphorus-containing hydrocarbons
status: valid
status modified: 2026-05-07
accepted date: 2026-05-07
in scheme: List of activities defined in Annex I of the IEPR to be reported as main activity and other activities for Production Installation and as main activity for Production Facility

Production of organic chemicals, such as: halogenic hydrocarbons
type: Concept
notation: A-4.1(f)
definition: Production of organic chemicals, such as: halogenic hydrocarbons
status: valid
status modified: 2026-05-07
accepted date: 2026-05-07
in scheme: List of activities defined in Annex I of the IEPR to be reported as main activity and other activities for Production Installation and as main activity for Production Facility

Production of organic chemicals, such as: organometallic compounds
type: Concept
notation: A-4.1(g)
definition: Production of organic chemicals, such as: organometallic compounds
status: valid
status modified: 2026-05-07
accepted date: 2026-05-07
in scheme: List of activities defined in Annex I of the IEPR to be reported as main activity and other activities for Production Installation and as main activity for Production Facility

Production of organic chemicals, such as: plastic materials (polymers, synthetic fibres and cellulose-based fibres)
type: Concept
notation: A-4.1(h)
definition: Production of organic chemicals, such as: plastic materials (polymers, synthetic fibres and cellulose-based fibres)
status: valid
status modified: 2026-05-07
accepted date: 2026-05-07
in scheme: List of activities defined in Annex I of the IEPR to be reported as main activity and other activities for Production Installation and as main activity for Production Facility

Production of organic chemicals, such as: synthetic rubbers
type: Concept
notation: A-4.1(i)
definition: Production of organic chemicals, such as: synthetic rubbers
status: valid
status modified: 2026-05-07
accepted date: 2026-05-07
in scheme: List of activities defined in Annex I of the IEPR to be reported as main activity and other activities for Production Installation and as main activity for Production Facility

Production of organic chemicals, such as: dyes and pigments
type: Concept
notation: A-4.1(j)
definition: Production of organic chemicals, such as: dyes and pigments
status: valid
status modified: 2026-05-07
accepted date: 2026-05-07
in scheme: List of activities defined in Annex I of the IEPR to be reported as main activity and other activities for Production Installation and as main activity for Production Facility

Production of organic chemicals, such as: surface-active agents and surfactants
type: Concept
notation: A-4.1(k)
definition: Production of organic chemicals, such as: surface-active agents and surfactants
status: valid
status modified: 2026-05-07
accepted date: 2026-05-07
in scheme: List of activities defined in Annex I of the IEPR to be reported as main activity and other activities for Production Installation and as main activity for Production Facility

A-4.2(a)
type: Concept
notation: A-4.2(a)
preferred label: Production of inorganic chemicals, such as: gases, such as ammonia, chlorine or hydrogen chloride, fluorine or hydrogen fluoride, carbon oxides, sulphur compounds, nitrogen oxides, hydrogen, sulphur dioxide, carbonyl chloride
definition: Production of inorganic chemicals, such as: gases, such as ammonia, chlorine or hydrogen chloride, fluorine or hydrogen fluoride, carbon oxides, sulphur compounds, nitrogen oxides, hydrogen, sulphur dioxide, carbonyl chloride
status: valid
status modified: 2026-05-07
accepted date: 2026-05-07
in scheme: List of activities defined in Annex I of the IEPR to be reported as main activity and other activities for Production Installation and as main activity for Production Facility

Production of inorganic chemicals, such as: acids, such as chromic acid, hydrofluoric acid, phosphoric acid, nitric acid, hydrochloric acid, sulphuric acid, oleum, sulphurous acids
type: Concept
notation: A-4.2(b)
definition: Production of inorganic chemicals, such as: acids, such as chromic acid, hydrofluoric acid, phosphoric acid, nitric acid, hydrochloric acid, sulphuric acid, oleum, sulphurous acids
status: valid
status modified: 2026-05-07
accepted date: 2026-05-07
in scheme: List of activities defined in Annex I of the IEPR to be reported as main activity and other activities for Production Installation and as main activity for Production Facility

Production of inorganic chemicals, such as: bases, such as ammonium hydroxide, potassium hydroxide, sodium hydroxide
type: Concept
notation: A-4.2(c)
definition: Production of inorganic chemicals, such as: bases, such as ammonium hydroxide, potassium hydroxide, sodium hydroxide
status: valid
status modified: 2026-05-07
accepted date: 2026-05-07
in scheme: List of activities defined in Annex I of the IEPR to be reported as main activity and other activities for Production Installation and as main activity for Production Facility

Production of inorganic chemicals, such as: salts, such as ammonium chloride, potassium chlorate, potassium carbonate, sodium carbonate, perborate, silver nitrate
type: Concept
notation: A-4.2(d)
definition: Production of inorganic chemicals, such as: salts, such as ammonium chloride, potassium chlorate, potassium carbonate, sodium carbonate, perborate, silver nitrate
status: valid
status modified: 2026-05-07
accepted date: 2026-05-07
in scheme: List of activities defined in Annex I of the IEPR to be reported as main activity and other activities for Production Installation and as main activity for Production Facility

Production of inorganic chemicals, such as: non-metals, metal oxides or other inorganic compounds such as calcium carbide, silicon, silicon carbide
type: Concept
notation: A-4.2(e)
definition: Production of inorganic chemicals, such as: non-metals, metal oxides or other inorganic compounds such as calcium carbide, silicon, silicon carbide
status: valid
status modified: 2026-05-07
accepted date: 2026-05-07
in scheme: List of activities defined in Annex I of the IEPR to be reported as main activity and other activities for Production Installation and as main activity for Production Facility

Production of phosphorous, nitrogen or potassium based fertilisers (simple or compound fertilisers)
type: Concept
notation: A-4.3
definition: Production of phosphorous, nitrogen or potassium based fertilisers (simple or compound fertilisers)
status: valid
status modified: 2026-05-07
accepted date: 2026-05-07
in scheme: List of activities defined in Annex I of the IEPR to be reported as main activity and other activities for Production Installation and as main activity for Production Facility

Production of plant protection products or of biocides
type: Concept
notation: A-4.4
definition: Production of plant protection products or of biocides
status: valid
status modified: 2026-05-07
accepted date: 2026-05-07
in scheme: List of activities defined in Annex I of the IEPR to be reported as main activity and other activities for Production Installation and as main activity for Production Facility

Production of pharmaceutical products including intermediates
type: Concept
notation: A-4.5
definition: Production of pharmaceutical products including intermediates
status: valid
status modified: 2026-05-07
accepted date: 2026-05-07
in scheme: List of activities defined in Annex I of the IEPR to be reported as main activity and other activities for Production Installation and as main activity for Production Facility

Production of explosives
type: Concept
notation: A-4.6
definition: Production of explosives
status: valid
status modified: 2026-05-07
accepted date: 2026-05-07
in scheme: List of activities defined in Annex I of the IEPR to be reported as main activity and other activities for Production Installation and as main activity for Production Facility

Disposal or recovery of hazardous waste with a capacity exceeding 10 tonnes per day involving one or more of the following activities:
type: Concept
notation: A-5.1
definition: Disposal or recovery of hazardous waste with a capacity exceeding 10 tonnes per day involving one or more of the following activities:
status: valid
status modified: 2026-05-07
accepted date: 2026-05-07
in scheme: List of activities defined in Annex I of the IEPR to be reported as main activity and other activities for Production Installation and as main activity for Production Facility

Disposal or recovery of hazardous waste with a capacity exceeding 10 tonnes per day involving biological treatment
type: Concept
notation: A-5.1(a)
definition: Disposal or recovery of hazardous waste with a capacity exceeding 10 tonnes per day involving biological treatment
status: valid
status modified: 2026-05-07
accepted date: 2026-05-07
in scheme: List of activities defined in Annex I of the IEPR to be reported as main activity and other activities for Production Installation and as main activity for Production Facility

Disposal or recovery of hazardous waste with a capacity exceeding 10 tonnes per day involving physico-chemical treatment
type: Concept
notation: A-5.1(b)
definition: Disposal or recovery of hazardous waste with a capacity exceeding 10 tonnes per day involving physico-chemical treatment
status: valid
status modified: 2026-05-07
accepted date: 2026-05-07
in scheme: List of activities defined in Annex I of the IEPR to be reported as main activity and other activities for Production Installation and as main activity for Production Facility

Disposal or recovery of hazardous waste with a capacity exceeding 10 tonnes per day involving blending or mixing prior to submission to any of the other activities listed in points 5.1 and 5.2
type: Concept
notation: A-5.1(c)
definition: Disposal or recovery of hazardous waste with a capacity exceeding 10 tonnes per day involving blending or mixing prior to submission to any of the other activities listed in points 5.1 and 5.2
status: valid
status modified: 2026-05-07
accepted date: 2026-05-07
in scheme: List of activities defined in Annex I of the IEPR to be reported as main activity and other activities for Production Installation and as main activity for Production Facility

Disposal or recovery of hazardous waste with a capacity exceeding 10 tonnes per day involving repackaging prior to submission to any of the other activities listed in points 5.1 and 5.2
type: Concept
notation: A-5.1(d)
definition: Disposal or recovery of hazardous waste with a capacity exceeding 10 tonnes per day involving repackaging prior to submission to any of the other activities listed in points 5.1 and 5.2
status: valid
status modified: 2026-05-07
accepted date: 2026-05-07
in scheme: List of activities defined in Annex I of the IEPR to be reported as main activity and other activities for Production Installation and as main activity for Production Facility

Disposal or recovery of hazardous waste with a capacity exceeding 10 tonnes per day involving solvent reclamation/regeneration
type: Concept
notation: A-5.1(e)
definition: Disposal or recovery of hazardous waste with a capacity exceeding 10 tonnes per day involving solvent reclamation/regeneration
status: valid
status modified: 2026-05-07
accepted date: 2026-05-07
in scheme: List of activities defined in Annex I of the IEPR to be reported as main activity and other activities for Production Installation and as main activity for Production Facility

Disposal or recovery of hazardous waste with a capacity exceeding 10 tonnes per day involving recycling/reclamation of inorganic materials other than metals or metal compounds
type: Concept
notation: A-5.1(f)
definition: Disposal or recovery of hazardous waste with a capacity exceeding 10 tonnes per day involving recycling/reclamation of inorganic materials other than metals or metal compounds
status: valid
status modified: 2026-05-07
accepted date: 2026-05-07
in scheme: List of activities defined in Annex I of the IEPR to be reported as main activity and other activities for Production Installation and as main activity for Production Facility

Disposal or recovery of hazardous waste with a capacity exceeding 10 tonnes per day involving the regeneration of acids or bases
type: Concept
notation: A-5.1(g)
definition: Disposal or recovery of hazardous waste with a capacity exceeding 10 tonnes per day involving the regeneration of acids or bases
status: valid
status modified: 2026-05-07
accepted date: 2026-05-07
in scheme: List of activities defined in Annex I of the IEPR to be reported as main activity and other activities for Production Installation and as main activity for Production Facility

Disposal or recovery of hazardous waste with a capacity exceeding 10 tonnes per day involving the recovery of components used for pollution abatement
type: Concept
notation: A-5.1(h)
definition: Disposal or recovery of hazardous waste with a capacity exceeding 10 tonnes per day involving the recovery of components used for pollution abatement
status: valid
status modified: 2026-05-07
accepted date: 2026-05-07
in scheme: List of activities defined in Annex I of the IEPR to be reported as main activity and other activities for Production Installation and as main activity for Production Facility

Disposal or recovery of hazardous waste with a capacity exceeding 10 tonnes per day involving the recovery of components from catalysts
type: Concept
notation: A-5.1(i)
definition: Disposal or recovery of hazardous waste with a capacity exceeding 10 tonnes per day involving the recovery of components from catalysts
status: valid
status modified: 2026-05-07
accepted date: 2026-05-07
in scheme: List of activities defined in Annex I of the IEPR to be reported as main activity and other activities for Production Installation and as main activity for Production Facility

Disposal or recovery of hazardous waste with a capacity exceeding 10 tonnes per day involving oil re-refining or other reuses of oil
type: Concept
notation: A-5.1(j)
definition: Disposal or recovery of hazardous waste with a capacity exceeding 10 tonnes per day involving oil re-refining or other reuses of oil
status: valid
status modified: 2026-05-07
accepted date: 2026-05-07
in scheme: List of activities defined in Annex I of the IEPR to be reported as main activity and other activities for Production Installation and as main activity for Production Facility

Disposal or recovery of hazardous waste with a capacity exceeding 10 tonnes per day involving surface impoundment
type: Concept
notation: A-5.1(k)
definition: Disposal or recovery of hazardous waste with a capacity exceeding 10 tonnes per day involving surface impoundment
status: valid
status modified: 2026-05-07
accepted date: 2026-05-07
in scheme: List of activities defined in Annex I of the IEPR to be reported as main activity and other activities for Production Installation and as main activity for Production Facility

Disposal or recovery of waste in waste incineration plants or in waste co-incineration plants
type: Concept
notation: A-5.2
definition: Disposal or recovery of waste in waste incineration plants or in waste co-incineration plants
status: valid
status modified: 2026-05-07
accepted date: 2026-05-07
in scheme: List of activities defined in Annex I of the IEPR to be reported as main activity and other activities for Production Installation and as main activity for Production Facility

Disposal or recovery of waste in waste incineration plants or in waste co-incineration plants for non-hazardous waste with a capacity exceeding 3 tonnes per hour
type: Concept
notation: A-5.2(a)
definition: Disposal or recovery of waste in waste incineration plants or in waste co-incineration plants for non-hazardous waste with a capacity exceeding 3 tonnes per hour
status: valid
status modified: 2026-05-07
accepted date: 2026-05-07
in scheme: List of activities defined in Annex I of the IEPR to be reported as main activity and other activities for Production Installation and as main activity for Production Facility

Disposal or recovery of waste in waste incineration plants or in waste co-incineration plants for hazardous waste with a capacity exceeding 10 tonnes per day
type: Concept
notation: A-5.2(b)
definition: Disposal or recovery of waste in waste incineration plants or in waste co-incineration plants for hazardous waste with a capacity exceeding 10 tonnes per day
status: valid
status modified: 2026-05-07
accepted date: 2026-05-07
in scheme: List of activities defined in Annex I of the IEPR to be reported as main activity and other activities for Production Installation and as main activity for Production Facility

A-5.3(a)
type: Concept
notation: A-5.3(a)
preferred label: Disposal of non-hazardous waste with a capacity exceeding 50 tonnes per day involving one or more of the following activities, excluding activities covered by Directive 2024/3019 concerning urban waste-water treatment.
definition: Disposal of non-hazardous waste with a capacity exceeding 50 tonnes per day involving one or more of the following activities, excluding activities covered by Directive 2024/3019 concerning urban waste-water treatment.
status: valid
status modified: 2026-05-07
accepted date: 2026-05-07
in scheme: List of activities defined in Annex I of the IEPR to be reported as main activity and other activities for Production Installation and as main activity for Production Facility

A-5.3(a)(i)
type: Concept
notation: A-5.3(a)(i)
preferred label: Disposal of non-hazardous waste with a capacity exceeding 50 tonnes per day involving biological treatment such as anaerobic digestion or co-digestion, excluding activities covered by Directive 2024/3019 concerning urban waste-water treatment
definition: Disposal of non-hazardous waste with a capacity exceeding 50 tonnes per day involving biological treatment such as anaerobic digestion or co-digestion, excluding activities covered by Directive 2024/3019concerning urban waste-water treatment
status: valid
status modified: 2026-05-07
accepted date: 2026-05-07
in scheme: List of activities defined in Annex I of the IEPR to be reported as main activity and other activities for Production Installation and as main activity for Production Facility

A-5.3(a)(ii)
type: Concept
notation: A-5.3(a)(ii)
preferred label: Disposal of non-hazardous waste with a capacity exceeding 50 tonnes per day involving physico-chemical treatment, excluding activities covered by Directive 2024/3019, concerning urban waste-water treatment
definition: Disposal of non-hazardous waste with a capacity exceeding 50 tonnes per day involving physico-chemical treatment, excluding activities covered by Directive 2024/3019, concerning urban waste-water treatment
status: valid
status modified: 2026-05-07
accepted date: 2026-05-07
in scheme: List of activities defined in Annex I of the IEPR to be reported as main activity and other activities for Production Installation and as main activity for Production Facility

A-5.3(a)(iii)
type: Concept
notation: A-5.3(a)(iii)
preferred label: Disposal of non-hazardous waste with a capacity exceeding 50 tonnes per day involving the pre-treatment of waste for incineration or co-incineration, excluding activities covered by Directive 2024/3019 concerning urban waste-water treatment
definition: Disposal of non-hazardous waste with a capacity exceeding 50 tonnes per day involving the pre-treatment of waste for incineration or co-incineration, excluding activities covered by Directive 2024/3019 concerning urban waste-water treatment
status: valid
status modified: 2026-05-07
accepted date: 2026-05-07
in scheme: List of activities defined in Annex I of the IEPR to be reported as main activity and other activities for Production Installation and as main activity for Production Facility

A-5.3(a)(iv)
type: Concept
notation: A-5.3(a)(iv)
preferred label: Disposal of non-hazardous waste with a capacity exceeding 50 tonnes per day involving the treatment of slags and ashes, excluding activities covered by Directive 2024/3019concerning urban waste-water treatment
definition: Disposal of non-hazardous waste with a capacity exceeding 50 tonnes per day involving the treatment of slags and ashes, excluding activities covered by Directive 2024/3019concerning urban waste-water treatment
status: valid
status modified: 2026-05-07
accepted date: 2026-05-07
in scheme: List of activities defined in Annex I of the IEPR to be reported as main activity and other activities for Production Installation and as main activity for Production Facility

A-5.3(a)(v)
type: Concept
notation: A-5.3(a)(v)
preferred label: Disposal of non-hazardous waste with a capacity exceeding 50 tonnes per day involving treatment in shredders of metal waste, including waste electrical and electronic equipment and end-of-life vehicles and their components, and excluding activities covered by Directive 2024/3019 concerning urban waste-water treatment
definition: Disposal of non-hazardous waste with a capacity exceeding 50 tonnes per day involving treatment in shredders of metal waste, including waste electrical and electronic equipment and end-of-life vehicles and their components, and excluding activities covered by Directive 2024/3019concerning urban waste-water treatment
status: valid
status modified: 2026-05-07
accepted date: 2026-05-07
in scheme: List of activities defined in Annex I of the IEPR to be reported as main activity and other activities for Production Installation and as main activity for Production Facility

A-5.3(b)
type: Concept
notation: A-5.3(b)
preferred label: Recovery, or a mix of recovery and disposal of non-hazardous waste with a capacity exceeding 75 tonnes per day involving one or more of the following activities, and excluding activities covered by Directive 2024/3019 concerning urban waste-water treatment.
definition: Recovery, or a mix of recovery and disposal, of non-hazardous waste with a capacity exceeding 75 tonnes per day involving one or more of the following activities, and excluding activities covered by Directive 2024/3019 concerning urban waste-water treatment.
status: valid
status modified: 2026-05-07
accepted date: 2026-05-07
in scheme: List of activities defined in Annex I of the IEPR to be reported as main activity and other activities for Production Installation and as main activity for Production Facility

A-5.3(b)(i)
type: Concept
notation: A-5.3(b)(i)
preferred label: Recovery,or a mix of recovery and disposal of non-hazardous waste with a capacity exceeding 75 tonnes per day involving biological treatment, such as anaerobic digestion,excluding activities covered by Directive 2024/3019 concerning urban waste-water treatment
definition: Recovery, or a mix of recovery and disposal, of non-hazardous waste with a capacity exceeding 75 tonnes per day involving biological treatment, such as anaerobic digestion, excluding activities covered by Directive 2024/3019 concerning urban waste-water treatment
status: valid
status modified: 2026-05-07
accepted date: 2026-05-07
in scheme: List of activities defined in Annex I of the IEPR to be reported as main activity and other activities for Production Installation and as main activity for Production Facility

A-5.3(b)(ii)
type: Concept
notation: A-5.3(b)(ii)
preferred label: Recovery or a mix of recovery and disposal of non-hazardous waste with a capacity exceeding 75 tonnes per day involving the pre-treatment of waste for incineration or co-incineration excluding activities covered by Directive 2024/3019 concerning urban waste-water treatment
definition: Recovery, or a mix of recovery and disposal, of non-hazardous waste with a capacity exceeding 75 tonnes per day involving the pre-treatment of waste for incineration or co-incineration, excluding activities covered by Directive 2024/3019 concerning urban waste-water treatment
status: valid
status modified: 2026-05-07
accepted date: 2026-05-07
in scheme: List of activities defined in Annex I of the IEPR to be reported as main activity and other activities for Production Installation and as main activity for Production Facility

A-5.3(b)(iii)
type: Concept
notation: A-5.3(b)(iii)
preferred label: Recovery, or a mix of recovery and disposal, of non-hazardous waste with a capacity exceeding 75 tonnes per day involving the treatment of slags and ashes, excluding activities covered by Directive 2024/3019 concerning urban waste-water treatment
definition: Recovery, or a mix of recovery and disposal, of non-hazardous waste with a capacity exceeding 75 tonnes per day involving the treatment of slags and ashes, excluding activities covered by Directive 2024/3019 concerning urban waste-water treatment
status: valid
status modified: 2026-05-07
accepted date: 2026-05-07
in scheme: List of activities defined in Annex I of the IEPR to be reported as main activity and other activities for Production Installation and as main activity for Production Facility

A-5.3(b)(iv)
type: Concept
notation: A-5.3(b)(iv)
preferred label: Recovery, or a mix of recovery and disposal, of non-hazardous waste with a capacity exceeding 75 tonnes per day involving treatment in shredders of metal waste, including waste electrical and electronic equipment and end-of-life vehicles and their components, and excluding activities covered by Directive 2024/3019 concerning urban waste-water treatment.
definition: Recovery, or a mix of recovery and disposal, of non-hazardous waste with a capacity exceeding 75 tonnes per day involving treatment in shredders of metal waste, including waste electrical and electronic equipment and end-of-life vehicles and their components, and excluding activities covered by Directive 2024/3019 concerning urban waste-water treatment.
status: valid
status modified: 2026-05-07
accepted date: 2026-05-07
in scheme: List of activities defined in Annex I of the IEPR to be reported as main activity and other activities for Production Installation and as main activity for Production Facility

A-5.4
type: Concept
notation: A-5.4
preferred label: Landfills, as defined in Article 2(g) of Council Directive 1999/31/EC of 26 April 1999 on the landfill of waste, receiving more than 10 tonnes of waste per day or with a total capacity exceeding 25000 tonnes, excluding landfills of inert waste
definition: Landfills, as defined in Article 2(g) of Council Directive 1999/31/EC of 26 April 1999 on the landfill of waste, receiving more than 10 tonnes of waste per day or with a total capacity exceeding 25000 tonnes, excluding landfills of inert waste
status: valid
status modified: 2026-05-07
accepted date: 2026-05-07
in scheme: List of activities defined in Annex I of the IEPR to be reported as main activity and other activities for Production Installation and as main activity for Production Facility

A-5.5
type: Concept
notation: A-5.5
preferred label: Temporary storage of hazardous waste not covered under point 5.4 pending any of the activities listed in points 5.1, 5.2, 5.4 and 5.6 with a total capacity exceeding 50 tonnes, excluding temporary storage, pending collection, on the site where the waste is generated
definition: Temporary storage of hazardous waste not covered under point 5.4 pending any of the activities listed in points 5.1, 5.2, 5.4 and 5.6 with a total capacity exceeding 50 tonnes, excluding temporary storage, pending collection, on the site where the waste is generated
status: valid
status modified: 2026-05-07
accepted date: 2026-05-07
in scheme: List of activities defined in Annex I of the IEPR to be reported as main activity and other activities for Production Installation and as main activity for Production Facility

Underground storage of hazardous waste with a total capacity exceeding 50 tonnes
type: Concept
notation: A-5.6
definition: Underground storage of hazardous waste with a total capacity exceeding 50 tonnes
status: valid
status modified: 2026-05-07
accepted date: 2026-05-07
in scheme: List of activities defined in Annex I of the IEPR to be reported as main activity and other activities for Production Installation and as main activity for Production Facility

Production in industrial installations of pulp from timber or other fibrous materials
type: Concept
notation: A-6.1(a)
definition: Production in industrial installations of pulp from timber or other fibrous materials
status: valid
status modified: 2026-05-07
accepted date: 2026-05-07
in scheme: List of activities defined in Annex I of the IEPR to be reported as main activity and other activities for Production Installation and as main activity for Production Facility

Production in industrial installations of paper or card board with a production capacity exceeding 20 tonnes per day
type: Concept
notation: A-6.1(b)
definition: Production in industrial installations of paper or card board with a production capacity exceeding 20 tonnes per day
status: valid
status modified: 2026-05-07
accepted date: 2026-05-07
in scheme: List of activities defined in Annex I of the IEPR to be reported as main activity and other activities for Production Installation and as main activity for Production Facility

Production in industrial installations with a production capacity exceeding 600 m3 per day of one or more of the following wood-based panels: oriented strand board, particleboard or fibreboard
type: Concept
notation: A-6.1(c)
definition: Production in industrial installations with a production capacity exceeding 600 m3 per day of one or more of the following wood-based panels: oriented strand board, particleboard or fibreboard
status: valid
status modified: 2026-05-07
accepted date: 2026-05-07
in scheme: List of activities defined in Annex I of the IEPR to be reported as main activity and other activities for Production Installation and as main activity for Production Facility

Preservation of wood and wood products with chemicals with a production capacity exceeding 75 m3 per day other than exclusively treating against sapstain
type: Concept
notation: A-6.10
definition: Preservation of wood and wood products with chemicals with a production capacity exceeding 75 m3 per day other than exclusively treating against sapstain
status: valid
status modified: 2026-05-07
accepted date: 2026-05-07
in scheme: List of activities defined in Annex I of the IEPR to be reported as main activity and other activities for Production Installation and as main activity for Production Facility

Independently operated treatment of waste water not covered by Directive 2024/3019, and discharged by an installation covered by Chapter II of Directive 2010/75/EU
type: Concept
notation: A-6.11
definition: Independently operated treatment of waste water not covered by Directive 2024/3019, and discharged by an installation covered by Chapter II of Directive 2010/75/EU
status: valid
status modified: 2026-05-07
accepted date: 2026-05-07
in scheme: List of activities defined in Annex I of the IEPR to be reported as main activity and other activities for Production Installation and as main activity for Production Facility

Pre-treatment (operations such as washing, bleaching, mercerisation) or dyeing of textile fibres or textiles where the treatment capacity exceeds 10 tonnes per day
type: Concept
notation: A-6.2
definition: Pre-treatment (operations such as washing, bleaching, mercerisation) or dyeing of textile fibres or textiles where the treatment capacity exceeds 10 tonnes per day
status: valid
status modified: 2026-05-07
accepted date: 2026-05-07
in scheme: List of activities defined in Annex I of the IEPR to be reported as main activity and other activities for Production Installation and as main activity for Production Facility

Tanning of hides and skins where the treatment capacity exceeds 12 tonnes of finished products per day
type: Concept
notation: A-6.3
definition: Tanning of hides and skins where the treatment capacity exceeds 12 tonnes of finished products per day
status: valid
status modified: 2026-05-07
accepted date: 2026-05-07
in scheme: List of activities defined in Annex I of the IEPR to be reported as main activity and other activities for Production Installation and as main activity for Production Facility

Operating slaughterhouses with a carcass production capacity greater than 50 tonnes per day
type: Concept
notation: A-6.4(a)
definition: Operating slaughterhouses with a carcass production capacity greater than 50 tonnes per day
status: valid
status modified: 2026-05-07
accepted date: 2026-05-07
in scheme: List of activities defined in Annex I of the IEPR to be reported as main activity and other activities for Production Installation and as main activity for Production Facility

A-6.4(b)(i)
type: Concept
notation: A-6.4(b)(i)
preferred label: Treatment and processing, other than exclusively packaging, of the following raw materials, whether previously processed or unprocessed, intended for the production of food or feed from only animal raw materials (other than exclusively milk) with a finished product production capacity greater than 75 tonnes per day
definition: Treatment and processing, other than exclusively packaging, of the following raw materials, whether previously processed or unprocessed, intended for the production of food or feed from only animal raw materials (other than exclusively milk) with a finished product production capacity greater than 75 tonnes per day
status: valid
status modified: 2026-05-07
accepted date: 2026-05-07
in scheme: List of activities defined in Annex I of the IEPR to be reported as main activity and other activities for Production Installation and as main activity for Production Facility

Treatment and processing of milk only, the quantity of milk received being greater than 200 tonnes per day (average value on an annual basis)
type: Concept
notation: A-6.4(c)
definition: Treatment and processing of milk only, the quantity of milk received being greater than 200 tonnes per day (average value on an annual basis)
status: valid
status modified: 2026-05-07
accepted date: 2026-05-07
in scheme: List of activities defined in Annex I of the IEPR to be reported as main activity and other activities for Production Installation and as main activity for Production Facility

Disposal or recycling of animal carcasses or animal by-products with a treatment capacity exceeding 10 tonnes per day
type: Concept
notation: A-6.5
definition: Disposal or recycling of animal carcasses or animal by-products with a treatment capacity exceeding 10 tonnes per day
status: valid
status modified: 2026-05-07
accepted date: 2026-05-07
in scheme: List of activities defined in Annex I of the IEPR to be reported as main activity and other activities for Production Installation and as main activity for Production Facility

Electrolysis of water for production of hydrogen where the production capacity exceeds 50 tonnes per day.
type: Concept
notation: A-6.6
definition: Electrolysis of water for production of hydrogen where the production capacity exceeds 50 tonnes per day.
status: valid
status modified: 2026-05-07
accepted date: 2026-05-07
in scheme: List of activities defined in Annex I of the IEPR to be reported as main activity and other activities for Production Installation and as main activity for Production Facility

A-6.7
type: Concept
notation: A-6.7
preferred label: Surface treatment of substances, objects or products using organic solvents, in particular for dressing, printing, coating, degreasing, waterproofing, sizing, painting, cleaning or impregnating, with an organic solvent consumption capacity of more than 150 kg per hour or more than 200 tonnes per year
definition: Surface treatment of substances, objects or products using organic solvents, in particular for dressing, printing, coating, degreasing, waterproofing, sizing, painting, cleaning or impregnating, with an organic solvent consumption capacity of more than 150 kg per hour or more than 200 tonnes per year
status: valid
status modified: 2026-05-07
accepted date: 2026-05-07
in scheme: List of activities defined in Annex I of the IEPR to be reported as main activity and other activities for Production Installation and as main activity for Production Facility

Production of carbon (hard-burnt coal) or electrographite by means of incineration or graphitisation
type: Concept
notation: A-6.8
definition: Production of carbon (hard-burnt coal) or electrographite by means of incineration or graphitisation
status: valid
status modified: 2026-05-07
accepted date: 2026-05-07
in scheme: List of activities defined in Annex I of the IEPR to be reported as main activity and other activities for Production Installation and as main activity for Production Facility

A-6.4(b)(ii)
type: Concept
notation: A-6.4(b)(ii)
preferred label: Treatment and processing, other than exclusively packaging, of the following raw materials, whether previously processed or unprocessed, intended for the production of food or feed from only vegetable raw materials with a finished product production capacity greater than 300 tonnes per day or 600 tonnes per day where the installation operates for a period of no more than 90 consecutive days in any year
definition: Treatment and processing, other than exclusively packaging, of the following raw materials, whether previously processed or unprocessed, intended for the production of food or feed from only vegetable raw materials with a finished product production capacity greater than 300 tonnes per day or 600 tonnes per day where the installation operates for a period of no more than 90 consecutive days in any year
status: valid
status modified: 2026-05-07
accepted date: 2026-05-07
in scheme: List of activities defined in Annex I of the IEPR to be reported as main activity and other activities for Production Installation and as main activity for Production Facility

A-6.4(b)(iii)
type: Concept
notation: A-6.4(b)(iii)
preferred label: Treatment and processing, other than exclusively packaging, of the following raw materials, whether previously processed or unprocessed, intended for the production of food or feed from animal and vegetable raw materials, both in combined and separate products, with a finished product production capacity in tonnes per day greater than 75 if A is equal to 10 or more or, [300- (22,5 x A)] in any other case, where A is the portion of animal material (in percent of weight) of the finished product production capacity
definition: Treatment and processing, other than exclusively packaging, of the following raw materials, whether previously processed or unprocessed, intended for the production of food or feed from animal and vegetable raw materials, both in combined and separate products, with a finished product production capacity in tonnes per day greater than 75 if A is equal to 10 or more or, [300- (22,5 x A)] in any other case, where A is the portion of animal material (in percent of weight) of the finished product production capacity
status: valid
status modified: 2026-05-07
accepted date: 2026-05-07
in scheme: List of activities defined in Annex I of the IEPR to be reported as main activity and other activities for Production Installation and as main activity for Production Facility

Capture of CO2 streams from installations covered by Directive 2010/75/EU for the purposes of geological storage pursuant to Directive 2009/31/EC
type: Concept
notation: A-6.9
definition: Capture of CO2 streams from installations covered by Directive 2010/75/EU for the purposes of geological storage pursuant to Directive 2009/31/EC
status: valid
status modified: 2026-05-07
accepted date: 2026-05-07
in scheme: List of activities defined in Annex I of the IEPR to be reported as main activity and other activities for Production Installation and as main activity for Production Facility

B-1
type: Concept
notation: B-1
preferred label: Rearing of pigs representing 350 LSU or more, excluding rearing activities that are carried out under organic production regimes in accordance with Regulation (EU) 2018/848, or where the stocking density is less than 2 LSU/hectare used only for grazing or growing fodder or forage used for feeding the animals and the animals are reared outside for a significant amount of time in a year or seasonally reared outside
definition: Rearing of pigs representing 350 LSU or more, excluding rearing activities that are carried out under organic production regimes in accordance with Regulation (EU) 2018/848, or where the stocking density is less than 2 LSU/hectare used only for grazing or growing fodder or forage used for feeding the animals and the animals are reared outside for a significant amount of time in a year or seasonally reared outside
status: valid
status modified: 2026-05-07
accepted date: 2026-05-07
in scheme: List of activities defined in Annex I of the IEPR to be reported as main activity and other activities for Production Installation and as main activity for Production Facility

B-2
type: Concept
notation: B-2
preferred label: Rearing of only laying hens representing 300 LSU or more, or rearing of only other poultry categories representing 280 LSU or more. In installations rearing a mix of poultry including laying hens, the threshold shall be 280 LSU and the capacity shall be calculated using 0.93 as weighting factor (1) for laying hens.
definition: Rearing of only laying hens representing 300 LSU or more, or rearing of only other poultry categories representing 280 LSU or more. In installations rearing a mix of poultry including laying hens, the threshold shall be 280 LSU and the capacity shall be calculated using 0.93 as weighting factor (1) for laying hens.
status: valid
status modified: 2026-05-07
accepted date: 2026-05-07
in scheme: List of activities defined in Annex I of the IEPR to be reported as main activity and other activities for Production Installation and as main activity for Production Facility

B-3
type: Concept
notation: B-3
preferred label: Rearing of any mix of pigs or poultry representing 380 LSU or more, excluding rearing of pigs in installations operating under organic production regimes in accordance with Regulation (EU) 2018/848, or where the stocking density is less than 2 LSU/hectare used only for grazing or growing fodder or forage used for feeding the animals and the animals are reared outside for a significant amount of time in a year or seasonally reared outside
definition: Rearing of any mix of pigs or poultry representing 380 LSU or more, excluding rearing of pigs in installations operating under organic production regimes in accordance with Regulation (EU) 2018/848, or where the stocking density is less than 2 LSU/hectare used only for grazing or growing fodder or forage used for feeding the animals and the animals are reared outside for a significant amount of time in a year or seasonally reared outside
status: valid
status modified: 2026-05-07
accepted date: 2026-05-07
in scheme: List of activities defined in Annex I of the IEPR to be reported as main activity and other activities for Production Installation and as main activity for Production Facility

Activities referred to in Article 2 of Directive (EU) 2015/2193 (where not covered by Annex I to Directive 2010/75/EU) - Combustion plants with a rated thermal input of at least 20 MW and below 50 MW
type: Concept
notation: C-1
definition: Activities referred to in Article 2 of Directive (EU) 2015/2193 (where not covered by Annex I to Directive 2010/75/EU) - Combustion plants with a rated thermal input of at least 20 MW and below 50 MW
status: valid
status modified: 2026-05-07
accepted date: 2026-05-07
in scheme: List of activities defined in Annex I of the IEPR to be reported as main activity and other activities for Production Installation and as main activity for Production Facility

Underground mining and related operations, including the extraction of crude oil or gas either onshore or offshore (where not covered by Annex I to Directive 2010/75/EU)
type: Concept
notation: D-1
definition: Underground mining and related operations, including the extraction of crude oil or gas either onshore or offshore (where not covered by Annex I to Directive 2010/75/EU)
status: valid
status modified: 2026-05-07
accepted date: 2026-05-07
in scheme: List of activities defined in Annex I of the IEPR to be reported as main activity and other activities for Production Installation and as main activity for Production Facility

Opencast mining and quarrying (where not covered by Annex I to Directive 2010/75/EU) where the surface of the area effectively under extractive operation equals 25 hectares or more
type: Concept
notation: E-1
definition: Opencast mining and quarrying (where not covered by Annex I to Directive 2010/75/EU) where the surface of the area effectively under extractive operation equals 25 hectares or more
status: valid
status modified: 2026-05-07
accepted date: 2026-05-07
in scheme: List of activities defined in Annex I of the IEPR to be reported as main activity and other activities for Production Installation and as main activity for Production Facility

Urban waste water treatment plants with a capacity of 100 000 population equivalents or more
type: Concept
notation: F-1
definition: Urban waste water treatment plants with a capacity of 100 000 population equivalents or more
status: valid
status modified: 2026-05-07
accepted date: 2026-05-07
in scheme: List of activities defined in Annex I of the IEPR to be reported as main activity and other activities for Production Installation and as main activity for Production Facility

Feed-based aquaculture exceeding an annual production capacity of 500 tonnes or more
type: Concept
notation: G-1
definition: Feed-based aquaculture exceeding an annual production capacity of 500 tonnes or more
status: valid
status modified: 2026-05-07
accepted date: 2026-05-07
in scheme: List of activities defined in Annex I of the IEPR to be reported as main activity and other activities for Production Installation and as main activity for Production Facility

Installations for the building and/or dismantling of ships, and for the painting or removal of paint from ships with a capacity for ships 100 m long or longer
type: Concept
notation: H-1
definition: Installations for the building and/or dismantling of ships, and for the painting or removal of paint from ships with a capacity for ships 100 m long or longer
status: valid
status modified: 2026-05-07
accepted date: 2026-05-07
in scheme: List of activities defined in Annex I of the IEPR to be reported as main activity and other activities for Production Installation and as main activity for Production Facility

Electrolysis of water for production of hydrogen (when not included under A-6.6)
type: Concept
notation: I-1
definition: Electrolysis of water for production of hydrogen (when not included under A-6.6)
status: valid
status modified: 2026-05-07
accepted date: 2026-05-07
in scheme: List of activities defined in Annex I of the IEPR to be reported as main activity and other activities for Production Installation and as main activity for Production Facility

Code list for substances to be reported under the IEPR Regulation following its Annex II
type: ConceptScheme
notation: IEPRPollutantCodeValue
is part of: Industrial Emission Portal Regulation and Industrial Emission Directive
registration status: Public draft
user modified: antogfed
date modified: 2026-05-08 12:51:51.0
vocabulary type: Common
is numeric concept identifiers: false
is notations equal identifiers: false

Alachlor
type: Concept
notation: ALACHLOR
definition: Alachlor
status: valid
status modified: 2026-05-08
accepted date: 2026-05-08
in scheme: Code list for substances to be reported under the IEPR Regulation following its Annex II
IEP rpollutant CAS: 15972-60-8
air threshold IEPR: -
air threshold IEPR: —
water threshold IEPR: 1
land threshold IEPR: 1

Aldrin
type: Concept
notation: ALDRIN
definition: Aldrin
status: valid
status modified: 2026-05-08
accepted date: 2026-05-08
in scheme: Code list for substances to be reported under the IEPR Regulation following its Annex II
IEP rpollutant CAS: 309-00-2
air threshold IEPR: 1
water threshold IEPR: 1
land threshold IEPR: 1

Anthracene
type: Concept
notation: ANTHRACENE
definition: Anthracene
status: valid
status modified: 2026-05-08
accepted date: 2026-05-08
in scheme: Code list for substances to be reported under the IEPR Regulation following its Annex II
IEP rpollutant CAS: 120-12-7
air threshold IEPR: 50
water threshold IEPR: 1
land threshold IEPR: 1

Arsenic and compounds (as As)
type: Concept
notation: ASANDCOMPOUNDS
definition: Arsenic and compounds (as As)
status: valid
status modified: 2026-05-08
accepted date: 2026-05-08
in scheme: Code list for substances to be reported under the IEPR Regulation following its Annex II
air threshold IEPR: 20
water threshold IEPR: 5
land threshold IEPR: 5
pollutant comments IEPR: All metals shall be reported as the total mass of the element in all chemical forms present in the release.

Asbestos
type: Concept
notation: ASBESTOS
definition: Asbestos
status: valid
status modified: 2026-05-08
accepted date: 2026-05-08
in scheme: Code list for substances to be reported under the IEPR Regulation following its Annex II
IEP rpollutant CAS: 1332-21-4
air threshold IEPR: 1
water threshold IEPR: 1
land threshold IEPR: 1

Atrazine
type: Concept
notation: ATRAZINE
definition: Atrazine
status: valid
status modified: 2026-05-08
accepted date: 2026-05-08
in scheme: Code list for substances to be reported under the IEPR Regulation following its Annex II
IEP rpollutant CAS: 1912-24-9
air threshold IEPR: —
water threshold IEPR: 1
land threshold IEPR: 1

Benzene
type: Concept
notation: BENZENE
definition: Benzene
status: valid
status modified: 2026-05-08
accepted date: 2026-05-08
in scheme: Code list for substances to be reported under the IEPR Regulation following its Annex II
IEP rpollutant CAS: 71-43-2
air threshold IEPR: 1000
water threshold IEPR: 200
land threshold IEPR: 200
pollutant comments IEPR: Single pollutants are to be reported if the threshold for BTEX (the sum parameter of benzene, toluene, ethyl benzene, xylenes) is exceeded (water or land)

Benzo(g,h,i)perylene
type: Concept
notation: BENZO(G,H,I)PERYLENE
definition: Benzo(g,h,i)perylene
status: valid
status modified: 2026-05-08
accepted date: 2026-05-08
in scheme: Code list for substances to be reported under the IEPR Regulation following its Annex II
IEP rpollutant CAS: 191-24-2
water threshold IEPR: 1

Cadmium and compounds (as Cd)
type: Concept
notation: CDANDCOMPOUNDS
definition: Cadmium and compounds (as Cd)
status: valid
status modified: 2026-05-08
accepted date: 2026-05-08
in scheme: Code list for substances to be reported under the IEPR Regulation following its Annex II
air threshold IEPR: 10
water threshold IEPR: 5
land threshold IEPR: 5
pollutant comments IEPR: All metals shall be reported as the total mass of the element in all chemical forms present in the release.

Chlorofluorocarbons (CFCs)
type: Concept
notation: CFCS
definition: Chlorofluorocarbons (CFCs)
status: valid
status modified: 2026-05-08
accepted date: 2026-05-08
in scheme: Code list for substances to be reported under the IEPR Regulation following its Annex II
air threshold IEPR: 1
water threshold IEPR: —
land threshold IEPR: —
pollutant comments IEPR: Total mass of substances including their isomers listed in Groups I and II of Annex I to Regulation (EC) No 1005/2009.

Methane (CH4)
type: Concept
notation: CH4
definition: Methane (CH4)
status: valid
status modified: 2026-05-08
accepted date: 2026-05-08
in scheme: Code list for substances to be reported under the IEPR Regulation following its Annex II
IEP rpollutant CAS: 74-82-8
air threshold IEPR: 100000
water threshold IEPR: —
land threshold IEPR: —

Chlordane
type: Concept
notation: CHLORDANE
definition: Chlordane
status: valid
status modified: 2026-05-08
accepted date: 2026-05-08
in scheme: Code list for substances to be reported under the IEPR Regulation following its Annex II
IEP rpollutant CAS: 57-74-9
air threshold IEPR: 1
water threshold IEPR: 1
land threshold IEPR: 1

Chlordecone
type: Concept
notation: CHLORDECONE
definition: Chlordecone
status: valid
status modified: 2026-05-08
accepted date: 2026-05-08
in scheme: Code list for substances to be reported under the IEPR Regulation following its Annex II
IEP rpollutant CAS: 143-50-0
air threshold IEPR: 1
water threshold IEPR: 1
land threshold IEPR: 1

Chlorfenvinphos
type: Concept
notation: CHLORFENVINPHOS
definition: Chlorfenvinphos
status: valid
status modified: 2026-05-08
accepted date: 2026-05-08
in scheme: Code list for substances to be reported under the IEPR Regulation following its Annex II
IEP rpollutant CAS: 470-90-6
air threshold IEPR: —
water threshold IEPR: 1
land threshold IEPR: 1

Chlorides (as total Cl)
type: Concept
notation: CHLORIDES
definition: Chlorides (as total Cl)
status: valid
status modified: 2026-05-08
accepted date: 2026-05-08
in scheme: Code list for substances to be reported under the IEPR Regulation following its Annex II
air threshold IEPR: —
water threshold IEPR: 2000000
land threshold IEPR: 2000000

Chlorine and inorganic compounds (as HCl)
type: Concept
notation: CHLORINEANDINORGANICCOMPOUNDS
definition: Chlorine and inorganic compounds (as HCl)
status: valid
status modified: 2026-05-08
accepted date: 2026-05-08
in scheme: Code list for substances to be reported under the IEPR Regulation following its Annex II
air threshold IEPR: 10000
water threshold IEPR: —
land threshold IEPR: —

Chloro-alkanes, C10-C13
type: Concept
notation: CHLORO-ALKANES(C10-13)
definition: Chloro-alkanes, C10-C13
status: valid
status modified: 2026-05-08
accepted date: 2026-05-08
in scheme: Code list for substances to be reported under the IEPR Regulation following its Annex II
IEP rpollutant CAS: 85535-84-8
air threshold IEPR: —
water threshold IEPR: 1
land threshold IEPR: 1

Chlorpyrifos
type: Concept
notation: CHLORPYRIFOS
definition: Chlorpyrifos
status: valid
status modified: 2026-05-08
accepted date: 2026-05-08
in scheme: Code list for substances to be reported under the IEPR Regulation following its Annex II
IEP rpollutant CAS: 2921-88-2
air threshold IEPR: —
water threshold IEPR: 1
land threshold IEPR: 1

Carbon monoxide (CO)
type: Concept
notation: CO
definition: Carbon monoxide (CO)
status: valid
status modified: 2026-05-08
accepted date: 2026-05-08
in scheme: Code list for substances to be reported under the IEPR Regulation following its Annex II
IEP rpollutant CAS: 630-08-0
air threshold IEPR: 500000
water threshold IEPR: —
land threshold IEPR: —

Carbon dioxide (CO2)
type: Concept
notation: CO2
definition: Carbon dioxide (CO2)
status: valid
status modified: 2026-05-08
accepted date: 2026-05-08
in scheme: Code list for substances to be reported under the IEPR Regulation following its Annex II
IEP rpollutant CAS: 124-38-9
air threshold IEPR: 100000000
water threshold IEPR: —
land threshold IEPR: —

Chromium and compounds (as Cr)
type: Concept
notation: CRANDCOMPOUNDS
definition: Chromium and compounds (as Cr)
status: valid
status modified: 2026-05-08
accepted date: 2026-05-08
in scheme: Code list for substances to be reported under the IEPR Regulation following its Annex II
air threshold IEPR: 100
water threshold IEPR: 50
land threshold IEPR: 50
pollutant comments IEPR: All metals shall be reported as the total mass of the element in all chemical forms present in the release.

Copper and compounds (as Cu)
type: Concept
notation: CUANDCOMPOUNDS
definition: Copper and compounds (as Cu)
status: valid
status modified: 2026-05-08
accepted date: 2026-05-08
in scheme: Code list for substances to be reported under the IEPR Regulation following its Annex II
air threshold IEPR: 100
water threshold IEPR: 50
land threshold IEPR: 50
pollutant comments IEPR: All metals shall be reported as the total mass of the element in all chemical forms present in the release.

Cyanides (as total CN)
type: Concept
notation: CYANIDES
definition: Cyanides (as total CN)
status: valid
status modified: 2026-05-08
accepted date: 2026-05-08
in scheme: Code list for substances to be reported under the IEPR Regulation following its Annex II
air threshold IEPR: —
water threshold IEPR: 50
land threshold IEPR: 50

Dichloromethane (DCM)
type: Concept
notation: DCM
definition: Dichloromethane (DCM)
status: valid
status modified: 2026-05-08
accepted date: 2026-05-08
in scheme: Code list for substances to be reported under the IEPR Regulation following its Annex II
IEP rpollutant CAS: 75-09-2
air threshold IEPR: 1000
water threshold IEPR: 10
land threshold IEPR: 10

DDT
type: Concept
notation: DDT
definition: DDT
status: valid
status modified: 2026-05-08
accepted date: 2026-05-08
in scheme: Code list for substances to be reported under the IEPR Regulation following its Annex II
IEP rpollutant CAS: 50-29-3
air threshold IEPR: 1
water threshold IEPR: 1
land threshold IEPR: 1

Di-(2-ethyl hexyl) phthalate (DEHP)
type: Concept
notation: DEHP
definition: Di-(2-ethyl hexyl) phthalate (DEHP)
status: valid
status modified: 2026-05-08
accepted date: 2026-05-08
in scheme: Code list for substances to be reported under the IEPR Regulation following its Annex II
IEP rpollutant CAS: 117-81-7
air threshold IEPR: 10
water threshold IEPR: 1
land threshold IEPR: 1

Dicofol
type: Concept
notation: DICOFOL
definition: Dicofol
status: valid
status modified: 2026-05-08
accepted date: 2026-05-08
in scheme: Code list for substances to be reported under the IEPR Regulation following its Annex II
IEP rpollutant CAS: 115-32-2
air threshold IEPR: 1
water threshold IEPR: 1
land threshold IEPR: 1

Dieldrin
type: Concept
notation: DIELDRIN
definition: Dieldrin
status: valid
status modified: 2026-05-08
accepted date: 2026-05-08
in scheme: Code list for substances to be reported under the IEPR Regulation following its Annex II
IEP rpollutant CAS: 60-57-1
air threshold IEPR: 1
water threshold IEPR: 1
land threshold IEPR: 1

Diuron
type: Concept
notation: DIURON
definition: Diuron
status: valid
status modified: 2026-05-08
accepted date: 2026-05-08
in scheme: Code list for substances to be reported under the IEPR Regulation following its Annex II
IEP rpollutant CAS: 330-54-1
air threshold IEPR: —
water threshold IEPR: 1
land threshold IEPR: 1

Endosulphan
type: Concept
notation: ENDOSULPHAN
definition: Endosulphan
status: valid
status modified: 2026-05-08
accepted date: 2026-05-08
in scheme: Code list for substances to be reported under the IEPR Regulation following its Annex II
IEP rpollutant CAS: 115-29-7
air threshold IEPR: —
water threshold IEPR: 1
land threshold IEPR: 1

Endrin
type: Concept
notation: ENDRIN
definition: Endrin
status: valid
status modified: 2026-05-08
accepted date: 2026-05-08
in scheme: Code list for substances to be reported under the IEPR Regulation following its Annex II
IEP rpollutant CAS: 72-20-8
air threshold IEPR: 1
water threshold IEPR: 1
land threshold IEPR: 1

Ethyl benzene
type: Concept
notation: ETHYLBENZENE
definition: Ethyl benzene
status: valid
status modified: 2026-05-08
accepted date: 2026-05-08
in scheme: Code list for substances to be reported under the IEPR Regulation following its Annex II
IEP rpollutant CAS: 100-41-4
air threshold IEPR: —
water threshold IEPR: 200
land threshold IEPR: 200
pollutant comments IEPR: Single pollutants are to be reported if the threshold for BTEX (the sum parameter of benzene, toluene, ethyl benzene, xylenes) is exceeded (water or land)

Ethylene oxide
type: Concept
notation: ETHYLENEOXIDE
definition: Ethylene oxide
status: valid
status modified: 2026-05-08
accepted date: 2026-05-08
in scheme: Code list for substances to be reported under the IEPR Regulation following its Annex II
IEP rpollutant CAS: 75-21-8
air threshold IEPR: 1000
water threshold IEPR: 10
land threshold IEPR: 10

Fluoranthene
type: Concept
notation: FLUORANTHENE
definition: Fluoranthene
status: valid
status modified: 2026-05-08
accepted date: 2026-05-08
in scheme: Code list for substances to be reported under the IEPR Regulation following its Annex II
IEP rpollutant CAS: 206-44-0
air threshold IEPR: —
water threshold IEPR: 1
land threshold IEPR: —

Fluorides (as total F)
type: Concept
notation: FLUORIDES
definition: Fluorides (as total F)
status: valid
status modified: 2026-05-08
accepted date: 2026-05-08
in scheme: Code list for substances to be reported under the IEPR Regulation following its Annex II
air threshold IEPR: —
water threshold IEPR: 2000
land threshold IEPR: 2000

Fluorine and inorganic compounds (as HF)
type: Concept
notation: FLUORINEANDINORGANICCOMPOUNDS
definition: Fluorine and inorganic compounds (as HF)
status: valid
status modified: 2026-05-08
accepted date: 2026-05-08
in scheme: Code list for substances to be reported under the IEPR Regulation following its Annex II
air threshold IEPR: 5000
water threshold IEPR: —
land threshold IEPR: —

Halogenated organic compounds (as AOX)
type: Concept
notation: HALOGENATEDORGANICCOMPOUNDS
definition: Halogenated organic compounds (as AOX)
status: valid
status modified: 2026-05-08
accepted date: 2026-05-08
in scheme: Code list for substances to be reported under the IEPR Regulation following its Annex II
air threshold IEPR: —
water threshold IEPR: 1000
land threshold IEPR: 1000
pollutant comments IEPR: Halogenated organic compounds which can be adsorbed to activated carbon expressed as chloride.

Halons
type: Concept
notation: HALONS
definition: Halons
status: valid
status modified: 2026-05-08
accepted date: 2026-05-08
in scheme: Code list for substances to be reported under the IEPR Regulation following its Annex II
air threshold IEPR: 1
water threshold IEPR: —
land threshold IEPR: —
pollutant comments IEPR: Total mass of substances including their isomers listed in Groups III and VI of Annex I to Regulation (EC) No 1005/2009.

Hexachlorobenzene (HCB)
type: Concept
notation: HCB
definition: Hexachlorobenzene (HCB)
status: valid
status modified: 2026-05-08
accepted date: 2026-05-08
in scheme: Code list for substances to be reported under the IEPR Regulation following its Annex II
IEP rpollutant CAS: 118-74-1
air threshold IEPR: 10
water threshold IEPR: 1
land threshold IEPR: 1

Hexachlorobutadiene (HCBD)
type: Concept
notation: HCBD
definition: Hexachlorobutadiene (HCBD)
status: valid
status modified: 2026-05-08
accepted date: 2026-05-08
in scheme: Code list for substances to be reported under the IEPR Regulation following its Annex II
IEP rpollutant CAS: 87-68-3
air threshold IEPR: —
water threshold IEPR: 1
land threshold IEPR: 1

Hydrochlorofluorocarbons (HCFCs)
type: Concept
notation: HCFCS
definition: Hydrochlorofluorocarbons (HCFCs)
status: valid
status modified: 2026-05-08
accepted date: 2026-05-08
in scheme: Code list for substances to be reported under the IEPR Regulation following its Annex II
air threshold IEPR: 1
water threshold IEPR: —
land threshold IEPR: —
pollutant comments IEPR: Total mass of substances including their isomers listed in Group VIII of Annex I to Regulation (EC) No 1005/2009 of the European Parliament and of the Council of 16 September 2009 on substances that deplete the ozone layer (OJ L286, 31.10.2009, p.1).

1,2,3,4,5,6-hexachlorocyclohexane (HCH)
type: Concept
notation: HCH
definition: 1,2,3,4,5,6-hexachlorocyclohexane (HCH)
status: valid
status modified: 2026-05-08
accepted date: 2026-05-08
in scheme: Code list for substances to be reported under the IEPR Regulation following its Annex II
IEP rpollutant CAS: 608-73-1
air threshold IEPR: 10
water threshold IEPR: 1
land threshold IEPR: 1

Hydrogen cyanide (HCN)
type: Concept
notation: HCN
definition: Hydrogen cyanide (HCN)
status: valid
status modified: 2026-05-08
accepted date: 2026-05-08
in scheme: Code list for substances to be reported under the IEPR Regulation following its Annex II
IEP rpollutant CAS: 74-90-8
air threshold IEPR: 200
water threshold IEPR: —
land threshold IEPR: —

Heptachlor
type: Concept
notation: HEPTACHLOR
definition: Heptachlor
status: valid
status modified: 2026-05-08
accepted date: 2026-05-08
in scheme: Code list for substances to be reported under the IEPR Regulation following its Annex II
IEP rpollutant CAS: 76-44-8
air threshold IEPR: 1
water threshold IEPR: 1
land threshold IEPR: 1

Hexabromobiphenyl
type: Concept
notation: HEXABROMOBIPHENYL
definition: Hexabromobiphenyl
status: valid
status modified: 2026-05-08
accepted date: 2026-05-08
in scheme: Code list for substances to be reported under the IEPR Regulation following its Annex II
IEP rpollutant CAS: 36355-1-8
air threshold IEPR: "0,1"
water threshold IEPR: "0,1"
land threshold IEPR: "0,1"

Hydro-fluorocarbons (HFCs)
type: Concept
notation: HFCS
definition: Hydro-fluorocarbons (HFCs)
status: valid
status modified: 2026-05-08
accepted date: 2026-05-08
in scheme: Code list for substances to be reported under the IEPR Regulation following its Annex II
air threshold IEPR: 100
water threshold IEPR: —
land threshold IEPR: —
pollutant comments IEPR: Total mass of hydrogen fluorocarbons: sum of HFC23, HFC32, HFC41, HFC4310mee, HFC125, HFC134, HFC134a, HFC152a, HFC143, HFC143a, HFC227ea, HFC236fa, HFC245ca, HFC365mfc.

Mercury and compounds (as Hg)
type: Concept
notation: HGANDCOMPOUNDS
definition: Mercury and compounds (as Hg)
status: valid
status modified: 2026-05-08
accepted date: 2026-05-08
in scheme: Code list for substances to be reported under the IEPR Regulation following its Annex II
air threshold IEPR: 10
water threshold IEPR: 1
land threshold IEPR: 1
pollutant comments IEPR: All metals shall be reported as the total mass of the element in all chemical forms present in the release.

Isodrin
type: Concept
notation: ISODRIN
definition: Isodrin
status: valid
status modified: 2026-05-08
accepted date: 2026-05-08
in scheme: Code list for substances to be reported under the IEPR Regulation following its Annex II
IEP rpollutant CAS: 465-73-6
air threshold IEPR: —
water threshold IEPR: 1
land threshold IEPR: —

Isoproturon
type: Concept
notation: ISOPROTURON
definition: Isoproturon
status: valid
status modified: 2026-05-08
accepted date: 2026-05-08
in scheme: Code list for substances to be reported under the IEPR Regulation following its Annex II
IEP rpollutant CAS: 34123-59-6
air threshold IEPR: —
water threshold IEPR: 1
land threshold IEPR: 1

Lindane
type: Concept
notation: LINDANE
definition: Lindane
status: valid
status modified: 2026-05-08
accepted date: 2026-05-08
in scheme: Code list for substances to be reported under the IEPR Regulation following its Annex II
IEP rpollutant CAS: 58-89-9
air threshold IEPR: 1
water threshold IEPR: 1
land threshold IEPR: 1

Mirex
type: Concept
notation: MIREX
definition: Mirex
status: valid
status modified: 2026-05-08
accepted date: 2026-05-08
in scheme: Code list for substances to be reported under the IEPR Regulation following its Annex II
IEP rpollutant CAS: 2385-85-5
air threshold IEPR: 1
water threshold IEPR: 1
land threshold IEPR: 1

Nitrous oxide (N2O)
type: Concept
notation: N2O
definition: Nitrous oxide (N2O)
status: valid
status modified: 2026-05-08
accepted date: 2026-05-08
in scheme: Code list for substances to be reported under the IEPR Regulation following its Annex II
IEP rpollutant CAS: 10024-97-2
air threshold IEPR: 10000
water threshold IEPR: —
land threshold IEPR: —

Naphthalene
type: Concept
notation: NAPHTHALENE
definition: Naphthalene
status: valid
status modified: 2026-05-08
accepted date: 2026-05-08
in scheme: Code list for substances to be reported under the IEPR Regulation following its Annex II
IEP rpollutant CAS: 91-20-3
air threshold IEPR: 100
water threshold IEPR: 10
land threshold IEPR: 10

Ammonia (NH3)
type: Concept
notation: NH3
definition: Ammonia (NH3)
status: valid
status modified: 2026-05-08
accepted date: 2026-05-08
in scheme: Code list for substances to be reported under the IEPR Regulation following its Annex II
IEP rpollutant CAS: 7664-41-7
air threshold IEPR: 10000
water threshold IEPR: —
land threshold IEPR: —

Nickel and compounds (as Ni)
type: Concept
notation: NIANDCOMPOUNDS
definition: Nickel and compounds (as Ni)
status: valid
status modified: 2026-05-08
accepted date: 2026-05-08
in scheme: Code list for substances to be reported under the IEPR Regulation following its Annex II
air threshold IEPR: 50
water threshold IEPR: 20
land threshold IEPR: 20
pollutant comments IEPR: All metals shall be reported as the total mass of the element in all chemical forms present in the release.

Non-methane volatile organic compounds (NMVOC)
type: Concept
notation: NMVOC
definition: Non-methane volatile organic compounds (NMVOC)
status: valid
status modified: 2026-05-08
accepted date: 2026-05-08
in scheme: Code list for substances to be reported under the IEPR Regulation following its Annex II
air threshold IEPR: 100000
water threshold IEPR: —
land threshold IEPR: —

Nitrogen oxides (NOx/NO2)
type: Concept
notation: NOX
definition: Nitrogen oxides (NOx/NO2)
status: valid
status modified: 2026-05-08
accepted date: 2026-05-08
in scheme: Code list for substances to be reported under the IEPR Regulation following its Annex II
air threshold IEPR: 100000
water threshold IEPR: —
land threshold IEPR: —

Nonylphenol and Nonylphenol ethoxylates (NP/NPEs)
type: Concept
notation: NPANDNPES
definition: Nonylphenol and Nonylphenol ethoxylates (NP/NPEs)
status: valid
status modified: 2026-05-08
accepted date: 2026-05-08
in scheme: Code list for substances to be reported under the IEPR Regulation following its Annex II
air threshold IEPR: —
water threshold IEPR: 1
land threshold IEPR: 1

Octylphenols and Octylphenol ethoxylates
type: Concept
notation: OCTYLPHENOLSANDOCTYLPHENOLETHOXYLATES
definition: Octylphenols and Octylphenol ethoxylates
status: valid
status modified: 2026-05-08
accepted date: 2026-05-08
in scheme: Code list for substances to be reported under the IEPR Regulation following its Annex II
IEP rpollutant CAS: 1806-26-4
air threshold IEPR: —
water threshold IEPR: 1
land threshold IEPR: —

Organotin compounds (as total Sn)
type: Concept
notation: ORGANOTINCOMPOUNDS
definition: Organotin compounds (as total Sn)
status: valid
status modified: 2026-05-08
accepted date: 2026-05-08
in scheme: Code list for substances to be reported under the IEPR Regulation following its Annex II
air threshold IEPR: —
water threshold IEPR: 50
land threshold IEPR: 50

Polycyclic aromatic hydrocarbons (PAHs)
type: Concept
notation: PAHS
definition: Polycyclic aromatic hydrocarbons (PAHs)
status: valid
status modified: 2026-05-08
accepted date: 2026-05-08
in scheme: Code list for substances to be reported under the IEPR Regulation following its Annex II
air threshold IEPR: 50
water threshold IEPR: 5
land threshold IEPR: 5
pollutant comments IEPR: For reporting releases to air, polycyclic aromatic hydrocarbons (PAHs) are to be measured as benzo(a)pyrene (50-32-8), benzo(b)fluoranthene (205-99-2), benzo(k)fluoranthene (207-08-9) and indeno(1,2,3-cd)pyrene (193-39-5) as specified in Regulation (EU) 2019/1021 of the European Parliament and of the Council of 20 June 2019 on persistent organic pollutants (OJ L 169, 25.6.2019, p. 45).

Lead and compounds (as Pb)
type: Concept
notation: PBANDCOMPOUNDS
definition: Lead and compounds (as Pb)
status: valid
status modified: 2026-05-08
accepted date: 2026-05-08
in scheme: Code list for substances to be reported under the IEPR Regulation following its Annex II
air threshold IEPR: 200
water threshold IEPR: 20
land threshold IEPR: 20
pollutant comments IEPR: All metals shall be reported as the total mass of the element in all chemical forms present in the release.

Brominated diphenylethers (PBDE)
type: Concept
notation: PBDE
definition: Brominated diphenylethers (PBDE)
status: valid
status modified: 2026-05-08
accepted date: 2026-05-08
in scheme: Code list for substances to be reported under the IEPR Regulation following its Annex II
air threshold IEPR: —
water threshold IEPR: 1
land threshold IEPR: 1
pollutant comments IEPR: Total mass of the following brominated diphenylethers: penta-BDE, octa-BDE and deca-BDE.

Polychlorinated biphenyls (PCBs)
type: Concept
notation: PCBS
definition: Polychlorinated biphenyls (PCBs)
status: valid
status modified: 2026-05-08
accepted date: 2026-05-08
in scheme: Code list for substances to be reported under the IEPR Regulation following its Annex II
IEP rpollutant CAS: 1336-36-3
air threshold IEPR: "0,1"
water threshold IEPR: "0,1"
land threshold IEPR: "0,1"

PCDD+PCDF (dioxins+furans) (as Teq)
type: Concept
notation: PCDD+PCDF(DIOXINS+FURANS)
definition: PCDD+PCDF (dioxins+furans) (as Teq)
status: valid
status modified: 2026-05-08
accepted date: 2026-05-08
in scheme: Code list for substances to be reported under the IEPR Regulation following its Annex II
air threshold IEPR: "0,0001"
water threshold IEPR: "0,0001"
land threshold IEPR: "0,0001"
pollutant comments IEPR: Expressed as I-TEQ

Pentachlorophenol (PCP)
type: Concept
notation: PCP
definition: Pentachlorophenol (PCP)
status: valid
status modified: 2026-05-08
accepted date: 2026-05-08
in scheme: Code list for substances to be reported under the IEPR Regulation following its Annex II
IEP rpollutant CAS: 87-86-5
air threshold IEPR: 10
water threshold IEPR: 1
land threshold IEPR: 1

Pentachlorobenzene
type: Concept
notation: PENTACHLOROBENZENE
definition: Pentachlorobenzene
status: valid
status modified: 2026-05-08
accepted date: 2026-05-08
in scheme: Code list for substances to be reported under the IEPR Regulation following its Annex II
IEP rpollutant CAS: 608-93-5
air threshold IEPR: 1
water threshold IEPR: 1
land threshold IEPR: 1

Tetrachloroethylene (PER)
type: Concept
notation: PER
definition: Tetrachloroethylene (PER)
status: valid
status modified: 2026-05-08
accepted date: 2026-05-08
in scheme: Code list for substances to be reported under the IEPR Regulation following its Annex II
IEP rpollutant CAS: 127-18-4
air threshold IEPR: 2000
water threshold IEPR: 10
land threshold IEPR: —

Perfluorocarbons (PFCs)
type: Concept
notation: PFCS
definition: Perfluorocarbons (PFCs)
status: valid
status modified: 2026-05-08
accepted date: 2026-05-08
in scheme: Code list for substances to be reported under the IEPR Regulation following its Annex II
air threshold IEPR: 100
water threshold IEPR: —
land threshold IEPR: —
pollutant comments IEPR: "Total mass of perfluorocarbons: sum of CF4, C2F6, C3F8, C4F10, c-C4F8, C5F12, C6F14."

Perfluorohexane-1-sulfonic acid (PFHxS) and its salts
type: Concept
notation: PFHxSANDSALTS
definition: Perfluorohexane-1-sulfonic acid (PFHxS) and its salts
status: valid
status modified: 2026-05-08
accepted date: 2026-05-08
in scheme: Code list for substances to be reported under the IEPR Regulation following its Annex II
IEP rpollutant CAS: 355-46-4
air threshold IEPR: 1
water threshold IEPR: 1
land threshold IEPR: 1

Perfluorooctanoic acid (PFOA) and its salts
type: Concept
notation: PFOAANDSALTS
definition: Perfluorooctanoic acid (PFOA) and its salts
status: valid
status modified: 2026-05-08
accepted date: 2026-05-08
in scheme: Code list for substances to be reported under the IEPR Regulation following its Annex II
IEP rpollutant CAS: 335-67-1
air threshold IEPR: 1
water threshold IEPR: 1
land threshold IEPR: 1

Phenols (as total C)
type: Concept
notation: PHENOLS
definition: Phenols (as total C)
status: valid
status modified: 2026-05-08
accepted date: 2026-05-08
in scheme: Code list for substances to be reported under the IEPR Regulation following its Annex II
IEP rpollutant CAS: 108-95-2
air threshold IEPR: —
water threshold IEPR: 20
land threshold IEPR: 20
pollutant comments IEPR: Total mass of phenol and simple substituted phenols expressed as total carbon.

Particulate matter (PM10)
type: Concept
notation: PM10
definition: Particulate matter (PM10)
status: valid
status modified: 2026-05-08
accepted date: 2026-05-08
in scheme: Code list for substances to be reported under the IEPR Regulation following its Annex II
air threshold IEPR: 50000
water threshold IEPR: —
land threshold IEPR: —

Sulphur hexafluoride (SF6)
type: Concept
notation: SF6
definition: Sulphur hexafluoride (SF6)
status: valid
status modified: 2026-05-08
accepted date: 2026-05-08
in scheme: Code list for substances to be reported under the IEPR Regulation following its Annex II
IEP rpollutant CAS: 2551-62-4
air threshold IEPR: 50
water threshold IEPR: —
land threshold IEPR: —

Simazine
type: Concept
notation: SIMAZINE
definition: Simazine
status: valid
status modified: 2026-05-08
accepted date: 2026-05-08
in scheme: Code list for substances to be reported under the IEPR Regulation following its Annex II
IEP rpollutant CAS: 122-34-9
air threshold IEPR: —
water threshold IEPR: 1
land threshold IEPR: 1

Sulphur oxides (SOx/SO2)
type: Concept
notation: SOX
definition: Sulphur oxides (SOx/SO2)
status: valid
status modified: 2026-05-08
accepted date: 2026-05-08
in scheme: Code list for substances to be reported under the IEPR Regulation following its Annex II
air threshold IEPR: 150000
water threshold IEPR: —
land threshold IEPR: —

Trichlorobenzenes (TCBs) (all isomers)
type: Concept
notation: TCBS
definition: Trichlorobenzenes (TCBs) (all isomers)
status: valid
status modified: 2026-05-08
accepted date: 2026-05-08
in scheme: Code list for substances to be reported under the IEPR Regulation following its Annex II
IEP rpollutant CAS: 12002-48-1
air threshold IEPR: 10
water threshold IEPR: 1
land threshold IEPR: —

Tetrachloromethane (TCM)
type: Concept
notation: TCM
definition: Tetrachloromethane (TCM)
status: valid
status modified: 2026-05-08
accepted date: 2026-05-08
in scheme: Code list for substances to be reported under the IEPR Regulation following its Annex II
IEP rpollutant CAS: 56-23-5
air threshold IEPR: 100
water threshold IEPR: 1
land threshold IEPR: —

Total organic carbon (TOC) (as total C or COD/3)
type: Concept
notation: TOC
definition: Total organic carbon (TOC) (as total C or COD/3)
status: valid
status modified: 2026-05-08
accepted date: 2026-05-08
in scheme: Code list for substances to be reported under the IEPR Regulation following its Annex II
air threshold IEPR: —
water threshold IEPR: 50000
land threshold IEPR: —

Toluene
type: Concept
notation: TOLUENE
definition: Toluene
status: valid
status modified: 2026-05-08
accepted date: 2026-05-08
in scheme: Code list for substances to be reported under the IEPR Regulation following its Annex II
IEP rpollutant CAS: 108-88-3
air threshold IEPR: —
water threshold IEPR: 200
land threshold IEPR: 200
pollutant comments IEPR: Single pollutants are to be reported if the threshold for BTEX (the sum parameter of benzene, toluene, ethyl benzene, xylenes) is exceeded (water or land)

Total nitrogen
type: Concept
notation: TOTALNITROGEN
definition: Total nitrogen
status: valid
status modified: 2026-05-08
accepted date: 2026-05-08
in scheme: Code list for substances to be reported under the IEPR Regulation following its Annex II
air threshold IEPR: —
water threshold IEPR: 50000
land threshold IEPR: 50000

Total phosphorus
type: Concept
notation: TOTALPHOSPHORUS
definition: Total phosphorus
status: valid
status modified: 2026-05-08
accepted date: 2026-05-08
in scheme: Code list for substances to be reported under the IEPR Regulation following its Annex II
air threshold IEPR: —
water threshold IEPR: 5000
land threshold IEPR: 5000

Toxaphene
type: Concept
notation: TOXAPHENE
definition: Toxaphene
status: valid
status modified: 2026-05-08
accepted date: 2026-05-08
in scheme: Code list for substances to be reported under the IEPR Regulation following its Annex II
IEP rpollutant CAS: 8001-35-2
air threshold IEPR: 1
water threshold IEPR: 1
land threshold IEPR: 1

Tributyltin and compounds
type: Concept
notation: TRIBUTYLTINANDCOMPOUNDS
definition: Tributyltin and compounds
status: valid
status modified: 2026-05-08
accepted date: 2026-05-08
in scheme: Code list for substances to be reported under the IEPR Regulation following its Annex II
air threshold IEPR: —
water threshold IEPR: 1
land threshold IEPR: 1
pollutant comments IEPR: Total mass of tributyltin compounds, expressed as mass of tributyltin.

Trichloroethylene
type: Concept
notation: TRICHLOROETHYLENE
definition: Trichloroethylene
status: valid
status modified: 2026-05-08
accepted date: 2026-05-08
in scheme: Code list for substances to be reported under the IEPR Regulation following its Annex II
IEP rpollutant CAS: 79-01-6
air threshold IEPR: 2000
water threshold IEPR: 10
land threshold IEPR: —

Trichloromethane
type: Concept
notation: TRICHLOROMETHANE
definition: Trichloromethane
status: valid
status modified: 2026-05-08
accepted date: 2026-05-08
in scheme: Code list for substances to be reported under the IEPR Regulation following its Annex II
IEP rpollutant CAS: 67-66-3
air threshold IEPR: 500
water threshold IEPR: 10
land threshold IEPR: —

Trifluralin
type: Concept
notation: TRIFLURALIN
definition: Trifluralin
status: valid
status modified: 2026-05-08
accepted date: 2026-05-08
in scheme: Code list for substances to be reported under the IEPR Regulation following its Annex II
IEP rpollutant CAS: 1582-09-8
air threshold IEPR: —
water threshold IEPR: 1
land threshold IEPR: 1

Triphenyltin and compounds
type: Concept
notation: TRIPHENYLTINANDCOMPOUNDS
definition: Triphenyltin and compounds
status: valid
status modified: 2026-05-08
accepted date: 2026-05-08
in scheme: Code list for substances to be reported under the IEPR Regulation following its Annex II
air threshold IEPR: —
water threshold IEPR: 1
land threshold IEPR: 1
pollutant comments IEPR: Total mass of triphenyltin compounds, expressed as mass of triphenyltin.

Vinyl chloride
type: Concept
notation: VINYLCHLORIDE
definition: Vinyl chloride
status: valid
status modified: 2026-05-08
accepted date: 2026-05-08
in scheme: Code list for substances to be reported under the IEPR Regulation following its Annex II
IEP rpollutant CAS: 75-01-4
air threshold IEPR: 1000
water threshold IEPR: 10
land threshold IEPR: 10

Xylenes
type: Concept
notation: XYLENES
definition: Xylenes
status: valid
status modified: 2026-05-08
accepted date: 2026-05-08
in scheme: Code list for substances to be reported under the IEPR Regulation following its Annex II
IEP rpollutant CAS: 1330-20-7
air threshold IEPR: —
water threshold IEPR: 200
land threshold IEPR: 200
pollutant comments IEPR: Single pollutants are to be reported if the threshold for BTEX (the sum parameter of benzene, toluene, ethyl benzene, xylenes) is exceeded (water or land). Total mass of xylene (ortho-xylene, meta-xylene, para-xylene).

Zinc and compounds (as Zn)
type: Concept
notation: ZNANDCOMPOUNDS
definition: Zinc and compounds (as Zn)
status: valid
status modified: 2026-05-08
accepted date: 2026-05-08
in scheme: Code list for substances to be reported under the IEPR Regulation following its Annex II
air threshold IEPR: 200
water threshold IEPR: 100
land threshold IEPR: 100
pollutant comments IEPR: All metals shall be reported as the total mass of the element in all chemical forms present in the release.

1,2-dichloroethane (EDC)
type: Concept
notation: DCE1,2
definition: 1,2-dichloroethane (EDC)
status: valid
status modified: 2026-05-08
accepted date: 2026-05-08
in scheme: Code list for substances to be reported under the IEPR Regulation following its Annex II
IEP rpollutant CAS: 107-06-2
air threshold IEPR: 1000
water threshold IEPR: 10
land threshold IEPR: 10

1,1,1-trichloroethane
type: Concept
notation: TCE-1,1,1
definition: 1,1,1-trichloroethane
status: valid
status modified: 2026-05-08
accepted date: 2026-05-08
in scheme: Code list for substances to be reported under the IEPR Regulation following its Annex II
IEP rpollutant CAS: 71-55-6
air threshold IEPR: 100
water threshold IEPR: —
land threshold IEPR: —

1,1,2,2-tetrachloroethane
type: Concept
notation: TETRACHLOROETHANE-1,1,2,2
definition: 1,1,2,2-tetrachloroethane
status: valid
status modified: 2026-05-08
accepted date: 2026-05-08
in scheme: Code list for substances to be reported under the IEPR Regulation following its Annex II
IEP rpollutant CAS: 79-34-5
air threshold IEPR: 50
water threshold IEPR: —
land threshold IEPR: —

Installation type value
type: ConceptScheme
notation: InstallationTypeValue
is part of: Industrial Emission Portal Regulation and Industrial Emission Directive
registration status: Public draft
user modified: antogfed
date modified: 2026-05-07 19:27:03.0
vocabulary type: Common
is numeric concept identifiers: false
is notations equal identifiers: false

IEPRIED
type: Concept
notation: IEPRIED
definition: Production installation performing as main activity an activity listed in Annex I of the IEPR and covered by the IED.
status: valid
status modified: 2026-05-06
accepted date: 2026-05-06
in scheme: Installation type value

IEPRTNONIED
type: Concept
notation: IEPRNONIED
definition: Production installation performing activity listed in Annex I of the IEPR but not covered by the IED.
status: valid
status modified: 2026-05-06
accepted date: 2026-05-06
in scheme: Installation type value

Substances to be reported to Combustion Plant inventory according to Art 72 of the Industrial Emissions Directive
type: ConceptScheme
notation: LCPPollutantCodeValue
is part of: Industrial Emission Portal Regulation and Industrial Emission Directive
registration status: Public draft
user modified: antogfed
date modified: 2026-05-07 19:27:30.0
vocabulary type: Common
is numeric concept identifiers: false
is notations equal identifiers: false

DUST
type: Concept
notation: Dust
definition: Dust (as total suspended particles)
status: valid
status modified: 2026-05-06
accepted date: 2026-05-06
in scheme: Substances to be reported to Combustion Plant inventory according to Art 72 of the Industrial Emissions Directive

NOX
type: Concept
notation: NOx
definition: Nitrogen Oxides
status: valid
status modified: 2026-05-06
accepted date: 2026-05-06
in scheme: Substances to be reported to Combustion Plant inventory according to Art 72 of the Industrial Emissions Directive

SO2
type: Concept
notation: SO2
definition: Sulphur Dioxide
status: valid
status modified: 2026-05-06
accepted date: 2026-05-06
in scheme: Substances to be reported to Combustion Plant inventory according to Art 72 of the Industrial Emissions Directive

Medium which receives a pollutant release or off-site transfer
type: ConceptScheme
notation: MediumCodeValue
is part of: Industrial Emission Portal Regulation and Industrial Emission Directive
registration status: Public draft
user modified: antogfed
date modified: 2026-05-07 19:36:10.0
vocabulary type: Common
is numeric concept identifiers: false
is notations equal identifiers: false

AIR
type: Concept
notation: AIR
definition: Releases to air of any pollutant specified in Annex II of the E-PRTR for which the applicable threshold value specified in Annex II is exceeded.
status: valid
status modified: 2026-05-06
accepted date: 2026-05-06
in scheme: Medium which receives a pollutant release or off-site transfer

LAND
type: Concept
notation: LAND
definition: Releases to land of any pollutant specified in Annex II of the E-PRTR for which the applicable threshold value specified in Annex II is exceeded.
status: valid
status modified: 2026-05-06
accepted date: 2026-05-06
in scheme: Medium which receives a pollutant release or off-site transfer

WATER
type: Concept
notation: WATER
definition: Releases to water of any pollutant specified in Annex II of the E-PRTR for which the applicable threshold value specified in Annex II is exceeded.
status: valid
status modified: 2026-05-06
accepted date: 2026-05-06
in scheme: Medium which receives a pollutant release or off-site transfer

Classification of the method used to derive the release or off-site transfer value
type: ConceptScheme
notation: MethodClassificationValue
is part of: Industrial Emission Portal Regulation and Industrial Emission Directive
registration status: Public draft
user modified: antogfed
date modified: 2026-05-07 19:32:51.0
vocabulary type: Common
is numeric concept identifiers: false
is notations equal identifiers: false

ALT
type: Concept
notation: ALT
definition: Alternative measurement methodology in accordance with existing CEN/ISO measurement standards
status: valid
status modified: 2026-05-06
accepted date: 2026-05-06
in scheme: Classification of the method used to derive the release or off-site transfer value

CEN/ISO
type: Concept
notation: CEN/ISO
definition: Internationally approved measurement standard
status: valid
status modified: 2026-05-06
accepted date: 2026-05-06
in scheme: Classification of the method used to derive the release or off-site transfer value

CRM
type: Concept
notation: CRM
definition: Measurement methodology for the performance of which is demonstrated by means of certified reference materials and accepted by competent authority.
status: valid
status modified: 2026-05-06
accepted date: 2026-05-06
in scheme: Classification of the method used to derive the release or off-site transfer value

ETS
type: Concept
notation: ETS
definition: Guidelines for the monitoring and reporting of greenhouse gas emissions under the Emission Trading Scheme.
status: valid
status modified: 2026-05-06
accepted date: 2026-05-06
in scheme: Classification of the method used to derive the release or off-site transfer value

IPCC
type: Concept
notation: IPCC
definition: IPCC Guidelines
status: valid
status modified: 2026-05-06
accepted date: 2026-05-06
in scheme: Classification of the method used to derive the release or off-site transfer value

MAB
type: Concept
notation: MAB
definition: Mass balance method which is accepted by the competent authority
status: valid
status modified: 2026-05-06
accepted date: 2026-05-06
in scheme: Classification of the method used to derive the release or off-site transfer value

NRB
type: Concept
notation: NRB
definition: National or regional binding measurement/calculation methodology prescribed by legal act for the pollutant and facility concerned.
status: valid
status modified: 2026-05-06
accepted date: 2026-05-06
in scheme: Classification of the method used to derive the release or off-site transfer value

OTH
type: Concept
notation: OTH
definition: Other measurement/calculation methodology
status: valid
status modified: 2026-05-06
accepted date: 2026-05-06
in scheme: Classification of the method used to derive the release or off-site transfer value

PER
type: Concept
notation: PER
definition: Measurement/Calculation Methodology already prescribed by the competent authority in a licence or an operating permit for that facility
status: valid
status modified: 2026-05-06
accepted date: 2026-05-06
in scheme: Classification of the method used to derive the release or off-site transfer value

SSC
type: Concept
notation: SSC
definition: European-wide sector specific calculation method
status: valid
status modified: 2026-05-06
accepted date: 2026-05-06
in scheme: Classification of the method used to derive the release or off-site transfer value

UNECE/EMEP
type: Concept
notation: UNECE/EMEP
definition: UNECE/EMEP EMEP/CORINAIR Emission Inventory Guidebook
status: valid
status modified: 2026-05-06
accepted date: 2026-05-06
in scheme: Classification of the method used to derive the release or off-site transfer value

WEIGH
type: Concept
notation: WEIGH
definition: Weighing
status: valid
status modified: 2026-05-06
accepted date: 2026-05-06
in scheme: Classification of the method used to derive the release or off-site transfer value

Further classification of the methods use to measure or calculate releases and off-site transfers
type: ConceptScheme
notation: MethodCodeValue
is part of: Industrial Emission Portal Regulation and Industrial Emission Directive
registration status: Public draft
user modified: antogfed
date modified: 2026-05-07 19:33:03.0
vocabulary type: Common
is numeric concept identifiers: false
is notations equal identifiers: false

Calculated
type: Concept
notation: C
definition: Calculated: calculation method used
status: valid
status modified: 2026-05-06
accepted date: 2026-05-06
in scheme: Further classification of the methods use to measure or calculate releases and off-site transfers

Estimated
type: Concept
notation: E
definition: Estimated
status: valid
status modified: 2026-05-06
accepted date: 2026-05-06
in scheme: Further classification of the methods use to measure or calculate releases and off-site transfers

Measured
type: Concept
notation: M
definition: Measured: analytical method used
status: valid
status modified: 2026-05-06
accepted date: 2026-05-06
in scheme: Further classification of the methods use to measure or calculate releases and off-site transfers

Months according to the Gregorian calendar
type: ConceptScheme
notation: MonthValue
is part of: Industrial Emission Portal Regulation and Industrial Emission Directive
registration status: Public draft
user modified: antogfed
date modified: 2026-05-07 19:33:16.0
vocabulary type: Common
is numeric concept identifiers: false
is notations equal identifiers: false

APR
type: Concept
notation: APR
definition: April
status: valid
status modified: 2026-05-06
accepted date: 2026-05-06
in scheme: Months according to the Gregorian calendar

AUG
type: Concept
notation: AUG
definition: August
status: valid
status modified: 2026-05-06
accepted date: 2026-05-06
in scheme: Months according to the Gregorian calendar

DEC
type: Concept
notation: DEC
definition: December
status: valid
status modified: 2026-05-06
accepted date: 2026-05-06
in scheme: Months according to the Gregorian calendar

FEB
type: Concept
notation: FEB
definition: February
status: valid
status modified: 2026-05-06
accepted date: 2026-05-06
in scheme: Months according to the Gregorian calendar

JAN
type: Concept
notation: JAN
definition: January
status: valid
status modified: 2026-05-06
accepted date: 2026-05-06
in scheme: Months according to the Gregorian calendar

JUL
type: Concept
notation: JUL
definition: July
status: valid
status modified: 2026-05-06
accepted date: 2026-05-06
in scheme: Months according to the Gregorian calendar

JUN
type: Concept
notation: JUN
definition: June
status: valid
status modified: 2026-05-06
accepted date: 2026-05-06
in scheme: Months according to the Gregorian calendar

MAR
type: Concept
notation: MAR
definition: March
status: valid
status modified: 2026-05-06
accepted date: 2026-05-06
in scheme: Months according to the Gregorian calendar

MAY
type: Concept
notation: MAY
definition: May
status: valid
status modified: 2026-05-06
accepted date: 2026-05-06
in scheme: Months according to the Gregorian calendar

NOV
type: Concept
notation: NOV
definition: November
status: valid
status modified: 2026-05-06
accepted date: 2026-05-06
in scheme: Months according to the Gregorian calendar

OCT
type: Concept
notation: OCT
definition: October
status: valid
status modified: 2026-05-06
accepted date: 2026-05-06
in scheme: Months according to the Gregorian calendar

SEP
type: Concept
notation: SEP
definition: September
status: valid
status modified: 2026-05-06
accepted date: 2026-05-06
in scheme: Months according to the Gregorian calendar

NACEValue
type: ConceptScheme
label: (List hosts the classification for the activities according to the Council Regulation 3037 and the NACE Rev 2.1 established by Commission Delegated Regulation (EU) 2023/137 and published by EUROSTAT on 10 February 2023./90/EEC)
notation: NACEValue
is part of: Industrial Emission Portal Regulation and Industrial Emission Directive
registration status: Public draft
user modified: antogfed
date modified: 2026-05-07 19:34:24.0
vocabulary type: Common
is numeric concept identifiers: false
is notations equal identifiers: false

"Growing of cereals, other than rice, leguminous crops and oil seeds"
type: Concept
notation: A.01.11
definition: "Growing of cereals, other than rice, leguminous crops and oil seeds"
status: valid
status modified: 2026-05-06
accepted date: 2026-05-06
in scheme: NACEValue

Growing of rice
type: Concept
notation: A.01.12
definition: Growing of rice
status: valid
status modified: 2026-05-06
accepted date: 2026-05-06
in scheme: NACEValue

"Growing of vegetables and melons, roots and tubers"
type: Concept
notation: A.01.13
definition: "Growing of vegetables and melons, roots and tubers"
status: valid
status modified: 2026-05-06
accepted date: 2026-05-06
in scheme: NACEValue

Growing of sugar cane
type: Concept
notation: A.01.14
definition: Growing of sugar cane
status: valid
status modified: 2026-05-06
accepted date: 2026-05-06
in scheme: NACEValue

Growing of tobacco
type: Concept
notation: A.01.15
definition: Growing of tobacco
status: valid
status modified: 2026-05-06
accepted date: 2026-05-06
in scheme: NACEValue

Growing of fibre crops
type: Concept
notation: A.01.16
definition: Growing of fibre crops
status: valid
status modified: 2026-05-06
accepted date: 2026-05-06
in scheme: NACEValue

Growing of other non-perennial crops
type: Concept
notation: A.01.19
definition: Growing of other non-perennial crops
status: valid
status modified: 2026-05-06
accepted date: 2026-05-06
in scheme: NACEValue

Growing of grapes
type: Concept
notation: A.01.21
definition: Growing of grapes
status: valid
status modified: 2026-05-06
accepted date: 2026-05-06
in scheme: NACEValue

Growing of tropical and subtropical fruits
type: Concept
notation: A.01.22
definition: Growing of tropical and subtropical fruits
status: valid
status modified: 2026-05-06
accepted date: 2026-05-06
in scheme: NACEValue

Growing of citrus fruits
type: Concept
notation: A.01.23
definition: Growing of citrus fruits
status: valid
status modified: 2026-05-06
accepted date: 2026-05-06
in scheme: NACEValue

Growing of pome fruits and stone fruits
type: Concept
notation: A.01.24
definition: Growing of pome fruits and stone fruits
status: valid
status modified: 2026-05-06
accepted date: 2026-05-06
in scheme: NACEValue

Growing of other tree and bush fruits and nuts
type: Concept
notation: A.01.25
definition: Growing of other tree and bush fruits and nuts
status: valid
status modified: 2026-05-06
accepted date: 2026-05-06
in scheme: NACEValue

Growing of oleaginous fruits
type: Concept
notation: A.01.26
definition: Growing of oleaginous fruits
status: valid
status modified: 2026-05-06
accepted date: 2026-05-06
in scheme: NACEValue

Growing of beverage crops
type: Concept
notation: A.01.27
definition: Growing of beverage crops
status: valid
status modified: 2026-05-06
accepted date: 2026-05-06
in scheme: NACEValue

"Growing of spices, aromatic, drug and pharmaceutical crops"
type: Concept
notation: A.01.28
definition: "Growing of spices, aromatic, drug and pharmaceutical crops"
status: valid
status modified: 2026-05-06
accepted date: 2026-05-06
in scheme: NACEValue

Growing of other perennial crops
type: Concept
notation: A.01.29
definition: Growing of other perennial crops
status: valid
status modified: 2026-05-06
accepted date: 2026-05-06
in scheme: NACEValue

Plant propagation
type: Concept
notation: A.01.30
definition: Plant propagation
status: valid
status modified: 2026-05-06
accepted date: 2026-05-06
in scheme: NACEValue

Raising of dairy cattle
type: Concept
notation: A.01.41
definition: Raising of dairy cattle
status: valid
status modified: 2026-05-06
accepted date: 2026-05-06
in scheme: NACEValue

Raising of other cattle and buffaloes
type: Concept
notation: A.01.42
definition: Raising of other cattle and buffaloes
status: valid
status modified: 2026-05-06
accepted date: 2026-05-06
in scheme: NACEValue

Raising of horses and other equines
type: Concept
notation: A.01.43
definition: Raising of horses and other equines
status: valid
status modified: 2026-05-06
accepted date: 2026-05-06
in scheme: NACEValue

Raising of camels and camelids
type: Concept
notation: A.01.44
definition: Raising of camels and camelids
status: valid
status modified: 2026-05-06
accepted date: 2026-05-06
in scheme: NACEValue

Raising of sheep and goats
type: Concept
notation: A.01.45
definition: Raising of sheep and goats
status: valid
status modified: 2026-05-06
accepted date: 2026-05-06
in scheme: NACEValue

Raising of swine and pigs
type: Concept
notation: A.01.46
definition: Raising of swine and pigs
status: valid
status modified: 2026-05-06
accepted date: 2026-05-06
in scheme: NACEValue

Raising of poultry
type: Concept
notation: A.01.47
definition: Raising of poultry
status: valid
status modified: 2026-05-06
accepted date: 2026-05-06
in scheme: NACEValue

Raising of other animals
type: Concept
notation: A.01.48
definition: Raising of other animals
status: valid
status modified: 2026-05-06
accepted date: 2026-05-06
in scheme: NACEValue

Mixed farming
type: Concept
notation: A.01.50
definition: Mixed farming
status: valid
status modified: 2026-05-06
accepted date: 2026-05-06
in scheme: NACEValue

Support activities for crop production
type: Concept
notation: A.01.61
definition: Support activities for crop production
status: valid
status modified: 2026-05-06
accepted date: 2026-05-06
in scheme: NACEValue

Support activities for animal production
type: Concept
notation: A.01.62
definition: Support activities for animal production
status: valid
status modified: 2026-05-06
accepted date: 2026-05-06
in scheme: NACEValue

Post-harvest crop activities and seed processing for propagation
type: Concept
notation: A.01.63
definition: Post-harvest crop activities and seed processing for propagation
status: valid
status modified: 2026-05-06
accepted date: 2026-05-06
in scheme: NACEValue

"Hunting, trapping and related service activities"
type: Concept
notation: A.01.70
definition: "Hunting, trapping and related service activities"
status: valid
status modified: 2026-05-06
accepted date: 2026-05-06
in scheme: NACEValue

Silviculture and other forestry activities
type: Concept
notation: A.02.10
definition: Silviculture and other forestry activities
status: valid
status modified: 2026-05-06
accepted date: 2026-05-06
in scheme: NACEValue

Logging
type: Concept
notation: A.02.20
definition: Logging
status: valid
status modified: 2026-05-06
accepted date: 2026-05-06
in scheme: NACEValue

Gathering of wild growing non-wood products
type: Concept
notation: A.02.30
definition: Gathering of wild growing non-wood products
status: valid
status modified: 2026-05-06
accepted date: 2026-05-06
in scheme: NACEValue

Support services to forestry
type: Concept
notation: A.02.40
definition: Support services to forestry
status: valid
status modified: 2026-05-06
accepted date: 2026-05-06
in scheme: NACEValue

Marine fishing
type: Concept
notation: A.03.11
definition: Marine fishing
status: valid
status modified: 2026-05-06
accepted date: 2026-05-06
in scheme: NACEValue

Freshwater fishing
type: Concept
notation: A.03.12
definition: Freshwater fishing
status: valid
status modified: 2026-05-06
accepted date: 2026-05-06
in scheme: NACEValue

Marine aquaculture
type: Concept
notation: A.03.21
definition: Marine aquaculture
status: valid
status modified: 2026-05-06
accepted date: 2026-05-06
in scheme: NACEValue

Freshwater aquaculture
type: Concept
notation: A.03.22
definition: Freshwater aquaculture
status: valid
status modified: 2026-05-06
accepted date: 2026-05-06
in scheme: NACEValue

Support activities for fishing and aquaculture
type: Concept
notation: A.03.30
definition: Support activities for fishing and aquaculture
status: valid
status modified: 2026-05-06
accepted date: 2026-05-06
in scheme: NACEValue

Mining of hard coal
type: Concept
notation: B.05.10
definition: Mining of hard coal
status: valid
status modified: 2026-05-06
accepted date: 2026-05-06
in scheme: NACEValue

Mining of lignite
type: Concept
notation: B.05.20
definition: Mining of lignite
status: valid
status modified: 2026-05-06
accepted date: 2026-05-06
in scheme: NACEValue

Extraction of crude petroleum
type: Concept
notation: B.06.10
definition: Extraction of crude petroleum
status: valid
status modified: 2026-05-06
accepted date: 2026-05-06
in scheme: NACEValue

Extraction of natural gas
type: Concept
notation: B.06.20
definition: Extraction of natural gas
status: valid
status modified: 2026-05-06
accepted date: 2026-05-06
in scheme: NACEValue

Mining of iron ores
type: Concept
notation: B.07.10
definition: Mining of iron ores
status: valid
status modified: 2026-05-06
accepted date: 2026-05-06
in scheme: NACEValue

Mining of uranium and thorium ores
type: Concept
notation: B.07.21
definition: Mining of uranium and thorium ores
status: valid
status modified: 2026-05-06
accepted date: 2026-05-06
in scheme: NACEValue

Mining of other non-ferrous metal ores
type: Concept
notation: B.07.29
definition: Mining of other non-ferrous metal ores
status: valid
status modified: 2026-05-06
accepted date: 2026-05-06
in scheme: NACEValue

"Quarrying of ornamental stone, limestone, gypsum, slate and other stone"
type: Concept
notation: B.08.11
definition: "Quarrying of ornamental stone, limestone, gypsum, slate and other stone"
status: valid
status modified: 2026-05-06
accepted date: 2026-05-06
in scheme: NACEValue

Operation of gravel and sand pits and mining of clay and kaolin
type: Concept
notation: B.08.12
definition: Operation of gravel and sand pits and mining of clay and kaolin
status: valid
status modified: 2026-05-06
accepted date: 2026-05-06
in scheme: NACEValue

Mining of chemical and fertiliser minerals
type: Concept
notation: B.08.91
definition: Mining of chemical and fertiliser minerals
status: valid
status modified: 2026-05-06
accepted date: 2026-05-06
in scheme: NACEValue

Extraction of peat
type: Concept
notation: B.08.92
definition: Extraction of peat
status: valid
status modified: 2026-05-06
accepted date: 2026-05-06
in scheme: NACEValue

Extraction of salt
type: Concept
notation: B.08.93
definition: Extraction of salt
status: valid
status modified: 2026-05-06
accepted date: 2026-05-06
in scheme: NACEValue

Other mining and quarrying n.e.c.
type: Concept
notation: B.08.99
definition: Other mining and quarrying n.e.c.
status: valid
status modified: 2026-05-06
accepted date: 2026-05-06
in scheme: NACEValue

Support activities for petroleum and natural gas extraction
type: Concept
notation: B.09.10
definition: Support activities for petroleum and natural gas extraction
status: valid
status modified: 2026-05-06
accepted date: 2026-05-06
in scheme: NACEValue

Support activities for other mining and quarrying
type: Concept
notation: B.09.90
definition: Support activities for other mining and quarrying
status: valid
status modified: 2026-05-06
accepted date: 2026-05-06
in scheme: NACEValue

"Processing and preserving of meat, except of poultry meat"
type: Concept
notation: C.10.11
definition: "Processing and preserving of meat, except of poultry meat"
status: valid
status modified: 2026-05-06
accepted date: 2026-05-06
in scheme: NACEValue

Processing and preserving of poultry meat
type: Concept
notation: C.10.12
definition: Processing and preserving of poultry meat
status: valid
status modified: 2026-05-06
accepted date: 2026-05-06
in scheme: NACEValue

Production of meat and poultry meat products
type: Concept
notation: C.10.13
definition: Production of meat and poultry meat products
status: valid
status modified: 2026-05-06
accepted date: 2026-05-06
in scheme: NACEValue

"Processing and preserving of fish, crustaceans and molluscs"
type: Concept
notation: C.10.20
definition: "Processing and preserving of fish, crustaceans and molluscs"
status: valid
status modified: 2026-05-06
accepted date: 2026-05-06
in scheme: NACEValue

Processing and preserving of potatoes
type: Concept
notation: C.10.31
definition: Processing and preserving of potatoes
status: valid
status modified: 2026-05-06
accepted date: 2026-05-06
in scheme: NACEValue

Manufacture of fruit and vegetable juice
type: Concept
notation: C.10.32
definition: Manufacture of fruit and vegetable juice
status: valid
status modified: 2026-05-06
accepted date: 2026-05-06
in scheme: NACEValue

Other processing and preserving of fruit and vegetables
type: Concept
notation: C.10.39
definition: Other processing and preserving of fruit and vegetables
status: valid
status modified: 2026-05-06
accepted date: 2026-05-06
in scheme: NACEValue

Manufacture of oils and fats
type: Concept
notation: C.10.41
definition: Manufacture of oils and fats
status: valid
status modified: 2026-05-06
accepted date: 2026-05-06
in scheme: NACEValue

Manufacture of margarine and similar edible fats
type: Concept
notation: C.10.42
definition: Manufacture of margarine and similar edible fats
status: valid
status modified: 2026-05-06
accepted date: 2026-05-06
in scheme: NACEValue

Manufacture of dairy products
type: Concept
notation: C.10.51
definition: Manufacture of dairy products
status: valid
status modified: 2026-05-06
accepted date: 2026-05-06
in scheme: NACEValue

Manufacture of ice cream and other edible ice
type: Concept
notation: C.10.52
definition: Manufacture of ice cream and other edible ice
status: valid
status modified: 2026-05-06
accepted date: 2026-05-06
in scheme: NACEValue

Manufacture of grain mill products
type: Concept
notation: C.10.61
definition: Manufacture of grain mill products
status: valid
status modified: 2026-05-06
accepted date: 2026-05-06
in scheme: NACEValue

Manufacture of starches and starch products
type: Concept
notation: C.10.62
definition: Manufacture of starches and starch products
status: valid
status modified: 2026-05-06
accepted date: 2026-05-06
in scheme: NACEValue

Manufacture of bread; manufacture of fresh pastry goods and cakes
type: Concept
notation: C.10.71
definition: Manufacture of bread; manufacture of fresh pastry goods and cakes
status: valid
status modified: 2026-05-06
accepted date: 2026-05-06
in scheme: NACEValue

"Manufacture of rusks, biscuits, preserved pastries and cakes"
type: Concept
notation: C.10.72
definition: "Manufacture of rusks, biscuits, preserved pastries and cakes"
status: valid
status modified: 2026-05-06
accepted date: 2026-05-06
in scheme: NACEValue

Manufacture of farinaceous products
type: Concept
notation: C.10.73
definition: Manufacture of farinaceous products
status: valid
status modified: 2026-05-06
accepted date: 2026-05-06
in scheme: NACEValue

Manufacture of sugar
type: Concept
notation: C.10.81
definition: Manufacture of sugar
status: valid
status modified: 2026-05-06
accepted date: 2026-05-06
in scheme: NACEValue

"Manufacture of cocoa, chocolate and sugar confectionery"
type: Concept
notation: C.10.82
definition: "Manufacture of cocoa, chocolate and sugar confectionery"
status: valid
status modified: 2026-05-06
accepted date: 2026-05-06
in scheme: NACEValue

Processing of tea and coffee
type: Concept
notation: C.10.83
definition: Processing of tea and coffee
status: valid
status modified: 2026-05-06
accepted date: 2026-05-06
in scheme: NACEValue

Manufacture of condiments and seasonings
type: Concept
notation: C.10.84
definition: Manufacture of condiments and seasonings
status: valid
status modified: 2026-05-06
accepted date: 2026-05-06
in scheme: NACEValue

Manufacture of prepared meals and dishes
type: Concept
notation: C.10.85
definition: Manufacture of prepared meals and dishes
status: valid
status modified: 2026-05-06
accepted date: 2026-05-06
in scheme: NACEValue

Manufacture of homogenised food preparations and dietetic food
type: Concept
notation: C.10.86
definition: Manufacture of homogenised food preparations and dietetic food
status: valid
status modified: 2026-05-06
accepted date: 2026-05-06
in scheme: NACEValue

Manufacture of other food products n.e.c.
type: Concept
notation: C.10.89
definition: Manufacture of other food products n.e.c.
status: valid
status modified: 2026-05-06
accepted date: 2026-05-06
in scheme: NACEValue

Manufacture of prepared feeds for farm animals
type: Concept
notation: C.10.91
definition: Manufacture of prepared feeds for farm animals
status: valid
status modified: 2026-05-06
accepted date: 2026-05-06
in scheme: NACEValue

Manufacture of prepared pet foods
type: Concept
notation: C.10.92
definition: Manufacture of prepared pet foods
status: valid
status modified: 2026-05-06
accepted date: 2026-05-06
in scheme: NACEValue

"Distilling, rectifying and blending of spirits"
type: Concept
notation: C.11.01
definition: "Distilling, rectifying and blending of spirits"
status: valid
status modified: 2026-05-06
accepted date: 2026-05-06
in scheme: NACEValue

Manufacture of wine from grape
type: Concept
notation: C.11.02
definition: Manufacture of wine from grape
status: valid
status modified: 2026-05-06
accepted date: 2026-05-06
in scheme: NACEValue

Manufacture of cider and other fruit fermented beverages
type: Concept
notation: C.11.03
definition: Manufacture of cider and other fruit fermented beverages
status: valid
status modified: 2026-05-06
accepted date: 2026-05-06
in scheme: NACEValue

Manufacture of other non-distilled fermented beverages
type: Concept
notation: C.11.04
definition: Manufacture of other non-distilled fermented beverages
status: valid
status modified: 2026-05-06
accepted date: 2026-05-06
in scheme: NACEValue

Manufacture of beer
type: Concept
notation: C.11.05
definition: Manufacture of beer
status: valid
status modified: 2026-05-06
accepted date: 2026-05-06
in scheme: NACEValue

Manufacture of malt
type: Concept
notation: C.11.06
definition: Manufacture of malt
status: valid
status modified: 2026-05-06
accepted date: 2026-05-06
in scheme: NACEValue

Manufacture of soft drinks and bottled waters
type: Concept
notation: C.11.07
definition: Manufacture of soft drinks and bottled waters
status: valid
status modified: 2026-05-06
accepted date: 2026-05-06
in scheme: NACEValue

Manufacture of tobacco products
type: Concept
notation: C.12.00
definition: Manufacture of tobacco products
status: valid
status modified: 2026-05-06
accepted date: 2026-05-06
in scheme: NACEValue

Preparation and spinning of textile fibres
type: Concept
notation: C.13.10
definition: Preparation and spinning of textile fibres
status: valid
status modified: 2026-05-06
accepted date: 2026-05-06
in scheme: NACEValue

Weaving of textiles
type: Concept
notation: C.13.20
definition: Weaving of textiles
status: valid
status modified: 2026-05-06
accepted date: 2026-05-06
in scheme: NACEValue

Finishing of textiles
type: Concept
notation: C.13.30
definition: Finishing of textiles
status: valid
status modified: 2026-05-06
accepted date: 2026-05-06
in scheme: NACEValue

Manufacture of knitted and crocheted fabrics
type: Concept
notation: C.13.91
definition: Manufacture of knitted and crocheted fabrics
status: valid
status modified: 2026-05-06
accepted date: 2026-05-06
in scheme: NACEValue

Manufacture of household textiles and made-up furnishing articles
type: Concept
notation: C.13.92
definition: Manufacture of household textiles and made-up furnishing articles
status: valid
status modified: 2026-05-06
accepted date: 2026-05-06
in scheme: NACEValue

Manufacture of carpets and rugs
type: Concept
notation: C.13.93
definition: Manufacture of carpets and rugs
status: valid
status modified: 2026-05-06
accepted date: 2026-05-06
in scheme: NACEValue

"Manufacture of cordage, rope, twine and netting"
type: Concept
notation: C.13.94
definition: "Manufacture of cordage, rope, twine and netting"
status: valid
status modified: 2026-05-06
accepted date: 2026-05-06
in scheme: NACEValue

Manufacture of non-wovens and non-woven articles
type: Concept
notation: C.13.95
definition: Manufacture of non-wovens and non-woven articles
status: valid
status modified: 2026-05-06
accepted date: 2026-05-06
in scheme: NACEValue

Manufacture of other technical and industrial textiles
type: Concept
notation: C.13.96
definition: Manufacture of other technical and industrial textiles
status: valid
status modified: 2026-05-06
accepted date: 2026-05-06
in scheme: NACEValue

Manufacture of other textiles n.e.c.
type: Concept
notation: C.13.99
definition: Manufacture of other textiles n.e.c.
status: valid
status modified: 2026-05-06
accepted date: 2026-05-06
in scheme: NACEValue

Manufacture of knitted and crocheted apparel
type: Concept
notation: C.14.10
definition: Manufacture of knitted and crocheted apparel
status: valid
status modified: 2026-05-06
accepted date: 2026-05-06
in scheme: NACEValue

Manufacture of outerwear
type: Concept
notation: C.14.21
definition: Manufacture of outerwear
status: valid
status modified: 2026-05-06
accepted date: 2026-05-06
in scheme: NACEValue

Manufacture of underwear
type: Concept
notation: C.14.22
definition: Manufacture of underwear
status: valid
status modified: 2026-05-06
accepted date: 2026-05-06
in scheme: NACEValue

Manufacture of workwear
type: Concept
notation: C.14.23
definition: Manufacture of workwear
status: valid
status modified: 2026-05-06
accepted date: 2026-05-06
in scheme: NACEValue

Manufacture of leather clothes and fur apparel
type: Concept
notation: C.14.24
definition: Manufacture of leather clothes and fur apparel
status: valid
status modified: 2026-05-06
accepted date: 2026-05-06
in scheme: NACEValue

Manufacture of other wearing apparel and accessories n.e.c.
type: Concept
notation: C.14.29
definition: Manufacture of other wearing apparel and accessories n.e.c.
status: valid
status modified: 2026-05-06
accepted date: 2026-05-06
in scheme: NACEValue

"Tanning, dressing, dyeing of leather and fur"
type: Concept
notation: C.15.11
definition: "Tanning, dressing, dyeing of leather and fur"
status: valid
status modified: 2026-05-06
accepted date: 2026-05-06
in scheme: NACEValue

"Manufacture of luggage, handbags, saddlery and harness of any material"
type: Concept
notation: C.15.12
definition: "Manufacture of luggage, handbags, saddlery and harness of any material"
status: valid
status modified: 2026-05-06
accepted date: 2026-05-06
in scheme: NACEValue

Manufacture of footwear
type: Concept
notation: C.15.20
definition: Manufacture of footwear
status: valid
status modified: 2026-05-06
accepted date: 2026-05-06
in scheme: NACEValue

Sawmilling and planing of wood
type: Concept
notation: C.16.11
definition: Sawmilling and planing of wood
status: valid
status modified: 2026-05-06
accepted date: 2026-05-06
in scheme: NACEValue

Processing and finishing of wood
type: Concept
notation: C.16.12
definition: Processing and finishing of wood
status: valid
status modified: 2026-05-06
accepted date: 2026-05-06
in scheme: NACEValue

Manufacture of veneer sheets and wood-based panels
type: Concept
notation: C.16.21
definition: Manufacture of veneer sheets and wood-based panels
status: valid
status modified: 2026-05-06
accepted date: 2026-05-06
in scheme: NACEValue

Manufacture of assembled parquet floors
type: Concept
notation: C.16.22
definition: Manufacture of assembled parquet floors
status: valid
status modified: 2026-05-06
accepted date: 2026-05-06
in scheme: NACEValue

Manufacture of other builders' carpentry and joinery
type: Concept
notation: C.16.23
definition: Manufacture of other builders' carpentry and joinery
status: valid
status modified: 2026-05-06
accepted date: 2026-05-06
in scheme: NACEValue

Manufacture of wooden containers
type: Concept
notation: C.16.24
definition: Manufacture of wooden containers
status: valid
status modified: 2026-05-06
accepted date: 2026-05-06
in scheme: NACEValue

Manufacture of doors and windows of wood
type: Concept
notation: C.16.25
definition: Manufacture of doors and windows of wood
status: valid
status modified: 2026-05-06
accepted date: 2026-05-06
in scheme: NACEValue

Manufacture of solid fuels from vegetable biomass
type: Concept
notation: C.16.26
definition: Manufacture of solid fuels from vegetable biomass
status: valid
status modified: 2026-05-06
accepted date: 2026-05-06
in scheme: NACEValue

Finishing of wooden products
type: Concept
notation: C.16.27
definition: Finishing of wooden products
status: valid
status modified: 2026-05-06
accepted date: 2026-05-06
in scheme: NACEValue

"Manufacture of other products of wood and articles of cork, straw and plaiting materials"
type: Concept
notation: C.16.28
definition: "Manufacture of other products of wood and articles of cork, straw and plaiting materials"
status: valid
status modified: 2026-05-06
accepted date: 2026-05-06
in scheme: NACEValue

Manufacture of pulp
type: Concept
notation: C.17.11
definition: Manufacture of pulp
status: valid
status modified: 2026-05-06
accepted date: 2026-05-06
in scheme: NACEValue

Manufacture of paper and paperboard
type: Concept
notation: C.17.12
definition: Manufacture of paper and paperboard
status: valid
status modified: 2026-05-06
accepted date: 2026-05-06
in scheme: NACEValue

"Manufacture of corrugated paper, paperboard and containers of paper and paperboard"
type: Concept
notation: C.17.21
definition: "Manufacture of corrugated paper, paperboard and containers of paper and paperboard"
status: valid
status modified: 2026-05-06
accepted date: 2026-05-06
in scheme: NACEValue

Manufacture of household and sanitary goods and of toilet requisites
type: Concept
notation: C.17.22
definition: Manufacture of household and sanitary goods and of toilet requisites
status: valid
status modified: 2026-05-06
accepted date: 2026-05-06
in scheme: NACEValue

Manufacture of paper stationery
type: Concept
notation: C.17.23
definition: Manufacture of paper stationery
status: valid
status modified: 2026-05-06
accepted date: 2026-05-06
in scheme: NACEValue

Manufacture of wallpaper
type: Concept
notation: C.17.24
definition: Manufacture of wallpaper
status: valid
status modified: 2026-05-06
accepted date: 2026-05-06
in scheme: NACEValue

Manufacture of other articles of paper and paperboard
type: Concept
notation: C.17.25
definition: Manufacture of other articles of paper and paperboard
status: valid
status modified: 2026-05-06
accepted date: 2026-05-06
in scheme: NACEValue

Printing of newspapers
type: Concept
notation: C.18.11
definition: Printing of newspapers
status: valid
status modified: 2026-05-06
accepted date: 2026-05-06
in scheme: NACEValue

Other printing
type: Concept
notation: C.18.12
definition: Other printing
status: valid
status modified: 2026-05-06
accepted date: 2026-05-06
in scheme: NACEValue

Pre-press and pre-media services
type: Concept
notation: C.18.13
definition: Pre-press and pre-media services
status: valid
status modified: 2026-05-06
accepted date: 2026-05-06
in scheme: NACEValue

Binding and related services
type: Concept
notation: C.18.14
definition: Binding and related services
status: valid
status modified: 2026-05-06
accepted date: 2026-05-06
in scheme: NACEValue

Reproduction of recorded media
type: Concept
notation: C.18.20
definition: Reproduction of recorded media
status: valid
status modified: 2026-05-06
accepted date: 2026-05-06
in scheme: NACEValue

Manufacture of coke oven products
type: Concept
notation: C.19.10
definition: Manufacture of coke oven products
status: valid
status modified: 2026-05-06
accepted date: 2026-05-06
in scheme: NACEValue

Manufacture of refined petroleum products and fossil fuel products
type: Concept
notation: C.19.20
definition: Manufacture of refined petroleum products and fossil fuel products
status: valid
status modified: 2026-05-06
accepted date: 2026-05-06
in scheme: NACEValue

Manufacture of industrial gases
type: Concept
notation: C.20.11
definition: Manufacture of industrial gases
status: valid
status modified: 2026-05-06
accepted date: 2026-05-06
in scheme: NACEValue

Manufacture of dyes and pigments
type: Concept
notation: C.20.12
definition: Manufacture of dyes and pigments
status: valid
status modified: 2026-05-06
accepted date: 2026-05-06
in scheme: NACEValue

Manufacture of other inorganic basic chemicals
type: Concept
notation: C.20.13
definition: Manufacture of other inorganic basic chemicals
status: valid
status modified: 2026-05-06
accepted date: 2026-05-06
in scheme: NACEValue

Manufacture of other organic basic chemicals
type: Concept
notation: C.20.14
definition: Manufacture of other organic basic chemicals
status: valid
status modified: 2026-05-06
accepted date: 2026-05-06
in scheme: NACEValue

Manufacture of fertilisers and nitrogen compounds
type: Concept
notation: C.20.15
definition: Manufacture of fertilisers and nitrogen compounds
status: valid
status modified: 2026-05-06
accepted date: 2026-05-06
in scheme: NACEValue

Manufacture of plastics in primary forms
type: Concept
notation: C.20.16
definition: Manufacture of plastics in primary forms
status: valid
status modified: 2026-05-06
accepted date: 2026-05-06
in scheme: NACEValue

Manufacture of synthetic rubber in primary forms
type: Concept
notation: C.20.17
definition: Manufacture of synthetic rubber in primary forms
status: valid
status modified: 2026-05-06
accepted date: 2026-05-06
in scheme: NACEValue

"Manufacture of pesticides, disinfectants and other agrochemical products"
type: Concept
notation: C.20.20
definition: "Manufacture of pesticides, disinfectants and other agrochemical products"
status: valid
status modified: 2026-05-06
accepted date: 2026-05-06
in scheme: NACEValue

"Manufacture of paints, varnishes and similar coatings, printing ink and mastics"
type: Concept
notation: C.20.30
definition: "Manufacture of paints, varnishes and similar coatings, printing ink and mastics"
status: valid
status modified: 2026-05-06
accepted date: 2026-05-06
in scheme: NACEValue

"Manufacture of soap and detergents, cleaning and polishing preparations"
type: Concept
notation: C.20.41
definition: "Manufacture of soap and detergents, cleaning and polishing preparations"
status: valid
status modified: 2026-05-06
accepted date: 2026-05-06
in scheme: NACEValue

Manufacture of perfumes and toilet preparations
type: Concept
notation: C.20.42
definition: Manufacture of perfumes and toilet preparations
status: valid
status modified: 2026-05-06
accepted date: 2026-05-06
in scheme: NACEValue

Manufacture of liquid biofuels
type: Concept
notation: C.20.51
definition: Manufacture of liquid biofuels
status: valid
status modified: 2026-05-06
accepted date: 2026-05-06
in scheme: NACEValue

Manufacture of other chemical products n.e.c.
type: Concept
notation: C.20.59
definition: Manufacture of other chemical products n.e.c.
status: valid
status modified: 2026-05-06
accepted date: 2026-05-06
in scheme: NACEValue

Manufacture of man-made fibres
type: Concept
notation: C.20.60
definition: Manufacture of man-made fibres
status: valid
status modified: 2026-05-06
accepted date: 2026-05-06
in scheme: NACEValue

Manufacture of basic pharmaceutical products
type: Concept
notation: C.21.10
definition: Manufacture of basic pharmaceutical products
status: valid
status modified: 2026-05-06
accepted date: 2026-05-06
in scheme: NACEValue

Manufacture of pharmaceutical preparations
type: Concept
notation: C.21.20
definition: Manufacture of pharmaceutical preparations
status: valid
status modified: 2026-05-06
accepted date: 2026-05-06
in scheme: NACEValue

"Manufacture, retreading and rebuilding of rubber tyres and manufacture of tubes"
type: Concept
notation: C.22.11
definition: "Manufacture, retreading and rebuilding of rubber tyres and manufacture of tubes"
status: valid
status modified: 2026-05-06
accepted date: 2026-05-06
in scheme: NACEValue

Manufacture of other rubber products
type: Concept
notation: C.22.12
definition: Manufacture of other rubber products
status: valid
status modified: 2026-05-06
accepted date: 2026-05-06
in scheme: NACEValue

"Manufacture of plastic plates, sheets, tubes and profiles"
type: Concept
notation: C.22.21
definition: "Manufacture of plastic plates, sheets, tubes and profiles"
status: valid
status modified: 2026-05-06
accepted date: 2026-05-06
in scheme: NACEValue

Manufacture of plastic packing goods
type: Concept
notation: C.22.22
definition: Manufacture of plastic packing goods
status: valid
status modified: 2026-05-06
accepted date: 2026-05-06
in scheme: NACEValue

Manufacture of doors and windows of plastic
type: Concept
notation: C.22.23
definition: Manufacture of doors and windows of plastic
status: valid
status modified: 2026-05-06
accepted date: 2026-05-06
in scheme: NACEValue

Manufacture of builders’ ware of plastic
type: Concept
notation: C.22.24
definition: Manufacture of builders’ ware of plastic
status: valid
status modified: 2026-05-06
accepted date: 2026-05-06
in scheme: NACEValue

Processing and finishing of plastic products
type: Concept
notation: C.22.25
definition: Processing and finishing of plastic products
status: valid
status modified: 2026-05-06
accepted date: 2026-05-06
in scheme: NACEValue

Manufacture of other plastic products
type: Concept
notation: C.22.26
definition: Manufacture of other plastic products
status: valid
status modified: 2026-05-06
accepted date: 2026-05-06
in scheme: NACEValue

Manufacture of flat glass
type: Concept
notation: C.23.11
definition: Manufacture of flat glass
status: valid
status modified: 2026-05-06
accepted date: 2026-05-06
in scheme: NACEValue

Shaping and processing of flat glass
type: Concept
notation: C.23.12
definition: Shaping and processing of flat glass
status: valid
status modified: 2026-05-06
accepted date: 2026-05-06
in scheme: NACEValue

Manufacture of hollow glass
type: Concept
notation: C.23.13
definition: Manufacture of hollow glass
status: valid
status modified: 2026-05-06
accepted date: 2026-05-06
in scheme: NACEValue

Manufacture of glass fibres
type: Concept
notation: C.23.14
definition: Manufacture of glass fibres
status: valid
status modified: 2026-05-06
accepted date: 2026-05-06
in scheme: NACEValue

"Manufacture and processing of other glass, including technical glassware"
type: Concept
notation: C.23.15
definition: "Manufacture and processing of other glass, including technical glassware"
status: valid
status modified: 2026-05-06
accepted date: 2026-05-06
in scheme: NACEValue

Manufacture of refractory products
type: Concept
notation: C.23.20
definition: Manufacture of refractory products
status: valid
status modified: 2026-05-06
accepted date: 2026-05-06
in scheme: NACEValue

Manufacture of ceramic tiles and flags
type: Concept
notation: C.23.31
definition: Manufacture of ceramic tiles and flags
status: valid
status modified: 2026-05-06
accepted date: 2026-05-06
in scheme: NACEValue

"Manufacture of bricks, tiles and construction products, in baked clay"
type: Concept
notation: C.23.32
definition: "Manufacture of bricks, tiles and construction products, in baked clay"
status: valid
status modified: 2026-05-06
accepted date: 2026-05-06
in scheme: NACEValue

Manufacture of ceramic household and ornamental articles
type: Concept
notation: C.23.41
definition: Manufacture of ceramic household and ornamental articles
status: valid
status modified: 2026-05-06
accepted date: 2026-05-06
in scheme: NACEValue

Manufacture of ceramic sanitary fixtures
type: Concept
notation: C.23.42
definition: Manufacture of ceramic sanitary fixtures
status: valid
status modified: 2026-05-06
accepted date: 2026-05-06
in scheme: NACEValue

Manufacture of ceramic insulators and insulating fittings
type: Concept
notation: C.23.43
definition: Manufacture of ceramic insulators and insulating fittings
status: valid
status modified: 2026-05-06
accepted date: 2026-05-06
in scheme: NACEValue

Manufacture of other technical ceramic products
type: Concept
notation: C.23.44
definition: Manufacture of other technical ceramic products
status: valid
status modified: 2026-05-06
accepted date: 2026-05-06
in scheme: NACEValue

Manufacture of other ceramic products
type: Concept
notation: C.23.45
definition: Manufacture of other ceramic products
status: valid
status modified: 2026-05-06
accepted date: 2026-05-06
in scheme: NACEValue

Manufacture of cement
type: Concept
notation: C.23.51
definition: Manufacture of cement
status: valid
status modified: 2026-05-06
accepted date: 2026-05-06
in scheme: NACEValue

Manufacture of lime and plaster
type: Concept
notation: C.23.52
definition: Manufacture of lime and plaster
status: valid
status modified: 2026-05-06
accepted date: 2026-05-06
in scheme: NACEValue

Manufacture of concrete products for construction purposes
type: Concept
notation: C.23.61
definition: Manufacture of concrete products for construction purposes
status: valid
status modified: 2026-05-06
accepted date: 2026-05-06
in scheme: NACEValue

Manufacture of plaster products for construction purposes
type: Concept
notation: C.23.62
definition: Manufacture of plaster products for construction purposes
status: valid
status modified: 2026-05-06
accepted date: 2026-05-06
in scheme: NACEValue

Manufacture of ready-mixed concrete
type: Concept
notation: C.23.63
definition: Manufacture of ready-mixed concrete
status: valid
status modified: 2026-05-06
accepted date: 2026-05-06
in scheme: NACEValue

Manufacture of mortars
type: Concept
notation: C.23.64
definition: Manufacture of mortars
status: valid
status modified: 2026-05-06
accepted date: 2026-05-06
in scheme: NACEValue

Manufacture of fibre cement
type: Concept
notation: C.23.65
definition: Manufacture of fibre cement
status: valid
status modified: 2026-05-06
accepted date: 2026-05-06
in scheme: NACEValue

"Manufacture of other articles of concrete, cement and plaster"
type: Concept
notation: C.23.66
definition: "Manufacture of other articles of concrete, cement and plaster"
status: valid
status modified: 2026-05-06
accepted date: 2026-05-06
in scheme: NACEValue

"Cutting, shaping and finishing of stone"
type: Concept
notation: C.23.70
definition: "Cutting, shaping and finishing of stone"
status: valid
status modified: 2026-05-06
accepted date: 2026-05-06
in scheme: NACEValue

Manufacture of abrasive products
type: Concept
notation: C.23.91
definition: Manufacture of abrasive products
status: valid
status modified: 2026-05-06
accepted date: 2026-05-06
in scheme: NACEValue

Manufacture of other non-metallic mineral products n.e.c.
type: Concept
notation: C.23.99
definition: Manufacture of other non-metallic mineral products n.e.c.
status: valid
status modified: 2026-05-06
accepted date: 2026-05-06
in scheme: NACEValue

Manufacture of basic iron and steel and of ferro-alloys
type: Concept
notation: C.24.10
definition: Manufacture of basic iron and steel and of ferro-alloys
status: valid
status modified: 2026-05-06
accepted date: 2026-05-06
in scheme: NACEValue

"Manufacture of tubes, pipes, hollow profiles and related fittings, of steel"
type: Concept
notation: C.24.20
definition: "Manufacture of tubes, pipes, hollow profiles and related fittings, of steel"
status: valid
status modified: 2026-05-06
accepted date: 2026-05-06
in scheme: NACEValue

Cold drawing of bars
type: Concept
notation: C.24.31
definition: Cold drawing of bars
status: valid
status modified: 2026-05-06
accepted date: 2026-05-06
in scheme: NACEValue

Cold rolling of narrow strip
type: Concept
notation: C.24.32
definition: Cold rolling of narrow strip
status: valid
status modified: 2026-05-06
accepted date: 2026-05-06
in scheme: NACEValue

Cold forming or folding
type: Concept
notation: C.24.33
definition: Cold forming or folding
status: valid
status modified: 2026-05-06
accepted date: 2026-05-06
in scheme: NACEValue

Cold drawing of wire
type: Concept
notation: C.24.34
definition: Cold drawing of wire
status: valid
status modified: 2026-05-06
accepted date: 2026-05-06
in scheme: NACEValue

Precious metals production
type: Concept
notation: C.24.41
definition: Precious metals production
status: valid
status modified: 2026-05-06
accepted date: 2026-05-06
in scheme: NACEValue

Aluminium production
type: Concept
notation: C.24.42
definition: Aluminium production
status: valid
status modified: 2026-05-06
accepted date: 2026-05-06
in scheme: NACEValue

"Lead, zinc and tin production"
type: Concept
notation: C.24.43
definition: "Lead, zinc and tin production"
status: valid
status modified: 2026-05-06
accepted date: 2026-05-06
in scheme: NACEValue

Copper production
type: Concept
notation: C.24.44
definition: Copper production
status: valid
status modified: 2026-05-06
accepted date: 2026-05-06
in scheme: NACEValue

Other non-ferrous metal production
type: Concept
notation: C.24.45
definition: Other non-ferrous metal production
status: valid
status modified: 2026-05-06
accepted date: 2026-05-06
in scheme: NACEValue

Processing of nuclear fuel
type: Concept
notation: C.24.46
definition: Processing of nuclear fuel
status: valid
status modified: 2026-05-06
accepted date: 2026-05-06
in scheme: NACEValue

Casting of iron
type: Concept
notation: C.24.51
definition: Casting of iron
status: valid
status modified: 2026-05-06
accepted date: 2026-05-06
in scheme: NACEValue

Casting of steel
type: Concept
notation: C.24.52
definition: Casting of steel
status: valid
status modified: 2026-05-06
accepted date: 2026-05-06
in scheme: NACEValue

Casting of light metals
type: Concept
notation: C.24.53
definition: Casting of light metals
status: valid
status modified: 2026-05-06
accepted date: 2026-05-06
in scheme: NACEValue

Casting of other non-ferrous metals
type: Concept
notation: C.24.54
definition: Casting of other non-ferrous metals
status: valid
status modified: 2026-05-06
accepted date: 2026-05-06
in scheme: NACEValue

Manufacture of metal structures and parts of structures
type: Concept
notation: C.25.11
definition: Manufacture of metal structures and parts of structures
status: valid
status modified: 2026-05-06
accepted date: 2026-05-06
in scheme: NACEValue

Manufacture of doors and windows of metal
type: Concept
notation: C.25.12
definition: Manufacture of doors and windows of metal
status: valid
status modified: 2026-05-06
accepted date: 2026-05-06
in scheme: NACEValue

"Manufacture of central heating radiators, steam generators and boilers"
type: Concept
notation: C.25.21
definition: "Manufacture of central heating radiators, steam generators and boilers"
status: valid
status modified: 2026-05-06
accepted date: 2026-05-06
in scheme: NACEValue

"Manufacture of other tanks, reservoirs and containers of metal"
type: Concept
notation: C.25.22
definition: "Manufacture of other tanks, reservoirs and containers of metal"
status: valid
status modified: 2026-05-06
accepted date: 2026-05-06
in scheme: NACEValue

Manufacture of weapons and ammunition
type: Concept
notation: C.25.30
definition: Manufacture of weapons and ammunition
status: valid
status modified: 2026-05-06
accepted date: 2026-05-06
in scheme: NACEValue

Forging and shaping metal and powder metallurgy
type: Concept
notation: C.25.40
definition: Forging and shaping metal and powder metallurgy
status: valid
status modified: 2026-05-06
accepted date: 2026-05-06
in scheme: NACEValue

Coating of metals
type: Concept
notation: C.25.51
definition: Coating of metals
status: valid
status modified: 2026-05-06
accepted date: 2026-05-06
in scheme: NACEValue

Heat treatment of metals
type: Concept
notation: C.25.52
definition: Heat treatment of metals
status: valid
status modified: 2026-05-06
accepted date: 2026-05-06
in scheme: NACEValue

Machining of metals
type: Concept
notation: C.25.53
definition: Machining of metals
status: valid
status modified: 2026-05-06
accepted date: 2026-05-06
in scheme: NACEValue

Manufacture of cutlery
type: Concept
notation: C.25.61
definition: Manufacture of cutlery
status: valid
status modified: 2026-05-06
accepted date: 2026-05-06
in scheme: NACEValue

Manufacture of locks and hinges
type: Concept
notation: C.25.62
definition: Manufacture of locks and hinges
status: valid
status modified: 2026-05-06
accepted date: 2026-05-06
in scheme: NACEValue

Manufacture of tools
type: Concept
notation: C.25.63
definition: Manufacture of tools
status: valid
status modified: 2026-05-06
accepted date: 2026-05-06
in scheme: NACEValue

Manufacture of steel drums and similar containers
type: Concept
notation: C.25.91
definition: Manufacture of steel drums and similar containers
status: valid
status modified: 2026-05-06
accepted date: 2026-05-06
in scheme: NACEValue

Manufacture of light metal packaging
type: Concept
notation: C.25.92
definition: Manufacture of light metal packaging
status: valid
status modified: 2026-05-06
accepted date: 2026-05-06
in scheme: NACEValue

"Manufacture of wire products, chain and springs"
type: Concept
notation: C.25.93
definition: "Manufacture of wire products, chain and springs"
status: valid
status modified: 2026-05-06
accepted date: 2026-05-06
in scheme: NACEValue

Manufacture of fasteners and screw machine products
type: Concept
notation: C.25.94
definition: Manufacture of fasteners and screw machine products
status: valid
status modified: 2026-05-06
accepted date: 2026-05-06
in scheme: NACEValue

Manufacture of other fabricated metal products n.e.c.
type: Concept
notation: C.25.99
definition: Manufacture of other fabricated metal products n.e.c.
status: valid
status modified: 2026-05-06
accepted date: 2026-05-06
in scheme: NACEValue

Manufacture of electronic components
type: Concept
notation: C.26.11
definition: Manufacture of electronic components
status: valid
status modified: 2026-05-06
accepted date: 2026-05-06
in scheme: NACEValue

Manufacture of loaded electronic boards
type: Concept
notation: C.26.12
definition: Manufacture of loaded electronic boards
status: valid
status modified: 2026-05-06
accepted date: 2026-05-06
in scheme: NACEValue

Manufacture of computers and peripheral equipment
type: Concept
notation: C.26.20
definition: Manufacture of computers and peripheral equipment
status: valid
status modified: 2026-05-06
accepted date: 2026-05-06
in scheme: NACEValue

Manufacture of communication equipment
type: Concept
notation: C.26.30
definition: Manufacture of communication equipment
status: valid
status modified: 2026-05-06
accepted date: 2026-05-06
in scheme: NACEValue

Manufacture of consumer electronics
type: Concept
notation: C.26.40
definition: Manufacture of consumer electronics
status: valid
status modified: 2026-05-06
accepted date: 2026-05-06
in scheme: NACEValue

"Manufacture of instruments and appliances for measuring, testing and navigation"
type: Concept
notation: C.26.51
definition: "Manufacture of instruments and appliances for measuring, testing and navigation"
status: valid
status modified: 2026-05-06
accepted date: 2026-05-06
in scheme: NACEValue

Manufacture of watches and clocks
type: Concept
notation: C.26.52
definition: Manufacture of watches and clocks
status: valid
status modified: 2026-05-06
accepted date: 2026-05-06
in scheme: NACEValue

"Manufacture of irradiation, electromedical and electrotherapeutic equipment"
type: Concept
notation: C.26.60
definition: "Manufacture of irradiation, electromedical and electrotherapeutic equipment"
status: valid
status modified: 2026-05-06
accepted date: 2026-05-06
in scheme: NACEValue

"Manufacture of optical instruments, magnetic and optical media and photographic equipment"
type: Concept
notation: C.26.70
definition: "Manufacture of optical instruments, magnetic and optical media and photographic equipment"
status: valid
status modified: 2026-05-06
accepted date: 2026-05-06
in scheme: NACEValue

"Manufacture of electric motors, generators and transformers"
type: Concept
notation: C.27.11
definition: "Manufacture of electric motors, generators and transformers"
status: valid
status modified: 2026-05-06
accepted date: 2026-05-06
in scheme: NACEValue

Manufacture of electricity distribution and control apparatus
type: Concept
notation: C.27.12
definition: Manufacture of electricity distribution and control apparatus
status: valid
status modified: 2026-05-06
accepted date: 2026-05-06
in scheme: NACEValue

Manufacture of batteries and accumulators
type: Concept
notation: C.27.20
definition: Manufacture of batteries and accumulators
status: valid
status modified: 2026-05-06
accepted date: 2026-05-06
in scheme: NACEValue

Manufacture of fibre optic cables
type: Concept
notation: C.27.31
definition: Manufacture of fibre optic cables
status: valid
status modified: 2026-05-06
accepted date: 2026-05-06
in scheme: NACEValue

Manufacture of other electronic and electric wires and cables
type: Concept
notation: C.27.32
definition: Manufacture of other electronic and electric wires and cables
status: valid
status modified: 2026-05-06
accepted date: 2026-05-06
in scheme: NACEValue

Manufacture of wiring devices
type: Concept
notation: C.27.33
definition: Manufacture of wiring devices
status: valid
status modified: 2026-05-06
accepted date: 2026-05-06
in scheme: NACEValue

Manufacture of lighting equipment
type: Concept
notation: C.27.40
definition: Manufacture of lighting equipment
status: valid
status modified: 2026-05-06
accepted date: 2026-05-06
in scheme: NACEValue

Manufacture of electric domestic appliances
type: Concept
notation: C.27.51
definition: Manufacture of electric domestic appliances
status: valid
status modified: 2026-05-06
accepted date: 2026-05-06
in scheme: NACEValue

Manufacture of non-electric domestic appliances
type: Concept
notation: C.27.52
definition: Manufacture of non-electric domestic appliances
status: valid
status modified: 2026-05-06
accepted date: 2026-05-06
in scheme: NACEValue

Manufacture of other electrical equipment
type: Concept
notation: C.27.90
definition: Manufacture of other electrical equipment
status: valid
status modified: 2026-05-06
accepted date: 2026-05-06
in scheme: NACEValue

"Manufacture of engines and turbines, except aircraft, vehicle and cycle engines"
type: Concept
notation: C.28.11
definition: "Manufacture of engines and turbines, except aircraft, vehicle and cycle engines"
status: valid
status modified: 2026-05-06
accepted date: 2026-05-06
in scheme: NACEValue

Manufacture of fluid power equipment
type: Concept
notation: C.28.12
definition: Manufacture of fluid power equipment
status: valid
status modified: 2026-05-06
accepted date: 2026-05-06
in scheme: NACEValue

Manufacture of other pumps and compressors
type: Concept
notation: C.28.13
definition: Manufacture of other pumps and compressors
status: valid
status modified: 2026-05-06
accepted date: 2026-05-06
in scheme: NACEValue

Manufacture of other taps and valves
type: Concept
notation: C.28.14
definition: Manufacture of other taps and valves
status: valid
status modified: 2026-05-06
accepted date: 2026-05-06
in scheme: NACEValue

"Manufacture of bearings, gears, gearing and driving elements"
type: Concept
notation: C.28.15
definition: "Manufacture of bearings, gears, gearing and driving elements"
status: valid
status modified: 2026-05-06
accepted date: 2026-05-06
in scheme: NACEValue

"Manufacture of ovens, furnaces and permanent household heating equipment"
type: Concept
notation: C.28.21
definition: "Manufacture of ovens, furnaces and permanent household heating equipment"
status: valid
status modified: 2026-05-06
accepted date: 2026-05-06
in scheme: NACEValue

Manufacture of lifting and handling equipment
type: Concept
notation: C.28.22
definition: Manufacture of lifting and handling equipment
status: valid
status modified: 2026-05-06
accepted date: 2026-05-06
in scheme: NACEValue

"Manufacture of office machinery and equipment, except computers and peripheral equipment"
type: Concept
notation: C.28.23
definition: "Manufacture of office machinery and equipment, except computers and peripheral equipment"
status: valid
status modified: 2026-05-06
accepted date: 2026-05-06
in scheme: NACEValue

Manufacture of power-driven hand tools
type: Concept
notation: C.28.24
definition: Manufacture of power-driven hand tools
status: valid
status modified: 2026-05-06
accepted date: 2026-05-06
in scheme: NACEValue

Manufacture of non-domestic air conditioning equipment
type: Concept
notation: C.28.25
definition: Manufacture of non-domestic air conditioning equipment
status: valid
status modified: 2026-05-06
accepted date: 2026-05-06
in scheme: NACEValue

Manufacture of other general-purpose machinery n.e.c.
type: Concept
notation: C.28.29
definition: Manufacture of other general-purpose machinery n.e.c.
status: valid
status modified: 2026-05-06
accepted date: 2026-05-06
in scheme: NACEValue

Manufacture of agricultural and forestry machinery
type: Concept
notation: C.28.30
definition: Manufacture of agricultural and forestry machinery
status: valid
status modified: 2026-05-06
accepted date: 2026-05-06
in scheme: NACEValue

Manufacture of metal forming machinery and machine tools for metal work
type: Concept
notation: C.28.41
definition: Manufacture of metal forming machinery and machine tools for metal work
status: valid
status modified: 2026-05-06
accepted date: 2026-05-06
in scheme: NACEValue

Manufacture of other machine tools
type: Concept
notation: C.28.42
definition: Manufacture of other machine tools
status: valid
status modified: 2026-05-06
accepted date: 2026-05-06
in scheme: NACEValue

Manufacture of machinery for metallurgy
type: Concept
notation: C.28.91
definition: Manufacture of machinery for metallurgy
status: valid
status modified: 2026-05-06
accepted date: 2026-05-06
in scheme: NACEValue

"Manufacture of machinery for mining, quarrying and construction"
type: Concept
notation: C.28.92
definition: "Manufacture of machinery for mining, quarrying and construction"
status: valid
status modified: 2026-05-06
accepted date: 2026-05-06
in scheme: NACEValue

"Manufacture of machinery for food, beverage and tobacco processing"
type: Concept
notation: C.28.93
definition: "Manufacture of machinery for food, beverage and tobacco processing"
status: valid
status modified: 2026-05-06
accepted date: 2026-05-06
in scheme: NACEValue

"Manufacture of machinery for textile, apparel and leather production"
type: Concept
notation: C.28.94
definition: "Manufacture of machinery for textile, apparel and leather production"
status: valid
status modified: 2026-05-06
accepted date: 2026-05-06
in scheme: NACEValue

Manufacture of machinery for paper and paperboard production
type: Concept
notation: C.28.95
definition: Manufacture of machinery for paper and paperboard production
status: valid
status modified: 2026-05-06
accepted date: 2026-05-06
in scheme: NACEValue

Manufacture of plastics and rubber machinery
type: Concept
notation: C.28.96
definition: Manufacture of plastics and rubber machinery
status: valid
status modified: 2026-05-06
accepted date: 2026-05-06
in scheme: NACEValue

Manufacture of additive manufacturing machinery
type: Concept
notation: C.28.97
definition: Manufacture of additive manufacturing machinery
status: valid
status modified: 2026-05-06
accepted date: 2026-05-06
in scheme: NACEValue

Manufacture of other special-purpose machinery n.e.c.
type: Concept
notation: C.28.99
definition: Manufacture of other special-purpose machinery n.e.c.
status: valid
status modified: 2026-05-06
accepted date: 2026-05-06
in scheme: NACEValue

Manufacture of motor vehicles
type: Concept
notation: C.29.10
definition: Manufacture of motor vehicles
status: valid
status modified: 2026-05-06
accepted date: 2026-05-06
in scheme: NACEValue

Manufacture of bodies and coachwork for motor vehicles; manufacture of trailers and semi-trailers
type: Concept
notation: C.29.20
definition: Manufacture of bodies and coachwork for motor vehicles; manufacture of trailers and semi-trailers
status: valid
status modified: 2026-05-06
accepted date: 2026-05-06
in scheme: NACEValue

Manufacture of electrical and electronic equipment for motor vehicles
type: Concept
notation: C.29.31
definition: Manufacture of electrical and electronic equipment for motor vehicles
status: valid
status modified: 2026-05-06
accepted date: 2026-05-06
in scheme: NACEValue

Manufacture of other parts and accessories for motor vehicles
type: Concept
notation: C.29.32
definition: Manufacture of other parts and accessories for motor vehicles
status: valid
status modified: 2026-05-06
accepted date: 2026-05-06
in scheme: NACEValue

Building of civilian ships and floating structures
type: Concept
notation: C.30.11
definition: Building of civilian ships and floating structures
status: valid
status modified: 2026-05-06
accepted date: 2026-05-06
in scheme: NACEValue

Building of pleasure and sporting boats
type: Concept
notation: C.30.12
definition: Building of pleasure and sporting boats
status: valid
status modified: 2026-05-06
accepted date: 2026-05-06
in scheme: NACEValue

Building of military ships and vessels
type: Concept
notation: C.30.13
definition: Building of military ships and vessels
status: valid
status modified: 2026-05-06
accepted date: 2026-05-06
in scheme: NACEValue

Manufacture of railway locomotives and rolling stock
type: Concept
notation: C.30.20
definition: Manufacture of railway locomotives and rolling stock
status: valid
status modified: 2026-05-06
accepted date: 2026-05-06
in scheme: NACEValue

Manufacture of civilian air and spacecraft and related machinery
type: Concept
notation: C.30.31
definition: Manufacture of civilian air and spacecraft and related machinery
status: valid
status modified: 2026-05-06
accepted date: 2026-05-06
in scheme: NACEValue

Manufacture of military air and spacecraft and related machinery
type: Concept
notation: C.30.32
definition: Manufacture of military air and spacecraft and related machinery
status: valid
status modified: 2026-05-06
accepted date: 2026-05-06
in scheme: NACEValue

Manufacture of military fighting vehicles
type: Concept
notation: C.30.40
definition: Manufacture of military fighting vehicles
status: valid
status modified: 2026-05-06
accepted date: 2026-05-06
in scheme: NACEValue

Manufacture of motorcycles
type: Concept
notation: C.30.91
definition: Manufacture of motorcycles
status: valid
status modified: 2026-05-06
accepted date: 2026-05-06
in scheme: NACEValue

Manufacture of bicycles and invalid carriages
type: Concept
notation: C.30.92
definition: Manufacture of bicycles and invalid carriages
status: valid
status modified: 2026-05-06
accepted date: 2026-05-06
in scheme: NACEValue

Manufacture of other transport equipment n.e.c.
type: Concept
notation: C.30.99
definition: Manufacture of other transport equipment n.e.c.
status: valid
status modified: 2026-05-06
accepted date: 2026-05-06
in scheme: NACEValue

Manufacture of furniture
type: Concept
notation: C.31.00
definition: Manufacture of furniture
status: valid
status modified: 2026-05-06
accepted date: 2026-05-06
in scheme: NACEValue

Striking of coins
type: Concept
notation: C.32.11
definition: Striking of coins
status: valid
status modified: 2026-05-06
accepted date: 2026-05-06
in scheme: NACEValue

Manufacture of jewellery and related articles
type: Concept
notation: C.32.12
definition: Manufacture of jewellery and related articles
status: valid
status modified: 2026-05-06
accepted date: 2026-05-06
in scheme: NACEValue

Manufacture of imitation jewellery and related articles
type: Concept
notation: C.32.13
definition: Manufacture of imitation jewellery and related articles
status: valid
status modified: 2026-05-06
accepted date: 2026-05-06
in scheme: NACEValue

Manufacture of musical instruments
type: Concept
notation: C.32.20
definition: Manufacture of musical instruments
status: valid
status modified: 2026-05-06
accepted date: 2026-05-06
in scheme: NACEValue

Manufacture of sports goods
type: Concept
notation: C.32.30
definition: Manufacture of sports goods
status: valid
status modified: 2026-05-06
accepted date: 2026-05-06
in scheme: NACEValue

Manufacture of games and toys
type: Concept
notation: C.32.40
definition: Manufacture of games and toys
status: valid
status modified: 2026-05-06
accepted date: 2026-05-06
in scheme: NACEValue

Manufacture of medical and dental instruments and supplies
type: Concept
notation: C.32.50
definition: Manufacture of medical and dental instruments and supplies
status: valid
status modified: 2026-05-06
accepted date: 2026-05-06
in scheme: NACEValue

Manufacture of brooms and brushes
type: Concept
notation: C.32.91
definition: Manufacture of brooms and brushes
status: valid
status modified: 2026-05-06
accepted date: 2026-05-06
in scheme: NACEValue

Other manufacturing n.e.c.
type: Concept
notation: C.32.99
definition: Other manufacturing n.e.c.
status: valid
status modified: 2026-05-06
accepted date: 2026-05-06
in scheme: NACEValue

Repair and maintenance of fabricated metal products
type: Concept
notation: C.33.11
definition: Repair and maintenance of fabricated metal products
status: valid
status modified: 2026-05-06
accepted date: 2026-05-06
in scheme: NACEValue

Repair and maintenance of machinery
type: Concept
notation: C.33.12
definition: Repair and maintenance of machinery
status: valid
status modified: 2026-05-06
accepted date: 2026-05-06
in scheme: NACEValue

Repair and maintenance of electronic and optical equipment
type: Concept
notation: C.33.13
definition: Repair and maintenance of electronic and optical equipment
status: valid
status modified: 2026-05-06
accepted date: 2026-05-06
in scheme: NACEValue

Repair and maintenance of electrical equipment
type: Concept
notation: C.33.14
definition: Repair and maintenance of electrical equipment
status: valid
status modified: 2026-05-06
accepted date: 2026-05-06
in scheme: NACEValue

Repair and maintenance of civilian ships and boats
type: Concept
notation: C.33.15
definition: Repair and maintenance of civilian ships and boats
status: valid
status modified: 2026-05-06
accepted date: 2026-05-06
in scheme: NACEValue

Repair and maintenance of civilian air and spacecraft
type: Concept
notation: C.33.16
definition: Repair and maintenance of civilian air and spacecraft
status: valid
status modified: 2026-05-06
accepted date: 2026-05-06
in scheme: NACEValue

Repair and maintenance of other civilian transport equipment
type: Concept
notation: C.33.17
definition: Repair and maintenance of other civilian transport equipment
status: valid
status modified: 2026-05-06
accepted date: 2026-05-06
in scheme: NACEValue

"Repair and maintenance of military fighting vehicles, ships, boats, air and spacecraft"
type: Concept
notation: C.33.18
definition: "Repair and maintenance of military fighting vehicles, ships, boats, air and spacecraft"
status: valid
status modified: 2026-05-06
accepted date: 2026-05-06
in scheme: NACEValue

Repair and maintenance of other equipment
type: Concept
notation: C.33.19
definition: Repair and maintenance of other equipment
status: valid
status modified: 2026-05-06
accepted date: 2026-05-06
in scheme: NACEValue

Installation of industrial machinery and equipment
type: Concept
notation: C.33.20
definition: Installation of industrial machinery and equipment
status: valid
status modified: 2026-05-06
accepted date: 2026-05-06
in scheme: NACEValue

Production of electricity from non-renewable sources
type: Concept
notation: D.35.11
definition: Production of electricity from non-renewable sources
status: valid
status modified: 2026-05-06
accepted date: 2026-05-06
in scheme: NACEValue

Production of electricity from renewable sources
type: Concept
notation: D.35.12
definition: Production of electricity from renewable sources
status: valid
status modified: 2026-05-06
accepted date: 2026-05-06
in scheme: NACEValue

Transmission of electricity
type: Concept
notation: D.35.13
definition: Transmission of electricity
status: valid
status modified: 2026-05-06
accepted date: 2026-05-06
in scheme: NACEValue

Distribution of electricity
type: Concept
notation: D.35.14
definition: Distribution of electricity
status: valid
status modified: 2026-05-06
accepted date: 2026-05-06
in scheme: NACEValue

Trade of electricity
type: Concept
notation: D.35.15
definition: Trade of electricity
status: valid
status modified: 2026-05-06
accepted date: 2026-05-06
in scheme: NACEValue

Storage of electricity
type: Concept
notation: D.35.16
definition: Storage of electricity
status: valid
status modified: 2026-05-06
accepted date: 2026-05-06
in scheme: NACEValue

Manufacture of gas
type: Concept
notation: D.35.21
definition: Manufacture of gas
status: valid
status modified: 2026-05-06
accepted date: 2026-05-06
in scheme: NACEValue

Distribution of gaseous fuels through mains
type: Concept
notation: D.35.22
definition: Distribution of gaseous fuels through mains
status: valid
status modified: 2026-05-06
accepted date: 2026-05-06
in scheme: NACEValue

Trade of gas through mains
type: Concept
notation: D.35.23
definition: Trade of gas through mains
status: valid
status modified: 2026-05-06
accepted date: 2026-05-06
in scheme: NACEValue

Storage of gas as part of network supply services
type: Concept
notation: D.35.24
definition: Storage of gas as part of network supply services
status: valid
status modified: 2026-05-06
accepted date: 2026-05-06
in scheme: NACEValue

Steam and air conditioning supply
type: Concept
notation: D.35.30
definition: Steam and air conditioning supply
status: valid
status modified: 2026-05-06
accepted date: 2026-05-06
in scheme: NACEValue

Activities of brokers and agents for electric power and natural gas
type: Concept
notation: D.35.40
definition: Activities of brokers and agents for electric power and natural gas
status: valid
status modified: 2026-05-06
accepted date: 2026-05-06
in scheme: NACEValue

"Water collection, treatment and supply"
type: Concept
notation: E.36.00
definition: "Water collection, treatment and supply"
status: valid
status modified: 2026-05-06
accepted date: 2026-05-06
in scheme: NACEValue

Sewerage
type: Concept
notation: E.37.00
definition: Sewerage
status: valid
status modified: 2026-05-06
accepted date: 2026-05-06
in scheme: NACEValue

Collection of non-hazardous waste
type: Concept
notation: E.38.11
definition: Collection of non-hazardous waste
status: valid
status modified: 2026-05-06
accepted date: 2026-05-06
in scheme: NACEValue

Collection of hazardous waste
type: Concept
notation: E.38.12
definition: Collection of hazardous waste
status: valid
status modified: 2026-05-06
accepted date: 2026-05-06
in scheme: NACEValue

Materials recovery
type: Concept
notation: E.38.21
definition: Materials recovery
status: valid
status modified: 2026-05-06
accepted date: 2026-05-06
in scheme: NACEValue

Energy recovery
type: Concept
notation: E.38.22
definition: Energy recovery
status: valid
status modified: 2026-05-06
accepted date: 2026-05-06
in scheme: NACEValue

Other waste recovery
type: Concept
notation: E.38.23
definition: Other waste recovery
status: valid
status modified: 2026-05-06
accepted date: 2026-05-06
in scheme: NACEValue

Incineration without energy recovery
type: Concept
notation: E.38.31
definition: Incineration without energy recovery
status: valid
status modified: 2026-05-06
accepted date: 2026-05-06
in scheme: NACEValue

Landfilling or permanent storage
type: Concept
notation: E.38.32
definition: Landfilling or permanent storage
status: valid
status modified: 2026-05-06
accepted date: 2026-05-06
in scheme: NACEValue

Other waste disposal
type: Concept
notation: E.38.33
definition: Other waste disposal
status: valid
status modified: 2026-05-06
accepted date: 2026-05-06
in scheme: NACEValue

Remediation activities and other waste management service activities
type: Concept
notation: E.39.00
definition: Remediation activities and other waste management service activities
status: valid
status modified: 2026-05-06
accepted date: 2026-05-06
in scheme: NACEValue

Construction of residential and non-residential buildings
type: Concept
notation: F.41.00
definition: Construction of residential and non-residential buildings
status: valid
status modified: 2026-05-06
accepted date: 2026-05-06
in scheme: NACEValue

Construction of roads and motorways
type: Concept
notation: F.42.11
definition: Construction of roads and motorways
status: valid
status modified: 2026-05-06
accepted date: 2026-05-06
in scheme: NACEValue

Construction of railways and underground railways
type: Concept
notation: F.42.12
definition: Construction of railways and underground railways
status: valid
status modified: 2026-05-06
accepted date: 2026-05-06
in scheme: NACEValue

Construction of bridges and tunnels
type: Concept
notation: F.42.13
definition: Construction of bridges and tunnels
status: valid
status modified: 2026-05-06
accepted date: 2026-05-06
in scheme: NACEValue

Construction of utility projects for fluids
type: Concept
notation: F.42.21
definition: Construction of utility projects for fluids
status: valid
status modified: 2026-05-06
accepted date: 2026-05-06
in scheme: NACEValue

Construction of utility projects for electricity and telecommunications
type: Concept
notation: F.42.22
definition: Construction of utility projects for electricity and telecommunications
status: valid
status modified: 2026-05-06
accepted date: 2026-05-06
in scheme: NACEValue

Construction of water projects
type: Concept
notation: F.42.91
definition: Construction of water projects
status: valid
status modified: 2026-05-06
accepted date: 2026-05-06
in scheme: NACEValue

Construction of other civil engineering projects n.e.c.
type: Concept
notation: F.42.99
definition: Construction of other civil engineering projects n.e.c.
status: valid
status modified: 2026-05-06
accepted date: 2026-05-06
in scheme: NACEValue

Demolition
type: Concept
notation: F.43.11
definition: Demolition
status: valid
status modified: 2026-05-06
accepted date: 2026-05-06
in scheme: NACEValue

Site preparation
type: Concept
notation: F.43.12
definition: Site preparation
status: valid
status modified: 2026-05-06
accepted date: 2026-05-06
in scheme: NACEValue

Test drilling and boring
type: Concept
notation: F.43.13
definition: Test drilling and boring
status: valid
status modified: 2026-05-06
accepted date: 2026-05-06
in scheme: NACEValue

Electrical installation
type: Concept
notation: F.43.21
definition: Electrical installation
status: valid
status modified: 2026-05-06
accepted date: 2026-05-06
in scheme: NACEValue

"Plumbing, heat and air-conditioning installation"
type: Concept
notation: F.43.22
definition: "Plumbing, heat and air-conditioning installation"
status: valid
status modified: 2026-05-06
accepted date: 2026-05-06
in scheme: NACEValue

Installation of insulation
type: Concept
notation: F.43.23
definition: Installation of insulation
status: valid
status modified: 2026-05-06
accepted date: 2026-05-06
in scheme: NACEValue

Other construction installation
type: Concept
notation: F.43.24
definition: Other construction installation
status: valid
status modified: 2026-05-06
accepted date: 2026-05-06
in scheme: NACEValue

Plastering
type: Concept
notation: F.43.31
definition: Plastering
status: valid
status modified: 2026-05-06
accepted date: 2026-05-06
in scheme: NACEValue

Joinery installation
type: Concept
notation: F.43.32
definition: Joinery installation
status: valid
status modified: 2026-05-06
accepted date: 2026-05-06
in scheme: NACEValue

Floor and wall covering
type: Concept
notation: F.43.33
definition: Floor and wall covering
status: valid
status modified: 2026-05-06
accepted date: 2026-05-06
in scheme: NACEValue

Painting and glazing
type: Concept
notation: F.43.34
definition: Painting and glazing
status: valid
status modified: 2026-05-06
accepted date: 2026-05-06
in scheme: NACEValue

Other building completion and finishing
type: Concept
notation: F.43.35
definition: Other building completion and finishing
status: valid
status modified: 2026-05-06
accepted date: 2026-05-06
in scheme: NACEValue

Roofing activities
type: Concept
notation: F.43.41
definition: Roofing activities
status: valid
status modified: 2026-05-06
accepted date: 2026-05-06
in scheme: NACEValue

Other specialised construction activities in construction of buildings
type: Concept
notation: F.43.42
definition: Other specialised construction activities in construction of buildings
status: valid
status modified: 2026-05-06
accepted date: 2026-05-06
in scheme: NACEValue

Specialised construction activities in civil engineering
type: Concept
notation: F.43.50
definition: Specialised construction activities in civil engineering
status: valid
status modified: 2026-05-06
accepted date: 2026-05-06
in scheme: NACEValue

Intermediation service activities for specialised construction services
type: Concept
notation: F.43.60
definition: Intermediation service activities for specialised construction services
status: valid
status modified: 2026-05-06
accepted date: 2026-05-06
in scheme: NACEValue

Masonry and bricklaying activities
type: Concept
notation: F.43.91
definition: Masonry and bricklaying activities
status: valid
status modified: 2026-05-06
accepted date: 2026-05-06
in scheme: NACEValue

Other specialised construction activities n.e.c.
type: Concept
notation: F.43.99
definition: Other specialised construction activities n.e.c.
status: valid
status modified: 2026-05-06
accepted date: 2026-05-06
in scheme: NACEValue

"Activities of agents involved in the wholesale of agricultural raw materials, live animals, textile raw materials and semi-finished goods"
type: Concept
notation: G.46.11
definition: "Activities of agents involved in the wholesale of agricultural raw materials, live animals, textile raw materials and semi-finished goods"
status: valid
status modified: 2026-05-06
accepted date: 2026-05-06
in scheme: NACEValue

"Activities of agents involved in the wholesale of fuels, ores, metals and industrial chemicals"
type: Concept
notation: G.46.12
definition: "Activities of agents involved in the wholesale of fuels, ores, metals and industrial chemicals"
status: valid
status modified: 2026-05-06
accepted date: 2026-05-06
in scheme: NACEValue

Activities of agents involved in the wholesale of timber and building materials
type: Concept
notation: G.46.13
definition: Activities of agents involved in the wholesale of timber and building materials
status: valid
status modified: 2026-05-06
accepted date: 2026-05-06
in scheme: NACEValue

"Activities of agents involved in the wholesale of machinery, industrial equipment, ships and aircraft"
type: Concept
notation: G.46.14
definition: "Activities of agents involved in the wholesale of machinery, industrial equipment, ships and aircraft"
status: valid
status modified: 2026-05-06
accepted date: 2026-05-06
in scheme: NACEValue

"Activities of agents involved in the wholesale of furniture, household goods, hardware and ironmongery"
type: Concept
notation: G.46.15
definition: "Activities of agents involved in the wholesale of furniture, household goods, hardware and ironmongery"
status: valid
status modified: 2026-05-06
accepted date: 2026-05-06
in scheme: NACEValue

"Activities of agents involved in the wholesale of textiles, clothing, fur, footwear and leather goods"
type: Concept
notation: G.46.16
definition: "Activities of agents involved in the wholesale of textiles, clothing, fur, footwear and leather goods"
status: valid
status modified: 2026-05-06
accepted date: 2026-05-06
in scheme: NACEValue

"Activities of agents involved in the wholesale of food, beverages and tobacco"
type: Concept
notation: G.46.17
definition: "Activities of agents involved in the wholesale of food, beverages and tobacco"
status: valid
status modified: 2026-05-06
accepted date: 2026-05-06
in scheme: NACEValue

Activities of agents involved in the wholesale of other particular products
type: Concept
notation: G.46.18
definition: Activities of agents involved in the wholesale of other particular products
status: valid
status modified: 2026-05-06
accepted date: 2026-05-06
in scheme: NACEValue

Activities of agents involved in non-specialised wholesale
type: Concept
notation: G.46.19
definition: Activities of agents involved in non-specialised wholesale
status: valid
status modified: 2026-05-06
accepted date: 2026-05-06
in scheme: NACEValue

"Wholesale of grain, unmanufactured tobacco, seeds and animal feeds"
type: Concept
notation: G.46.21
definition: "Wholesale of grain, unmanufactured tobacco, seeds and animal feeds"
status: valid
status modified: 2026-05-06
accepted date: 2026-05-06
in scheme: NACEValue

Wholesale of flowers and plants
type: Concept
notation: G.46.22
definition: Wholesale of flowers and plants
status: valid
status modified: 2026-05-06
accepted date: 2026-05-06
in scheme: NACEValue

Wholesale of live animals
type: Concept
notation: G.46.23
definition: Wholesale of live animals
status: valid
status modified: 2026-05-06
accepted date: 2026-05-06
in scheme: NACEValue

"Wholesale of hides, skins and leather"
type: Concept
notation: G.46.24
definition: "Wholesale of hides, skins and leather"
status: valid
status modified: 2026-05-06
accepted date: 2026-05-06
in scheme: NACEValue

Wholesale of fruit and vegetables
type: Concept
notation: G.46.31
definition: Wholesale of fruit and vegetables
status: valid
status modified: 2026-05-06
accepted date: 2026-05-06
in scheme: NACEValue

"Wholesale of meat, meat products, fish and fish products"
type: Concept
notation: G.46.32
definition: "Wholesale of meat, meat products, fish and fish products"
status: valid
status modified: 2026-05-06
accepted date: 2026-05-06
in scheme: NACEValue

"Wholesale of dairy products, eggs and edible oils and fats"
type: Concept
notation: G.46.33
definition: "Wholesale of dairy products, eggs and edible oils and fats"
status: valid
status modified: 2026-05-06
accepted date: 2026-05-06
in scheme: NACEValue

Wholesale of beverages
type: Concept
notation: G.46.34
definition: Wholesale of beverages
status: valid
status modified: 2026-05-06
accepted date: 2026-05-06
in scheme: NACEValue

Wholesale of tobacco products
type: Concept
notation: G.46.35
definition: Wholesale of tobacco products
status: valid
status modified: 2026-05-06
accepted date: 2026-05-06
in scheme: NACEValue

"Wholesale of sugar, chocolate and sugar confectionery"
type: Concept
notation: G.46.36
definition: "Wholesale of sugar, chocolate and sugar confectionery"
status: valid
status modified: 2026-05-06
accepted date: 2026-05-06
in scheme: NACEValue

"Wholesale of coffee, tea, cocoa and spices"
type: Concept
notation: G.46.37
definition: "Wholesale of coffee, tea, cocoa and spices"
status: valid
status modified: 2026-05-06
accepted date: 2026-05-06
in scheme: NACEValue

Wholesale of other food
type: Concept
notation: G.46.38
definition: Wholesale of other food
status: valid
status modified: 2026-05-06
accepted date: 2026-05-06
in scheme: NACEValue

"Non-specialised wholesale of food, beverages and tobacco"
type: Concept
notation: G.46.39
definition: "Non-specialised wholesale of food, beverages and tobacco"
status: valid
status modified: 2026-05-06
accepted date: 2026-05-06
in scheme: NACEValue

Wholesale of textiles
type: Concept
notation: G.46.41
definition: Wholesale of textiles
status: valid
status modified: 2026-05-06
accepted date: 2026-05-06
in scheme: NACEValue

Wholesale of clothing and footwear
type: Concept
notation: G.46.42
definition: Wholesale of clothing and footwear
status: valid
status modified: 2026-05-06
accepted date: 2026-05-06
in scheme: NACEValue

Wholesale of electrical household appliances
type: Concept
notation: G.46.43
definition: Wholesale of electrical household appliances
status: valid
status modified: 2026-05-06
accepted date: 2026-05-06
in scheme: NACEValue

Wholesale of china and glassware and cleaning materials
type: Concept
notation: G.46.44
definition: Wholesale of china and glassware and cleaning materials
status: valid
status modified: 2026-05-06
accepted date: 2026-05-06
in scheme: NACEValue

Wholesale of perfume and cosmetics
type: Concept
notation: G.46.45
definition: Wholesale of perfume and cosmetics
status: valid
status modified: 2026-05-06
accepted date: 2026-05-06
in scheme: NACEValue

Wholesale of pharmaceutical and medical goods
type: Concept
notation: G.46.46
definition: Wholesale of pharmaceutical and medical goods
status: valid
status modified: 2026-05-06
accepted date: 2026-05-06
in scheme: NACEValue

"Wholesale of household, office and shop furniture, carpets and lighting equipment"
type: Concept
notation: G.46.47
definition: "Wholesale of household, office and shop furniture, carpets and lighting equipment"
status: valid
status modified: 2026-05-06
accepted date: 2026-05-06
in scheme: NACEValue

Wholesale of watches and jewellery
type: Concept
notation: G.46.48
definition: Wholesale of watches and jewellery
status: valid
status modified: 2026-05-06
accepted date: 2026-05-06
in scheme: NACEValue

Wholesale of other household goods
type: Concept
notation: G.46.49
definition: Wholesale of other household goods
status: valid
status modified: 2026-05-06
accepted date: 2026-05-06
in scheme: NACEValue

Wholesale of information and communication equipment
type: Concept
notation: G.46.50
definition: Wholesale of information and communication equipment
status: valid
status modified: 2026-05-06
accepted date: 2026-05-06
in scheme: NACEValue

"Wholesale of agricultural machinery, equipment and supplies"
type: Concept
notation: G.46.61
definition: "Wholesale of agricultural machinery, equipment and supplies"
status: valid
status modified: 2026-05-06
accepted date: 2026-05-06
in scheme: NACEValue

Wholesale of machine tools
type: Concept
notation: G.46.62
definition: Wholesale of machine tools
status: valid
status modified: 2026-05-06
accepted date: 2026-05-06
in scheme: NACEValue

"Wholesale of mining, construction and civil engineering machinery"
type: Concept
notation: G.46.63
definition: "Wholesale of mining, construction and civil engineering machinery"
status: valid
status modified: 2026-05-06
accepted date: 2026-05-06
in scheme: NACEValue

Wholesale of other machinery and equipment
type: Concept
notation: G.46.64
definition: Wholesale of other machinery and equipment
status: valid
status modified: 2026-05-06
accepted date: 2026-05-06
in scheme: NACEValue

Wholesale of motor vehicles
type: Concept
notation: G.46.71
definition: Wholesale of motor vehicles
status: valid
status modified: 2026-05-06
accepted date: 2026-05-06
in scheme: NACEValue

Wholesale of motor vehicle parts and accessories
type: Concept
notation: G.46.72
definition: Wholesale of motor vehicle parts and accessories
status: valid
status modified: 2026-05-06
accepted date: 2026-05-06
in scheme: NACEValue

"Wholesale of motorcycles, motorcycle parts and accessories"
type: Concept
notation: G.46.73
definition: "Wholesale of motorcycles, motorcycle parts and accessories"
status: valid
status modified: 2026-05-06
accepted date: 2026-05-06
in scheme: NACEValue

"Wholesale of solid, liquid and gaseous fuels and related products"
type: Concept
notation: G.46.81
definition: "Wholesale of solid, liquid and gaseous fuels and related products"
status: valid
status modified: 2026-05-06
accepted date: 2026-05-06
in scheme: NACEValue

Wholesale of metals and metal ores
type: Concept
notation: G.46.82
definition: Wholesale of metals and metal ores
status: valid
status modified: 2026-05-06
accepted date: 2026-05-06
in scheme: NACEValue

"Wholesale of wood, construction materials and sanitary equipment"
type: Concept
notation: G.46.83
definition: "Wholesale of wood, construction materials and sanitary equipment"
status: valid
status modified: 2026-05-06
accepted date: 2026-05-06
in scheme: NACEValue

"Wholesale of hardware, plumbing and heating equipment and supplies"
type: Concept
notation: G.46.84
definition: "Wholesale of hardware, plumbing and heating equipment and supplies"
status: valid
status modified: 2026-05-06
accepted date: 2026-05-06
in scheme: NACEValue

Wholesale of chemical products
type: Concept
notation: G.46.85
definition: Wholesale of chemical products
status: valid
status modified: 2026-05-06
accepted date: 2026-05-06
in scheme: NACEValue

Wholesale of other intermediate products
type: Concept
notation: G.46.86
definition: Wholesale of other intermediate products
status: valid
status modified: 2026-05-06
accepted date: 2026-05-06
in scheme: NACEValue

Wholesale of waste and scrap
type: Concept
notation: G.46.87
definition: Wholesale of waste and scrap
status: valid
status modified: 2026-05-06
accepted date: 2026-05-06
in scheme: NACEValue

Other specialised wholesale n.e.c.
type: Concept
notation: G.46.89
definition: Other specialised wholesale n.e.c.
status: valid
status modified: 2026-05-06
accepted date: 2026-05-06
in scheme: NACEValue

Non-specialised wholesale trade
type: Concept
notation: G.46.90
definition: Non-specialised wholesale trade
status: valid
status modified: 2026-05-06
accepted date: 2026-05-06
in scheme: NACEValue

"Non-specialised retail sale of predominately food, beverages or tobacco"
type: Concept
notation: G.47.11
definition: "Non-specialised retail sale of predominately food, beverages or tobacco"
status: valid
status modified: 2026-05-06
accepted date: 2026-05-06
in scheme: NACEValue

Other non-specialised retail sale
type: Concept
notation: G.47.12
definition: Other non-specialised retail sale
status: valid
status modified: 2026-05-06
accepted date: 2026-05-06
in scheme: NACEValue

Retail sale of fruit and vegetables
type: Concept
notation: G.47.21
definition: Retail sale of fruit and vegetables
status: valid
status modified: 2026-05-06
accepted date: 2026-05-06
in scheme: NACEValue

Retail sale of meat and meat products
type: Concept
notation: G.47.22
definition: Retail sale of meat and meat products
status: valid
status modified: 2026-05-06
accepted date: 2026-05-06
in scheme: NACEValue

"Retail sale of fish, crustaceans and molluscs"
type: Concept
notation: G.47.23
definition: "Retail sale of fish, crustaceans and molluscs"
status: valid
status modified: 2026-05-06
accepted date: 2026-05-06
in scheme: NACEValue

"Retail sale of bread, cake and confectionery"
type: Concept
notation: G.47.24
definition: "Retail sale of bread, cake and confectionery"
status: valid
status modified: 2026-05-06
accepted date: 2026-05-06
in scheme: NACEValue

Retail sale of beverages
type: Concept
notation: G.47.25
definition: Retail sale of beverages
status: valid
status modified: 2026-05-06
accepted date: 2026-05-06
in scheme: NACEValue

Retail sale of tobacco products
type: Concept
notation: G.47.26
definition: Retail sale of tobacco products
status: valid
status modified: 2026-05-06
accepted date: 2026-05-06
in scheme: NACEValue

Retail sale of other food
type: Concept
notation: G.47.27
definition: Retail sale of other food
status: valid
status modified: 2026-05-06
accepted date: 2026-05-06
in scheme: NACEValue

Retail sale of automotive fuel
type: Concept
notation: G.47.30
definition: Retail sale of automotive fuel
status: valid
status modified: 2026-05-06
accepted date: 2026-05-06
in scheme: NACEValue

Retail sale of information and communication equipment
type: Concept
notation: G.47.40
definition: Retail sale of information and communication equipment
status: valid
status modified: 2026-05-06
accepted date: 2026-05-06
in scheme: NACEValue

Retail sale of textiles
type: Concept
notation: G.47.51
definition: Retail sale of textiles
status: valid
status modified: 2026-05-06
accepted date: 2026-05-06
in scheme: NACEValue

"Retail sale of hardware, building materials, paints and glass"
type: Concept
notation: G.47.52
definition: "Retail sale of hardware, building materials, paints and glass"
status: valid
status modified: 2026-05-06
accepted date: 2026-05-06
in scheme: NACEValue

"Retail sale of carpets, rugs, wall and floor coverings"
type: Concept
notation: G.47.53
definition: "Retail sale of carpets, rugs, wall and floor coverings"
status: valid
status modified: 2026-05-06
accepted date: 2026-05-06
in scheme: NACEValue

Retail sale of electrical household appliances
type: Concept
notation: G.47.54
definition: Retail sale of electrical household appliances
status: valid
status modified: 2026-05-06
accepted date: 2026-05-06
in scheme: NACEValue

"Retail sale of furniture, lighting equipment, tableware and other household goods"
type: Concept
notation: G.47.55
definition: "Retail sale of furniture, lighting equipment, tableware and other household goods"
status: valid
status modified: 2026-05-06
accepted date: 2026-05-06
in scheme: NACEValue

Retail sale of books
type: Concept
notation: G.47.61
definition: Retail sale of books
status: valid
status modified: 2026-05-06
accepted date: 2026-05-06
in scheme: NACEValue

"Retail sale of newspapers, and other periodical publications and stationery"
type: Concept
notation: G.47.62
definition: "Retail sale of newspapers, and other periodical publications and stationery"
status: valid
status modified: 2026-05-06
accepted date: 2026-05-06
in scheme: NACEValue

Retail sale of sporting equipment
type: Concept
notation: G.47.63
definition: Retail sale of sporting equipment
status: valid
status modified: 2026-05-06
accepted date: 2026-05-06
in scheme: NACEValue

Retail sale of games and toys
type: Concept
notation: G.47.64
definition: Retail sale of games and toys
status: valid
status modified: 2026-05-06
accepted date: 2026-05-06
in scheme: NACEValue

Retail sale of cultural and recreational goods n.e.c.
type: Concept
notation: G.47.69
definition: Retail sale of cultural and recreational goods n.e.c.
status: valid
status modified: 2026-05-06
accepted date: 2026-05-06
in scheme: NACEValue

Retail sale of clothing
type: Concept
notation: G.47.71
definition: Retail sale of clothing
status: valid
status modified: 2026-05-06
accepted date: 2026-05-06
in scheme: NACEValue

Retail sale of footwear and leather goods
type: Concept
notation: G.47.72
definition: Retail sale of footwear and leather goods
status: valid
status modified: 2026-05-06
accepted date: 2026-05-06
in scheme: NACEValue

Retail sale of pharmaceutical products
type: Concept
notation: G.47.73
definition: Retail sale of pharmaceutical products
status: valid
status modified: 2026-05-06
accepted date: 2026-05-06
in scheme: NACEValue

Retail sale of medical and orthopaedic goods
type: Concept
notation: G.47.74
definition: Retail sale of medical and orthopaedic goods
status: valid
status modified: 2026-05-06
accepted date: 2026-05-06
in scheme: NACEValue

Retail sale of cosmetic and toilet articles
type: Concept
notation: G.47.75
definition: Retail sale of cosmetic and toilet articles
status: valid
status modified: 2026-05-06
accepted date: 2026-05-06
in scheme: NACEValue

"Retail sale of flowers, plants, fertilisers, pets and pet food"
type: Concept
notation: G.47.76
definition: "Retail sale of flowers, plants, fertilisers, pets and pet food"
status: valid
status modified: 2026-05-06
accepted date: 2026-05-06
in scheme: NACEValue

Retail sale of watches and jewellery
type: Concept
notation: G.47.77
definition: Retail sale of watches and jewellery
status: valid
status modified: 2026-05-06
accepted date: 2026-05-06
in scheme: NACEValue

Retail sale of other new goods
type: Concept
notation: G.47.78
definition: Retail sale of other new goods
status: valid
status modified: 2026-05-06
accepted date: 2026-05-06
in scheme: NACEValue

Retail sale of second-hand goods
type: Concept
notation: G.47.79
definition: Retail sale of second-hand goods
status: valid
status modified: 2026-05-06
accepted date: 2026-05-06
in scheme: NACEValue

Retail sale of motor vehicles
type: Concept
notation: G.47.81
definition: Retail sale of motor vehicles
status: valid
status modified: 2026-05-06
accepted date: 2026-05-06
in scheme: NACEValue

Retail sale of motor vehicle parts and accessories
type: Concept
notation: G.47.82
definition: Retail sale of motor vehicle parts and accessories
status: valid
status modified: 2026-05-06
accepted date: 2026-05-06
in scheme: NACEValue

"Retail sale of motorcycles, motorcycle parts and accessories"
type: Concept
notation: G.47.83
definition: "Retail sale of motorcycles, motorcycle parts and accessories"
status: valid
status modified: 2026-05-06
accepted date: 2026-05-06
in scheme: NACEValue

Intermediation service activities for non-specialised retail sale
type: Concept
notation: G.47.91
definition: Intermediation service activities for non-specialised retail sale
status: valid
status modified: 2026-05-06
accepted date: 2026-05-06
in scheme: NACEValue

Intermediation service activities for specialised retail sale
type: Concept
notation: G.47.92
definition: Intermediation service activities for specialised retail sale
status: valid
status modified: 2026-05-06
accepted date: 2026-05-06
in scheme: NACEValue

Passenger heavy rail transport
type: Concept
notation: H.49.11
definition: Passenger heavy rail transport
status: valid
status modified: 2026-05-06
accepted date: 2026-05-06
in scheme: NACEValue

Other passenger rail transport
type: Concept
notation: H.49.12
definition: Other passenger rail transport
status: valid
status modified: 2026-05-06
accepted date: 2026-05-06
in scheme: NACEValue

Freight rail transport
type: Concept
notation: H.49.20
definition: Freight rail transport
status: valid
status modified: 2026-05-06
accepted date: 2026-05-06
in scheme: NACEValue

Scheduled passenger transport by road
type: Concept
notation: H.49.31
definition: Scheduled passenger transport by road
status: valid
status modified: 2026-05-06
accepted date: 2026-05-06
in scheme: NACEValue

Non-scheduled passenger transport by road
type: Concept
notation: H.49.32
definition: Non-scheduled passenger transport by road
status: valid
status modified: 2026-05-06
accepted date: 2026-05-06
in scheme: NACEValue

On-demand passenger transport service activities by vehicle with driver
type: Concept
notation: H.49.33
definition: On-demand passenger transport service activities by vehicle with driver
status: valid
status modified: 2026-05-06
accepted date: 2026-05-06
in scheme: NACEValue

Passenger transport by cableways and ski lifts
type: Concept
notation: H.49.34
definition: Passenger transport by cableways and ski lifts
status: valid
status modified: 2026-05-06
accepted date: 2026-05-06
in scheme: NACEValue

Other passenger land transport n.e.c.
type: Concept
notation: H.49.39
definition: Other passenger land transport n.e.c.
status: valid
status modified: 2026-05-06
accepted date: 2026-05-06
in scheme: NACEValue

Freight transport by road
type: Concept
notation: H.49.41
definition: Freight transport by road
status: valid
status modified: 2026-05-06
accepted date: 2026-05-06
in scheme: NACEValue

Removal services
type: Concept
notation: H.49.42
definition: Removal services
status: valid
status modified: 2026-05-06
accepted date: 2026-05-06
in scheme: NACEValue

Transport via pipeline
type: Concept
notation: H.49.50
definition: Transport via pipeline
status: valid
status modified: 2026-05-06
accepted date: 2026-05-06
in scheme: NACEValue

Sea and coastal passenger water transport
type: Concept
notation: H.50.10
definition: Sea and coastal passenger water transport
status: valid
status modified: 2026-05-06
accepted date: 2026-05-06
in scheme: NACEValue

Sea and coastal freight water transport
type: Concept
notation: H.50.20
definition: Sea and coastal freight water transport
status: valid
status modified: 2026-05-06
accepted date: 2026-05-06
in scheme: NACEValue

Inland passenger water transport
type: Concept
notation: H.50.30
definition: Inland passenger water transport
status: valid
status modified: 2026-05-06
accepted date: 2026-05-06
in scheme: NACEValue

Inland freight water transport
type: Concept
notation: H.50.40
definition: Inland freight water transport
status: valid
status modified: 2026-05-06
accepted date: 2026-05-06
in scheme: NACEValue

Passenger air transport
type: Concept
notation: H.51.10
definition: Passenger air transport
status: valid
status modified: 2026-05-06
accepted date: 2026-05-06
in scheme: NACEValue

Freight air transport
type: Concept
notation: H.51.21
definition: Freight air transport
status: valid
status modified: 2026-05-06
accepted date: 2026-05-06
in scheme: NACEValue

Space transport
type: Concept
notation: H.51.22
definition: Space transport
status: valid
status modified: 2026-05-06
accepted date: 2026-05-06
in scheme: NACEValue

Warehousing and storage
type: Concept
notation: H.52.10
definition: Warehousing and storage
status: valid
status modified: 2026-05-06
accepted date: 2026-05-06
in scheme: NACEValue

Service activities incidental to land transportation
type: Concept
notation: H.52.21
definition: Service activities incidental to land transportation
status: valid
status modified: 2026-05-06
accepted date: 2026-05-06
in scheme: NACEValue

Service activities incidental to water transportation
type: Concept
notation: H.52.22
definition: Service activities incidental to water transportation
status: valid
status modified: 2026-05-06
accepted date: 2026-05-06
in scheme: NACEValue

Service activities incidental to air transportation
type: Concept
notation: H.52.23
definition: Service activities incidental to air transportation
status: valid
status modified: 2026-05-06
accepted date: 2026-05-06
in scheme: NACEValue

Cargo handling
type: Concept
notation: H.52.24
definition: Cargo handling
status: valid
status modified: 2026-05-06
accepted date: 2026-05-06
in scheme: NACEValue

Logistics service activities
type: Concept
notation: H.52.25
definition: Logistics service activities
status: valid
status modified: 2026-05-06
accepted date: 2026-05-06
in scheme: NACEValue

Other support activities for transportation
type: Concept
notation: H.52.26
definition: Other support activities for transportation
status: valid
status modified: 2026-05-06
accepted date: 2026-05-06
in scheme: NACEValue

Intermediation service activities for freight transportation
type: Concept
notation: H.52.31
definition: Intermediation service activities for freight transportation
status: valid
status modified: 2026-05-06
accepted date: 2026-05-06
in scheme: NACEValue

Intermediation service activities for passenger transportation
type: Concept
notation: H.52.32
definition: Intermediation service activities for passenger transportation
status: valid
status modified: 2026-05-06
accepted date: 2026-05-06
in scheme: NACEValue

Postal activities under universal service obligation
type: Concept
notation: H.53.10
definition: Postal activities under universal service obligation
status: valid
status modified: 2026-05-06
accepted date: 2026-05-06
in scheme: NACEValue

Other postal and courier activities
type: Concept
notation: H.53.20
definition: Other postal and courier activities
status: valid
status modified: 2026-05-06
accepted date: 2026-05-06
in scheme: NACEValue

Intermediation service activities for postal and courier activities
type: Concept
notation: H.53.30
definition: Intermediation service activities for postal and courier activities
status: valid
status modified: 2026-05-06
accepted date: 2026-05-06
in scheme: NACEValue

Hotels and similar accommodation
type: Concept
notation: I.55.10
definition: Hotels and similar accommodation
status: valid
status modified: 2026-05-06
accepted date: 2026-05-06
in scheme: NACEValue

Holiday and other short-stay accommodation
type: Concept
notation: I.55.20
definition: Holiday and other short-stay accommodation
status: valid
status modified: 2026-05-06
accepted date: 2026-05-06
in scheme: NACEValue

Camping grounds and recreational vehicle parks
type: Concept
notation: I.55.30
definition: Camping grounds and recreational vehicle parks
status: valid
status modified: 2026-05-06
accepted date: 2026-05-06
in scheme: NACEValue

Intermediation service activities for accommodation
type: Concept
notation: I.55.40
definition: Intermediation service activities for accommodation
status: valid
status modified: 2026-05-06
accepted date: 2026-05-06
in scheme: NACEValue

Other accommodation
type: Concept
notation: I.55.90
definition: Other accommodation
status: valid
status modified: 2026-05-06
accepted date: 2026-05-06
in scheme: NACEValue

Restaurant activities
type: Concept
notation: I.56.11
definition: Restaurant activities
status: valid
status modified: 2026-05-06
accepted date: 2026-05-06
in scheme: NACEValue

Mobile food service activities
type: Concept
notation: I.56.12
definition: Mobile food service activities
status: valid
status modified: 2026-05-06
accepted date: 2026-05-06
in scheme: NACEValue

Event catering activities
type: Concept
notation: I.56.21
definition: Event catering activities
status: valid
status modified: 2026-05-06
accepted date: 2026-05-06
in scheme: NACEValue

Contract catering service activities and other food service activities
type: Concept
notation: I.56.22
definition: Contract catering service activities and other food service activities
status: valid
status modified: 2026-05-06
accepted date: 2026-05-06
in scheme: NACEValue

Beverage serving activities
type: Concept
notation: I.56.30
definition: Beverage serving activities
status: valid
status modified: 2026-05-06
accepted date: 2026-05-06
in scheme: NACEValue

Intermediation service activities for food and beverage services activities
type: Concept
notation: I.56.40
definition: Intermediation service activities for food and beverage services activities
status: valid
status modified: 2026-05-06
accepted date: 2026-05-06
in scheme: NACEValue

Publishing of books
type: Concept
notation: J.58.11
definition: Publishing of books
status: valid
status modified: 2026-05-06
accepted date: 2026-05-06
in scheme: NACEValue

Publishing of newspapers
type: Concept
notation: J.58.12
definition: Publishing of newspapers
status: valid
status modified: 2026-05-06
accepted date: 2026-05-06
in scheme: NACEValue

Publishing of journals and periodicals
type: Concept
notation: J.58.13
definition: Publishing of journals and periodicals
status: valid
status modified: 2026-05-06
accepted date: 2026-05-06
in scheme: NACEValue

"Other publishing activities, except software publishing"
type: Concept
notation: J.58.19
definition: "Other publishing activities, except software publishing"
status: valid
status modified: 2026-05-06
accepted date: 2026-05-06
in scheme: NACEValue

Publishing of video games
type: Concept
notation: J.58.21
definition: Publishing of video games
status: valid
status modified: 2026-05-06
accepted date: 2026-05-06
in scheme: NACEValue

Other software publishing
type: Concept
notation: J.58.29
definition: Other software publishing
status: valid
status modified: 2026-05-06
accepted date: 2026-05-06
in scheme: NACEValue

"Motion picture, video and television programme production activities"
type: Concept
notation: J.59.11
definition: "Motion picture, video and television programme production activities"
status: valid
status modified: 2026-05-06
accepted date: 2026-05-06
in scheme: NACEValue

"Motion picture, video and television programme post-production activities"
type: Concept
notation: J.59.12
definition: "Motion picture, video and television programme post-production activities"
status: valid
status modified: 2026-05-06
accepted date: 2026-05-06
in scheme: NACEValue

Motion picture and video distribution activities
type: Concept
notation: J.59.13
definition: Motion picture and video distribution activities
status: valid
status modified: 2026-05-06
accepted date: 2026-05-06
in scheme: NACEValue

Motion picture projection activities
type: Concept
notation: J.59.14
definition: Motion picture projection activities
status: valid
status modified: 2026-05-06
accepted date: 2026-05-06
in scheme: NACEValue

Sound recording and music publishing activities
type: Concept
notation: J.59.20
definition: Sound recording and music publishing activities
status: valid
status modified: 2026-05-06
accepted date: 2026-05-06
in scheme: NACEValue

Radio broadcasting and audio distribution activities
type: Concept
notation: J.60.10
definition: Radio broadcasting and audio distribution activities
status: valid
status modified: 2026-05-06
accepted date: 2026-05-06
in scheme: NACEValue

"Television programming, broadcasting and video distribution activities"
type: Concept
notation: J.60.20
definition: "Television programming, broadcasting and video distribution activities"
status: valid
status modified: 2026-05-06
accepted date: 2026-05-06
in scheme: NACEValue

News agency activities
type: Concept
notation: J.60.31
definition: News agency activities
status: valid
status modified: 2026-05-06
accepted date: 2026-05-06
in scheme: NACEValue

Other content distribution activities
type: Concept
notation: J.60.39
definition: Other content distribution activities
status: valid
status modified: 2026-05-06
accepted date: 2026-05-06
in scheme: NACEValue

"Wired, wireless, and satellite telecommunication activities"
type: Concept
notation: K.61.10
definition: "Wired, wireless, and satellite telecommunication activities"
status: valid
status modified: 2026-05-06
accepted date: 2026-05-06
in scheme: NACEValue

Telecommunication reselling activities and intermediation service activities for telecommunication
type: Concept
notation: K.61.20
definition: Telecommunication reselling activities and intermediation service activities for telecommunication
status: valid
status modified: 2026-05-06
accepted date: 2026-05-06
in scheme: NACEValue

Other telecommunication activities
type: Concept
notation: K.61.90
definition: Other telecommunication activities
status: valid
status modified: 2026-05-06
accepted date: 2026-05-06
in scheme: NACEValue

Computer programming activities
type: Concept
notation: K.62.10
definition: Computer programming activities
status: valid
status modified: 2026-05-06
accepted date: 2026-05-06
in scheme: NACEValue

Computer consultancy and computer facilities management activities
type: Concept
notation: K.62.20
definition: Computer consultancy and computer facilities management activities
status: valid
status modified: 2026-05-06
accepted date: 2026-05-06
in scheme: NACEValue

Other information technology and computer service activities
type: Concept
notation: K.62.90
definition: Other information technology and computer service activities
status: valid
status modified: 2026-05-06
accepted date: 2026-05-06
in scheme: NACEValue

"Computing infrastructure, data processing, hosting and related activities"
type: Concept
notation: K.63.10
definition: "Computing infrastructure, data processing, hosting and related activities"
status: valid
status modified: 2026-05-06
accepted date: 2026-05-06
in scheme: NACEValue

Web search portal activities
type: Concept
notation: K.63.91
definition: Web search portal activities
status: valid
status modified: 2026-05-06
accepted date: 2026-05-06
in scheme: NACEValue

Other information service activities
type: Concept
notation: K.63.92
definition: Other information service activities
status: valid
status modified: 2026-05-06
accepted date: 2026-05-06
in scheme: NACEValue

Central banking
type: Concept
notation: L.64.11
definition: Central banking
status: valid
status modified: 2026-05-06
accepted date: 2026-05-06
in scheme: NACEValue

Other monetary intermediation
type: Concept
notation: L.64.19
definition: Other monetary intermediation
status: valid
status modified: 2026-05-06
accepted date: 2026-05-06
in scheme: NACEValue

Activities of holding companies
type: Concept
notation: L.64.21
definition: Activities of holding companies
status: valid
status modified: 2026-05-06
accepted date: 2026-05-06
in scheme: NACEValue

Activities of financing conduits
type: Concept
notation: L.64.22
definition: Activities of financing conduits
status: valid
status modified: 2026-05-06
accepted date: 2026-05-06
in scheme: NACEValue

Activities of money market and non-money market investments funds
type: Concept
notation: L.64.31
definition: Activities of money market and non-money market investments funds
status: valid
status modified: 2026-05-06
accepted date: 2026-05-06
in scheme: NACEValue

"Activities of trust, estate and agency accounts"
type: Concept
notation: L.64.32
definition: "Activities of trust, estate and agency accounts"
status: valid
status modified: 2026-05-06
accepted date: 2026-05-06
in scheme: NACEValue

Financial leasing
type: Concept
notation: L.64.91
definition: Financial leasing
status: valid
status modified: 2026-05-06
accepted date: 2026-05-06
in scheme: NACEValue

Other credit granting
type: Concept
notation: L.64.92
definition: Other credit granting
status: valid
status modified: 2026-05-06
accepted date: 2026-05-06
in scheme: NACEValue

"Other financial service activities, except insurance and pension funding n.e.c."
type: Concept
notation: L.64.99
definition: "Other financial service activities, except insurance and pension funding n.e.c."
status: valid
status modified: 2026-05-06
accepted date: 2026-05-06
in scheme: NACEValue

Life insurance
type: Concept
notation: L.65.11
definition: Life insurance
status: valid
status modified: 2026-05-06
accepted date: 2026-05-06
in scheme: NACEValue

Non-life insurance
type: Concept
notation: L.65.12
definition: Non-life insurance
status: valid
status modified: 2026-05-06
accepted date: 2026-05-06
in scheme: NACEValue

Reinsurance
type: Concept
notation: L.65.20
definition: Reinsurance
status: valid
status modified: 2026-05-06
accepted date: 2026-05-06
in scheme: NACEValue

Pension funding
type: Concept
notation: L.65.30
definition: Pension funding
status: valid
status modified: 2026-05-06
accepted date: 2026-05-06
in scheme: NACEValue

Administration of financial markets
type: Concept
notation: L.66.11
definition: Administration of financial markets
status: valid
status modified: 2026-05-06
accepted date: 2026-05-06
in scheme: NACEValue

Security and commodity contracts brokerage
type: Concept
notation: L.66.12
definition: Security and commodity contracts brokerage
status: valid
status modified: 2026-05-06
accepted date: 2026-05-06
in scheme: NACEValue

"Other activities auxiliary to financial services, except insurance and pension funding"
type: Concept
notation: L.66.19
definition: "Other activities auxiliary to financial services, except insurance and pension funding"
status: valid
status modified: 2026-05-06
accepted date: 2026-05-06
in scheme: NACEValue

Risk and damage evaluation
type: Concept
notation: L.66.21
definition: Risk and damage evaluation
status: valid
status modified: 2026-05-06
accepted date: 2026-05-06
in scheme: NACEValue

Activities of insurance agents and brokers
type: Concept
notation: L.66.22
definition: Activities of insurance agents and brokers
status: valid
status modified: 2026-05-06
accepted date: 2026-05-06
in scheme: NACEValue

Activities auxiliary to insurance and pension funding n.e.c.
type: Concept
notation: L.66.29
definition: Activities auxiliary to insurance and pension funding n.e.c.
status: valid
status modified: 2026-05-06
accepted date: 2026-05-06
in scheme: NACEValue

Fund management activities
type: Concept
notation: L.66.30
definition: Fund management activities
status: valid
status modified: 2026-05-06
accepted date: 2026-05-06
in scheme: NACEValue

Buying and selling of own real estate
type: Concept
notation: M.68.11
definition: Buying and selling of own real estate
status: valid
status modified: 2026-05-06
accepted date: 2026-05-06
in scheme: NACEValue

Development of building projects
type: Concept
notation: M.68.12
definition: Development of building projects
status: valid
status modified: 2026-05-06
accepted date: 2026-05-06
in scheme: NACEValue

Rental and operating of own or leased real estate
type: Concept
notation: M.68.20
definition: Rental and operating of own or leased real estate
status: valid
status modified: 2026-05-06
accepted date: 2026-05-06
in scheme: NACEValue

Intermediation service activities for real estate activities
type: Concept
notation: M.68.31
definition: Intermediation service activities for real estate activities
status: valid
status modified: 2026-05-06
accepted date: 2026-05-06
in scheme: NACEValue

Other real estate activities on a fee or contract basis
type: Concept
notation: M.68.32
definition: Other real estate activities on a fee or contract basis
status: valid
status modified: 2026-05-06
accepted date: 2026-05-06
in scheme: NACEValue

Legal activities
type: Concept
notation: N.69.10
definition: Legal activities
status: valid
status modified: 2026-05-06
accepted date: 2026-05-06
in scheme: NACEValue

"Accounting, bookkeeping and auditing activities; tax consultancy"
type: Concept
notation: N.69.20
definition: "Accounting, bookkeeping and auditing activities; tax consultancy"
status: valid
status modified: 2026-05-06
accepted date: 2026-05-06
in scheme: NACEValue

Activities of head offices
type: Concept
notation: N.70.10
definition: Activities of head offices
status: valid
status modified: 2026-05-06
accepted date: 2026-05-06
in scheme: NACEValue

Business and other management consultancy activities
type: Concept
notation: N.70.20
definition: Business and other management consultancy activities
status: valid
status modified: 2026-05-06
accepted date: 2026-05-06
in scheme: NACEValue

Architectural activities
type: Concept
notation: N.71.11
definition: Architectural activities
status: valid
status modified: 2026-05-06
accepted date: 2026-05-06
in scheme: NACEValue

Engineering activities and related technical consultancy
type: Concept
notation: N.71.12
definition: Engineering activities and related technical consultancy
status: valid
status modified: 2026-05-06
accepted date: 2026-05-06
in scheme: NACEValue

Technical testing and analysis
type: Concept
notation: N.71.20
definition: Technical testing and analysis
status: valid
status modified: 2026-05-06
accepted date: 2026-05-06
in scheme: NACEValue

Research and experimental development on natural sciences and engineering
type: Concept
notation: N.72.10
definition: Research and experimental development on natural sciences and engineering
status: valid
status modified: 2026-05-06
accepted date: 2026-05-06
in scheme: NACEValue

Research and experimental development on social sciences and humanities
type: Concept
notation: N.72.20
definition: Research and experimental development on social sciences and humanities
status: valid
status modified: 2026-05-06
accepted date: 2026-05-06
in scheme: NACEValue

Activities of advertising agencies
type: Concept
notation: N.73.11
definition: Activities of advertising agencies
status: valid
status modified: 2026-05-06
accepted date: 2026-05-06
in scheme: NACEValue

Media representation
type: Concept
notation: N.73.12
definition: Media representation
status: valid
status modified: 2026-05-06
accepted date: 2026-05-06
in scheme: NACEValue

Market research and public opinion polling
type: Concept
notation: N.73.20
definition: Market research and public opinion polling
status: valid
status modified: 2026-05-06
accepted date: 2026-05-06
in scheme: NACEValue

Public relations and communication activities
type: Concept
notation: N.73.30
definition: Public relations and communication activities
status: valid
status modified: 2026-05-06
accepted date: 2026-05-06
in scheme: NACEValue

Industrial product and fashion design activities
type: Concept
notation: N.74.11
definition: Industrial product and fashion design activities
status: valid
status modified: 2026-05-06
accepted date: 2026-05-06
in scheme: NACEValue

Graphic design and visual communication activities
type: Concept
notation: N.74.12
definition: Graphic design and visual communication activities
status: valid
status modified: 2026-05-06
accepted date: 2026-05-06
in scheme: NACEValue

Interior design activities
type: Concept
notation: N.74.13
definition: Interior design activities
status: valid
status modified: 2026-05-06
accepted date: 2026-05-06
in scheme: NACEValue

Other specialised design activities
type: Concept
notation: N.74.14
definition: Other specialised design activities
status: valid
status modified: 2026-05-06
accepted date: 2026-05-06
in scheme: NACEValue

Photographic activities
type: Concept
notation: N.74.20
definition: Photographic activities
status: valid
status modified: 2026-05-06
accepted date: 2026-05-06
in scheme: NACEValue

Translation and interpretation activities
type: Concept
notation: N.74.30
definition: Translation and interpretation activities
status: valid
status modified: 2026-05-06
accepted date: 2026-05-06
in scheme: NACEValue

Patent brokering and marketing service activities
type: Concept
notation: N.74.91
definition: Patent brokering and marketing service activities
status: valid
status modified: 2026-05-06
accepted date: 2026-05-06
in scheme: NACEValue

"All other professional, scientific and technical activities n.e.c."
type: Concept
notation: N.74.99
definition: "All other professional, scientific and technical activities n.e.c."
status: valid
status modified: 2026-05-06
accepted date: 2026-05-06
in scheme: NACEValue

Veterinary activities
type: Concept
notation: N.75.00
definition: Veterinary activities
status: valid
status modified: 2026-05-06
accepted date: 2026-05-06
in scheme: NACEValue

Rental and leasing of cars and light motor vehicles
type: Concept
notation: O.77.11
definition: Rental and leasing of cars and light motor vehicles
status: valid
status modified: 2026-05-06
accepted date: 2026-05-06
in scheme: NACEValue

Rental and leasing of trucks
type: Concept
notation: O.77.12
definition: Rental and leasing of trucks
status: valid
status modified: 2026-05-06
accepted date: 2026-05-06
in scheme: NACEValue

Rental and leasing of recreational and sports goods
type: Concept
notation: O.77.21
definition: Rental and leasing of recreational and sports goods
status: valid
status modified: 2026-05-06
accepted date: 2026-05-06
in scheme: NACEValue

Rental and leasing of other personal and household goods
type: Concept
notation: O.77.22
definition: Rental and leasing of other personal and household goods
status: valid
status modified: 2026-05-06
accepted date: 2026-05-06
in scheme: NACEValue

Rental and leasing of agricultural machinery and equipment
type: Concept
notation: O.77.31
definition: Rental and leasing of agricultural machinery and equipment
status: valid
status modified: 2026-05-06
accepted date: 2026-05-06
in scheme: NACEValue

Rental and leasing of construction and civil engineering machinery and equipment
type: Concept
notation: O.77.32
definition: Rental and leasing of construction and civil engineering machinery and equipment
status: valid
status modified: 2026-05-06
accepted date: 2026-05-06
in scheme: NACEValue

"Rental and leasing of office machinery, equipment and computers"
type: Concept
notation: O.77.33
definition: "Rental and leasing of office machinery, equipment and computers"
status: valid
status modified: 2026-05-06
accepted date: 2026-05-06
in scheme: NACEValue

Rental and leasing of water transport equipment
type: Concept
notation: O.77.34
definition: Rental and leasing of water transport equipment
status: valid
status modified: 2026-05-06
accepted date: 2026-05-06
in scheme: NACEValue

Rental and leasing of air transport equipment
type: Concept
notation: O.77.35
definition: Rental and leasing of air transport equipment
status: valid
status modified: 2026-05-06
accepted date: 2026-05-06
in scheme: NACEValue

"Rental and leasing of other machinery, equipment and tangible goods n.e.c."
type: Concept
notation: O.77.39
definition: "Rental and leasing of other machinery, equipment and tangible goods n.e.c."
status: valid
status modified: 2026-05-06
accepted date: 2026-05-06
in scheme: NACEValue

"Leasing of intellectual property and similar products, except copyrighted works"
type: Concept
notation: O.77.40
definition: "Leasing of intellectual property and similar products, except copyrighted works"
status: valid
status modified: 2026-05-06
accepted date: 2026-05-06
in scheme: NACEValue

"Intermediation service activities for rental and leasing of cars, motorhomes and trailers"
type: Concept
notation: O.77.51
definition: "Intermediation service activities for rental and leasing of cars, motorhomes and trailers"
status: valid
status modified: 2026-05-06
accepted date: 2026-05-06
in scheme: NACEValue

Intermediation service activities for rental and leasing of other tangible goods and non-financial intangible assets
type: Concept
notation: O.77.52
definition: Intermediation service activities for rental and leasing of other tangible goods and non-financial intangible assets
status: valid
status modified: 2026-05-06
accepted date: 2026-05-06
in scheme: NACEValue

Activities of employment placement agencies
type: Concept
notation: O.78.10
definition: Activities of employment placement agencies
status: valid
status modified: 2026-05-06
accepted date: 2026-05-06
in scheme: NACEValue

Temporary employment agency activities and other human resource provisions
type: Concept
notation: O.78.20
definition: Temporary employment agency activities and other human resource provisions
status: valid
status modified: 2026-05-06
accepted date: 2026-05-06
in scheme: NACEValue

Travel agency activities
type: Concept
notation: O.79.11
definition: Travel agency activities
status: valid
status modified: 2026-05-06
accepted date: 2026-05-06
in scheme: NACEValue

Tour operator activities
type: Concept
notation: O.79.12
definition: Tour operator activities
status: valid
status modified: 2026-05-06
accepted date: 2026-05-06
in scheme: NACEValue

Other reservation service and related activities
type: Concept
notation: O.79.90
definition: Other reservation service and related activities
status: valid
status modified: 2026-05-06
accepted date: 2026-05-06
in scheme: NACEValue

Investigation and private security activities
type: Concept
notation: O.80.01
definition: Investigation and private security activities
status: valid
status modified: 2026-05-06
accepted date: 2026-05-06
in scheme: NACEValue

Security activities n.e.c.
type: Concept
notation: O.80.09
definition: Security activities n.e.c.
status: valid
status modified: 2026-05-06
accepted date: 2026-05-06
in scheme: NACEValue

Combined facilities support activities
type: Concept
notation: O.81.10
definition: Combined facilities support activities
status: valid
status modified: 2026-05-06
accepted date: 2026-05-06
in scheme: NACEValue

General cleaning of buildings
type: Concept
notation: O.81.21
definition: General cleaning of buildings
status: valid
status modified: 2026-05-06
accepted date: 2026-05-06
in scheme: NACEValue

Other building and industrial cleaning activities
type: Concept
notation: O.81.22
definition: Other building and industrial cleaning activities
status: valid
status modified: 2026-05-06
accepted date: 2026-05-06
in scheme: NACEValue

Other cleaning activities
type: Concept
notation: O.81.23
definition: Other cleaning activities
status: valid
status modified: 2026-05-06
accepted date: 2026-05-06
in scheme: NACEValue

Landscape service activities
type: Concept
notation: O.81.30
definition: Landscape service activities
status: valid
status modified: 2026-05-06
accepted date: 2026-05-06
in scheme: NACEValue

Office administrative and support activities
type: Concept
notation: O.82.10
definition: Office administrative and support activities
status: valid
status modified: 2026-05-06
accepted date: 2026-05-06
in scheme: NACEValue

Activities of call centres
type: Concept
notation: O.82.20
definition: Activities of call centres
status: valid
status modified: 2026-05-06
accepted date: 2026-05-06
in scheme: NACEValue

Organisation of conventions and trade shows
type: Concept
notation: O.82.30
definition: Organisation of conventions and trade shows
status: valid
status modified: 2026-05-06
accepted date: 2026-05-06
in scheme: NACEValue

Intermediation service activities for business support service activities n.e.c.
type: Concept
notation: O.82.40
definition: Intermediation service activities for business support service activities n.e.c.
status: valid
status modified: 2026-05-06
accepted date: 2026-05-06
in scheme: NACEValue

Activities of collection agencies and credit bureaus
type: Concept
notation: O.82.91
definition: Activities of collection agencies and credit bureaus
status: valid
status modified: 2026-05-06
accepted date: 2026-05-06
in scheme: NACEValue

Packaging activities
type: Concept
notation: O.82.92
definition: Packaging activities
status: valid
status modified: 2026-05-06
accepted date: 2026-05-06
in scheme: NACEValue

Other business support service activities n.e.c.
type: Concept
notation: O.82.99
definition: Other business support service activities n.e.c.
status: valid
status modified: 2026-05-06
accepted date: 2026-05-06
in scheme: NACEValue

General public administration activities
type: Concept
notation: P.84.11
definition: General public administration activities
status: valid
status modified: 2026-05-06
accepted date: 2026-05-06
in scheme: NACEValue

"Regulation of health care, education, cultural services and other social services"
type: Concept
notation: P.84.12
definition: "Regulation of health care, education, cultural services and other social services"
status: valid
status modified: 2026-05-06
accepted date: 2026-05-06
in scheme: NACEValue

Regulation of and contribution to more efficient operation of businesses
type: Concept
notation: P.84.13
definition: Regulation of and contribution to more efficient operation of businesses
status: valid
status modified: 2026-05-06
accepted date: 2026-05-06
in scheme: NACEValue

Foreign affairs
type: Concept
notation: P.84.21
definition: Foreign affairs
status: valid
status modified: 2026-05-06
accepted date: 2026-05-06
in scheme: NACEValue

Defence activities
type: Concept
notation: P.84.22
definition: Defence activities
status: valid
status modified: 2026-05-06
accepted date: 2026-05-06
in scheme: NACEValue

Justice and judicial activities
type: Concept
notation: P.84.23
definition: Justice and judicial activities
status: valid
status modified: 2026-05-06
accepted date: 2026-05-06
in scheme: NACEValue

Public order and safety activities
type: Concept
notation: P.84.24
definition: Public order and safety activities
status: valid
status modified: 2026-05-06
accepted date: 2026-05-06
in scheme: NACEValue

Fire service activities
type: Concept
notation: P.84.25
definition: Fire service activities
status: valid
status modified: 2026-05-06
accepted date: 2026-05-06
in scheme: NACEValue

Compulsory social security activities
type: Concept
notation: P.84.30
definition: Compulsory social security activities
status: valid
status modified: 2026-05-06
accepted date: 2026-05-06
in scheme: NACEValue

Pre-primary education
type: Concept
notation: Q.85.10
definition: Pre-primary education
status: valid
status modified: 2026-05-06
accepted date: 2026-05-06
in scheme: NACEValue

Primary education
type: Concept
notation: Q.85.20
definition: Primary education
status: valid
status modified: 2026-05-06
accepted date: 2026-05-06
in scheme: NACEValue

General secondary education
type: Concept
notation: Q.85.31
definition: General secondary education
status: valid
status modified: 2026-05-06
accepted date: 2026-05-06
in scheme: NACEValue

Vocational secondary education
type: Concept
notation: Q.85.32
definition: Vocational secondary education
status: valid
status modified: 2026-05-06
accepted date: 2026-05-06
in scheme: NACEValue

Post-secondary non-tertiary education
type: Concept
notation: Q.85.33
definition: Post-secondary non-tertiary education
status: valid
status modified: 2026-05-06
accepted date: 2026-05-06
in scheme: NACEValue

Tertiary education
type: Concept
notation: Q.85.40
definition: Tertiary education
status: valid
status modified: 2026-05-06
accepted date: 2026-05-06
in scheme: NACEValue

Sports and recreation education
type: Concept
notation: Q.85.51
definition: Sports and recreation education
status: valid
status modified: 2026-05-06
accepted date: 2026-05-06
in scheme: NACEValue

Cultural education
type: Concept
notation: Q.85.52
definition: Cultural education
status: valid
status modified: 2026-05-06
accepted date: 2026-05-06
in scheme: NACEValue

Driving school activities
type: Concept
notation: Q.85.53
definition: Driving school activities
status: valid
status modified: 2026-05-06
accepted date: 2026-05-06
in scheme: NACEValue

Other education n.e.c.
type: Concept
notation: Q.85.59
definition: Other education n.e.c.
status: valid
status modified: 2026-05-06
accepted date: 2026-05-06
in scheme: NACEValue

Intermediation service activities for courses and tutors
type: Concept
notation: Q.85.61
definition: Intermediation service activities for courses and tutors
status: valid
status modified: 2026-05-06
accepted date: 2026-05-06
in scheme: NACEValue

Educational support activities n.e.c.
type: Concept
notation: Q.85.69
definition: Educational support activities n.e.c.
status: valid
status modified: 2026-05-06
accepted date: 2026-05-06
in scheme: NACEValue

Hospital activities
type: Concept
notation: R.86.10
definition: Hospital activities
status: valid
status modified: 2026-05-06
accepted date: 2026-05-06
in scheme: NACEValue

General medical practice activities
type: Concept
notation: R.86.21
definition: General medical practice activities
status: valid
status modified: 2026-05-06
accepted date: 2026-05-06
in scheme: NACEValue

Medical specialists activities
type: Concept
notation: R.86.22
definition: Medical specialists activities
status: valid
status modified: 2026-05-06
accepted date: 2026-05-06
in scheme: NACEValue

Dental practice care activities
type: Concept
notation: R.86.23
definition: Dental practice care activities
status: valid
status modified: 2026-05-06
accepted date: 2026-05-06
in scheme: NACEValue

Diagnostic imaging services and medical laboratory activities
type: Concept
notation: R.86.91
definition: Diagnostic imaging services and medical laboratory activities
status: valid
status modified: 2026-05-06
accepted date: 2026-05-06
in scheme: NACEValue

Patient transportation by ambulance
type: Concept
notation: R.86.92
definition: Patient transportation by ambulance
status: valid
status modified: 2026-05-06
accepted date: 2026-05-06
in scheme: NACEValue

"Activities of psychologists and psychotherapists, except medical doctors"
type: Concept
notation: R.86.93
definition: "Activities of psychologists and psychotherapists, except medical doctors"
status: valid
status modified: 2026-05-06
accepted date: 2026-05-06
in scheme: NACEValue

Nursing and midwifery activities
type: Concept
notation: R.86.94
definition: Nursing and midwifery activities
status: valid
status modified: 2026-05-06
accepted date: 2026-05-06
in scheme: NACEValue

Physiotherapy activities
type: Concept
notation: R.86.95
definition: Physiotherapy activities
status: valid
status modified: 2026-05-06
accepted date: 2026-05-06
in scheme: NACEValue

"Traditional, complementary and alternative medicine activities"
type: Concept
notation: R.86.96
definition: "Traditional, complementary and alternative medicine activities"
status: valid
status modified: 2026-05-06
accepted date: 2026-05-06
in scheme: NACEValue

"Intermediation service activities for medical, dental and other human health services"
type: Concept
notation: R.86.97
definition: "Intermediation service activities for medical, dental and other human health services"
status: valid
status modified: 2026-05-06
accepted date: 2026-05-06
in scheme: NACEValue

Other human health activities n.e.c.
type: Concept
notation: R.86.99
definition: Other human health activities n.e.c.
status: valid
status modified: 2026-05-06
accepted date: 2026-05-06
in scheme: NACEValue

Residential nursing care activities
type: Concept
notation: R.87.10
definition: Residential nursing care activities
status: valid
status modified: 2026-05-06
accepted date: 2026-05-06
in scheme: NACEValue

Residential care activities for persons living with or having a diagnosis of a mental illness or substance abuse
type: Concept
notation: R.87.20
definition: Residential care activities for persons living with or having a diagnosis of a mental illness or substance abuse
status: valid
status modified: 2026-05-06
accepted date: 2026-05-06
in scheme: NACEValue

Residential care activities for older persons or persons with physical disabilities
type: Concept
notation: R.87.30
definition: Residential care activities for older persons or persons with physical disabilities
status: valid
status modified: 2026-05-06
accepted date: 2026-05-06
in scheme: NACEValue

Intermediation service activities for residential care activities
type: Concept
notation: R.87.91
definition: Intermediation service activities for residential care activities
status: valid
status modified: 2026-05-06
accepted date: 2026-05-06
in scheme: NACEValue

Other residential care activities n.e.c.
type: Concept
notation: R.87.99
definition: Other residential care activities n.e.c.
status: valid
status modified: 2026-05-06
accepted date: 2026-05-06
in scheme: NACEValue

Social work activities without accommodation for older persons or persons with disabilities
type: Concept
notation: R.88.10
definition: Social work activities without accommodation for older persons or persons with disabilities
status: valid
status modified: 2026-05-06
accepted date: 2026-05-06
in scheme: NACEValue

Child day-care activities
type: Concept
notation: R.88.91
definition: Child day-care activities
status: valid
status modified: 2026-05-06
accepted date: 2026-05-06
in scheme: NACEValue

Other social work activities without accommodation n.e.c.
type: Concept
notation: R.88.99
definition: Other social work activities without accommodation n.e.c.
status: valid
status modified: 2026-05-06
accepted date: 2026-05-06
in scheme: NACEValue

Literary creation and musical composition activities
type: Concept
notation: S.90.11
definition: Literary creation and musical composition activities
status: valid
status modified: 2026-05-06
accepted date: 2026-05-06
in scheme: NACEValue

Visual arts creation activities
type: Concept
notation: S.90.12
definition: Visual arts creation activities
status: valid
status modified: 2026-05-06
accepted date: 2026-05-06
in scheme: NACEValue

Other arts creation activities
type: Concept
notation: S.90.13
definition: Other arts creation activities
status: valid
status modified: 2026-05-06
accepted date: 2026-05-06
in scheme: NACEValue

Activities of performing arts
type: Concept
notation: S.90.20
definition: Activities of performing arts
status: valid
status modified: 2026-05-06
accepted date: 2026-05-06
in scheme: NACEValue

Operation of arts facilities and sites
type: Concept
notation: S.90.31
definition: Operation of arts facilities and sites
status: valid
status modified: 2026-05-06
accepted date: 2026-05-06
in scheme: NACEValue

Other support activities to arts and performing arts
type: Concept
notation: S.90.39
definition: Other support activities to arts and performing arts
status: valid
status modified: 2026-05-06
accepted date: 2026-05-06
in scheme: NACEValue

Library activities
type: Concept
notation: S.91.11
definition: Library activities
status: valid
status modified: 2026-05-06
accepted date: 2026-05-06
in scheme: NACEValue

Archive activities
type: Concept
notation: S.91.12
definition: Archive activities
status: valid
status modified: 2026-05-06
accepted date: 2026-05-06
in scheme: NACEValue

Museum and collection activities
type: Concept
notation: S.91.21
definition: Museum and collection activities
status: valid
status modified: 2026-05-06
accepted date: 2026-05-06
in scheme: NACEValue

Historical site and monument activities
type: Concept
notation: S.91.22
definition: Historical site and monument activities
status: valid
status modified: 2026-05-06
accepted date: 2026-05-06
in scheme: NACEValue

"Conservation, restoration and other support activities for cultural heritage"
type: Concept
notation: S.91.30
definition: "Conservation, restoration and other support activities for cultural heritage"
status: valid
status modified: 2026-05-06
accepted date: 2026-05-06
in scheme: NACEValue

Botanical and zoological garden activities
type: Concept
notation: S.91.41
definition: Botanical and zoological garden activities
status: valid
status modified: 2026-05-06
accepted date: 2026-05-06
in scheme: NACEValue

Nature reserve activities
type: Concept
notation: S.91.42
definition: Nature reserve activities
status: valid
status modified: 2026-05-06
accepted date: 2026-05-06
in scheme: NACEValue

Gambling and betting activities
type: Concept
notation: S.92.00
definition: Gambling and betting activities
status: valid
status modified: 2026-05-06
accepted date: 2026-05-06
in scheme: NACEValue

Operation of sports facilities
type: Concept
notation: S.93.11
definition: Operation of sports facilities
status: valid
status modified: 2026-05-06
accepted date: 2026-05-06
in scheme: NACEValue

Activities of sports clubs
type: Concept
notation: S.93.12
definition: Activities of sports clubs
status: valid
status modified: 2026-05-06
accepted date: 2026-05-06
in scheme: NACEValue

Activities of fitness centres
type: Concept
notation: S.93.13
definition: Activities of fitness centres
status: valid
status modified: 2026-05-06
accepted date: 2026-05-06
in scheme: NACEValue

Sports activities n.e.c.
type: Concept
notation: S.93.19
definition: Sports activities n.e.c.
status: valid
status modified: 2026-05-06
accepted date: 2026-05-06
in scheme: NACEValue

Activities of amusement parks and theme parks
type: Concept
notation: S.93.21
definition: Activities of amusement parks and theme parks
status: valid
status modified: 2026-05-06
accepted date: 2026-05-06
in scheme: NACEValue

Amusement and recreation activities n.e.c.
type: Concept
notation: S.93.29
definition: Amusement and recreation activities n.e.c.
status: valid
status modified: 2026-05-06
accepted date: 2026-05-06
in scheme: NACEValue

Activities of business and employers membership organisations
type: Concept
notation: T.94.11
definition: Activities of business and employers membership organisations
status: valid
status modified: 2026-05-06
accepted date: 2026-05-06
in scheme: NACEValue

Activities of professional membership organisations
type: Concept
notation: T.94.12
definition: Activities of professional membership organisations
status: valid
status modified: 2026-05-06
accepted date: 2026-05-06
in scheme: NACEValue

Activities of trade unions
type: Concept
notation: T.94.20
definition: Activities of trade unions
status: valid
status modified: 2026-05-06
accepted date: 2026-05-06
in scheme: NACEValue

Activities of religious organisations
type: Concept
notation: T.94.91
definition: Activities of religious organisations
status: valid
status modified: 2026-05-06
accepted date: 2026-05-06
in scheme: NACEValue

Activities of political organisations
type: Concept
notation: T.94.92
definition: Activities of political organisations
status: valid
status modified: 2026-05-06
accepted date: 2026-05-06
in scheme: NACEValue

Activities of other membership organisations n.e.c.
type: Concept
notation: T.94.99
definition: Activities of other membership organisations n.e.c.
status: valid
status modified: 2026-05-06
accepted date: 2026-05-06
in scheme: NACEValue

Repair and maintenance of computers and communication equipment
type: Concept
notation: T.95.10
definition: Repair and maintenance of computers and communication equipment
status: valid
status modified: 2026-05-06
accepted date: 2026-05-06
in scheme: NACEValue

Repair and maintenance of consumer electronics
type: Concept
notation: T.95.21
definition: Repair and maintenance of consumer electronics
status: valid
status modified: 2026-05-06
accepted date: 2026-05-06
in scheme: NACEValue

Repair and maintenance of household appliances and home and garden equipment
type: Concept
notation: T.95.22
definition: Repair and maintenance of household appliances and home and garden equipment
status: valid
status modified: 2026-05-06
accepted date: 2026-05-06
in scheme: NACEValue

Repair and maintenance of footwear and leather goods
type: Concept
notation: T.95.23
definition: Repair and maintenance of footwear and leather goods
status: valid
status modified: 2026-05-06
accepted date: 2026-05-06
in scheme: NACEValue

Repair and maintenance of furniture and home furnishings
type: Concept
notation: T.95.24
definition: Repair and maintenance of furniture and home furnishings
status: valid
status modified: 2026-05-06
accepted date: 2026-05-06
in scheme: NACEValue

"Repair and maintenance of watches, clocks and jewellery"
type: Concept
notation: T.95.25
definition: "Repair and maintenance of watches, clocks and jewellery"
status: valid
status modified: 2026-05-06
accepted date: 2026-05-06
in scheme: NACEValue

Repair and maintenance of personal and household goods n.e.c.
type: Concept
notation: T.95.29
definition: Repair and maintenance of personal and household goods n.e.c.
status: valid
status modified: 2026-05-06
accepted date: 2026-05-06
in scheme: NACEValue

Repair and maintenance of motor vehicles
type: Concept
notation: T.95.31
definition: Repair and maintenance of motor vehicles
status: valid
status modified: 2026-05-06
accepted date: 2026-05-06
in scheme: NACEValue

Repair and maintenance of motorcycles
type: Concept
notation: T.95.32
definition: Repair and maintenance of motorcycles
status: valid
status modified: 2026-05-06
accepted date: 2026-05-06
in scheme: NACEValue

"Intermediation service activities for repair and maintenance of computers, personal and household goods, and motor vehicles and motorcycles"
type: Concept
notation: T.95.40
definition: "Intermediation service activities for repair and maintenance of computers, personal and household goods, and motor vehicles and motorcycles"
status: valid
status modified: 2026-05-06
accepted date: 2026-05-06
in scheme: NACEValue

Washing and cleaning of textile and fur products
type: Concept
notation: T.96.10
definition: Washing and cleaning of textile and fur products
status: valid
status modified: 2026-05-06
accepted date: 2026-05-06
in scheme: NACEValue

Hairdressing and barber activities
type: Concept
notation: T.96.21
definition: Hairdressing and barber activities
status: valid
status modified: 2026-05-06
accepted date: 2026-05-06
in scheme: NACEValue

Beauty care and other beauty treatment activities
type: Concept
notation: T.96.22
definition: Beauty care and other beauty treatment activities
status: valid
status modified: 2026-05-06
accepted date: 2026-05-06
in scheme: NACEValue

"Day spa, sauna and steam bath activities"
type: Concept
notation: T.96.23
definition: "Day spa, sauna and steam bath activities"
status: valid
status modified: 2026-05-06
accepted date: 2026-05-06
in scheme: NACEValue

Funeral and related activities
type: Concept
notation: T.96.30
definition: Funeral and related activities
status: valid
status modified: 2026-05-06
accepted date: 2026-05-06
in scheme: NACEValue

Intermediation service activities for personal services
type: Concept
notation: T.96.40
definition: Intermediation service activities for personal services
status: valid
status modified: 2026-05-06
accepted date: 2026-05-06
in scheme: NACEValue

Provision of domestic personal service activities
type: Concept
notation: T.96.91
definition: Provision of domestic personal service activities
status: valid
status modified: 2026-05-06
accepted date: 2026-05-06
in scheme: NACEValue

Other personal service activities n.e.c.
type: Concept
notation: T.96.99
definition: Other personal service activities n.e.c.
status: valid
status modified: 2026-05-06
accepted date: 2026-05-06
in scheme: NACEValue

Activities of households as employers of domestic personnel
type: Concept
notation: U.97.00
definition: Activities of households as employers of domestic personnel
status: valid
status modified: 2026-05-06
accepted date: 2026-05-06
in scheme: NACEValue

Undifferentiated goods-producing activities of private households for own use
type: Concept
notation: U.98.10
definition: Undifferentiated goods-producing activities of private households for own use
status: valid
status modified: 2026-05-06
accepted date: 2026-05-06
in scheme: NACEValue

Undifferentiated service-producing activities of private households for own use
type: Concept
notation: U.98.20
definition: Undifferentiated service-producing activities of private households for own use
status: valid
status modified: 2026-05-06
accepted date: 2026-05-06
in scheme: NACEValue

Activities of extraterritorial organisations and bodies
type: Concept
notation: V.99.00
definition: Activities of extraterritorial organisations and bodies
status: valid
status modified: 2026-05-06
accepted date: 2026-05-06
in scheme: NACEValue

Categories of fuel input to further distinguish gaseous fuels as required by Article 72 of Directive 2010/75/EU and to distinguish gaseous fuel as energy use as required by IEPR
type: ConceptScheme
notation: OtherGaseousFuelValue
is part of: Industrial Emission Portal Regulation and Industrial Emission Directive
registration status: Public draft
user modified: antogfed
date modified: 2026-05-07 19:34:44.0
vocabulary type: Common
is numeric concept identifiers: false
is notations equal identifiers: false

BlastFurnaceGas
type: Concept
notation: BlastFurnaceGas
definition: Blast Furnace Gas
status: valid
status modified: 2026-05-06
accepted date: 2026-05-06
in scheme: Categories of fuel input to further distinguish gaseous fuels as required by Article 72 of Directive 2010/75/EU and to distinguish gaseous fuel as energy use as required by IEPR

CokeOvenGas
type: Concept
notation: CokeOvenGas
definition: Coke oven gas
status: valid
status modified: 2026-05-06
accepted date: 2026-05-06
in scheme: Categories of fuel input to further distinguish gaseous fuels as required by Article 72 of Directive 2010/75/EU and to distinguish gaseous fuel as energy use as required by IEPR

FurnaceGas
type: Concept
notation: FurnaceGas
definition: Furnace gas
status: valid
status modified: 2026-05-06
accepted date: 2026-05-06
in scheme: Categories of fuel input to further distinguish gaseous fuels as required by Article 72 of Directive 2010/75/EU and to distinguish gaseous fuel as energy use as required by IEPR

LPG
type: Concept
notation: LPG
definition: Liquefied petroleum gas
status: valid
status modified: 2026-05-06
accepted date: 2026-05-06
in scheme: Categories of fuel input to further distinguish gaseous fuels as required by Article 72 of Directive 2010/75/EU and to distinguish gaseous fuel as energy use as required by IEPR

Other
type: Concept
notation: Other
definition: Other
status: valid
status modified: 2026-05-06
accepted date: 2026-05-06
in scheme: Categories of fuel input to further distinguish gaseous fuels as required by Article 72 of Directive 2010/75/EU and to distinguish gaseous fuel as energy use as required by IEPR

OxygenSteel
type: Concept
notation: OxygenSteel
definition: Oxygen Steel
status: valid
status modified: 2026-05-06
accepted date: 2026-05-06
in scheme: Categories of fuel input to further distinguish gaseous fuels as required by Article 72 of Directive 2010/75/EU and to distinguish gaseous fuel as energy use as required by IEPR

RefineryGas
type: Concept
notation: RefineryGas
definition: Refinery Gas
status: valid
status modified: 2026-05-06
accepted date: 2026-05-06
in scheme: Categories of fuel input to further distinguish gaseous fuels as required by Article 72 of Directive 2010/75/EU and to distinguish gaseous fuel as energy use as required by IEPR

List of other reporting programme to which a Production Installation might be covered
type: ConceptScheme
notation: OtherReportingProgramme
is part of: Industrial Emission Portal Regulation and Industrial Emission Directive
registration status: Public draft
user modified: antogfed
date modified: 2026-05-07 19:35:18.0
vocabulary type: Common
is numeric concept identifiers: false
is notations equal identifiers: false

ETS
type: Concept
notation: ETS
definition: The Production Installation is also covered by the ETS Regulation
status: valid
status modified: 2026-05-06
accepted date: 2026-05-06
in scheme: List of other reporting programme to which a Production Installation might be covered

Seveso
type: Concept
notation: Seveso
definition: Production installation is part of a facility, i.e. an establishment covered by the Seveso Directive
status: valid
status modified: 2026-05-06
accepted date: 2026-05-06
in scheme: List of other reporting programme to which a Production Installation might be covered

Categories of fuel input to further distinguish solid fuels as required by Article 72 of Directive 2010/75/EU and to distinguish solid fuels as energy use as required by IEPR
type: ConceptScheme
notation: OtherSolidFuelValue
is part of: Industrial Emission Portal Regulation and Industrial Emission Directive
registration status: Public draft
user modified: antogfed
date modified: 2026-05-07 19:35:32.0
vocabulary type: Common
is numeric concept identifiers: false
is notations equal identifiers: false

Coke
type: Concept
notation: Coke
definition: Coke
status: valid
status modified: 2026-05-06
accepted date: 2026-05-06
in scheme: Categories of fuel input to further distinguish solid fuels as required by Article 72 of Directive 2010/75/EU and to distinguish solid fuels as energy use as required by IEPR

Other
type: Concept
notation: Other
definition: Other
status: valid
status modified: 2026-05-06
accepted date: 2026-05-06
in scheme: Categories of fuel input to further distinguish solid fuels as required by Article 72 of Directive 2010/75/EU and to distinguish solid fuels as energy use as required by IEPR

PatentFuels
type: Concept
notation: PatentFuels
definition: A patent fuel which presents specific characteristics
status: valid
status modified: 2026-05-06
accepted date: 2026-05-06
in scheme: Categories of fuel input to further distinguish solid fuels as required by Article 72 of Directive 2010/75/EU and to distinguish solid fuels as energy use as required by IEPR

Tar
type: Concept
notation: Tar
definition: Tar
status: valid
status modified: 2026-05-06
accepted date: 2026-05-06
in scheme: Categories of fuel input to further distinguish solid fuels as required by Article 72 of Directive 2010/75/EU and to distinguish solid fuels as energy use as required by IEPR

The type of Production Installation Part
type: ConceptScheme
notation: PlantTypeValue
is part of: Industrial Emission Portal Regulation and Industrial Emission Directive
registration status: Public draft
user modified: antogfed
date modified: 2026-05-07 19:38:35.0
vocabulary type: Common
is numeric concept identifiers: false
is notations equal identifiers: false

Large combustion plant
type: Concept
notation: LCP
definition: A combustion plant as defined in Chapter III of Directive 2010/75/EU
status: valid
status modified: 2026-05-06
accepted date: 2026-05-06
in scheme: The type of Production Installation Part

Medium combustion plant
type: Concept
notation: MCP
definition: Medium combustion plant as defined by Directive 2015/2193 with a thermal input between 20MW and 50MW
status: valid
status modified: 2026-05-06
accepted date: 2026-05-06
in scheme: The type of Production Installation Part

Waste incineration plant
type: Concept
notation: WI
definition: Plant covered by Directive 2010/75/EU, Chapter IV, incinerating waste
status: valid
status modified: 2026-05-06
accepted date: 2026-05-06
in scheme: The type of Production Installation Part

Waste co-incineration plant
type: Concept
notation: co-WI
definition: Plant covered by Directive 2010/75/EU, Chapter IV, co-incinerating waste
status: valid
status modified: 2026-05-06
accepted date: 2026-05-06
in scheme: The type of Production Installation Part

Unit to be used to report Production Volume under the IEPR
type: ConceptScheme
notation: ProductionVolumeUnitCodeValue
is part of: Industrial Emission Portal Regulation and Industrial Emission Directive
registration status: Public draft
user modified: antogfed
date modified: 2026-05-07 19:39:42.0
vocabulary type: Common
is numeric concept identifiers: false
is notations equal identifiers: false

Production volume from activity A-1.1 expressed in Gigajoule of useful energy output
type: Concept
notation: GJ_A-1.1
definition: Production volume from activity A-1.1 expressed in Gigajoule of useful energy output
status: valid
status modified: 2026-05-07
accepted date: 2026-05-07
in scheme: Unit to be used to report Production Volume under the IEPR

Production volume from activity C-1 expressed in Gigajoule of useful energy output
type: Concept
notation: GJ_C-1
definition: Production volume from activity C-1 expressed in Gigajoule of useful energy output
status: valid
status modified: 2026-05-07
accepted date: 2026-05-07
in scheme: Unit to be used to report Production Volume under the IEPR

Production volume from activity B-1 expressed in Number of livestock units
type: Concept
notation: LSU_B-1
definition: Production volume from activity B-1 expressed in Number of livestock units
status: valid
status modified: 2026-05-07
accepted date: 2026-05-07
in scheme: Unit to be used to report Production Volume under the IEPR

Production volume from activity B-2 expressed in Number of livestock units
type: Concept
notation: LSU_B-2
definition: Production volume from activity B-2 expressed in Number of livestock units
status: valid
status modified: 2026-05-07
accepted date: 2026-05-07
in scheme: Unit to be used to report Production Volume under the IEPR

Production volume from activity B-3 expressed in Number of livestock units
type: Concept
notation: LSU_B-3
definition: Production volume from activity B-3 expressed in Number of livestock units
status: valid
status modified: 2026-05-07
accepted date: 2026-05-07
in scheme: Unit to be used to report Production Volume under the IEPR

Production volume from activity A-6.11 expressed in Cubic meter of treated wastewater
type: Concept
notation: MC3_A-6.11
definition: Production volume from activity A-6.11 expressed in Cubic meter of treated wastewater
status: valid
status modified: 2026-05-07
accepted date: 2026-05-07
in scheme: Unit to be used to report Production Volume under the IEPR

Production volume from activity F-1 expressed in Cubic meters of treated wastewater
type: Concept
notation: MC3_F-1
definition: Production volume from activity F-1 expressed in Cubic meters of treated wastewater
status: valid
status modified: 2026-05-07
accepted date: 2026-05-07
in scheme: Unit to be used to report Production Volume under the IEPR

Production volume from activity A-2.7 expressed in Tonnes of battery cells
type: Concept
notation: TBC_A-2.7
definition: Production volume from activity A-2.7 expressed in Tonnes of battery cells
status: valid
status modified: 2026-05-07
accepted date: 2026-05-07
in scheme: Unit to be used to report Production Volume under the IEPR

Production volume from activity A-3.6 expressed in Tonnes of extracted material
type: Concept
notation: TEM_A-3.6
definition: Production volume from activity A-3.6 expressed in Tonnes of extracted material
status: valid
status modified: 2026-05-07
accepted date: 2026-05-07
in scheme: Unit to be used to report Production Volume under the IEPR

Production volume from activity D-1 expressed in Tonnes of extracted material
type: Concept
notation: TEM_D-1
definition: Production volume from activity D-1 expressed in Tonnes of extracted material
status: valid
status modified: 2026-05-07
accepted date: 2026-05-07
in scheme: Unit to be used to report Production Volume under the IEPR

Production volume from activity E-1 expressed in Tonnes of extracted material
type: Concept
notation: TEM_E-1
definition: Production volume from activity E-1 expressed in Tonnes of extracted material
status: valid
status modified: 2026-05-07
accepted date: 2026-05-07
in scheme: Unit to be used to report Production Volume under the IEPR

Production volume from activity A-6.6 expressed in Tonnes of hydrogen
type: Concept
notation: TH2_A-6.6
definition: Production volume from activity A-6.6 expressed in Tonnes of hydrogen
status: valid
status modified: 2026-05-07
accepted date: 2026-05-07
in scheme: Unit to be used to report Production Volume under the IEPR

Production volume from activity I-1 expressed in Tonnes of hydrogen
type: Concept
notation: TH2_I-1
definition: Production volume from activity I-1 expressed in Tonnes of hydrogen
status: valid
status modified: 2026-05-07
accepted date: 2026-05-07
in scheme: Unit to be used to report Production Volume under the IEPR

Production volume from activity A-1.2 expressed in Tonnes of products as oil equivalents
type: Concept
notation: TOE_A-1.2
definition: Production volume from activity A-1.2 expressed in Tonnes of products as oil equivalents
status: valid
status modified: 2026-05-07
accepted date: 2026-05-07
in scheme: Unit to be used to report Production Volume under the IEPR

Production volume from activity A-1.3 expressed in Tonnes of products as oil equivalents
type: Concept
notation: TOE_A-1.3
definition: Production volume from activity A-1.3 expressed in Tonnes of products as oil equivalents
status: valid
status modified: 2026-05-07
accepted date: 2026-05-07
in scheme: Unit to be used to report Production Volume under the IEPR

Production volume from activity A-1.4(a) expressed in Tonnes of products as oil equivalents
type: Concept
notation: TOE_A-1.4(a)
definition: Production volume from activity A-1.4(a) expressed in Tonnes of products as oil equivalents
status: valid
status modified: 2026-05-07
accepted date: 2026-05-07
in scheme: Unit to be used to report Production Volume under the IEPR

Production volume from activity A-1.4(b) expressed in Tonnes of products as oil equivalents
type: Concept
notation: TOE_A-1.4(b)
definition: Production volume from activity A-1.4(b) expressed in Tonnes of products as oil equivalents
status: valid
status modified: 2026-05-07
accepted date: 2026-05-07
in scheme: Unit to be used to report Production Volume under the IEPR

Production volume from activity A-2.1 expressed in Tonnes of products
type: Concept
notation: TOP_A-2.1
definition: Production volume from activity A-2.1 expressed in Tonnes of products
status: valid
status modified: 2026-05-07
accepted date: 2026-05-07
in scheme: Unit to be used to report Production Volume under the IEPR

Production volume from activity A-2.2 expressed in Tonnes of products
type: Concept
notation: TOP_A-2.2
definition: Production volume from activity A-2.2 expressed in Tonnes of products
status: valid
status modified: 2026-05-07
accepted date: 2026-05-07
in scheme: Unit to be used to report Production Volume under the IEPR

Production volume from activity A-2.3(a) expressed in Tonnes of products
type: Concept
notation: TOP_A-2.3(a)
definition: Production volume from activity A-2.3(a) expressed in Tonnes of products
status: valid
status modified: 2026-05-07
accepted date: 2026-05-07
in scheme: Unit to be used to report Production Volume under the IEPR

Production volume from activity A-2.3(aa) expressed in Tonnes of products
type: Concept
notation: TOP_A-2.3(aa)
definition: Production volume from activity A-2.3(aa) expressed in Tonnes of products
status: valid
status modified: 2026-05-07
accepted date: 2026-05-07
in scheme: Unit to be used to report Production Volume under the IEPR

Production volume from activity A-2.3(b) expressed in Tonnes of products
type: Concept
notation: TOP_A-2.3(b)
definition: Production volume from activity A-2.3(b) expressed in Tonnes of products
status: valid
status modified: 2026-05-07
accepted date: 2026-05-07
in scheme: Unit to be used to report Production Volume under the IEPR

Production volume from activity A-2.3(ba) expressed in Tonnes of products
type: Concept
notation: TOP_A-2.3(ba)
definition: Production volume from activity A-2.3(ba) expressed in Tonnes of products
status: valid
status modified: 2026-05-07
accepted date: 2026-05-07
in scheme: Unit to be used to report Production Volume under the IEPR

Production volume from activity A-2.3(c) expressed in Tonnes of products
type: Concept
notation: TOP_A-2.3(c)
definition: Production volume from activity A-2.3(c) expressed in Tonnes of products
status: valid
status modified: 2026-05-07
accepted date: 2026-05-07
in scheme: Unit to be used to report Production Volume under the IEPR

Production volume from activity A-2.4 expressed in Tonnes of products
type: Concept
notation: TOP_A-2.4
definition: Production volume from activity A-2.4 expressed in Tonnes of products
status: valid
status modified: 2026-05-07
accepted date: 2026-05-07
in scheme: Unit to be used to report Production Volume under the IEPR

Production volume from activity A-2.5(a) expressed in Tonnes of products
type: Concept
notation: TOP_A-2.5(a)
definition: Production volume from activity A-2.5(a) expressed in Tonnes of products
status: valid
status modified: 2026-05-07
accepted date: 2026-05-07
in scheme: Unit to be used to report Production Volume under the IEPR

Production volume from activity A-2.5(b) expressed in Tonnes of products
type: Concept
notation: TOP_A-2.5(b)
definition: Production volume from activity A-2.5(b) expressed in Tonnes of products
status: valid
status modified: 2026-05-07
accepted date: 2026-05-07
in scheme: Unit to be used to report Production Volume under the IEPR

Production volume from activity A-3.1(a) expressed in Tonnes of products
type: Concept
notation: TOP_A-3.1(a)
definition: Production volume from activity A-3.1(a) expressed in Tonnes of products
status: valid
status modified: 2026-05-07
accepted date: 2026-05-07
in scheme: Unit to be used to report Production Volume under the IEPR

Production volume from activity A-3.1(b) expressed in Tonnes of products
type: Concept
notation: TOP_A-3.1(b)
definition: Production volume from activity A-3.1(b) expressed in Tonnes of products
status: valid
status modified: 2026-05-07
accepted date: 2026-05-07
in scheme: Unit to be used to report Production Volume under the IEPR

Production volume from activity A-3.1(c) expressed in Tonnes of products
type: Concept
notation: TOP_A-3.1(c)
definition: Production volume from activity A-3.1(c) expressed in Tonnes of products
status: valid
status modified: 2026-05-07
accepted date: 2026-05-07
in scheme: Unit to be used to report Production Volume under the IEPR

Production volume from activity A-3.2 expressed in Tonnes of products
type: Concept
notation: TOP_A-3.2
definition: Production volume from activity A-3.2 expressed in Tonnes of products
status: valid
status modified: 2026-05-07
accepted date: 2026-05-07
in scheme: Unit to be used to report Production Volume under the IEPR

Production volume from activity A-3.3 expressed in Tonnes of products
type: Concept
notation: TOP_A-3.3
definition: Production volume from activity A-3.3 expressed in Tonnes of products
status: valid
status modified: 2026-05-07
accepted date: 2026-05-07
in scheme: Unit to be used to report Production Volume under the IEPR

Production volume from activity A-3.4 expressed in Tonnes of products
type: Concept
notation: TOP_A-3.4
definition: Production volume from activity A-3.4 expressed in Tonnes of products
status: valid
status modified: 2026-05-07
accepted date: 2026-05-07
in scheme: Unit to be used to report Production Volume under the IEPR

Production volume from activity A-3.5 (a) expressed in Tonnes of products
type: Concept
notation: TOP_A-3.5 (a)
definition: Production volume from activity A-3.5 (a) expressed in Tonnes of products
status: valid
status modified: 2026-05-07
accepted date: 2026-05-07
in scheme: Unit to be used to report Production Volume under the IEPR

Production volume from activity A-3.5 (b) expressed in Tonnes of products
type: Concept
notation: TOP_A-3.5 (b)
definition: Production volume from activity A-3.5 (b) expressed in Tonnes of products
status: valid
status modified: 2026-05-07
accepted date: 2026-05-07
in scheme: Unit to be used to report Production Volume under the IEPR

Production volume from activity A-4.1(a) expressed in Tonnes of products
type: Concept
notation: TOP_A-4.1(a)
definition: Production volume from activity A-4.1(a) expressed in Tonnes of products
status: valid
status modified: 2026-05-07
accepted date: 2026-05-07
in scheme: Unit to be used to report Production Volume under the IEPR

Production volume from activity A-4.1(b) expressed in Tonnes of products
type: Concept
notation: TOP_A-4.1(b)
definition: Production volume from activity A-4.1(b) expressed in Tonnes of products
status: valid
status modified: 2026-05-07
accepted date: 2026-05-07
in scheme: Unit to be used to report Production Volume under the IEPR

Production volume from activity A-4.1(c) expressed in Tonnes of products
type: Concept
notation: TOP_A-4.1(c)
definition: Production volume from activity A-4.1(c) expressed in Tonnes of products
status: valid
status modified: 2026-05-07
accepted date: 2026-05-07
in scheme: Unit to be used to report Production Volume under the IEPR

Production volume from activity A-4.1(d) expressed in Tonnes of products
type: Concept
notation: TOP_A-4.1(d)
definition: Production volume from activity A-4.1(d) expressed in Tonnes of products
status: valid
status modified: 2026-05-07
accepted date: 2026-05-07
in scheme: Unit to be used to report Production Volume under the IEPR

Production volume from activity A-4.1(e) expressed in Tonnes of products
type: Concept
notation: TOP_A-4.1(e)
definition: Production volume from activity A-4.1(e) expressed in Tonnes of products
status: valid
status modified: 2026-05-07
accepted date: 2026-05-07
in scheme: Unit to be used to report Production Volume under the IEPR

Production volume from activity A-4.1(f) expressed in Tonnes of products
type: Concept
notation: TOP_A-4.1(f)
definition: Production volume from activity A-4.1(f) expressed in Tonnes of products
status: valid
status modified: 2026-05-07
accepted date: 2026-05-07
in scheme: Unit to be used to report Production Volume under the IEPR

Production volume from activity A-4.1(g) expressed in Tonnes of products
type: Concept
notation: TOP_A-4.1(g)
definition: Production volume from activity A-4.1(g) expressed in Tonnes of products
status: valid
status modified: 2026-05-07
accepted date: 2026-05-07
in scheme: Unit to be used to report Production Volume under the IEPR

Production volume from activity A-4.1(h) expressed in Tonnes of products
type: Concept
notation: TOP_A-4.1(h)
definition: Production volume from activity A-4.1(h) expressed in Tonnes of products
status: valid
status modified: 2026-05-07
accepted date: 2026-05-07
in scheme: Unit to be used to report Production Volume under the IEPR

Production volume from activity A-4.1(i) expressed in Tonnes of products
type: Concept
notation: TOP_A-4.1(i)
definition: Production volume from activity A-4.1(i) expressed in Tonnes of products
status: valid
status modified: 2026-05-07
accepted date: 2026-05-07
in scheme: Unit to be used to report Production Volume under the IEPR

Production volume from activity A-4.1(j) expressed in Tonnes of products
type: Concept
notation: TOP_A-4.1(j)
definition: Production volume from activity A-4.1(j) expressed in Tonnes of products
status: valid
status modified: 2026-05-07
accepted date: 2026-05-07
in scheme: Unit to be used to report Production Volume under the IEPR

Production volume from activity A-4.1(k) expressed in Tonnes of products
type: Concept
notation: TOP_A-4.1(k)
definition: Production volume from activity A-4.1(k) expressed in Tonnes of products
status: valid
status modified: 2026-05-07
accepted date: 2026-05-07
in scheme: Unit to be used to report Production Volume under the IEPR

Production volume from activity A-4.2(a) expressed in Tonnes of products
type: Concept
notation: TOP_A-4.2(a)
definition: Production volume from activity A-4.2(a) expressed in Tonnes of products
status: valid
status modified: 2026-05-07
accepted date: 2026-05-07
in scheme: Unit to be used to report Production Volume under the IEPR

Production volume from activity A-4.2(b) expressed in Tonnes of products
type: Concept
notation: TOP_A-4.2(b)
definition: Production volume from activity A-4.2(b) expressed in Tonnes of products
status: valid
status modified: 2026-05-07
accepted date: 2026-05-07
in scheme: Unit to be used to report Production Volume under the IEPR

Production volume from activity A-4.2(c) expressed in Tonnes of products
type: Concept
notation: TOP_A-4.2(c)
definition: Production volume from activity A-4.2(c) expressed in Tonnes of products
status: valid
status modified: 2026-05-07
accepted date: 2026-05-07
in scheme: Unit to be used to report Production Volume under the IEPR

Production volume from activity A-4.2(d) expressed in Tonnes of products
type: Concept
notation: TOP_A-4.2(d)
definition: Production volume from activity A-4.2(d) expressed in Tonnes of products
status: valid
status modified: 2026-05-07
accepted date: 2026-05-07
in scheme: Unit to be used to report Production Volume under the IEPR

Production volume from activity A-4.2(e) expressed in Tonnes of products
type: Concept
notation: TOP_A-4.2(e)
definition: Production volume from activity A-4.2(e) expressed in Tonnes of products
status: valid
status modified: 2026-05-07
accepted date: 2026-05-07
in scheme: Unit to be used to report Production Volume under the IEPR

Production volume from activity A-4.3 expressed in Tonnes of products
type: Concept
notation: TOP_A-4.3
definition: Production volume from activity A-4.3 expressed in Tonnes of products
status: valid
status modified: 2026-05-07
accepted date: 2026-05-07
in scheme: Unit to be used to report Production Volume under the IEPR

Production volume from activity A-4.4 expressed in Tonnes of products
type: Concept
notation: TOP_A-4.4
definition: Production volume from activity A-4.4 expressed in Tonnes of products
status: valid
status modified: 2026-05-07
accepted date: 2026-05-07
in scheme: Unit to be used to report Production Volume under the IEPR

Production volume from activity A-4.5 expressed in Tonnes of products
type: Concept
notation: TOP_A-4.5
definition: Production volume from activity A-4.5 expressed in Tonnes of products
status: valid
status modified: 2026-05-07
accepted date: 2026-05-07
in scheme: Unit to be used to report Production Volume under the IEPR

Production volume from activity A-4.6 expressed in Tonnes of products
type: Concept
notation: TOP_A-4.6
definition: Production volume from activity A-4.6 expressed in Tonnes of products
status: valid
status modified: 2026-05-07
accepted date: 2026-05-07
in scheme: Unit to be used to report Production Volume under the IEPR

Production volume from activity A-6.1(a) expressed in Tonnes of products
type: Concept
notation: TOP_A-6.1(a)
definition: Production volume from activity A-6.1(a) expressed in Tonnes of products
status: valid
status modified: 2026-05-07
accepted date: 2026-05-07
in scheme: Unit to be used to report Production Volume under the IEPR

Production volume from activity A-6.1(b) expressed in Tonnes of products
type: Concept
notation: TOP_A-6.1(b)
definition: Production volume from activity A-6.1(b) expressed in Tonnes of products
status: valid
status modified: 2026-05-07
accepted date: 2026-05-07
in scheme: Unit to be used to report Production Volume under the IEPR

Production volume from activity A-6.1(c) expressed in Tonnes of products
type: Concept
notation: TOP_A-6.1(c)
definition: Production volume from activity A-6.1(c) expressed in Tonnes of products
status: valid
status modified: 2026-05-07
accepted date: 2026-05-07
in scheme: Unit to be used to report Production Volume under the IEPR

Production volume from activity A-6.10 expressed in Tonnes of products
type: Concept
notation: TOP_A-6.10
definition: Production volume from activity A-6.10 expressed in Tonnes of products
status: valid
status modified: 2026-05-07
accepted date: 2026-05-07
in scheme: Unit to be used to report Production Volume under the IEPR

Production volume from activity A-6.2 expressed in Tonnes of products
type: Concept
notation: TOP_A-6.2
definition: Production volume from activity A-6.2 expressed in Tonnes of products
status: valid
status modified: 2026-05-07
accepted date: 2026-05-07
in scheme: Unit to be used to report Production Volume under the IEPR

Production volume from activity A-6.3 expressed in Tonnes of products
type: Concept
notation: TOP_A-6.3
definition: Production volume from activity A-6.3 expressed in Tonnes of products
status: valid
status modified: 2026-05-07
accepted date: 2026-05-07
in scheme: Unit to be used to report Production Volume under the IEPR

Production volume from activity A-6.4(a) expressed in Tonnes of products
type: Concept
notation: TOP_A-6.4(a)
definition: Production volume from activity A-6.4(a) expressed in Tonnes of products
status: valid
status modified: 2026-05-07
accepted date: 2026-05-07
in scheme: Unit to be used to report Production Volume under the IEPR

Production volume from activity A-6.4(b)(i) expressed in Tonnes of products
type: Concept
notation: TOP_A-6.4(b)(i)
definition: Production volume from activity A-6.4(b)(i) expressed in Tonnes of products
status: valid
status modified: 2026-05-07
accepted date: 2026-05-07
in scheme: Unit to be used to report Production Volume under the IEPR

Production volume from activity A-6.4(b)(ii) expressed in Tonnes of products
type: Concept
notation: TOP_A-6.4(b)(ii)
definition: Production volume from activity A-6.4(b)(ii) expressed in Tonnes of products
status: valid
status modified: 2026-05-07
accepted date: 2026-05-07
in scheme: Unit to be used to report Production Volume under the IEPR

Production volume from activity A-6.4(b)(iii) expressed in Tonnes of products
type: Concept
notation: TOP_A-6.4(b)(iii)
definition: Production volume from activity A-6.4(b)(iii) expressed in Tonnes of products
status: valid
status modified: 2026-05-07
accepted date: 2026-05-07
in scheme: Unit to be used to report Production Volume under the IEPR

Production volume from activity A-6.4(c) expressed in Tonnes of products
type: Concept
notation: TOP_A-6.4(c)
definition: Production volume from activity A-6.4(c) expressed in Tonnes of products
status: valid
status modified: 2026-05-07
accepted date: 2026-05-07
in scheme: Unit to be used to report Production Volume under the IEPR

Production volume from activity A-6.7 expressed in Tonnes of products
type: Concept
notation: TOP_A-6.7
definition: Production volume from activity A-6.7 expressed in Tonnes of products
status: valid
status modified: 2026-05-07
accepted date: 2026-05-07
in scheme: Unit to be used to report Production Volume under the IEPR

Production volume from activity A-6.8 expressed in Tonnes of products
type: Concept
notation: TOP_A-6.8
definition: Production volume from activity A-6.8 expressed in Tonnes of products
status: valid
status modified: 2026-05-07
accepted date: 2026-05-07
in scheme: Unit to be used to report Production Volume under the IEPR

Production volume from activity A-6.9 expressed in Tonnes of products
type: Concept
notation: TOP_A-6.9
definition: Production volume from activity A-6.9 expressed in Tonnes of products
status: valid
status modified: 2026-05-07
accepted date: 2026-05-07
in scheme: Unit to be used to report Production Volume under the IEPR

Production volume from activity G-1 expressed in Tonnes of products
type: Concept
notation: TOP_G-1
definition: Production volume from activity G-1 expressed in Tonnes of products
status: valid
status modified: 2026-05-07
accepted date: 2026-05-07
in scheme: Unit to be used to report Production Volume under the IEPR

Production volume from activity H-1a expressed in Tonnes of products
type: Concept
notation: TOP_H-1a
definition: Production volume from activity H-1a expressed in Tonnes of products
status: valid
status modified: 2026-05-07
accepted date: 2026-05-07
in scheme: Unit to be used to report Production Volume under the IEPR

Production volume from activity A-2.6 expressed in Tonnes of the surface treatment substances in ready to use state
type: Concept
notation: TSTS_A-2.6
definition: Production volume from activity A-2.6 expressed in Tonnes of the surface treatment substances in ready to use state
status: valid
status modified: 2026-05-07
accepted date: 2026-05-07
in scheme: Unit to be used to report Production Volume under the IEPR

Production volume from activity H-1b expressed in Tonnes of the surface treatment substances in ready to use state
type: Concept
notation: TSTS_H-1b
definition: Production volume from activity H-1b expressed in Tonnes of the surface treatment substances in ready to use state
status: valid
status modified: 2026-05-07
accepted date: 2026-05-07
in scheme: Unit to be used to report Production Volume under the IEPR

Production volume from activity A-5.1 expressed in Tonnes of incoming waste
type: Concept
notation: TW_A-5.1
definition: Production volume from activity A-5.1 expressed in Tonnes of incoming waste
status: valid
status modified: 2026-05-07
accepted date: 2026-05-07
in scheme: Unit to be used to report Production Volume under the IEPR

Production volume from activity A-5.2(a) expressed in Tonnes of incoming waste
type: Concept
notation: TW_A-5.2(a)
definition: Production volume from activity A-5.2(a) expressed in Tonnes of incoming waste
status: valid
status modified: 2026-05-07
accepted date: 2026-05-07
in scheme: Unit to be used to report Production Volume under the IEPR

Production volume from activity A-5.2(b) expressed in Tonnes of incoming waste
type: Concept
notation: TW_A-5.2(b)
definition: Production volume from activity A-5.2(b) expressed in Tonnes of incoming waste
status: valid
status modified: 2026-05-07
accepted date: 2026-05-07
in scheme: Unit to be used to report Production Volume under the IEPR

Production volume from activity A-5.3(a) expressed in Tonnes of incoming waste
type: Concept
notation: TW_A-5.3(a)
definition: Production volume from activity A-5.3(a) expressed in Tonnes of incoming waste
status: valid
status modified: 2026-05-07
accepted date: 2026-05-07
in scheme: Unit to be used to report Production Volume under the IEPR

Production volume from activity A-5.3(b) expressed in Tonnes of incoming waste
type: Concept
notation: TW_A-5.3(b)
definition: Production volume from activity A-5.3(b) expressed in Tonnes of incoming waste
status: valid
status modified: 2026-05-07
accepted date: 2026-05-07
in scheme: Unit to be used to report Production Volume under the IEPR

Production volume from activity A-5.4 expressed in Tonnes of incoming waste
type: Concept
notation: TW_A-5.4
definition: Production volume from activity A-5.4 expressed in Tonnes of incoming waste
status: valid
status modified: 2026-05-07
accepted date: 2026-05-07
in scheme: Unit to be used to report Production Volume under the IEPR

Production volume from activity A-5.5 expressed in Tonnes of incoming waste
type: Concept
notation: TW_A-5.5
definition: Production volume from activity A-5.5 expressed in Tonnes of incoming waste
status: valid
status modified: 2026-05-07
accepted date: 2026-05-07
in scheme: Unit to be used to report Production Volume under the IEPR

Production volume from activity A-5.6 expressed in Tonnes of incoming waste
type: Concept
notation: TW_A-5.6
definition: Production volume from activity A-5.6 expressed in Tonnes of incoming waste
status: valid
status modified: 2026-05-07
accepted date: 2026-05-07
in scheme: Unit to be used to report Production Volume under the IEPR

Production volume from activity A-6.5 expressed in Tonnes of incoming waste
type: Concept
notation: TW_A-6.5
definition: Production volume from activity A-6.5 expressed in Tonnes of incoming waste
status: valid
status modified: 2026-05-07
accepted date: 2026-05-07
in scheme: Unit to be used to report Production Volume under the IEPR

Unit to be used to report raw material according to the definition set in the IEPR CID
type: ConceptScheme
notation: RawMaterialUnitCodeValue
is part of: Industrial Emission Portal Regulation and Industrial Emission Directive
registration status: Public draft
user modified: antogfed
date modified: 2026-05-07 19:39:52.0
vocabulary type: Common
is numeric concept identifiers: false
is notations equal identifiers: false

Blast furnace slags valid for activity: A-3.4
type: Concept
notation: BlastFurnaceSlags
definition: Blast furnace slags valid for activity: A-3.4
status: valid
status modified: 2026-05-07
accepted date: 2026-05-07
in scheme: Unit to be used to report raw material according to the definition set in the IEPR CID

Total externally sourced metal scrap used as input to the process. valid for activity: A-2.2; A-2.3(a); A-2.3(aa); A-2.3(b); A-2.3(ba); A-2.3(c); A-2.4; A-2.5(a); A-2.5(b)
type: Concept
notation: ExternalMetalScrap
definition: Total externally sourced metal scrap used as input to the process. valid for activity: A-2.2; A-2.3(a); A-2.3(aa); A-2.3(b); A-2.3(ba); A-2.3(c); A-2.4; A-2.5(a); A-2.5(b)
status: valid
status modified: 2026-05-07
accepted date: 2026-05-07
in scheme: Unit to be used to report raw material according to the definition set in the IEPR CID

Paper for recycling used as feedstock for paper and board production valid for activity: A-6.1(b)
type: Concept
notation: PaperForRecycling
definition: Paper for recycling used as feedstock for paper and board production valid for activity: A-6.1(b)
status: valid
status modified: 2026-05-07
accepted date: 2026-05-07
in scheme: Unit to be used to report raw material according to the definition set in the IEPR CID

Recovered wood used as feedstock for wood-based panels valid for activity: A-6.1(c)
type: Concept
notation: RecoveredWood
definition: Recovered wood used as feedstock for wood-based panels valid for activity: A-6.1(c)
status: valid
status modified: 2026-05-07
accepted date: 2026-05-07
in scheme: Unit to be used to report raw material according to the definition set in the IEPR CID

Recycled polymers valid for activity: A-4.1(h)
type: Concept
notation: RecycledPolymers
definition: Recycled polymers valid for activity: A-4.1(h)
status: valid
status modified: 2026-05-07
accepted date: 2026-05-07
in scheme: Unit to be used to report raw material according to the definition set in the IEPR CID

Secondary cullet valid for activity: A-3.3
type: Concept
notation: SecondaryCullet
definition: Secondary cullet valid for activity: A-3.3
status: valid
status modified: 2026-05-07
accepted date: 2026-05-07
in scheme: Unit to be used to report raw material according to the definition set in the IEPR CID

Secondary steel valid for activity: H-1
type: Concept
notation: SecondarySteel
definition: Secondary steel valid for activity: H-1
status: valid
status modified: 2026-05-07
accepted date: 2026-05-07
in scheme: Unit to be used to report raw material according to the definition set in the IEPR CID

Secondary wood-based feedstock (incl. secondary pulpwood, sawdust, forest residues) used as input for pulp production valid for activity: A-6.1(a)
type: Concept
notation: SecondaryWoodFeedstock
definition: Secondary wood-based feedstock (incl. secondary pulpwood, sawdust, forest residues) used as input for pulp production valid for activity: A-6.1(a)
status: valid
status modified: 2026-05-07
accepted date: 2026-05-07
in scheme: Unit to be used to report raw material according to the definition set in the IEPR CID

Used oil valid for activity: A-1.2; A-1.4(a) and A-1.4(b)
type: Concept
notation: UsedOil
definition: Used oil valid for activity: A-1.2; A-1.4(a) and A-1.4(b)
status: valid
status modified: 2026-05-07
accepted date: 2026-05-07
in scheme: Unit to be used to report raw material according to the definition set in the IEPR CID

Waste as raw material such as fly ash, blast furnace slag and ceramic waste valid for activity: A-3.5(a) and A-3.5(b)
type: Concept
notation: WasteAsRM
definition: Waste as raw material such as fly ash, blast furnace slag and ceramic waste valid for activity: A-3.5(a) and A-3.5(b)
status: valid
status modified: 2026-05-07
accepted date: 2026-05-07
in scheme: Unit to be used to report raw material according to the definition set in the IEPR CID

This code list contains the potential options under which a confidentiality claim for data can be made
type: ConceptScheme
notation: ReasonValue
is part of: Industrial Emission Portal Regulation and Industrial Emission Directive
registration status: Public draft
user modified: antogfed
date modified: 2026-05-07 19:40:28.0
vocabulary type: Common
is numeric concept identifiers: false
is notations equal identifiers: false

Article4(2)(a)
type: Concept
notation: Art4-2a
preferred label: Disclosure of the information would adversely affect the confidentiality of the proceedings of public authorities, where such confidentiality is provided for by law, in accordance with Directive 2003/4/EC.
definition: Disclosure of the information would adversely affect the confidentiality of the proceedings of public authorities, where such confidentiality is provided for by law, in accordance with Directive 2003/4/EC.
status: valid
status modified: 2026-05-06
accepted date: 2026-05-06
in scheme: This code list contains the potential options under which a confidentiality claim for data can be made

Disclosure of the information would adversely affect international relations, public security or national defence, in accordance with Directive 2003/4/EC.
type: Concept
notation: Art4-2b
definition: Disclosure of the information would adversely affect international relations, public security or national defense, in accordance with Directive 2003/4/EC.
status: valid
status modified: 2026-05-06
accepted date: 2026-05-06
in scheme: This code list contains the potential options under which a confidentiality claim for data can be made

Article4(2)(c)
type: Concept
notation: Art4-2c
preferred label: Disclosure of the information would adversely affect the course of justice, the ability of any person to receive a fair trial or the ability of a public authority to conduct an enquiry of a criminal or disciplinary nature, in accordance with Directive 2003/4/EC.
definition: Disclosure of the information would adversely affect the course of justice, the ability of any person to receive a fair trial or the ability of a public authority to conduct an enquiry of a criminal or disciplinary nature, in accordance with Directive 2003/4/EC.
status: valid
status modified: 2026-05-06
accepted date: 2026-05-06
in scheme: This code list contains the potential options under which a confidentiality claim for data can be made

Article4(2)(d)
type: Concept
notation: Art4-2d
preferred label: Disclosure of the information would adversely affect the confidentiality of commercial or industrial information where such confidentiality is provided for by national or Community law to protect a legitimate economic interest, including the public interest in maintaining statistical confidentiality and tax secrecy, in accordance with Directive 2003/4/EC.
definition: Disclosure of the information would adversely affect the confidentiality of commercial or industrial information where such confidentiality is provided for by national or Community law to protect a legitimate economic interest, including the public interest in maintaining statistical confidentiality and tax secrecy, in accordance with Directive 2003/4/EC.
status: valid
status modified: 2026-05-06
accepted date: 2026-05-06
in scheme: This code list contains the potential options under which a confidentiality claim for data can be made

Disclosure of the information would adversely affect intellectual property rights, in accordance with Directive 2003/4/EC.
type: Concept
notation: Art4-2e
definition: Disclosure of the information would adversely affect intellectual property rights, in accordance with Directive 2003/4/EC.
status: valid
status modified: 2026-05-06
accepted date: 2026-05-06
in scheme: This code list contains the potential options under which a confidentiality claim for data can be made

Article4(2)(f)
type: Concept
notation: Art4-2f
preferred label: Disclosure of the information would adversely affect the confidentiality of personal data and/or files relating to a natural person where that person has not consented to the disclosure of the information to the public, where such confidentiality is provided for by national or Community law, in accordance with Directive 2003/4/EC.
definition: Disclosure of the information would adversely affect the confidentiality of personal data and/or files relating to a natural person where that person has not consented to the disclosure of the information to the public, where such confidentiality is provided for by national or Community law, in accordance with Directive 2003/4/EC.
status: valid
status modified: 2026-05-06
accepted date: 2026-05-06
in scheme: This code list contains the potential options under which a confidentiality claim for data can be made

Article4(2)(g)
type: Concept
notation: Art4-2g
preferred label: Disclosure of the information would adversely affect the interests or protection of any person who supplied the information requested on a voluntary basis without being under, or capable of being put under, a legal obligation to do so, unless that person has consented to the release of the information concerned, in accordance with DIRECTIVE 2003/4/EC.
definition: Disclosure of the information would adversely affect the interests or protection of any person who supplied the information requested on a voluntary basis without being under, or capable of being put under, a legal obligation to do so, unless that person has consented to the release of the information concerned, in accordance with DIRECTIVE 2003/4/EC.
status: valid
status modified: 2026-05-06
accepted date: 2026-05-06
in scheme: This code list contains the potential options under which a confidentiality claim for data can be made

Disclosure of the information would adversely affect the protection of the environment to which such information relates, such as the location of rare species, according to DIRECTIVE 2003/4/EC.
type: Concept
notation: Art4-2h
definition: Disclosure of the information would adversely affect the protection of the environment to which such information relates, such as the location of rare species, according to DIRECTIVE 2003/4/EC.
status: valid
status modified: 2026-05-06
accepted date: 2026-05-06
in scheme: This code list contains the potential options under which a confidentiality claim for data can be made

Values of specific conditions type
type: ConceptScheme
notation: SpecificConditionsTypeValue
is part of: Industrial Emission Portal Regulation and Industrial Emission Directive
registration status: Public draft
user modified: antogfed
date modified: 2026-05-07 19:40:39.0
vocabulary type: Common
is numeric concept identifiers: false
is notations equal identifiers: false

Stack height classification
type: ConceptScheme
notation: StackHeightClassValue
is part of: Industrial Emission Portal Regulation and Industrial Emission Directive
registration status: Public draft
user modified: antogfed
date modified: 2026-05-07 19:40:57.0
vocabulary type: Common
is numeric concept identifiers: false
is notations equal identifiers: false

CLASS1
type: Concept
notation: CLASS1
definition: Stack height < 45m. For further detail on determination of the stack height see the E-PRTR and LCP Integrated Reporting Manual for Reporters.
status: valid
status modified: 2026-05-06
accepted date: 2026-05-06
in scheme: Stack height classification

CLASS2
type: Concept
notation: CLASS2
definition: Stack height ≥ 45m < 100m. For further detail on determination of the stack height see the E-PRTR and LCP Integrated Reporting Manual for Reporters.
status: valid
status modified: 2026-05-06
accepted date: 2026-05-06
in scheme: Stack height classification

CLASS3
type: Concept
notation: CLASS3
definition: Stack height ≥ 100m < 150m. For further detail on determination of the stack height see the E-PRTR and LCP Integrated Reporting Manual for Reporters.
status: valid
status modified: 2026-05-06
accepted date: 2026-05-06
in scheme: Stack height classification

CLASS4
type: Concept
notation: CLASS4
definition: Stack height ≥ 150m < 200m. For further detail on determination of the stack height see the E-PRTR and LCP Integrated Reporting Manual for Reporters.
status: valid
status modified: 2026-05-06
accepted date: 2026-05-06
in scheme: Stack height classification

CLASS5
type: Concept
notation: CLASS5
definition: Stack height ≥ 200m. For further detail on determination of the stack height see the E-PRTR and LCP Integrated Reporting Manual for Reporters.
status: valid
status modified: 2026-05-06
accepted date: 2026-05-06
in scheme: Stack height classification

Various units that can be used to report attributes to the IEPR and the Large Combustion Plants
type: ConceptScheme
notation: UnitCodeValue
is part of: Industrial Emission Portal Regulation and Industrial Emission Directive
registration status: Public draft
user modified: antogfed
date modified: 2026-05-07 19:41:09.0
vocabulary type: Common
is numeric concept identifiers: false
is notations equal identifiers: false

GJ
type: Concept
notation: GJ
definition: gigajoule
status: valid
status modified: 2026-05-07
accepted date: 2026-05-07
in scheme: Various units that can be used to report attributes to the IEPR and the Large Combustion Plants

GW
type: Concept
notation: GW
definition: gigawatt
status: valid
status modified: 2026-05-07
accepted date: 2026-05-07
in scheme: Various units that can be used to report attributes to the IEPR and the Large Combustion Plants

GWH
type: Concept
notation: GWH
definition: gigawatt hour
status: valid
status modified: 2026-05-07
accepted date: 2026-05-07
in scheme: Various units that can be used to report attributes to the IEPR and the Large Combustion Plants

HLTR
type: Concept
notation: HLTR
definition: hectolitre
status: valid
status modified: 2026-05-07
accepted date: 2026-05-07
in scheme: Various units that can be used to report attributes to the IEPR and the Large Combustion Plants

KG
type: Concept
notation: KG
definition: kilogram
status: valid
status modified: 2026-05-07
accepted date: 2026-05-07
in scheme: Various units that can be used to report attributes to the IEPR and the Large Combustion Plants

KW
type: Concept
notation: KW
definition: kilowatt
status: valid
status modified: 2026-05-07
accepted date: 2026-05-07
in scheme: Various units that can be used to report attributes to the IEPR and the Large Combustion Plants

KWH
type: Concept
notation: KWH
definition: kilowatt hour
status: valid
status modified: 2026-05-07
accepted date: 2026-05-07
in scheme: Various units that can be used to report attributes to the IEPR and the Large Combustion Plants

LTR
type: Concept
notation: LTR
definition: litre
status: valid
status modified: 2026-05-07
accepted date: 2026-05-07
in scheme: Various units that can be used to report attributes to the IEPR and the Large Combustion Plants

MTK
type: Concept
notation: MTK
definition: square metre
status: valid
status modified: 2026-05-07
accepted date: 2026-05-07
in scheme: Various units that can be used to report attributes to the IEPR and the Large Combustion Plants

MTQ
type: Concept
notation: MTQ
definition: cubic metre
status: valid
status modified: 2026-05-07
accepted date: 2026-05-07
in scheme: Various units that can be used to report attributes to the IEPR and the Large Combustion Plants

MW
type: Concept
notation: MW
definition: megawatt
status: valid
status modified: 2026-05-07
accepted date: 2026-05-07
in scheme: Various units that can be used to report attributes to the IEPR and the Large Combustion Plants

MWH
type: Concept
notation: MWH
definition: megawatt hour (1000 kW.h)
status: valid
status modified: 2026-05-07
accepted date: 2026-05-07
in scheme: Various units that can be used to report attributes to the IEPR and the Large Combustion Plants

PCS
type: Concept
notation: PCS
definition: pieces
status: valid
status modified: 2026-05-07
accepted date: 2026-05-07
in scheme: Various units that can be used to report attributes to the IEPR and the Large Combustion Plants

TJ
type: Concept
notation: TJ
definition: Terajoules
status: valid
status modified: 2026-05-07
accepted date: 2026-05-07
in scheme: Various units that can be used to report attributes to the IEPR and the Large Combustion Plants

TNE
type: Concept
notation: TNE
definition: tonne (metric ton)
status: valid
status modified: 2026-05-07
accepted date: 2026-05-07
in scheme: Various units that can be used to report attributes to the IEPR and the Large Combustion Plants

Type of waste that is subject to an off-site transfer
type: ConceptScheme
notation: WasteClassificationValue
is part of: Industrial Emission Portal Regulation and Industrial Emission Directive
registration status: Public draft
user modified: antogfed
date modified: 2026-05-07 19:41:20.0
vocabulary type: Common
is numeric concept identifiers: false
is notations equal identifiers: false

HW
type: Concept
notation: HW
definition: Hazardous waste as defined by Article 2(14) of the E-PRTR
status: valid
status modified: 2026-05-06
accepted date: 2026-05-06
in scheme: Type of waste that is subject to an off-site transfer

NONHW
type: Concept
notation: NONHW
definition: Non-hazardous waste
status: valid
status modified: 2026-05-06
accepted date: 2026-05-06
in scheme: Type of waste that is subject to an off-site transfer

Final treatment to the waste reported in an off-site transfer
type: ConceptScheme
notation: WasteTreatmentValue
is part of: Industrial Emission Portal Regulation and Industrial Emission Directive
registration status: Public draft
user modified: antogfed
date modified: 2026-05-07 19:41:35.0
vocabulary type: Common
is numeric concept identifiers: false
is notations equal identifiers: false

Disposal
type: Concept
notation: D
definition: Destined for disposal
status: valid
status modified: 2026-05-06
accepted date: 2026-05-06
in scheme: Final treatment to the waste reported in an off-site transfer

Recovery
type: Concept
notation: R
definition: Destined for recovery
status: valid
status modified: 2026-05-06
accepted date: 2026-05-06
in scheme: Final treatment to the waste reported in an off-site transfer