Activities listed in Annex I to Directive 2010/75/EU which are operated in the installation.
type: ConceptScheme
notation: IEDAnnexIActivityValue
is part of: euregistryonindustrialsites
registration status: Released
user modified: marnaian
date modified: 2019-06-07 11:45:47.0
vocabulary type: Common
is numeric concept identifiers: false
is notations equal identifiers: false

Energy industries
type: Concept
notation: 1
definition: Energy industries
status: invalid
status modified: 2018-05-17
accepted date: 2017-02-08
not accepted date: 2018-05-17
in scheme: Activities listed in Annex I to Directive 2010/75/EU which are operated in the installation.

Combustion of fuels in installations with a total rated thermal input of 50 MW or more
type: Concept
notation: 1.1
definition: Combustion of fuels in installations with a total rated thermal input of 50 MW or more
status: valid
status modified: 2017-02-08
accepted date: 2017-02-08
in scheme: Activities listed in Annex I to Directive 2010/75/EU which are operated in the installation.

Refining of mineral oil and gas
type: Concept
notation: 1.2
definition: Refining of mineral oil and gas
status: valid
status modified: 2017-02-08
accepted date: 2017-02-08
in scheme: Activities listed in Annex I to Directive 2010/75/EU which are operated in the installation.

Production of coke
type: Concept
notation: 1.3
definition: Production of coke
status: valid
status modified: 2017-02-08
accepted date: 2017-02-08
in scheme: Activities listed in Annex I to Directive 2010/75/EU which are operated in the installation.

Gasification or liquefaction of coal
type: Concept
notation: 1.4(a)
definition: Gasification or liquefaction of coal
status: valid
status modified: 2017-02-08
accepted date: 2017-02-08
in scheme: Activities listed in Annex I to Directive 2010/75/EU which are operated in the installation.

Gasification or liquefaction of fuels other than coal, in installations with a total rated thermal input of 20 MW or more
type: Concept
notation: 1.4(b)
definition: Gasification or liquefaction of fuels other than coal, in installations with a total rated thermal input of 20 MW or more
status: valid
status modified: 2017-02-08
accepted date: 2017-02-08
in scheme: Activities listed in Annex I to Directive 2010/75/EU which are operated in the installation.

Production and processing of metals
type: Concept
notation: 2
definition: Production and processing of metals
status: invalid
status modified: 2018-05-17
accepted date: 2017-02-08
not accepted date: 2018-05-17
in scheme: Activities listed in Annex I to Directive 2010/75/EU which are operated in the installation.

Metal ore (including sulphide ore) roasting or sintering
type: Concept
notation: 2.1
definition: Metal ore (including sulphide ore) roasting or sintering
status: valid
status modified: 2017-02-08
accepted date: 2017-02-08
in scheme: Activities listed in Annex I to Directive 2010/75/EU which are operated in the installation.

Production of pig iron or steel (primary or secondary fusion) including continuous casting, with a capacity exceeding 2.5 tonnes per hour
type: Concept
notation: 2.2
definition: Production of pig iron or steel (primary or secondary fusion) including continuous casting, with a capacity exceeding 2.5 tonnes per hour
status: valid
status modified: 2017-02-08
accepted date: 2017-02-08
in scheme: Activities listed in Annex I to Directive 2010/75/EU which are operated in the installation.

Processing of ferrous metals: operation of hot-rolling mills with a capacity exceeding 20 tonnes of crude steel per hour
type: Concept
notation: 2.3(a)
definition: Processing of ferrous metals: operation of hot-rolling mills with a capacity exceeding 20 tonnes of crude steel per hour
status: valid
status modified: 2017-02-08
accepted date: 2017-02-08
in scheme: Activities listed in Annex I to Directive 2010/75/EU which are operated in the installation.

Processing of ferrous metals: operation of smitheries with hammers the energy of which exceeds 50 kilojoule per hammer, where the calorific power used exceeds 20 MW
type: Concept
notation: 2.3(b)
definition: Processing of ferrous metals: operation of smitheries with hammers the energy of which exceeds 50 kilojoule per hammer, where the calorific power used exceeds 20 MW
status: valid
status modified: 2017-02-08
accepted date: 2017-02-08
in scheme: Activities listed in Annex I to Directive 2010/75/EU which are operated in the installation.

Processing of ferrous metals: application of protective fused metal coats with an input exceeding 2 tonnes of crude steel per hour.
type: Concept
notation: 2.3(c)
definition: Processing of ferrous metals: application of protective fused metal coats with an input exceeding 2 tonnes of crude steel per hour.
status: valid
status modified: 2017-02-08
accepted date: 2017-02-08
in scheme: Activities listed in Annex I to Directive 2010/75/EU which are operated in the installation.

Operation of ferrous metal foundries with a production capacity exceeding 20 tonnes per day
type: Concept
notation: 2.4
definition: Operation of ferrous metal foundries with a production capacity exceeding 20 tonnes per day
status: valid
status modified: 2017-02-08
accepted date: 2017-02-08
in scheme: Activities listed in Annex I to Directive 2010/75/EU which are operated in the installation.

Processing of non-ferrous metals: production of non-ferrous crude metals from ore, concentrates or secondary raw materials by metallurgical, chemical or electrolytic processes
type: Concept
notation: 2.5(a)
definition: Processing of non-ferrous metals: production of non-ferrous crude metals from ore, concentrates or secondary raw materials by metallurgical, chemical or electrolytic processes
status: valid
status modified: 2017-02-08
accepted date: 2017-02-08
in scheme: Activities listed in Annex I to Directive 2010/75/EU which are operated in the installation.

2.5(b)
type: Concept
notation: 2.5(b)
preferred label: Processing of non-ferrous metals: melting, including the alloyage, of non-ferrous metals, including recovered products and operation of non-ferrous metal foundries, with a melting capacity exceeding 4 tonnes per day for lead and cadmium or 20 tonnes per day for all other metals.
definition: Processing of non-ferrous metals: melting, including the alloyage, of non-ferrous metals, including recovered products and operation of non-ferrous metal foundries, with a melting capacity exceeding 4 tonnes per day for lead and cadmium or 20 tonnes per day for all other metals.
status: valid
status modified: 2017-02-08
accepted date: 2017-02-08
in scheme: Activities listed in Annex I to Directive 2010/75/EU which are operated in the installation.

Surface treatment of metals or plastic materials using an electrolytic or chemical process where the volume of the treatment vats exceeds 30 m3
type: Concept
notation: 2.6
definition: Surface treatment of metals or plastic materials using an electrolytic or chemical process where the volume of the treatment vats exceeds 30 m3
status: valid
status modified: 2017-02-08
accepted date: 2017-02-08
in scheme: Activities listed in Annex I to Directive 2010/75/EU which are operated in the installation.

Mineral industry
type: Concept
notation: 3
definition: Mineral industry
status: invalid
status modified: 2018-05-17
accepted date: 2017-02-08
not accepted date: 2018-05-17
in scheme: Activities listed in Annex I to Directive 2010/75/EU which are operated in the installation.

Production of cement clinker in rotary kilns with a production capacity exceeding 500 tonnes per day or in other kilns with a production capacity exceeding 50 tonnes per day
type: Concept
notation: 3.1(a)
definition: Production of cement clinker in rotary kilns with a production capacity exceeding 500 tonnes per day or in other kilns with a production capacity exceeding 50 tonnes per day
status: valid
status modified: 2017-02-08
accepted date: 2017-02-08
in scheme: Activities listed in Annex I to Directive 2010/75/EU which are operated in the installation.

Production of lime in kilns with a production capacity exceeding 50 tonnes per day
type: Concept
notation: 3.1(b)
definition: Production of lime in kilns with a production capacity exceeding 50 tonnes per day
status: valid
status modified: 2017-02-08
accepted date: 2017-02-08
in scheme: Activities listed in Annex I to Directive 2010/75/EU which are operated in the installation.

Production of magnesium oxide in kilns with a production capacity exceeding 50 tonnes per day
type: Concept
notation: 3.1(c)
definition: Production of magnesium oxide in kilns with a production capacity exceeding 50 tonnes per day
status: valid
status modified: 2017-02-08
accepted date: 2017-02-08
in scheme: Activities listed in Annex I to Directive 2010/75/EU which are operated in the installation.

Production of asbestos or the manufacture of asbestos based products
type: Concept
notation: 3.2
definition: Production of asbestos or the manufacture of asbestos based products
status: valid
status modified: 2017-02-08
accepted date: 2017-02-08
in scheme: Activities listed in Annex I to Directive 2010/75/EU which are operated in the installation.

Manufacture of glass including glass fibre with a melting capacity exceeding 20 tonnes per day
type: Concept
notation: 3.3
definition: Manufacture of glass including glass fibre with a melting capacity exceeding 20 tonnes per day
status: valid
status modified: 2017-02-08
accepted date: 2017-02-08
in scheme: Activities listed in Annex I to Directive 2010/75/EU which are operated in the installation.

Melting mineral substances including the production of mineral fibres with a melting capacity exceeding 20 tonnes per day
type: Concept
notation: 3.4
definition: Melting mineral substances including the production of mineral fibres with a melting capacity exceeding 20 tonnes per day
status: valid
status modified: 2017-02-08
accepted date: 2017-02-08
in scheme: Activities listed in Annex I to Directive 2010/75/EU which are operated in the installation.

http://dd.eionet.europa.eu/vocabulary/euregistryonindustrialsites/IEDAnnexIActivityValue/3.5
type: Concept
notation: 3.5
preferred label: Manufacture of ceramic products by firing, in particular roofing tiles, bricks, refractory bricks, tiles, stoneware or porcelain with a production capacity exceeding 75 tonnes per day and/or with a kiln capacity exceeding 4 m3 and with a setting density per kiln exceeding 300 kg/m3
definition: Manufacture of ceramic products by firing, in particular roofing tiles, bricks, refractory bricks, tiles, stoneware or porcelain with a production capacity exceeding 75 tonnes per day and/or with a kiln capacity exceeding 4 m3 and with a setting density per kiln exceeding 300 kg/m3
status: valid
status modified: 2017-02-08
accepted date: 2017-02-08
in scheme: Activities listed in Annex I to Directive 2010/75/EU which are operated in the installation.

Chemical industry
type: Concept
notation: 4
definition: Chemical industry
status: invalid
status modified: 2018-05-17
accepted date: 2017-02-08
not accepted date: 2018-05-17
in scheme: Activities listed in Annex I to Directive 2010/75/EU which are operated in the installation.

Production of organic chemicals: simple hydrocarbons (linear or cyclic, saturated or unsaturated, aliphatic or aromatic)
type: Concept
notation: 4.1(a)
definition: Production of organic chemicals: simple hydrocarbons (linear or cyclic, saturated or unsaturated, aliphatic or aromatic)
status: valid
status modified: 2017-02-08
accepted date: 2017-02-08
in scheme: Activities listed in Annex I to Directive 2010/75/EU which are operated in the installation.

Production of organic chemicals: oxygen-containing hydrocarbons such as alcohols, aldehydes, ketones, carboxylic acids, esters and mixtures of esters, acetates, ethers, peroxides and epoxy resins
type: Concept
notation: 4.1(b)
definition: Production of organic chemicals: oxygen-containing hydrocarbons such as alcohols, aldehydes, ketones, carboxylic acids, esters and mixtures of esters, acetates, ethers, peroxides and epoxy resins
status: valid
status modified: 2017-02-08
accepted date: 2017-02-08
in scheme: Activities listed in Annex I to Directive 2010/75/EU which are operated in the installation.

Production of organic chemicals: sulphurous hydrocarbons
type: Concept
notation: 4.1(c)
definition: Production of organic chemicals: sulphurous hydrocarbons
status: valid
status modified: 2017-02-08
accepted date: 2017-02-08
in scheme: Activities listed in Annex I to Directive 2010/75/EU which are operated in the installation.

Production of organic chemicals: nitrogenous hydrocarbons such as amines, amides, nitrous compounds, nitro compounds or nitrate compounds, nitriles, cyanates, isocyanates
type: Concept
notation: 4.1(d)
definition: Production of organic chemicals: nitrogenous hydrocarbons such as amines, amides, nitrous compounds, nitro compounds or nitrate compounds, nitriles, cyanates, isocyanates
status: valid
status modified: 2017-02-08
accepted date: 2017-02-08
in scheme: Activities listed in Annex I to Directive 2010/75/EU which are operated in the installation.

Production of organic chemicals: phosphorus-containing hydrocarbons
type: Concept
notation: 4.1(e)
definition: Production of organic chemicals: phosphorus-containing hydrocarbons
status: valid
status modified: 2017-02-08
accepted date: 2017-02-08
in scheme: Activities listed in Annex I to Directive 2010/75/EU which are operated in the installation.

Production of organic chemicals: halogenic hydrocarbons
type: Concept
notation: 4.1(f)
definition: Production of organic chemicals: halogenic hydrocarbons
status: valid
status modified: 2017-02-08
accepted date: 2017-02-08
in scheme: Activities listed in Annex I to Directive 2010/75/EU which are operated in the installation.

Production of organic chemicals: organometallic compounds
type: Concept
notation: 4.1(g)
definition: Production of organic chemicals: organometallic compounds
status: valid
status modified: 2017-02-08
accepted date: 2017-02-08
in scheme: Activities listed in Annex I to Directive 2010/75/EU which are operated in the installation.

Production of organic chemicals: plastic materials (polymers, synthetic fibres and cellulose-based fibres)
type: Concept
notation: 4.1(h)
definition: Production of organic chemicals: plastic materials (polymers, synthetic fibres and cellulose-based fibres)
status: valid
status modified: 2017-02-08
accepted date: 2017-02-08
in scheme: Activities listed in Annex I to Directive 2010/75/EU which are operated in the installation.

Production of organic chemicals: synthetic rubbers
type: Concept
notation: 4.1(i)
definition: Production of organic chemicals: synthetic rubbers
status: valid
status modified: 2017-02-08
accepted date: 2017-02-08
in scheme: Activities listed in Annex I to Directive 2010/75/EU which are operated in the installation.

Production of organic chemicals: dyes and pigments
type: Concept
notation: 4.1(j)
definition: Production of organic chemicals: dyes and pigments
status: valid
status modified: 2017-02-08
accepted date: 2017-02-08
in scheme: Activities listed in Annex I to Directive 2010/75/EU which are operated in the installation.

Production of organic chemicals: surface-active agents and surfactants
type: Concept
notation: 4.1(k)
definition: Production of organic chemicals: surface-active agents and surfactants
status: valid
status modified: 2017-02-08
accepted date: 2017-02-08
in scheme: Activities listed in Annex I to Directive 2010/75/EU which are operated in the installation.

4.2(a)
type: Concept
notation: 4.2(a)
preferred label: Production of inorganic chemicals: gases, such as ammonia, chlorine or hydrogen chloride, fluorine or hydrogen fluoride, carbon oxides, sulphur compounds, nitrogen oxides, hydrogen, sulphur dioxide, carbonyl chloride
definition: Production of inorganic chemicals: gases, such as ammonia, chlorine or hydrogen chloride, fluorine or hydrogen fluoride, carbon oxides, sulphur compounds, nitrogen oxides, hydrogen, sulphur dioxide, carbonyl chloride
status: valid
status modified: 2017-02-08
accepted date: 2017-02-08
in scheme: Activities listed in Annex I to Directive 2010/75/EU which are operated in the installation.

Production of inorganic chemicals: acids, such as chromic acid, hydrofluoric acid, phosphoric acid, nitric acid, hydrochloric acid, sulphuric acid, oleum, sulphurous acids
type: Concept
notation: 4.2(b)
definition: Production of inorganic chemicals: acids, such as chromic acid, hydrofluoric acid, phosphoric acid, nitric acid, hydrochloric acid, sulphuric acid, oleum, sulphurous acids
status: valid
status modified: 2017-02-08
accepted date: 2017-02-08
in scheme: Activities listed in Annex I to Directive 2010/75/EU which are operated in the installation.

Production of inorganic chemicals: bases, such as ammonium hydroxide, potassium hydroxide, sodium hydroxide
type: Concept
notation: 4.2(c)
definition: Production of inorganic chemicals: bases, such as ammonium hydroxide, potassium hydroxide, sodium hydroxide
status: valid
status modified: 2017-02-08
accepted date: 2017-02-08
in scheme: Activities listed in Annex I to Directive 2010/75/EU which are operated in the installation.

Production of inorganic chemicals: salts, such as ammonium chloride, potassium chlorate, potassium carbonate, sodium carbonate, perborate, silver nitrate
type: Concept
notation: 4.2(d)
definition: Production of inorganic chemicals: salts, such as ammonium chloride, potassium chlorate, potassium carbonate, sodium carbonate, perborate, silver nitrate
status: valid
status modified: 2017-02-08
accepted date: 2017-02-08
in scheme: Activities listed in Annex I to Directive 2010/75/EU which are operated in the installation.

Production of inorganic chemicals: non-metals, metal oxides or other inorganic compounds such as calcium carbide, silicon, silicon carbide
type: Concept
notation: 4.2(e)
definition: Production of inorganic chemicals: non-metals, metal oxides or other inorganic compounds such as calcium carbide, silicon, silicon carbide
status: valid
status modified: 2017-02-08
accepted date: 2017-02-08
in scheme: Activities listed in Annex I to Directive 2010/75/EU which are operated in the installation.

Production of phosphorous, nitrogen or potassium based fertilisers (simple or compound fertilisers)
type: Concept
notation: 4.3
definition: Production of phosphorous, nitrogen or potassium based fertilisers (simple or compound fertilisers)
status: valid
status modified: 2017-02-08
accepted date: 2017-02-08
in scheme: Activities listed in Annex I to Directive 2010/75/EU which are operated in the installation.

Production of plant protection products or of biocides
type: Concept
notation: 4.4
definition: Production of plant protection products or of biocides
status: valid
status modified: 2017-02-08
accepted date: 2017-02-08
in scheme: Activities listed in Annex I to Directive 2010/75/EU which are operated in the installation.

Production of pharmaceutical products including intermediates
type: Concept
notation: 4.5
definition: Production of pharmaceutical products including intermediates
status: valid
status modified: 2017-02-08
accepted date: 2017-02-08
in scheme: Activities listed in Annex I to Directive 2010/75/EU which are operated in the installation.

Production of explosives
type: Concept
notation: 4.6
definition: Production of explosives
status: valid
status modified: 2017-02-08
accepted date: 2017-02-08
in scheme: Activities listed in Annex I to Directive 2010/75/EU which are operated in the installation.

Waste management
type: Concept
notation: 5
definition: Waste management
status: invalid
status modified: 2018-05-17
accepted date: 2017-02-08
not accepted date: 2018-05-17
in scheme: Activities listed in Annex I to Directive 2010/75/EU which are operated in the installation.

Disposal or recovery of hazardous waste with a capacity exceeding 10 tonnes per day involving one or more of the following activities.
type: Concept
notation: 5.1
definition: Disposal or recovery of hazardous waste with a capacity exceeding 10 tonnes per day involving one or more of the following activities.
status: valid
status modified: 2018-05-17
in scheme: Activities listed in Annex I to Directive 2010/75/EU which are operated in the installation.

Disposal or recovery of hazardous waste with a capacity exceeding 10 tonnes per day involving biological treatment
type: Concept
notation: 5.1(a)
definition: Disposal or recovery of hazardous waste with a capacity exceeding 10 tonnes per day involving biological treatment
status: valid
status modified: 2017-02-08
accepted date: 2017-02-08
in scheme: Activities listed in Annex I to Directive 2010/75/EU which are operated in the installation.

Disposal or recovery of hazardous waste with a capacity exceeding 10 tonnes per day involving physico-chemical treatment
type: Concept
notation: 5.1(b)
definition: Disposal or recovery of hazardous waste with a capacity exceeding 10 tonnes per day involving physico-chemical treatment
status: valid
status modified: 2017-02-08
accepted date: 2017-02-08
in scheme: Activities listed in Annex I to Directive 2010/75/EU which are operated in the installation.

Disposal or recovery of hazardous waste with a capacity exceeding 10 tonnes per day involving blending or mixing prior to submission to any of the other activities listed in points 5.1 and 5.2
type: Concept
notation: 5.1(c)
definition: Disposal or recovery of hazardous waste with a capacity exceeding 10 tonnes per day involving blending or mixing prior to submission to any of the other activities listed in points 5.1 and 5.2
status: valid
status modified: 2017-02-08
accepted date: 2017-02-08
in scheme: Activities listed in Annex I to Directive 2010/75/EU which are operated in the installation.

Disposal or recovery of hazardous waste with a capacity exceeding 10 tonnes per day involving repackaging prior to submission to any of the other activities listed in points 5.1 and 5.2
type: Concept
notation: 5.1(d)
definition: Disposal or recovery of hazardous waste with a capacity exceeding 10 tonnes per day involving repackaging prior to submission to any of the other activities listed in points 5.1 and 5.2
status: valid
status modified: 2017-02-08
accepted date: 2017-02-08
in scheme: Activities listed in Annex I to Directive 2010/75/EU which are operated in the installation.

Disposal or recovery of hazardous waste with a capacity exceeding 10 tonnes per day involving solvent reclamation/regeneration
type: Concept
notation: 5.1(e)
definition: Disposal or recovery of hazardous waste with a capacity exceeding 10 tonnes per day involving solvent reclamation/regeneration
status: valid
status modified: 2017-02-08
accepted date: 2017-02-08
in scheme: Activities listed in Annex I to Directive 2010/75/EU which are operated in the installation.

Disposal or recovery of hazardous waste with a capacity exceeding 10 tonnes per day involving recycling/reclamation of inorganic materials other than metals or metal compounds
type: Concept
notation: 5.1(f)
definition: Disposal or recovery of hazardous waste with a capacity exceeding 10 tonnes per day involving recycling/reclamation of inorganic materials other than metals or metal compounds
status: valid
status modified: 2017-02-08
accepted date: 2017-02-08
in scheme: Activities listed in Annex I to Directive 2010/75/EU which are operated in the installation.

Disposal or recovery of hazardous waste with a capacity exceeding 10 tonnes per day involving the regeneration of acids or bases
type: Concept
notation: 5.1(g)
definition: Disposal or recovery of hazardous waste with a capacity exceeding 10 tonnes per day involving the regeneration of acids or bases
status: valid
status modified: 2017-02-08
accepted date: 2017-02-08
in scheme: Activities listed in Annex I to Directive 2010/75/EU which are operated in the installation.

Disposal or recovery of hazardous waste with a capacity exceeding 10 tonnes per day involving the recovery of components used for pollution abatement
type: Concept
notation: 5.1(h)
definition: Disposal or recovery of hazardous waste with a capacity exceeding 10 tonnes per day involving the recovery of components used for pollution abatement
status: valid
status modified: 2017-02-08
accepted date: 2017-02-08
in scheme: Activities listed in Annex I to Directive 2010/75/EU which are operated in the installation.

Disposal or recovery of hazardous waste with a capacity exceeding 10 tonnes per day involving the recovery of components from catalysts
type: Concept
notation: 5.1(i)
definition: Disposal or recovery of hazardous waste with a capacity exceeding 10 tonnes per day involving the recovery of components from catalysts
status: valid
status modified: 2017-02-08
accepted date: 2017-02-08
in scheme: Activities listed in Annex I to Directive 2010/75/EU which are operated in the installation.

Disposal or recovery of hazardous waste with a capacity exceeding 10 tonnes per day involving oil re-refining or other reuses of oil
type: Concept
notation: 5.1(j)
definition: Disposal or recovery of hazardous waste with a capacity exceeding 10 tonnes per day involving oil re-refining or other reuses of oil
status: valid
status modified: 2017-02-08
accepted date: 2017-02-08
in scheme: Activities listed in Annex I to Directive 2010/75/EU which are operated in the installation.

Disposal or recovery of hazardous waste with a capacity exceeding 10 tonnes per day involving surface impoundment
type: Concept
notation: 5.1(k)
definition: Disposal or recovery of hazardous waste with a capacity exceeding 10 tonnes per day involving surface impoundment
status: valid
status modified: 2017-02-08
accepted date: 2017-02-08
in scheme: Activities listed in Annex I to Directive 2010/75/EU which are operated in the installation.

Disposal or recovery of waste in waste incineration plants or in waste co-incineration plants for non-hazardous waste with a capacity exceeding 3 tonnes per hour
type: Concept
notation: 5.2(a)
definition: Disposal or recovery of waste in waste incineration plants or in waste co-incineration plants for non-hazardous waste with a capacity exceeding 3 tonnes per hour
status: valid
status modified: 2017-02-08
accepted date: 2017-02-08
in scheme: Activities listed in Annex I to Directive 2010/75/EU which are operated in the installation.

Disposal or recovery of waste in waste incineration plants or in waste co-incineration plants for hazardous waste with a capacity exceeding 10 tonnes per day
type: Concept
notation: 5.2(b)
definition: Disposal or recovery of waste in waste incineration plants or in waste co-incineration plants for hazardous waste with a capacity exceeding 10 tonnes per day
status: valid
status modified: 2017-02-08
accepted date: 2017-02-08
in scheme: Activities listed in Annex I to Directive 2010/75/EU which are operated in the installation.

Disposal of non-hazardous waste with a capacity exceeding 50 tonnes per day involving one or more of the following activities.
type: Concept
notation: 5.3(a)
definition: Disposal of non-hazardous waste with a capacity exceeding 50 tonnes per day involving one or more of the following activities, and excluding activities covered by Council Directive 91/271/EEC of 21 May 1991 concerning urban waste-water treatment.
status: valid
status modified: 2018-05-17
in scheme: Activities listed in Annex I to Directive 2010/75/EU which are operated in the installation.

5.3(a)(i)
type: Concept
notation: 5.3(a)(i)
preferred label: Disposal of non-hazardous waste with a capacity exceeding 50 tonnes per day involving biological treatment, excluding activities covered by Council Directive 91/271/EEC of 21 May 1991 concerning urban waste-water treatment
definition: Disposal of non-hazardous waste with a capacity exceeding 50 tonnes per day involving biological treatment, excluding activities covered by Council Directive 91/271/EEC of 21 May 1991 concerning urban waste-water treatment
status: valid
status modified: 2017-02-08
accepted date: 2017-02-08
in scheme: Activities listed in Annex I to Directive 2010/75/EU which are operated in the installation.

5.3(a)(ii)
type: Concept
notation: 5.3(a)(ii)
preferred label: Disposal of non-hazardous waste with a capacity exceeding 50 tonnes per day involving physico-chemical treatment ,excluding activities covered by Council Directive 91/271/EEC of 21 May 1991 concerning urban waste-water treatment
definition: Disposal of non-hazardous waste with a capacity exceeding 50 tonnes per day involving physico-chemical treatment ,excluding activities covered by Council Directive 91/271/EEC of 21 May 1991 concerning urban waste-water treatment
status: valid
status modified: 2017-02-08
accepted date: 2017-02-08
in scheme: Activities listed in Annex I to Directive 2010/75/EU which are operated in the installation.

5.3(a)(iii)
type: Concept
notation: 5.3(a)(iii)
preferred label: Disposal of non-hazardous waste with a capacity exceeding 50 tonnes per day involving the pre-treatment of waste for incineration or co-incineration, excluding activities covered by Council Directive 91/271/EEC of 21 May 1991 concerning urban waste-water treatment
definition: Disposal of non-hazardous waste with a capacity exceeding 50 tonnes per day involving the pre-treatment of waste for incineration or co-incineration, excluding activities covered by Council Directive 91/271/EEC of 21 May 1991 concerning urban waste-water treatment
status: valid
status modified: 2017-02-08
accepted date: 2017-02-08
in scheme: Activities listed in Annex I to Directive 2010/75/EU which are operated in the installation.

5.3(a)(iv)
type: Concept
notation: 5.3(a)(iv)
preferred label: Disposal of non-hazardous waste with a capacity exceeding 50 tonnes per day involving the treatment of slags and ashes, excluding activities covered by Council Directive 91/271/EEC of 21 May 1991 concerning urban waste-water treatment
definition: Disposal of non-hazardous waste with a capacity exceeding 50 tonnes per day involving the treatment of slags and ashes, excluding activities covered by Council Directive 91/271/EEC of 21 May 1991 concerning urban waste-water treatment
status: valid
status modified: 2017-02-08
accepted date: 2017-02-08
in scheme: Activities listed in Annex I to Directive 2010/75/EU which are operated in the installation.

5.3(a)(v)
type: Concept
notation: 5.3(a)(v)
preferred label: Disposal of non-hazardous waste with a capacity exceeding 50 tonnes per day involving treatment in shredders of metal waste, including waste electrical and electronic equipment and end-of-life vehicles and their components , and excluding activities covered by Council Directive 91/271/EEC of 21 May 1991 concerning urban waste-water treatment
definition: Disposal of non-hazardous waste with a capacity exceeding 50 tonnes per day involving treatment in shredders of metal waste, including waste electrical and electronic equipment and end-of-life vehicles and their components , and excluding activities covered by Council Directive 91/271/EEC of 21 May 1991 concerning urban waste-water treatment
status: valid
status modified: 2017-02-08
accepted date: 2017-02-08
in scheme: Activities listed in Annex I to Directive 2010/75/EU which are operated in the installation.

5.3(b)
type: Concept
notation: 5.3(b)
preferred label: Recovery, or a mix of recovery and disposal, of non-hazardous waste with a capacity exceeding 75 tonnes per day involving one or more of the following activities, and excluding activities covered by Directive 91/271/EEC.
definition: Recovery, or a mix of recovery and disposal, of non-hazardous waste with a capacity exceeding 75 tonnes per day involving one or more of the following activities, and excluding activities covered by Directive 91/271/EEC.
status: valid
status modified: 2018-05-17
in scheme: Activities listed in Annex I to Directive 2010/75/EU which are operated in the installation.

Recovery, or a mix of recovery and disposal, of non-hazardous waste with a capacity exceeding 75 tonnes per day involving biological treatment, excluding activities covered by Directive 91/271/EEC
type: Concept
notation: 5.3(b)(i)
definition: Recovery, or a mix of recovery and disposal, of non-hazardous waste with a capacity exceeding 75 tonnes per day involving biological treatment, excluding activities covered by Directive 91/271/EEC
status: valid
status modified: 2017-02-08
accepted date: 2017-02-08
in scheme: Activities listed in Annex I to Directive 2010/75/EU which are operated in the installation.

5.3(b)(ii)
type: Concept
notation: 5.3(b)(ii)
preferred label: Recovery, or a mix of recovery and disposal, of non-hazardous waste with a capacity exceeding 75 tonnes per day involving the pre-treatment of waste for incineration or co-incineration, excluding activities covered by Directive 91/271/EEC
definition: Recovery, or a mix of recovery and disposal, of non-hazardous waste with a capacity exceeding 75 tonnes per day involving the pre-treatment of waste for incineration or co-incineration, excluding activities covered by Directive 91/271/EEC
status: valid
status modified: 2017-02-08
accepted date: 2017-02-08
in scheme: Activities listed in Annex I to Directive 2010/75/EU which are operated in the installation.

5.3(b)(iii)
type: Concept
notation: 5.3(b)(iii)
preferred label: Recovery, or a mix of recovery and disposal, of non-hazardous waste with a capacity exceeding 75 tonnes per day involving the treatment of slags and ashes, excluding activities covered by Directive 91/271/EEC
definition: Recovery, or a mix of recovery and disposal, of non-hazardous waste with a capacity exceeding 75 tonnes per day involving the treatment of slags and ashes, excluding activities covered by Directive 91/271/EEC
status: valid
status modified: 2017-02-08
accepted date: 2017-02-08
in scheme: Activities listed in Annex I to Directive 2010/75/EU which are operated in the installation.

5.3(b)(iv)
type: Concept
notation: 5.3(b)(iv)
preferred label: Recovery, or a mix of recovery and disposal, of non-hazardous waste with a capacity exceeding 75 tonnes per day involving treatment in shredders of metal waste, including waste electrical and electronic equipment and end-of-life vehicles and their components, and excluding activities covered by Directive 91/271/EEC.
definition: Recovery, or a mix of recovery and disposal, of non-hazardous waste with a capacity exceeding 75 tonnes per day involving treatment in shredders of metal waste, including waste electrical and electronic equipment and end-of-life vehicles and their components, and excluding activities covered by Directive 91/271/EEC.
status: valid
status modified: 2017-02-08
accepted date: 2017-02-08
in scheme: Activities listed in Annex I to Directive 2010/75/EU which are operated in the installation.

http://dd.eionet.europa.eu/vocabulary/euregistryonindustrialsites/IEDAnnexIActivityValue/5.4
type: Concept
notation: 5.4
preferred label: Landfills, as defined in Article 2(g) of Council Directive 1999/31/EC of 26 April 1999 on the landfill of waste, receiving more than 10 tonnes of waste per day or with a total capacity exceeding 25,000 tonnes, excluding landfills of inert waste
definition: Landfills, as defined in Article 2(g) of Council Directive 1999/31/EC of 26 April 1999 on the landfill of waste, receiving more than 10 tonnes of waste per day or with a total capacity exceeding 25,000 tonnes, excluding landfills of inert waste
status: valid
status modified: 2017-02-08
accepted date: 2017-02-08
in scheme: Activities listed in Annex I to Directive 2010/75/EU which are operated in the installation.

http://dd.eionet.europa.eu/vocabulary/euregistryonindustrialsites/IEDAnnexIActivityValue/5.5
type: Concept
notation: 5.5
preferred label: Temporary storage of hazardous waste not covered under point 5.4 pending any of the activities listed in points 5.1, 5.2, 5.4 and 5.6 with a total capacity exceeding 50 tonnes, excluding temporary storage, pending collection, on the site where the waste is generated
definition: Temporary storage of hazardous waste not covered under point 5.4 pending any of the activities listed in points 5.1, 5.2, 5.4 and 5.6 with a total capacity exceeding 50 tonnes, excluding temporary storage, pending collection, on the site where the waste is generated
status: valid
status modified: 2017-02-08
accepted date: 2017-02-08
in scheme: Activities listed in Annex I to Directive 2010/75/EU which are operated in the installation.

Underground storage of hazardous waste with a total capacity exceeding 50 tonnes
type: Concept
notation: 5.6
definition: Underground storage of hazardous waste with a total capacity exceeding 50 tonnes
status: valid
status modified: 2017-02-08
accepted date: 2017-02-08
in scheme: Activities listed in Annex I to Directive 2010/75/EU which are operated in the installation.

Other activities
type: Concept
notation: 6
definition: Other activities
status: invalid
status modified: 2018-05-17
accepted date: 2017-02-08
not accepted date: 2018-05-17
in scheme: Activities listed in Annex I to Directive 2010/75/EU which are operated in the installation.

Production in industrial installations of pulp from timber or other fibrous materials
type: Concept
notation: 6.1(a)
definition: Production in industrial installations of pulp from timber or other fibrous materials
status: valid
status modified: 2017-02-08
accepted date: 2017-02-08
in scheme: Activities listed in Annex I to Directive 2010/75/EU which are operated in the installation.

Production in industrial installations of paper or card board with a production capacity exceeding 20 tonnes per day
type: Concept
notation: 6.1(b)
definition: Production in industrial installations of paper or card board with a production capacity exceeding 20 tonnes per day
status: valid
status modified: 2017-02-08
accepted date: 2017-02-08
in scheme: Activities listed in Annex I to Directive 2010/75/EU which are operated in the installation.

Production in industrial installations with a production capacity exceeding 600 m3 per day of one or more of the following wood-based panels: oriented strand board, particleboard or fibreboard
type: Concept
notation: 6.1(c)
definition: Production in industrial installations with a production capacity exceeding 600 m3 per day of one or more of the following wood-based panels: oriented strand board, particleboard or fibreboard
status: valid
status modified: 2017-02-08
accepted date: 2017-02-08
in scheme: Activities listed in Annex I to Directive 2010/75/EU which are operated in the installation.

Preservation of wood and wood products with chemicals with a production capacity exceeding 75 m3 per day other than exclusively treating against sapstain
type: Concept
notation: 6.10
definition: Preservation of wood and wood products with chemicals with a production capacity exceeding 75 m3 per day other than exclusively treating against sapstain
status: valid
status modified: 2017-02-08
accepted date: 2017-02-08
in scheme: Activities listed in Annex I to Directive 2010/75/EU which are operated in the installation.

Independently operated treatment of waste water not covered by Directive 91/271/EEC and discharged by an installation covered by Chapter II of Directive 2010/75/EU
type: Concept
notation: 6.11
definition: Independently operated treatment of waste water not covered by Directive 91/271/EEC and discharged by an installation covered by Chapter II of Directive 2010/75/EU
status: valid
status modified: 2017-02-08
accepted date: 2017-02-08
in scheme: Activities listed in Annex I to Directive 2010/75/EU which are operated in the installation.

Pre-treatment (operations such as washing, bleaching, mercerisation) or dyeing of textile fibres or textiles where the treatment capacity exceeds 10 tonnes per day
type: Concept
notation: 6.2
definition: Pre-treatment (operations such as washing, bleaching, mercerisation) or dyeing of textile fibres or textiles where the treatment capacity exceeds 10 tonnes per day
status: valid
status modified: 2017-02-08
accepted date: 2017-02-08
in scheme: Activities listed in Annex I to Directive 2010/75/EU which are operated in the installation.

Tanning of hides and skins where the treatment capacity exceeds 12 tonnes of finished products per day
type: Concept
notation: 6.3
definition: Tanning of hides and skins where the treatment capacity exceeds 12 tonnes of finished products per day
status: valid
status modified: 2017-02-08
accepted date: 2017-02-08
in scheme: Activities listed in Annex I to Directive 2010/75/EU which are operated in the installation.

Operating slaughterhouses with a carcass production capacity greater than 50 tonnes per day
type: Concept
notation: 6.4(a)
definition: Operating slaughterhouses with a carcass production capacity greater than 50 tonnes per day
status: valid
status modified: 2017-02-08
accepted date: 2017-02-08
in scheme: Activities listed in Annex I to Directive 2010/75/EU which are operated in the installation.

6.4(b)(i)
type: Concept
notation: 6.4(b)(i)
preferred label: Treatment and processing, other than exclusively packaging, of the following raw materials, whether previously processed or unprocessed, intended for the production of food or feed from only animal raw materials (other than exclusively milk) with a finished product production capacity greater than 75 tonnes per day
definition: Treatment and processing, other than exclusively packaging, of the following raw materials, whether previously processed or unprocessed, intended for the production of food or feed from only animal raw materials (other than exclusively milk) with a finished product production capacity greater than 75 tonnes per day
status: valid
status modified: 2017-02-08
accepted date: 2017-02-08
in scheme: Activities listed in Annex I to Directive 2010/75/EU which are operated in the installation.

6.4(b)(ii)
type: Concept
notation: 6.4(b)(ii)
preferred label: Treatment and processing, other than exclusively packaging, of the following raw materials, whether previously processed or unprocessed, intended for the production of food or feed from only vegetable raw materials with a finished product production capacity greater than 300 tonnes per day or 600 tonnes per day where the installation operates for a period of no more than 90 consecutive days in any year
definition: Treatment and processing, other than exclusively packaging, of the following raw materials, whether previously processed or unprocessed, intended for the production of food or feed from only vegetable raw materials with a finished product production capacity greater than 300 tonnes per day or 600 tonnes per day where the installation operates for a period of no more than 90 consecutive days in any year
status: valid
status modified: 2017-02-08
accepted date: 2017-02-08
in scheme: Activities listed in Annex I to Directive 2010/75/EU which are operated in the installation.

Treatment and processing of milk only, the quantity of milk received being greater than 200 tonnes per day (average value on an annual basis)
type: Concept
notation: 6.4(c)
definition: Treatment and processing of milk only, the quantity of milk received being greater than 200 tonnes per day (average value on an annual basis)
status: valid
status modified: 2017-02-08
accepted date: 2017-02-08
in scheme: Activities listed in Annex I to Directive 2010/75/EU which are operated in the installation.

Disposal or recycling of animal carcases or animal waste with a treatment capacity exceeding 10 tonnes per day
type: Concept
notation: 6.5
definition: Disposal or recycling of animal carcases or animal waste with a treatment capacity exceeding 10 tonnes per day
status: valid
status modified: 2017-02-08
accepted date: 2017-02-08
in scheme: Activities listed in Annex I to Directive 2010/75/EU which are operated in the installation.

Intensive rearing of poultry with more than 40,000 places for poultry
type: Concept
notation: 6.6(a)
definition: Intensive rearing of poultry with more than 40,000 places for poultry
status: valid
status modified: 2017-02-08
accepted date: 2017-02-08
in scheme: Activities listed in Annex I to Directive 2010/75/EU which are operated in the installation.

Intensive rearing of pigs with more than 2,000 places for production pigs (over 30 kg)
type: Concept
notation: 6.6(b)
definition: Intensive rearing of pigs with more than 2,000 places for production pigs (over 30 kg)
status: valid
status modified: 2017-02-08
accepted date: 2017-02-08
in scheme: Activities listed in Annex I to Directive 2010/75/EU which are operated in the installation.

Intensive rearing of pigs with more than 750 places for sows
type: Concept
notation: 6.6(c)
definition: Intensive rearing of pigs with more than 750 places for sows
status: valid
status modified: 2017-02-08
accepted date: 2017-02-08
in scheme: Activities listed in Annex I to Directive 2010/75/EU which are operated in the installation.

http://dd.eionet.europa.eu/vocabulary/euregistryonindustrialsites/IEDAnnexIActivityValue/6.7
type: Concept
notation: 6.7
preferred label: Surface treatment of substances, objects or products using organic solvents, in particular for dressing, printing, coating, degreasing, waterproofing, sizing, painting, cleaning or impregnating, with an organic solvent consumption capacity of more than 150 kg per hour or more than 200 tonnes per year
definition: Surface treatment of substances, objects or products using organic solvents, in particular for dressing, printing, coating, degreasing, waterproofing, sizing, painting, cleaning or impregnating, with an organic solvent consumption capacity of more than 150 kg per hour or more than 200 tonnes per year
status: valid
status modified: 2017-02-08
accepted date: 2017-02-08
in scheme: Activities listed in Annex I to Directive 2010/75/EU which are operated in the installation.

Production of carbon (hard-burnt coal) or electrographite by means of incineration or graphitisation
type: Concept
notation: 6.8
definition: Production of carbon (hard-burnt coal) or electrographite by means of incineration or graphitisation
status: valid
status modified: 2017-02-08
accepted date: 2017-02-08
in scheme: Activities listed in Annex I to Directive 2010/75/EU which are operated in the installation.

Capture of CO2 streams from installations covered by Directive 2010/75/EU for the purposes of geological storage pursuant to Directive 2009/31/EC
type: Concept
notation: 6.9
definition: Capture of CO2 streams from installations covered by Directive 2010/75/EU for the purposes of geological storage pursuant to Directive 2009/31/EC
status: valid
status modified: 2017-02-08
accepted date: 2017-02-08
in scheme: Activities listed in Annex I to Directive 2010/75/EU which are operated in the installation.

6.4(b)(iii)
type: Concept
notation: 6.4(b)(iii)
preferred label: Treatment and processing, other than exclusively packaging, of the following raw materials, whether previously processed or unprocessed, intended for the production of food or feed from animal and vegetable raw materials, both in combined and separate products, with a finished product production capacity in tonnes per day greater than 75 if A is equal to 10 or more or, [300- (22,5 � A)] in any other case, where �A� is the portion of animal material (in percent of weight) of the finished product production capacity
definition: Treatment and processing, other than exclusively packaging, of the following raw materials, whether previously processed or unprocessed, intended for the production of food or feed from animal and vegetable raw materials, both in combined and separate products, with a finished product production capacity in tonnes per day greater than 75 if A is equal to 10 or more or, [300- (22,5 � A)] in any other case, where �A� is the portion of animal material (in percent of weight) of the finished product production capacity
status: valid
status modified: 2017-02-08
accepted date: 2017-02-08
in scheme: Activities listed in Annex I to Directive 2010/75/EU which are operated in the installation.