AQD - Quality control and assurance on CDR
type: ConceptScheme
notation: cdrqaqc
is part of: aq
registration status: Public draft
user modified: targajau
date modified: 2025-09-26 15:22:51.0
vocabulary type: Common
working user: targajau
is numeric concept identifiers: false
is notations equal identifiers: true

XML must include Reporting Header
type: Concept
notation: 1
definition: aqd:AQD_ReportingHeader element must be present.
status: valid
status modified: 2023-05-04
accepted date: 2023-05-04
in scheme: AQD - Quality control and assurance on CDR
hidden label: XML must include Reporting Header
editorial note: [Crucial]: Yes - System requirement - Integrated into one qa check
error type: BLOCKER

Reporting period must be reported and the envelop starting year must match the specific year within Reporing Header in the XML
type: Concept
notation: 2
definition: aqd:AQD_ReportingHeader/aqd:reportingPeriod must be reported in all XMLs. The (start) year value must be equal to the year specified in (aqd:AQD_ReportingHeader) in the XML file and it must be between 2014 - 2015.
status: valid
status modified: 2023-05-04
accepted date: 2023-05-04
in scheme: AQD - Quality control and assurance on CDR
hidden label: Reporting period must be reported and the envelop starting year must match the specific year within Reporing Header in the XML
editorial note: Updated to check aqd:reportingPeriod
error type: BLOCKER

The following elements must be included within Reporting Header (inspire Id, reporting authority and change element)
type: Concept
notation: 3
definition: aqd:AQD_ReportingHeader must include aqd:inspireId, aqd:reportingAuthority, aqd:change elements
status: valid
status modified: 2023-05-04
accepted date: 2023-05-04
in scheme: AQD - Quality control and assurance on CDR
hidden label: The following elements must be included within Reporting Header (inspire Id, reporting authority and change element)
editorial note: [Crucial]: Yes - System requirement - Integrated into one qa check
error type: BLOCKER

For aqd:AQD_ReportingHeader, if aqd:change='true', the following information must also be provided: aqd:AQD_ReportingHeader/aqd:changeDescription and aqd:AQD_ReportingHeader/aqd:content
type: Concept
notation: 4
definition: For aqd:AQD_ReportingHeader, if aqd:change='true', the following information must also be provided: aqd:AQD_ReportingHeader/aqd:changeDescription and aqd:AQD_ReportingHeader/aqd:content
status: valid
status modified: 2023-05-04
accepted date: 2023-05-04
in scheme: AQD - Quality control and assurance on CDR
hidden label: For aqd:AQD_ReportingHeader, if aqd:change='true', the following information must also be provided: aqd:AQD_ReportingHeader/aqd:changeDescription and aqd:AQD_ReportingHeader/aqd:content
editorial note: [Crucial]: Yes - System requirement - Integrated into one qa check
error type: BLOCKER

For aqd:AQD_ReportingHeader, if aqd:change='false', element aqd:content IS NOT expected.
type: Concept
notation: 5
definition: For aqd:AQD_ReportingHeader, if aqd:change='false', element aqd:content IS NOT expected.
status: valid
status modified: 2023-05-04
accepted date: 2023-05-04
in scheme: AQD - Quality control and assurance on CDR
hidden label: For aqd:AQD_ReportingHeader, if aqd:change='false', element aqd:content IS NOT expected.
editorial note: [Crucial]: Yes - System requirement - Integrated into one qa check
error type: BLOCKER

At least one file in the folder must be an XML with correct extension (*.xml)
type: Concept
notation: 6
definition: At least one file in the folder must be an XML with correct extension (*.xml)
status: valid
status modified: 2023-05-04
accepted date: 2023-05-04
in scheme: AQD - Quality control and assurance on CDR
error type: BLOCKER

Checks if this delivery is new or an update (on same reporting year)
type: Concept
notation: B0
definition: Check if delivery if this is a new delivery or updated delivery (via reporting year)
status: valid
status modified: 2023-05-04
accepted date: 2023-05-04
in scheme: AQD - Quality control and assurance on CDR
hidden label: Checks if this delivery is new or an update (on same reporting year)
editorial note: [Crucial]: Yes - Information
error type: WARNING

Number of zones reported
type: Concept
notation: B01
definition: Compile & feedback upon the total number of AQ zone feature types included in the delivery
status: valid
status modified: 2023-05-04
accepted date: 2023-05-04
in scheme: AQD - Quality control and assurance on CDR
hidden label: Number of zones reported
editorial note: [Crucial]: Yes - Information
error type: INFO

Number of new zones compared to previous report. Blocker will be returned if XML is a new delivery and localId are all new compared to previous deliveries
type: Concept
notation: B02
definition: Compile & feedback upon the total number of new records for AQ zones included in the delivery against previous delivery
status: valid
status modified: 2023-05-04
accepted date: 2023-05-04
in scheme: AQD - Quality control and assurance on CDR
hidden label: Number of new zones compared to previous report. Blocker will be returned if XML is a new delivery and localId are all new compared to previous deliveries
editorial note: [Crucial]: Yes - Information - Update to check if all localId are new
error type: BLOCKER

Number of existing zones compared to previous report. Blocker will be returned if XML is an update delivery and localId are all new compared to previous deliveries
type: Concept
notation: B03
definition: Compile & feedback upon the total number of existing records for AQ zones included in the delivery against previous delivery
status: valid
status modified: 2023-05-04
accepted date: 2023-05-04
in scheme: AQD - Quality control and assurance on CDR
hidden label: Number of existing zones compared to previous report. Blocker will be returned if XML is an update delivery and localId are all new compared to previous deliveries
editorial note: [Crucial]: Yes - System requirement - Update to check if all localId are new
error type: BLOCKER

List reported zones
type: Concept
notation: B04
definition: Compile & feedback upon all reported zones. Feedback report shall include the gml:id attribute, am:inspireId, am:name/gn:GeographicalName/gn:spelling/gn:text & aqd:zoneCode elements as available.
status: valid
status modified: 2023-05-04
accepted date: 2023-05-04
in scheme: AQD - Quality control and assurance on CDR
hidden label: List reported zones
editorial note: [Crucial]: Yes - Information
error type: INFO

reserved
type: Concept
notation: B05
definition: Compile & feedback upon the total number of modification to existing for AQ zone feature types included in the delivery, including ./aqd:predecessor information Report if the object xlinked via aqd:predecessor is not found within the current or previous deliveries (aqd:AQD_Zone)
status: reserved
status modified: 2023-05-04
accepted date: 2023-05-04
in scheme: AQD - Quality control and assurance on CDR
hidden label: reserved
editorial note: Not implemented -IPR requirement (Annex II-B-8)

New zones/agglomerations for the protection of Health must link to predecessor.
type: Concept
notation: B05a
definition: New zones/agglomerations compared to previous deliveries for the protection of Health must link to predecessor (aqd:predecessor). .
status: valid
status modified: 2023-05-04
accepted date: 2023-05-04
in scheme: AQD - Quality control and assurance on CDR
error type: BLOCKER

New zones/agglomerations for the protection of vegetation should link to predecessor.
type: Concept
notation: B05b
definition: New zones/agglomerations compared to previous deliveries for the protection of Vegetation should link to predecessor (aqd:predecessor).
status: valid
status modified: 2023-05-04
accepted date: 2023-05-04
in scheme: AQD - Quality control and assurance on CDR
error type: ERROR

Number of zones that provides coordinates inside the xml via geometry element
type: Concept
notation: B06a
definition: The number of zones designated with coordinates via the ./am:geometry element
status: valid
status modified: 2023-05-04
accepted date: 2023-05-04
in scheme: AQD - Quality control and assurance on CDR
hidden label: Number of zones that provides coordinates inside the xml via geometry element
editorial note: [Crucial]: Yes - Information
error type: INFO

Number of zones that provides coordinates via Local Administrative Units (LAU) element and external shapefile link
type: Concept
notation: B06b
definition: The number of zones designated with coordinates via the ./aqd:LAU element and the ./aqd:shapefileLink element
status: valid
status modified: 2023-05-04
accepted date: 2023-05-04
in scheme: AQD - Quality control and assurance on CDR
hidden label: Number of zones that provides coordinates via Local Administrative Units (LAU) element and external shapefile link
editorial note: [Crucial]: Yes - Information
error type: INFO

Number of unique combinations of zone types, pollutants and protection target
type: Concept
notation: B07
definition: List of unique combinations of aqd:aqdZoneType, aqd:pollutantCode and aqd:protectionTarget
status: valid
status modified: 2023-05-04
accepted date: 2023-05-04
in scheme: AQD - Quality control and assurance on CDR
hidden label: Number of unique combinations of zone types, pollutants and protection target
editorial note: [Crucial]: - Information
error type: INFO

Check and count expected combinations of Pollutant and ProtectionTarget
type: Concept
notation: B08
definition: Check and count expected combinations of Pollutant and ProtectionTarget: Sulphur dioxide (1) + health - Sulphur dioxide (1) + vegetation - Ozone (7) + health - Ozone (7) + vegetation - Nitrogen dioxide (8) + health - Nitrogen oxides (9) + vegetation - Particulate matter < 10 µm (5) + health - Particulate matter < 2.5 µm (6001) + health - Carbon monoxide (10) + health - Benzene (20) + health - Lead in PM10 (5012) + health - Arsenic in PM10 (5018) + health - Cadmium in PM10 (5014) + health -Nickel in PM10 (5015) + health - Benzo(a)pyrene in PM10 (5029) + health
status: valid
status modified: 2023-05-04
accepted date: 2023-05-04
in scheme: AQD - Quality control and assurance on CDR
hidden label: Check and count expected combinations of Pollutant and ProtectionTarget
editorial note: [Crucial]: Yes - SYSTEM & INSPIRE requirement
error type: BLOCKER

Internal XML and INSPIRE identifiers must be unique (gml:id, base:localId)
type: Concept
notation: B09
definition: All gml:id attributes, am:inspireId and aqd:inspireId elements shall have unique content
status: valid
status modified: 2023-05-04
accepted date: 2023-05-04
in scheme: AQD - Quality control and assurance on CDR
hidden label: Internal XML and INSPIRE identifiers must be unique (gml:id, base:localId)
editorial note: [Crucial]: Yes - SYSTEM & INSPIRE requirement
error type: BLOCKER

List unique namespaces used and count number of elements
type: Concept
notation: B10
definition: ./am:inspireId/base:Identifier/base:namespace List base:namespace and count the number of base:localId assigned to each base:namespace.
status: valid
status modified: 2023-05-04
accepted date: 2023-05-04
in scheme: AQD - Quality control and assurance on CDR
hidden label: List unique namespaces used and count number of elements
editorial note: [Crucial]: Yes - INSPIRE requirement
error type: INFO

Check namespace is registered
type: Concept
notation: B10.1
definition: Check that namespace is registered in vocabulary (http://dd.eionet.europa.eu/vocabulary/aq/namespace/view)
status: valid
status modified: 2023-05-04
accepted date: 2023-05-04
in scheme: AQD - Quality control and assurance on CDR
hidden label: Unregistered country namespaace has been used
editorial note: [Crucial]: Yes - System requirement
error type: BLOCKER

The sum of the population of different zones for expected combinations of Pollutant and ProtectionTarget must be within +/-5%
type: Concept
notation: B11
definition: The sum of the population reported via aqd:residentPopulation of different zones for expected combinations of Pollutant and ProtectionTarget must be within +/-5% (according to http://dd.eionet.europa.eu/vocabulary/aq/namespace/view)
status: valid
status modified: 2023-05-04
accepted date: 2023-05-04
in scheme: AQD - Quality control and assurance on CDR
error type: BLOCKER

The sum of the population of different zones for expected combinations of Pollutant and ProtectionTarget must not differ substantially between themselves
type: Concept
notation: B11b
definition: The sum of the population reported via aqd:population of different zones for expected combinations of Pollutant and ProtectionTarget can not be greater than 1% of the total Population or 50,000 inhabitants (whichever is lower)
status: valid
status modified: 2023-05-04
accepted date: 2023-05-04
in scheme: AQD - Quality control and assurance on CDR
error type: ERROR

The sum of the area (km2) of different zones for expected combinations of Pollutant and ProtectionTarget must be within +/-0.5%
type: Concept
notation: B12
definition: The sum of the area (km2) reported via aqd:area of different zones for expected combinations of Pollutant and ProtectionTarget must be within +/-0.5% (according to http://dd.eionet.europa.eu/vocabulary/aq/namespace/view)
status: valid
status modified: 2023-05-04
accepted date: 2023-05-04
in scheme: AQD - Quality control and assurance on CDR
hidden label: reserved
editorial note: Not implemented
error type: BLOCKER

The sum of the areas of different zones for expected combinations of Pollutant and ProtectionTarget must not differ substantially between themselves
type: Concept
notation: B12b
definition: The sum of the area (km2) reported via aqd:area of different zones for expected combinations of Pollutant and ProtectionTarget can not be greater than must be within 1% of SurfaceArea or 50 km2 (whichever is lower)
status: valid
status modified: 2023-05-04
accepted date: 2023-05-04
in scheme: AQD - Quality control and assurance on CDR
error type: ERROR

Compare area declared for each zone compared to previous (based on localId)
type: Concept
notation: B12c
definition: Compare area declared for each zone compared to previous (based on localId)
status: valid
status modified: 2023-07-14
accepted date: 2023-07-14
in scheme: AQD - Quality control and assurance on CDR
error type: ERROR

The geographical language code must correspond to either the ISO 639-3 or ISO 639-5.
type: Concept
notation: B13
definition: /aqd:AQD_Zone/am:name/gn:GeographicalName/gn:language value shall be the language of the name, given as a three letters code, in accordance with either ISO 639-3 or ISO 639-5.
status: valid
status modified: 2023-05-04
accepted date: 2023-05-04
in scheme: AQD - Quality control and assurance on CDR
hidden label: The geographical language code must correspond to either the ISO 639-3 or ISO 639-5.
editorial note: [Crucial]: Yes - INSPIRE requirement
error type: SKIPPED

Check the sum of area and population for Health protection combinations against vocabulary.
type: Concept
notation: B14
definition: Check and make the sum of area (aqd:area) and population (aqd:residentPopulation) expected combinations of Pollutant and ProtectionTarget: Sulphur dioxide (1) + health - Ozone (7) + health - Nitrogen dioxide (8) + health - Particulate matter < 10 µm (5) + health - Particulate matter < 2.5 µm (6001) + health - Carbon monoxide (10) + health - Benzene (20) + health - Lead in PM10 (5012) + health - Arsenic in PM10 (5018) + health - Cadmium in PM10 (5014) + health -Nickel in PM10 (5015) + health - Benzo(a)pyrene in PM10 (5029) + health
status: valid
status modified: 2023-05-04
accepted date: 2023-05-04
in scheme: AQD - Quality control and assurance on CDR
error type: WARNING

Check the sum of area and population for all Health protection combinations are within 5% of the mode of the sums.
type: Concept
notation: B15
definition: The sum of area and population for all Health protection combinations should be within 5% of the mode of the sums for the same combination
status: valid
status modified: 2023-05-04
accepted date: 2023-05-04
in scheme: AQD - Quality control and assurance on CDR
error type: WARNING

Check results on B14 and B15. Any combination with a warning in both B14 and B15 will result in Error.
type: Concept
notation: B16
definition: Check results on B14 and B15. Any combination with a warning in both B14 and B15 will result in Error.
status: valid
status modified: 2023-05-04
accepted date: 2023-05-04
in scheme: AQD - Quality control and assurance on CDR
error type: ERROR

Compare the list of zone-pollutant-protectionTarget combination with previous delivery
type: Concept
notation: B17
definition: QC rule B17 checks if the combinations of aqd:AQD_Zone - aqd:pollutantCode - aqd:protectionTarget from the current XML are present in the latest delivery of the previous year; it lists all aqd:AQD_Zone - aqd:pollutantCode - aqd:protectionTarget combinations which are different from the previous year submission of data flow B.
status: experimental
status modified: 2023-07-14
accepted date: 2023-07-14
in scheme: AQD - Quality control and assurance on CDR
hidden label: reserved
editorial note: reserved
error type: WARNING

The geographical language text must be a string
type: Concept
notation: B18
definition: ./am:name/gn:GeographicalName/gn:spelling/gn:SpellingOfName/gn:text shall return a string
status: valid
status modified: 2023-05-04
accepted date: 2023-05-04
in scheme: AQD - Quality control and assurance on CDR
hidden label: The geographical language text must be a string
editorial note: [Crucial]: Yes - IPR requirement (Annex II-B-4)
error type: BLOCKER

reserved
type: Concept
notation: B19
definition: ./am:name/gn:GeographicalName/gn:spelling/gn:SpellingOfName/gn:script attribute xsi:nil="true" nilReason="unknown"
status: reserved
status modified: 2023-05-04
accepted date: 2023-05-04
in scheme: AQD - Quality control and assurance on CDR
hidden label: reserved
editorial note: Not implemented -INSPIRE requirement

The coordinate reference system for the zones must be defined with a correct uniform resource name
type: Concept
notation: B20
definition: /am:geometry/gml:Polygon, ./am:geometry/gml:Point, ./am:geometry/gml:MultiPoint, ./am:geometry/gml:MultiSurface, ./am:geometry/gml:Grid, ./am:geometry/gml:RectifiedGrid the srsName attribute shall be a recognisable URN. The following 3 srsNames are expected urn:ogc:def:crs:EPSG::3035 or urn:ogc:def:crs:EPSG::4258 or urn:ogc:def:crs:EPSG::4326
status: valid
status modified: 2023-05-04
accepted date: 2023-05-04
in scheme: AQD - Quality control and assurance on CDR
hidden label: Coordinate system for Zones needs revision
editorial note: [Crucial]: Yes - IPR requimrent (Annex II-B-6)
error type: BLOCKER

The dimension attribute must be given the value "2"
type: Concept
notation: B21
definition: /am:geometry/gml:Polygon, ./am:geometry/gml:Point, ./am:geometry/gml:MultiPoint, ./am:geometry/gml:MultiSurface, ./am:geometry/gml:Grid, ./am:geometry/gml:RectifiedGrid, ./am:geometry/gml:Polygon/gml:exterior/gml:LinearRing/gml:posList the srsDimension attribute shall resolve to "2" to allow the x & y-coordinate of the feature of interest
status: valid
status modified: 2023-05-04
accepted date: 2023-05-04
in scheme: AQD - Quality control and assurance on CDR
hidden label: Geometry information needs revising as errors were detected which will prevent processing it.
editorial note: [Crucial]: Yes - IPR requimrent (Annex II-B-6)
error type: ERROR

The count attribute must be equal to the Y and X coordinate doublets
type: Concept
notation: B22
definition: ./am:geometry /gml:Polygon/gml:exterior/gml:LinearRing/gml:posList the count attribute shall resolve to the sum of y & x-coordinate doublets.
status: valid
status modified: 2023-05-04
accepted date: 2023-05-04
in scheme: AQD - Quality control and assurance on CDR
hidden label: Coordinate provided for Zones needs revision as not provided a Y and X coordinate doublets
editorial note: [Crucial]: Yes - IPR requirement (Annex II-B-6) & system requirement (can not process if not correct)
error type: BLOCKER

The coordinates must be ordered as latitude (y-axis), longtitude (x-axis). Please note that if warning, GEOMETRY checks might fail.
type: Concept
notation: B23
definition: Check that the coordinates lists in ./am:geometry /gml:Polygon/gml:exterior/gml:LinearRing/gml:posList ar presented in lat / long (y-axis / x-axis) notation.
status: valid
status modified: 2023-05-04
accepted date: 2023-05-04
in scheme: AQD - Quality control and assurance on CDR
hidden label: The coordinates must be ordered as latitude (y-axis), longtitude (x-axis)
editorial note: [Crucial]: Yes - IPR requimrent (Annex II-B-6) - Exception with France
error type: WARNING

Zone type must conform to http://inspire.ec.europa.eu/codelist/ZoneTypeCode/airQualityManagementZone
type: Concept
notation: B24
definition: ./am:zoneType value shall resolve to http://inspire.ec.europa.eu/codelist/ZoneTypeCode/airQualityManagementZone (working URL)
status: valid
status modified: 2023-05-04
accepted date: 2023-05-04
in scheme: AQD - Quality control and assurance on CDR
hidden label: Codelist for am:zoneType requires revision: INSPIRE codelist is required
editorial note: [Crucial]: - INSPIRE requirement
error type: ERROR

Start time must be less than end time and must be provided
type: Concept
notation: B25
definition: ./am:designationPeriod/gml:TimePeriod/gml:beginPosition shall be less than ./am:designationPeri/gml:TimePeriod/gml:endPosition. (start time must be provided)
status: valid
status modified: 2023-05-04
accepted date: 2023-05-04
in scheme: AQD - Quality control and assurance on CDR
hidden label: Zone's Start time must be less than end time
editorial note: [Crucial]: Yes - IPR requimrent (Annex II-B-7)
error type: BLOCKER

The begin date of a zone should be the same as previous delivery (inc. updates for the same year)
type: Concept
notation: B26
definition: ./am:designationPeriod/gml:TimePeriod/gml:beginPosition shall NOT be different from previous delivery
status: experimental
status modified: 2023-07-14
accepted date: 2023-07-14
in scheme: AQD - Quality control and assurance on CDR
hidden label: The begin date of a zone should be the same as previous delivery (inc. updates for the same year)
error type: ERROR

The zone's end date should not differ from previous delivery (if already closed)
type: Concept
notation: B27
definition: ./am:designationPeri/gml:TimePeriod/gml:endPosition shall not be different from previous delivery (exception from NULL to a value) - If in previous delivery the zone was already closed, it can not be re-opened - If previous delivery has an end date, in new delivery, it can not change
status: experimental
status modified: 2023-07-14
accepted date: 2023-07-14
in scheme: AQD - Quality control and assurance on CDR
hidden label: The zone's end date should not differ from previous delivery (if already closed)

End date must be greater than start date, if end date exists
type: Concept
notation: B28
definition: ./am:beginLifespanVersion shall be a valid historical date for the start of the version of the zone in extended ISO format. If an am:endLifespanVersion exists its value shall be greater than the am:beginLifespanVersion
status: valid
status modified: 2023-05-04
accepted date: 2023-05-04
in scheme: AQD - Quality control and assurance on CDR
hidden label: Zone's End date must be greater than start date, if end date exists
editorial note: [Crucial]: Yes - INSPIRE requirement
error type: BLOCKER

Start date shall be less, or equal to
type: Concept
notation: B29
definition: ./am:beginLifespanVersion shall be LESS THAN OR EQUAL TO ./am:designationPeriod/gml:TimePeriod/gml:endPosition ./am:beginLifespanVersion shall be GREATER THAN OR EQUAL TO ./am:designationPeriod/gml:TimePeriod/gml:beginPosition
status: reserved
status modified: 2023-05-04
accepted date: 2023-05-04
in scheme: AQD - Quality control and assurance on CDR
hidden label: Start date shall be less, or equal to
editorial note: Not implemented -

Enviromental Domain must conform to http://inspire.ec.europa.eu/codelist/MediaValue/[code]
type: Concept
notation: B30
definition: ./am:environmentalDomain shall be a citation via href xlink attribute of http://inspire.ec.europa.eu/codelist/MediaValue/[code] (currently resolves to 404 error)
status: valid
status modified: 2023-05-04
accepted date: 2023-05-04
in scheme: AQD - Quality control and assurance on CDR
hidden label: Codelist for am:environmentalDomain requires revision: INSPIRE codelist is required
editorial note: [Crucial]: N/A - INSPIRE requirement
error type: ERROR

Legislation citation name must be “2011/850/EC”
type: Concept
notation: B31
definition: ./am:legalBasis/base2:LegislationCitation/base2:name value shall be “2011/850/EC”
status: valid
status modified: 2023-05-04
accepted date: 2023-05-04
in scheme: AQD - Quality control and assurance on CDR
hidden label: Legislation citation name must be “2011/850/EC”
editorial note: [Crucial]: N/A - INSPIRE requirement
error type: WARNING

Legislation citation date must be “2011-12-12”
type: Concept
notation: B32
definition: ./am:legalBasis/base2:LegislationCitation/base2:date value shall be “2011/12/12”
status: valid
status modified: 2023-05-04
accepted date: 2023-05-04
in scheme: AQD - Quality control and assurance on CDR
hidden label: Legislation citation date must be “2011-12-12”
editorial note: [Crucial]: N/A - INSPIRE requirement
error type: WARNING

Legislation citation line must be “http://rod.eionet.europa.eu/instruments/650”
type: Concept
notation: B33
definition: ./am:legalBasis/base2:LegislationCitation/base2:link value shall be “http://rod.eionet.europa.eu/instruments/650”
status: valid
status modified: 2023-05-04
accepted date: 2023-05-04
in scheme: AQD - Quality control and assurance on CDR
hidden label: Legislation citation line must be “http://rod.eionet.europa.eu/instruments/650”
editorial note: [Crucial]: N/A - INSPIRE requirement
error type: WARNING

Base level must conform to http://inspire.ec.europa.eu/codelist/LegislationLevelValue/[code]
type: Concept
notation: B34
definition: ./am:legalBasis/base2:LegislationCitation/base2:level shall be a citation via href xlink attribute of http://inspire.ec.europa.eu/codelist/LegislationLevelValue/[code]
status: valid
status modified: 2023-05-04
accepted date: 2023-05-04
in scheme: AQD - Quality control and assurance on CDR
hidden label: Codelist for …base2:level requires revision: INSPIRE codelist is required
editorial note: [Crucial]: Yes - INSPIRE requirement
error type: ERROR

Zone code must be unique. The value may e equal the LocalId
type: Concept
notation: B35
definition: ./aqd:zoneCode shall be a unique code for the zone within the ./am:inspireId/base:Identifier/base:namespace. ./aqd:zoneCode . The value may equal the value at ./am:inspireId/base:Identifier/base:localId
status: valid
status modified: 2023-05-04
accepted date: 2023-05-04
in scheme: AQD - Quality control and assurance on CDR
hidden label: Zone code must be unique. The value may e equal the LocalId
editorial note: [Crucial]: Yes - IPR requimrent (Annex II-B-3)
error type: BLOCKER

Population must be a value higher than zero
type: Concept
notation: B36
definition: ./aqd:residentPopulation shall be an integer value GREATER THAN 0 (zero)
status: valid
status modified: 2023-05-04
accepted date: 2023-05-04
in scheme: AQD - Quality control and assurance on CDR
hidden label: Population must be a value higher than zero
editorial note: [Crucial]: Yes - IPR requimrent (Annex II-B-9)
error type: BLOCKER

Year in which the resident population was estimated must have the format yyyy
type: Concept
notation: B37
definition: ./aqd:residentPopulationYear/gml:TimeInstant/gml:timePosition shall cite the year in which the resident population was estimated in yyyy format
status: valid
status modified: 2023-05-04
accepted date: 2023-05-04
in scheme: AQD - Quality control and assurance on CDR
hidden label: The year in which resident population was provided is in the wrong format
editorial note: [Crucial]: Yes - IPR requimrent (Annex II-B-10)
error type: ERROR

The Area value must be a decimal number, greater than zero.
type: Concept
notation: B38
definition: ./aqd:area the value will be a decimal number GREATER THAN 0 (zero)
status: valid
status modified: 2023-05-04
accepted date: 2023-05-04
in scheme: AQD - Quality control and assurance on CDR
hidden label: The Area value must be a decimal number, greater than zero.
editorial note: [Crucial]: Yes - NOT required
error type: BLOCKER

Check for correct Pollutant/ProtectionTarget combination
type: Concept
notation: B39a
definition: The allowed content combination within ./aqd:pollutants/aqd:Pollutant/aqd:pollutantCode AND ./aqd:pollutants/aqd:Pollutant/aqd:protectionTarget shall be constrained to Sulphur dioxide (air) + health (http://dd.eionet.europa.eu/vocabulary/aq/pollutant/1 + http://dd.eionet.europa.eu/vocabulary/aq/protectiontarget/H) - Sulphur dioxide (air) + vegetation (http://dd.eionet.europa.eu/vocabulary/aq/pollutant/1 + http://dd.eionet.europa.eu/vocabulary/aq/protectiontarget/V) - Ozone (air) + health (http://dd.eionet.europa.eu/vocabulary/aq/pollutant/7 + http://dd.eionet.europa.eu/vocabulary/aq/protectiontarget/H) - Ozone (air) + vegetation (http://dd.eionet.europa.eu/vocabulary/aq/pollutant/7 + http://dd.eionet.europa.eu/vocabulary/aq/protectiontarget/V) - Nitrogen dioxide (air) + health (http://dd.eionet.europa.eu/vocabulary/aq/pollutant/8 + http://dd.eionet.europa.eu/vocabulary/aq/protectiontarget/H) - Nitrogen oxides (air) + eco (http://dd.eionet.europa.eu/vocabulary/aq/pollutant/9 + http://dd.eionet.europa.eu/vocabulary/aq/protectiontarget/V) - Particulate matter < 10 µm (aerosol) + health (http://dd.eionet.europa.eu/vocabulary/aq/pollutant/5 + http://dd.eionet.europa.eu/vocabulary/aq/protectiontarget/H) - Particulate matter < 2.5 µm (aerosol) + health (http://dd.eionet.europa.eu/vocabulary/aq/pollutant/6001 + http://dd.eionet.europa.eu/vocabulary/aq/protectiontarget/H) - Carbon monoxide (air) + health (http://dd.eionet.europa.eu/vocabulary/aq/pollutant/10 + http://dd.eionet.europa.eu/vocabulary/aq/protectiontarget/H) - Benzene (air) + health (http://dd.eionet.europa.eu/vocabulary/aq/pollutant/20 + http://dd.eionet.europa.eu/vocabulary/aq/protectiontarget/H) - Lead in PM10 (aerosol) + health (http://dd.eionet.europa.eu/vocabulary/aq/pollutant/5012 + http://dd.eionet.europa.eu/vocabulary/aq/protectiontarget/H) - Arsenic in PM10 (aerosol) + health (http://dd.eionet.europa.eu/vocabulary/aq/pollutant/5018 + http://dd.eionet.europa.eu/vocabulary/aq/protectiontarget/H) - Cadmium…
status: valid
status modified: 2023-05-04
accepted date: 2023-05-04
in scheme: AQD - Quality control and assurance on CDR
hidden label: Check for correct Pollutant/ProtectionTarget combination
editorial note: [Crucial]: Yes - Air quality requirement
error type: ERROR

Check if at least one of the expected Pollutant/ProtectionTarget combination(s) is provided in the delivery
type: Concept
notation: B39b
definition: Count number of occurrences across XML and list it as below (it can not be 0): Sulphur dioxide (1) + health & Sulphur dioxide (1) + vegetation & Ozone (7) + health & Ozone (7) + vegetation & Nitrogen dioxide (8) + health & Nitrogen oxides (9) + vegetation & Particulate matter < 10 µm (5) + health & Particulate matter < 2.5 µm (6001) + health & Carbon monoxide (10) + health & Benzene (20) + health Lead in PM10 (5012) + health & Arsenic in PM10 (5018) + health & Cadmium in PM10 (5014) + health & Nickel in PM10 (5015) + health & Benzo(a)pyrene in PM10 (5029) + health & One exception: Nitrogen oxides (9) + vegetation can be 0 for Gibraltar
status: valid
status modified: 2023-05-04
accepted date: 2023-05-04
in scheme: AQD - Quality control and assurance on CDR
hidden label: Missing expected combinations of Pollutant and ProtectionTarget
editorial note: [Crucial]: Yes -
error type: BLOCKER

Check and list if any individual zone with any duplicated Pollutant/ProtectionTarget combination
type: Concept
notation: B39c
definition: Check if any combination in B39a is repeated within individual AQD:Zone . An error is returned if repeated.
status: valid
status modified: 2023-05-04
accepted date: 2023-05-04
in scheme: AQD - Quality control and assurance on CDR
hidden label: Pollutant/ProtectionTarget combination is repeated withing same zone. Please amend
editorial note: [Crucial]: Yes - System requirement
error type: BLOCKER

ExtensionExemption accepted prior to 2015 deliveries
type: Concept
notation: B40
definition: IF aqd:reportingPeriod included in the ReportingHeader is equal or greater than year 2015, ./aqd:timeExtensionExemption must resolve to http://dd.eionet.europa.eu/vocabulary/aq/timeextensiontypes/none Only 1 entry is allowed. Else ./aqd:timeExtensionExemption attribute must resolve to one of concept within http://dd.eionet.europa.eu/vocabulary/aq/timeextensiontypes/… Multiple entries are allowed.
status: valid
status modified: 2023-05-04
accepted date: 2023-05-04
in scheme: AQD - Quality control and assurance on CDR
hidden label: Time extensions are NOT expected in zones after 2015.
editorial note: [Crucial]: Yes - IPR requimrent (Annex II-B-13)
error type: ERROR

Where AQTimeExemption is either NO2-1h, or NO2-annual, then NO2 and Protection Target Health must be present
type: Concept
notation: B41
definition: Where ./aqd:timeExtensionExemption resolves to http://dd.eionet.europa.eu/vocabulary/aq/timeextensiontypes/NO2 1h OR http://dd.eionet.europa.eu/vocabulary/aq/timeextensiontypes/NO2 annual at least one combination within ./aqd:pollutants which includes ./aqd:pollutants/aqd:Pollutant/aqd:pollutantCode AND ./aqd:pollutants/aqd:Pollutant/aqd:protectionTarget shall be constrained to Nitro gen dioxide Nitrogen dioxide (air) + health http://dd.eionet.europa.eu/vocabulary/aq/pollutant/8 http://dd.eionet.europa.eu/vocabulary/aq/protectiontarget/H
status: valid
status modified: 2023-05-04
accepted date: 2023-05-04
in scheme: AQD - Quality control and assurance on CDR
hidden label: Where AQTimeExemption is either NO2-1h, or NO2-annual, then NO2 and Protection Target Health must be present
editorial note: [Crucial]: Yes - Content check according to Article 22 of Directive 2008/50/EC
error type: BLOCKER

Where AQTimeExemption is either PM10-24h, or PM10-annual, then PM10 and Protection Target Health must be present.
type: Concept
notation: B42
definition: Where ./aqd:timeExtensionExemption resolves to http://dd.eionet.europa.eu/vocabulary/aq/timeextensiontypes/PM10-24h OR http://dd.eionet.europa.eu/vocabulary/aq/timeextensiontypes/PM10-annual at least one combination within ./aqd:pollutants which includes ./aqd:pollutants/aqd:Pollutant/aqd:pollutantCode AND ./aqd:pollutants/aqd:Pollutant/aqd:protectionTarget shall be constrained to Particulate matter < 10 μm (aerosol) + health http://dd.eionet.europa.eu/vocabulary/aq/pollutant/5 http://dd.eionet.europa.eu/vocabulary/aq/protectiontarget/H
status: valid
status modified: 2023-05-04
accepted date: 2023-05-04
in scheme: AQD - Quality control and assurance on CDR
hidden label: Where AQTimeExemption is either PM10-24h, or PM10-annual, then PM10 and Protection Target Health must be present.
editorial note: [Crucial]: Yes - Content check according to Article 22 of Directive 2008/50/EC
error type: BLOCKER

Where AQTimeExemption is C6H6-annual, then C6H6 and Protection Target Health must be present.
type: Concept
notation: B43
definition: Where ./aqd:timeExtensionExemption resolves to http://dd.eionet.europa.eu/vocabulary/aq/timeextensiontypes/C6H6-annual at least one combination within ./aqd:pollutants which includes ./aqd:pollutants/aqd:Pollutant/aqd:pollutantCode AND ./aqd:pollutants/aqd:Pollutant/aqd:protectionTarget shall be constrained to Benzene (air) + healt http://dd.eionet.europa.eu/vocabulary/aq/pollutant/20 http://dd.eionet.europa.eu/vocabulary/aq/protectiontarget/H
status: valid
status modified: 2023-05-04
accepted date: 2023-05-04
in scheme: AQD - Quality control and assurance on CDR
hidden label: Where AQTimeExemption is C6H6-annual, then C6H6 and Protection Target Health must be present.
editorial note: [Crucial]: Yes - Content check according to Article 22 of Directive 2008/50/EC
error type: BLOCKER

Geometry should not be a hyperlink. If provided via shapefile, element aqd:shapefileLink need to be used
type: Concept
notation: B45
definition: ./am:geometry shall not be a href xlink. If geometry is provided via shapefile, please use element aqd:shapefileLink
status: valid
status modified: 2023-05-04
accepted date: 2023-05-04
in scheme: AQD - Quality control and assurance on CDR
hidden label: Link to shapefiles use incorrect element. Please use aqd:shapefileLink
editorial note: [Crucial]: - SYSTEM & INSPIRE requirement
error type: ERROR

Where a link is provided, it should refer to an existing and valid shape file in the same folder in the CDR as the XML is uploaded
type: Concept
notation: B46
definition: Where ./aqd:shapefileLink has been used this should return a link to a valid and existing link in cdr (e.g. http://cdr.eionet.europa.eu/es/eu/aqd/b/envurng9g/ES_Zones_2014.shp)
status: valid
status modified: 2023-05-04
accepted date: 2023-05-04
in scheme: AQD - Quality control and assurance on CDR
hidden label: Shapefile have not been reported correctly in the expected CDR envelope. Please revise
editorial note: [Crucial]: Skipped - Not implemented - This is required for correctly processing geometries
error type: BLOCKER

Zone type must be either Agglomeration or Non-agglomeration
type: Concept
notation: B47
definition: ./aqd:aqdZoneType attribute must resolve to one of concept within http://dd.eionet.europa.eu/vocabulary/aq/zonetype/[concept] Currently, these are: http://dd.eionet.europa.eu/vocabulary/aq/zonetype/noagg or http://dd.eionet.europa.eu/vocabulary/aq/zonetype/agg
status: valid
status modified: 2023-05-04
accepted date: 2023-05-04
in scheme: AQD - Quality control and assurance on CDR
hidden label: Zone type must be either Agglomeration or Non-agglomeration
editorial note: [Crucial]: Yes - AQ requirement
error type: BLOCKER

Designation Period DATE must be provided in extended ISO format
type: Concept
notation: B48
definition: When am:designationPeriod/am:designationPeriod/gml:beginPosition & am:designationPeriod/am:designationPeriod/gml:endPosition ARE populated, the DATE must be in extended ISO format
status: valid
status modified: 2023-05-04
accepted date: 2023-05-04
in scheme: AQD - Quality control and assurance on CDR
error type: BLOCKER

reserved
type: Concept
notation: B44
definition: Where ./aqd:LAU has been used the list of the administrative these shall be checked to ensure they relate to the MS. This must be provided if /aqd:shapefileLink is not provided or am:geometry does not contain geometry. The value shall be a valid code from the following codelist: http://dd.eionet.europa.eu/vocabulary/common/nuts/ http://dd.eionet.europa.eu/vocabulary/lau1/ http://dd.eionet.europa.eu/vocabulary/lau2/ NUTS, LAU1 or LAU2 codes must belong to the country reporting data. Country ISO code at cdr.eionet.europa.eu/ZZ/eu/aqd/b/…. shall be the same as the codelist: http://dd.eionet.europa.eu/vocabulary/common/nuts/ZZ[concept] http://dd.eionet.europa.eu/vocabulary/lau1/zz/[concept] http://dd.eionet.europa.eu/vocabulary/lau2/zz/[concept] (exception of gb which has lau and nut codeas as uk)
status: reserved
status modified: 2023-05-04
accepted date: 2023-05-04
in scheme: AQD - Quality control and assurance on CDR
hidden label: reserved
editorial note: [Crucial]: Skipped - Not implemented

Cross checks with other data-flows
type: Concept
notation: BCrossCheck
definition: Cross checks with other data-flows
status: valid
status modified: 2023-05-04
accepted date: 2023-05-04
in scheme: AQD - Quality control and assurance on CDR
error type: WARNING

Checks if this delivery is new or an update (on same reporting year)
type: Concept
notation: C0
definition: Check if delivery if this is a new delivery or updated delivery (via reporting year)
status: valid
status modified: 2023-05-04
accepted date: 2023-05-04
in scheme: AQD - Quality control and assurance on CDR
hidden label: Checks if this delivery is new or an update (on same reporting year)
editorial note: [Crucial]: Yes - Information
error type: WARNING

Number of Assessment Regimes reported
type: Concept
notation: C01
definition: Compile & feedback upon the total number of AQ Assessment Regime feature types included in the delivery
status: valid
status modified: 2023-05-04
accepted date: 2023-05-04
in scheme: AQD - Quality control and assurance on CDR
hidden label: Number of Assessment Regimes reported
editorial note: [Crucial]: Yes - Information
error type: BLOCKER

Number of new Assessment Regimes compared to previous report. ERROR will be returned if XML is a new delivery and localId are not new compared to previous deliveries
type: Concept
notation: C02
definition: Compile & feedback upon the total number of new records for AQ Assessment Regime feature types included in the delivery. ERROR will be returned if XML is a new delivery and localId are not new compared to previous deliveries.
status: valid
status modified: 2023-05-04
accepted date: 2023-05-04
in scheme: AQD - Quality control and assurance on CDR
hidden label: Number of new Assessment Regimes compared to previous report. ERROR will be returned if XML is a new delivery and localId are not new compared to previous deliveries
editorial note: [Crucial]: Error, new delivery but re-using localId from previous -
error type: BLOCKER

Number of existing Assessment Regimes compared to previous report. ERROR will be returned if XML is an update and ALL localId (100%) are NEW to previous delivery (for the same YEAR).
type: Concept
notation: C03
definition: Compile & feedback upon the total number of modifications to previously reported AQ Assessment Regime feature types included in the delivery ERROR will be returned if XML is an update and ALL localId (100%) are different to previous delivery (for the same YEAR).
status: valid
status modified: 2023-05-04
accepted date: 2023-05-04
in scheme: AQD - Quality control and assurance on CDR
hidden label: Number of existing Assessment Regimes compared to previous report. ERROR will be returned if XML is an update and ALL localId (100%) are NEW to previous delivery (for the same YEAR).
editorial note: Error, updated delivery but all localId are new
error type: BLOCKER

Number of Assessment Regimes in C should match Assessment Regimes in Preliminary C (for the same YEAR).
type: Concept
notation: C03a
definition: The assessment regimes previously declared in the preliminary Assessment Regime (forward looking) should match those declared under the current Assessment Regime (retrospective look)
status: valid
status modified: 2023-05-04
accepted date: 2023-05-04
in scheme: AQD - Quality control and assurance on CDR
error type: WARNING

Number of Assessment Methods used under Assessment Regimes should be the same as Preliminary Assessment Regime (for the same YEAR).
type: Concept
notation: C03b
definition: The assessment methods previously declared in the preliminary Assessment Regime (forward looking) should match those declared under the current Assessment Regime (retrospective look)
status: valid
status modified: 2023-05-04
accepted date: 2023-05-04
in scheme: AQD - Quality control and assurance on CDR
error type: WARNING

Check if, for matching methods, the AssessmentType has changed the assessmentTypes
type: Concept
notation: C03c
status: valid
status modified: 2023-05-04
accepted date: 2023-05-04
in scheme: AQD - Quality control and assurance on CDR
error type: WARNING

List new assessment methods in C compared to C preliminary
type: Concept
notation: C03d
status: valid
status modified: 2023-05-04
accepted date: 2023-05-04
in scheme: AQD - Quality control and assurance on CDR
error type: WARNING

gml:id must be unique within the XML document
type: Concept
notation: C04
definition: All gml:id attributes shall have unique content within the document or namespace
status: valid
status modified: 2023-05-04
accepted date: 2023-05-04
in scheme: AQD - Quality control and assurance on CDR
hidden label: gml:id must be unique within the XML document
editorial note: [Crucial]: Yes - XML requirement
error type: BLOCKER

Local Id shall be unique for the assessment regime.
type: Concept
notation: C05
definition: ./aqd:inspireId/base:Identifier/base:localId shall be an unique code for the assessment regime.
status: valid
status modified: 2023-05-04
accepted date: 2023-05-04
in scheme: AQD - Quality control and assurance on CDR
hidden label: Local Id shall be unique for the assessment regime.
editorial note: [Crucial]: Yes - INSPIRE/system requirement
error type: BLOCKER

List unique namespaces used and count number of elements
type: Concept
notation: C06
definition: ./aqd:inspireId/base:Identifier/base:namespace List base:namespace and count the number of base:localId assigned to each base:namespace.
status: valid
status modified: 2023-05-04
accepted date: 2023-05-04
in scheme: AQD - Quality control and assurance on CDR
hidden label: List unique namespaces used and count number of elements
editorial note: [Crucial]: Yes - INSPIRE/system requirement
error type: INFO

Check namespace is registered
type: Concept
notation: C06.1
definition: Check that namespace is registered in vocabulary (http://dd.eionet.europa.eu/vocabulary/aq/namespace/view)
status: valid
status modified: 2023-05-04
accepted date: 2023-05-04
in scheme: AQD - Quality control and assurance on CDR
hidden label: Check namespace is registered
editorial note: [Crucial]: Yes - System requirement
error type: BLOCKER

Each Assessment Regime shall have one Environmental Objective element
type: Concept
notation: C07
definition: Each of the number of /aqd:AQD_AssessmentRegime records shall contain 1 ./aqd:assessmentThreshold/aqd:AssessmentThreshold/aqd:environmental Objective records per /aqd:AQD_AssessmentRegime element
status: valid
status modified: 2023-05-04
accepted date: 2023-05-04
in scheme: AQD - Quality control and assurance on CDR
hidden label: Each Assessment Regime shall have one Environmental Objective element
editorial note: [Crucial]: Yes - IPR/system requirement - aqd:AQD_AssessmentRegime/aqd:assessmentThreshold [Cardinality 0..* to 0..1]
error type: BLOCKER

Assessment regimes must be reported all expected pollutants
type: Concept
notation: C08
definition: ./aqd:pollutant xlink:href attribute may resolve to one of http://dd.eionet.europa.eu/vocabulary/aq/pollutant/1 http://dd.eionet.europa.eu/vocabulary/aq/pollutant/7 http://dd.eionet.europa.eu/vocabulary/aq/pollutant/8 http://dd.eionet.europa.eu/vocabulary/aq/pollutant/9 http://dd.eionet.europa.eu/vocabulary/aq/pollutant/5 http://dd.eionet.europa.eu/vocabulary/aq/pollutant/6001 http://dd.eionet.europa.eu/vocabulary/aq/pollutant/10 http://dd.eionet.europa.eu/vocabulary/aq/pollutant/20 http://dd.eionet.europa.eu/vocabulary/aq/pollutant/5012 http://dd.eionet.europa.eu/vocabulary/aq/pollutant/5014 http://dd.eionet.europa.eu/vocabulary/aq/pollutant/5015 http://dd.eionet.europa.eu/vocabulary/aq/pollutant/5018 http://dd.eionet.europa.eu/vocabulary/aq/pollutant/5029
status: valid
status modified: 2023-05-04
accepted date: 2023-05-04
in scheme: AQD - Quality control and assurance on CDR
hidden label: Assessment regimes must be reported all expected pollutants
editorial note: [Crucial]: Yes - IPR requirement (Annex II-C-4)
error type: BLOCKER

Check valid combination of pollutant/EnvironmentalObjective (Objective/ProtectionTarget/ReportingMetric). Error if unexpected combination
type: Concept
notation: C10
definition: Check that EnvironmentalObjetive (ObjectiveType+ReportingMetric+ProtectionTarget) correspond to a valid combination in http://dd.eionet.europa.eu/vocabulary/aq/environmentalobjective/view
status: valid
status modified: 2023-05-04
accepted date: 2023-05-04
in scheme: AQD - Quality control and assurance on CDR
hidden label: Unexpected combinations found
editorial note: [Crucial]: Yes - IPR requirement (Annex II-C-4 + Annex II-C-5) -Updated in v5.0 to use EnvObjective vocabulary
error type: BLOCKER

Check discrepancies between the expected Assessment Regime combinations based on dataflow B - Zones (latest released same reporting years)
type: Concept
notation: C11
definition: The new check C11 will double check that data-flow C is complete according to all zones declared in data-flow B. The validation throws error when: a) The combination of elements Pollutant + Protection Target + ZoneId + Environmental objective from B is missing in C. b) The combination of elements Pollutant + Protection Target + ZoneId + Environmental objective from C is missing in B. c) The combination of elements Pollutant + Protection Target + ZoneId + Environmental objective is duplicated. Exception when objective type is "MO", "ECO", "ERT", "LVMOT", "LVmaxMOT", "INT" and "ALT"
status: valid
status modified: 2023-05-04
accepted date: 2023-05-04
in scheme: AQD - Quality control and assurance on CDR
hidden label: reserved
editorial note: Included in C10
error type: BLOCKER

Check the minimum number of fixed SPO required per each Zone+EnvironmentalObjective according to AQ Directive
type: Concept
notation: C12
definition: Evaluate the minimum number of fixed sampling points for all zones considering the population number reported in dataflow B and the classification of the zone for the particular Environmental Objective. Minimum according to anexV & IX. Numbers in EEA vocabulary: https://dd.eionet.europa.eu/vocabulary/aq/anexV_IX_minimum_spo/view & https://dd.eionet.europa.eu/vocabulary/aq/art10_O3_Model_minimum_spo/view
status: experimental
status modified: 2024-06-14
accepted date: 2024-06-14
in scheme: AQD - Quality control and assurance on CDR
error type: REGERROR

reserved
type: Concept
notation: C13
definition: reserved
status: deprecated
status modified: 2023-05-04
accepted date: 2023-05-04
in scheme: AQD - Quality control and assurance on CDR
hidden label: reserved
editorial note: Included in C10

reserved
type: Concept
notation: C14
definition: reserved
status: deprecated
status modified: 2023-05-04
accepted date: 2023-05-04
in scheme: AQD - Quality control and assurance on CDR
hidden label: reserved
editorial note: Included in C10

reserved
type: Concept
notation: C15
definition: reserved
status: deprecated
status modified: 2023-05-04
accepted date: 2023-05-04
in scheme: AQD - Quality control and assurance on CDR
hidden label: reserved
editorial note: Included in C10

reserved
type: Concept
notation: C16
definition: reserved
status: deprecated
status modified: 2023-05-04
accepted date: 2023-05-04
in scheme: AQD - Quality control and assurance on CDR
hidden label: reserved
editorial note: Included in C10

reserved
type: Concept
notation: C17
definition: reserved
status: deprecated
status modified: 2023-05-04
accepted date: 2023-05-04
in scheme: AQD - Quality control and assurance on CDR
hidden label: reserved
editorial note: Included in C10

reserved
type: Concept
notation: C18
definition: reserved
status: deprecated
status modified: 2023-05-04
accepted date: 2023-05-04
in scheme: AQD - Quality control and assurance on CDR
hidden label: reserved
editorial note: Included in C10

reserved
type: Concept
notation: C19
definition: reserved
status: deprecated
status modified: 2023-05-04
accepted date: 2023-05-04
in scheme: AQD - Quality control and assurance on CDR
hidden label: reserved
editorial note: Included in C10

Check and list any missing combination of pollutant/EnvironmentalObjective. Error if combination missing
type: Concept
notation: C20
definition: Provide any missing combination of Pollutant/EnvironmentalObjective according to vocabulary http://dd.eionet.europa.eu/vocabulary/aq/environmentalobjective/ (Exceptions: when ObjectiveType = .../MO + .../LVMOT + .../LVmaxMOT &those combinations when "Exceedance threshold" within the vocabulary is populated)
status: valid
status modified: 2023-05-04
accepted date: 2023-05-04
in scheme: AQD - Quality control and assurance on CDR
hidden label: Missing combination of pollutant/EnvironmentalObjective.
editorial note: [Crucial]: Yes - IPR requirement (Annex II-C-4 + Annex II-C-5) + correct content check vs AQD/IPR
error type: BLOCKER

Count number of Assessment Regimes for pollutants with Monitoring Objective according to Annex X (Directive 2008/50/EC)
type: Concept
notation: C09
definition: Count on unique pollutants when Assessment regime(s)'s aqd:objectiveType xlink:href attribute resolve to http://dd.eionet.europa.eu/vocabulary/aq/objectivetype/MO According to ANNEX X - MEASUREMENTS OF OZONE PRECURSOR SUBSTANCES (DIRECTIVE 2008/50/EC) Measurement of ozone precursor substances shall include at least nitrogen oxides (NO and NO2), and appropriate volatile organic compounds (VOC). A list of volatile organic compounds recommended for measurement is given below: 1-Butene Isoprene Ethyl benzene Ethane Trans-2-Butene n-Hexane m + p-Xylene Ethylene cis-2-Butene i-Hexane o-Xylene Acetylene 1,3-Butadiene n-Heptane 1,2,4-Trimethylebenzene Propane n-Pentane n-Octane 1,2,3-Trimethylebenzene Propene i-Pentane i-Octane 1,3,5-Trimethylebenzene n-Butane 1-Pentene Benzene Formaldehyde i-Butane 2-Pentene Toluene Total non-methane hydrocarbons
status: valid
status modified: 2023-05-04
accepted date: 2023-05-04
in scheme: AQD - Quality control and assurance on CDR
hidden label: Count number of Assessment Regimes for pollutants with Monitoring Objetive
editorial note: [Crucial]: N/A - IPR requirement (Annex II-C-4)
error type: ERROR

Check if combination of pollutant/EnvironmentalObjective for reporting PM2.5 National Exposure Reduction Target is included
type: Concept
notation: C20a
definition: Check if combination of pollutant/EnvironmentalObjective for reporting PM2.5 National Exposure Reduction Target is included
status: valid
status modified: 2023-05-04
accepted date: 2023-05-04
in scheme: AQD - Quality control and assurance on CDR
error type: WARNING

Check Assessment Threshold Classification according to the allowed combination
type: Concept
notation: C21
definition: Assess correctness of /aqd:assessmentThreshold/aqd:AssessmentThreshold/aqd:exceedanceAttainment depending on combination aqd:pollutant + aqd:objectiveType + aqd:reportingMetric + aqd:protectionTarget against vocabulary http://dd.eionet.europa.eu/vocabulary/aq/environmentalobjective/
status: valid
status modified: 2023-05-04
accepted date: 2023-05-04
in scheme: AQD - Quality control and assurance on CDR
hidden label: Assessment Threshold classification required ratification.
editorial note: [Crucial]: Yes - IPR requirement (Annex II-C-6) + correct content check vs AQD/IPR
error type: ERROR

Check modifications of Assessment Threshold Classification
type: Concept
notation: C22
definition: Modification of Assessment Threshold Classification must be accompanied by change of classification year.
status: valid
status modified: 2023-08-07
accepted date: 2023-08-07
in scheme: AQD - Quality control and assurance on CDR
hidden label: Modification of Assessment Threshold Classification must be accompanied by change of classification year.
error type: WARNING

The assessement type shall be either "Fixed Measurement," "modelling," "Indicative Measurement", "Objective Estimation", or "other"
type: Concept
notation: C23a
definition: ./aqd:assessmentMethods/aqd:AssessmentMethods/aqd:assessmentType xlink:href attribute shall resolve to one of http://dd.eionet.europa.eu/vocabulary/aq/assessmenttype/[concept]Current options in the codelist are:http://dd.eionet.europa.eu/vocabulary/aq/assessmenttype/fixed http://dd.eionet.europa.eu/vocabulary/aq/assessmenttype/model http://dd.eionet.europa.eu/vocabulary/aq/assessmenttype/indicative http://dd.eionet.europa.eu/vocabulary/aq/assessmenttype/objective http://dd.eionet.europa.eu/vocabulary/aq/assessmenttype/other
status: valid
status modified: 2023-05-04
accepted date: 2023-05-04
in scheme: AQD - Quality control and assurance on CDR
hidden label: The assessement type shall be either Fixed Measurement – Modelling – Objective Estimation or Indicative measurement
editorial note: [Crucial]: Yes - IPR requirement (Annex II-C-9)
error type: BLOCKER

A textual description of assessment type is expected
type: Concept
notation: C23b
definition: ./aqd:assessmentMethods/aqd:AssessmentMethods/aqd:assessmentTypeDescription resolve to a text description of Assessment Type
status: valid
status modified: 2023-05-04
accepted date: 2023-05-04
in scheme: AQD - Quality control and assurance on CDR
hidden label: A textual description of assessment type is expected
editorial note: [Crucial]: - IPR requirement (Annex II-C-9) https://taskman.eionet.europa.eu/issues/72746
error type: WARNING

When providing a link to model or objective estimation(s), a valid link must be provided
type: Concept
notation: C24
definition: The assessment methods referenced by ./aqd:assessmentMethods/aqd:AssessmentMethods/aqd:modelAssessmentMetadata xlink:href attribute shall resolve to a traversable link to an assessment method /aqd:AQD_Model reported under cdr.eionet.europa.eu/ZZ/eu/aqd/d/… (The href is made using “namespace”/”localId”)
status: valid
status modified: 2023-05-04
accepted date: 2023-05-04
in scheme: AQD - Quality control and assurance on CDR
hidden label: Invalid link to model or objetive estimation(s)
editorial note: [Crucial]: Yes (crosscheck) - IPR requirement (Annex II-C-11)
error type: BLOCKER

When providing a link to fix or indicative measurement(s), a valid link must be provided
type: Concept
notation: C25
definition: The assessment methods referenced by ./aqd:assessmentMethods/aqd:AssessmentMethods/aqd:samplingPointAssessmentMetadata xlink:href attribute shall resolve to a traversable link to an assessment method /aqd:AQD_SamplingPoint reported under cdr.eionet.europa.eu/ZZ/eu/aqd/d/… (The href is made using “namespace”/”localId”)
status: valid
status modified: 2023-05-04
accepted date: 2023-05-04
in scheme: AQD - Quality control and assurance on CDR
hidden label: Invalid link to samplingPoint(s)
editorial note: [Crucial]: Yes (crosscheck) - IPR requirement (Annex II-C-12)
error type: BLOCKER

Any assessment method used under Assessment must be operational within the Reporting Period
type: Concept
notation: C26
definition: The assessment methods referenced by ./aqd:assessmentMethods/aqd:AssessmentMethods/aqd:modelAssessmentMeta data or ./aqd:assessmentMethods/aqd:AssessmentMethods/aqd:samplingPointAssessmentMetadata xlink:href attribute shall contain one element /aqd:AQD_Model/ef:observingCapability/ef:ObservingCapability/ef:observingTime/gml:TimePeriod/gml:endPosition or /aqd:AQD_SamplingPoint/ef:observingCapability/ef:ObservingCapability/ef:observingTime/gml:TimePeriod/gml:endPosition that is operational within the aqd:reportingPeriod included in the ReportingHead
status: valid
status modified: 2023-05-04
accepted date: 2023-05-04
in scheme: AQD - Quality control and assurance on CDR
hidden label: Some assessment method seem to be closed while being declared in the Assessment Regime. Please revise.
editorial note: [Crucial]: Yes (crosscheck) - Crosscheck to ensure Method operational within Reporting Year
error type: ERROR

The number of zones must be the same as cited in the AssessmentRegime (for the same Reporting Year)
type: Concept
notation: C27
definition: The number of unique zones cited by /aqd:AQD_AssessmentRegime shall be EQUAL to the number of unique zones in ./aqd:AQD_Zone for the same ReportingYear
status: valid
status modified: 2023-05-04
accepted date: 2023-05-04
in scheme: AQD - Quality control and assurance on CDR
hidden label: A mismatch between zones linked in C and B has been identified. Please revise both deliveries
editorial note: Crosscheck to ensure Zone operational within Reporting Year
error type: ERROR

The zone linked to each Assessment Regime must be operational within the Reporting Period
type: Concept
notation: C28
definition: The lifecycle information of ./aqd:zone xlink:href shall be current,/aqd:AQD_Zone/am:designationPeriod/gml:TimePeriod/gml:endPosition shall be greater than the begin position of the aqd:reportingPeriod included in the ReportingHeader If endPosition is indeterminate (i.e.<gml:endPosition indeterminatePosition="unknown"/>) /aqd:AQD_Zone/am:designationPeriod/gml:TimePeriod/gml:beginPosition shall NOT be greater than the begin position of the aqd:reportingPeriod included in the ReportingHeader
status: valid
status modified: 2023-05-04
accepted date: 2023-05-04
in scheme: AQD - Quality control and assurance on CDR
hidden label: The zone linked to each Assessment Regime must be operational within the Reporting Period
editorial note: Crosscheck to ensure Zone operational within Reporting Year
error type: BLOCKER

The regime(s) for PM2.5 AEI (both ECO & ERT) MUST not link to any specific zone.
type: Concept
notation: C30
definition: The regime(s) for PM2.5 AEI (both ECO & ERT) MUST not link to any specific zone. Specific syntax in XML is: <aqd:zone nilReason="inapplicable"/>
status: experimental
status modified: 2023-05-04
accepted date: 2023-05-04
in scheme: AQD - Quality control and assurance on CDR
hidden label: reserved
error type: ERROR

If the Asseement Metadata lifecycle information is current, then the Operational Activity End Time shall be within ReportingPeriod
type: Concept
notation: C33
definition: The lifecycle information of ./aqd:assessmentMethods/aqd:AssessmentMethods/aqd:samplingPointAssessmentMetadata xlink:href shall be current, /AQD_SamplingPoint/ef:operationActivityPeriod/gml:endPosition shall be operational within the aqd:reportingPeriod included in the ReportingHeader
status: valid
status modified: 2023-05-04
accepted date: 2023-05-04
in scheme: AQD - Quality control and assurance on CDR
hidden label: If the Asseement Metadata lifecycle information is current, then the Operational Activity End Time shall be within ReportingPeriod
editorial note: [Crucial]: Yes - Crosscheck to ensure Method operational within Reporting Year - Important update, very similar to C26 (missing AQD_Model)
error type: WARNING

If a sampling point or a model is used in any Assessment Regime, it has to be described as TRUE for AQ Directive use
type: Concept
notation: C35
definition: /aqd:AQD_SamplingPoint/aqd:usedAQD or /aqd:AQD_Model/aqd:used shall EQUAL “true” for all ./aqd:assessmentMethods/aqd:AssessmentMethods/aqd:[samplingPoint or model]AssessmentMetadata xlink:href citations
status: valid
status modified: 2023-05-04
accepted date: 2023-05-04
in scheme: AQD - Quality control and assurance on CDR
hidden label: If a sampling point or a model is used in any Assessment Regime, it has to be described as TRUE for AQ Directive use
editorial note: [Crucial]: Yes - Cross-check coherence between C & D
error type: WARNING

Delivery should contain one and only one Assessment Regime for PM2.5 Exposure Concentration Obligation (ECO)
type: Concept
notation: C36
definition: There shall be only 1 record per MS where ./aqd:assessmentThreshold/aqd:AssessmentThreshold/aqd:environmental Objective/aqd:EnvironmentalObjective/aqd:objectiveType xlink:href attribute resolves to http://dd.eionet.europa.eu/vocabulary/aq/objectivetype/ECO
status: stable
status modified: 2023-05-04
accepted date: 2023-05-04
in scheme: AQD - Quality control and assurance on CDR
hidden label: reserved
editorial note: Not implemented
error type: ERROR

Delivery should contain one and only one Assessment Regime for PM2.5 Exposure Reduction Target (ERT)
type: Concept
notation: C37
definition: There shall be only 1 record per MS where ./aqd:assessmentThreshold/aqd:AssessmentThreshold/aqd:environmental Objective/aqd:EnvironmentalObjective/aqd:objectiveType xlink:href attribute resolves to http://dd.eionet.europa.eu/vocabulary/aq/objectivetype/ERT
status: valid
status modified: 2023-05-04
accepted date: 2023-05-04
in scheme: AQD - Quality control and assurance on CDR
hidden label: Assessment Regime for AEI is missing or multiple records have been provided (only 1 expected per country)
error type: ERROR

The cited stations under the Assessment Regime for the Average Exposure Indicator should be classified as Background.
type: Concept
notation: C38
definition: Where./aqd:assessmentThreshold/aqd:AssessmentThreshold/aqd:environmentalObjective/aqd:EnvironmentalObjective/aqd:reportingMetric xlink:href attribute resolves to http://dd.eionet.europa.eu/vocabulary/aq/reportingmetric/AEI the /aqd:AQD_SamplingPoint/aqd:relevantEmissions/aqd:RelevantEmissions/aqd:stationClassification xlink:href attribute shall resolve to http://dd.eionet.europa.eu/vocabulary/aq/stationclassification/background for all aqd:AQD_SamplingPoint linked via aqd:AQD_AssessmentRegime/aqd:assessmentMethods/aqd:AssessmentMethods /aqd:samplingPointAssessmentMetadata citations
status: valid
status modified: 2023-05-04
accepted date: 2023-05-04
in scheme: AQD - Quality control and assurance on CDR
hidden label: SamplingPoint(s) declared for assessing AEI are not background
editorial note: [Crucial]: Yes - INFORMATION, warnes if any AEI station is not background
error type: ERROR

Pollutant, Assessment Threshold and Environmental Objective shall equal one combination, except where Particulate Matter 2.5, which is not applicable.
type: Concept
notation: C29
definition: aqd:zone xlink:href attribute shall resolve to a traversable link to an AQ zone in /aqd:AQD_Zone reported under cdr.eionet.europa.eu/ZZ/eu/aqd/b/... The ./aqd:pollutant and ./aqd:assessmentThreshold/aqd:AssessmentThreshold/aqd:environmentalObjective/aqd:EnvironmentalObjective/aqd:protectionTarget within the Assessment Regime shall equal one combination /aqd:AQD_Zone/aqd:pollutants/aqd:Pollutant/aqd:pollutantCode and /aqd:AQD_Zone/aqd:pollutants/aqd:Pollutant/aqd:protectionTarget within the linked zone aqd:AQD_Zone/aqd:pollutantsException : Where ./aqd:pollutant resolves to http://dd.eionet.europa.eu/vocabulary/aq/pollutant/6001 ./aqd:zone xlink:href attribute MAY resolve to <aqd:zone nilReason='inapplicable'/>
status: valid
status modified: 2023-05-04
accepted date: 2023-05-04
in scheme: AQD - Quality control and assurance on CDR
hidden label: A mismatch between the pollutant declared in Assessment Regime and the zone pollutant has been identified. Please revise.
editorial note: [Crucial]: Yes (crosscheck) - Crosscheck to ensure Method operational within Reporting Year - Improved in cdr (swaped with C27)
error type: ERROR

COUNT number zone-pollutant-target comibantion to match those in dataset B for the same reporting Year
type: Concept
notation: C31
definition: COUNT number zone-pollutant-target comibantion to match those in dataset B for the same reporting Year ./aqd:assessmentThreshold/aqd:AssessmentThreshold/aqd:environmentalObjective/aqd:EnvironmentalObjective/aqd:protectionTarget + ./aqd:pollutant + /aqd:zone combinations shall reconcile to corresponding information within / aqd:AQD_Zone/aqd:pollutants/aqd:Pollutant/aqd:protectionTarget , /aqd:AQD_Zone/aqd:pollutants/aqd:Pollutant/aqd:pollutantCode + /aqd:AQD_Zone/am:inspireId/base:Identifier/base:localId : Sulphur dioxide (1) + health (B vs C) & Sulphur dioxide (1) + vegetation (B vs C) & Ozone (7) + health (B vs C) & Ozone (7) + vegetation (B vs C) & Nitrogen dioxide (8) + health (B vs C) & Nitrogen oxides (9) + vegetation (B vs C) & Particulate matter < 10 µm (5) + health (B vs C) & Particulate matter < 2.5 µm (6001) + health (B vs C) & Carbon monoxide (10) + health (B vs C) & Benzene (20) + health (B vs C) & Lead in PM10 (5012) + health (B vs C) & Arsenic in PM10 (5018) + health (B vs C) & Cadmium in PM10 (5014) + health (B vs C) & Nickel in PM10 (5015) + health (B vs C) & Benzo(a)pyrene in PM10 (5029) + health (B vs C)
status: valid
status modified: 2023-05-04
accepted date: 2023-05-04
in scheme: AQD - Quality control and assurance on CDR
hidden label: COUNT number zone-pollutant-target comibantion to match those in dataset B for the same reporting Year
editorial note: [Crucial]: Yes (crosscheck) - Updated in 4.0.2 if any C is greater than B = ERROR (RED) IF all B = C then OK if any C is smaller than B = WARNING
error type: ERROR

COUNT number zone-pollutant-target combination to match those in dataset C preliminary for the same reporting Year
type: Concept
notation: C31b
definition: COUNT number zone-pollutant-target comibantion to match those in dataset B for the same reporting Year ./aqd:assessmentThreshold/aqd:AssessmentThreshold/aqd:environmentalObjective/aqd:EnvironmentalObjective/aqd:protectionTarget + ./aqd:pollutant + /aqd:zone combinations shall reconcile to corresponding information within / aqd:AQD_Zone/aqd:pollutants/aqd:Pollutant/aqd:protectionTarget , /aqd:AQD_Zone/aqd:pollutants/aqd:Pollutant/aqd:pollutantCode + /aqd:AQD_Zone/am:inspireId/base:Identifier/base:localId : Sulphur dioxide (1) + health (C_pre vs C) & Sulphur dioxide (1) + vegetation (C_pre vs C) & Ozone (7) + health (C_pre vs C) & Ozone (7) + vegetation (C_pre vs C) & Nitrogen dioxide (8) + health (C_pre vs C) & Nitrogen oxides (9) + vegetation (C_pre vs C) & Particulate matter < 10 µm (5) + health (C_pre vs C) & Particulate matter < 2.5 µm (6001) + health (C_pre vs C) & Carbon monoxide (10) + health (C_pre vs C) & Benzene (20) + health (C_pre vs C) & Lead in PM10 (5012) + health (C_pre vs C) & Arsenic in PM10 (5018) + health (C_pre vs C) & Cadmium in PM10 (5014) + health (C_pre vs C) & Nickel in PM10 (5015) + health (B vs C) & Benzo(a)pyrene in PM10 (5029) + health (C_pre vs C)
status: valid
status modified: 2023-05-04
accepted date: 2023-05-04
in scheme: AQD - Quality control and assurance on CDR
error type: WARNING

Check Assessment Type of Asssessment Methods compared to assessmentType within Assessment Regime
type: Concept
notation: C32
definition: ./aqd:assessmentMethods/aqd:AssessmentMethods/aqd:assessmentType shall be compared with the /aqd:AQD_SamplingPoint/aqd:assessmentType for assessment method cited by ./aqd:assessmentMethods/aqd:AssessmentMethods/aqd:samplingPointAssessmentMetadata xlink:href attribute and/or /aqd:AQD_Model/aqd:assessmentType for assessment method cited by ./aqd:assessmentMethods/aqd:AssessmentMethods/aqd:samplingPointAssessmentMetadata xlink:href attribute. The following combinations are allowed: Within AssessmentRegime Within SamplingPoint/Model Status: fixed fixed OK & indicative indicative/fixed OK & model model OK & objective objective OK & fixed indicative/model/objective WRONG & indicative fixed/model/objective WRONG & model fixed/indicative/objective WRONG & objective fixed/indicative/model OK
status: valid
status modified: 2023-05-04
accepted date: 2023-05-04
in scheme: AQD - Quality control and assurance on CDR
hidden label: A mismatch has been detected between assessment types in Assessment Regime and assessment type in data flow D
editorial note: [Crucial]: Yes - Cross-check coherence between C & D
error type: ERROR

Evaluate the consistency of SamplingPoints used for the assessment of PM2.5 AEI (ECO) and AEI (ERT) in current delivery. They should be the same.
type: Concept
notation: C39
definition: Evaluate the consistency of SamplingPoints used for the assessment of PM2.5 AEI (ECO) and AEI (ERT) in current delivery. They should be the same.
status: experimental
status modified: 2023-05-04
accepted date: 2023-05-04
in scheme: AQD - Quality control and assurance on CDR
editorial note: Implemented
error type: BLOCKER

Evaluate the continuity of Stations used for the assessment of PM2.5 AEI ECO compared to latest delivery from previous year
type: Concept
notation: C39b
definition: Evaluate the continuity of Stations used for the assessment of PM2.5 AEI ECO compared to latest delivery from previous year
status: valid
status modified: 2023-05-04
accepted date: 2023-05-04
in scheme: AQD - Quality control and assurance on CDR
error type: WARNING

Evaluate the continuity of SamplingPoints used for the assessment of PM2.5 AEI ECO compared to latest delivery from previous year
type: Concept
notation: C39c
definition: Evaluate the continuity of SamplingPoints used for the assessment of PM2.5 AEI ECO compared to latest delivery from previous year
status: valid
status modified: 2023-05-04
accepted date: 2023-05-04
in scheme: AQD - Quality control and assurance on CDR
error type: WARNING

All Assessment Regimes should be linked to at least one Assessment Method (either SamplingPoint or Model/ObjectiveEstimation)
type: Concept
notation: C40
definition: The total number of /aqd:assessmentMethods/aqd:AssessmentMethods/aqd:samplingPointAssessmentMetadata and /aqd:assessmentMethods/aqd:AssessmentMethods/aqd:modelAssessmentMetadata citations within a MS (delivery) shall be GREATER THAN OR EQUAL to 1 where ./aqd:pollutant xlink:href attribute resolves to
status: valid
status modified: 2023-05-04
accepted date: 2023-05-04
in scheme: AQD - Quality control and assurance on CDR
hidden label: Assessment Regime(s) must link to at least one assessment method. Please revise
editorial note: [Crucial]: - IPR requirement (Annex II-C-11)
error type: ERROR

All Assessment Regimes must not be empty
type: Concept
notation: C40b
definition: Blocker will return if all Assessment Regimes are empty (i.e. not linked to an Assessment Method)
status: valid
status modified: 2023-05-04
accepted date: 2023-05-04
in scheme: AQD - Quality control and assurance on CDR
error type: BLOCKER

The year of the latest Classification report must be within the last 5 years according to AQ Directive
type: Concept
notation: C41
definition: gml:timePosition MUST be provided and must be equal or greater than (aqd:reportingPeriod – 5 yeasr ) included in the ReportingHeader
status: valid
status modified: 2023-05-04
accepted date: 2023-05-04
in scheme: AQD - Quality control and assurance on CDR
hidden label: Classification report needs updating, it is more than 5 years old.
editorial note: [Crucial]: - IPR requirement (Annex II-C-7)
error type: ERROR

A valid url should be provided linking to the latest Classification Report
type: Concept
notation: C42
definition: Free text shall be provided including at least 1 valid URL
status: valid
status modified: 2023-05-04
accepted date: 2023-05-04
in scheme: AQD - Quality control and assurance on CDR
hidden label: A valid url should be provided linking to the latest Classification Report
editorial note: [Crucial]: - IPR requirement (Annex II-C-8)
error type: WARNING

Alert & Information - At least one assessment regime for those Environmental Objectives with information and/or alert thresholds must be reported
type: Concept
notation: C46
definition: At least one assessment regime for the following Environmental Objectives must be reported: NO2-Health-Alert, SO2-Health-Alert, O3-Health-Information & O3-Health-Alert.
status: valid
status modified: 2023-05-04
accepted date: 2023-05-04
in scheme: AQD - Quality control and assurance on CDR
error type: BLOCKER

INF and ALT thresholds - COUNT number zone-pollutant-target combination to match those in dataset B for the same reporting Year
type: Concept
notation: C47
definition: COUNT number zone-pollutant-target comibantion to match those in dataset B for the same reporting Year ./aqd:assessmentThreshold/aqd:AssessmentThreshold/aqd:environmentalObjective/aqd:EnvironmentalObjective/aqd:protectionTarget + ./aqd:pollutant + /aqd:zone combinations shall reconcile to corresponding information within / aqd:AQD_Zone/aqd:pollutants/aqd:Pollutant/aqd:protectionTarget , /aqd:AQD_Zone/aqd:pollutants/aqd:Pollutant/aqd:pollutantCode + /aqd:AQD_Zone/am:inspireId/base:Identifier/base:localId : Sulphur dioxide (1) + health (B vs C) & Ozone (7) + health (B vs C) & Nitrogen dioxide (8) + health (B vs C)
status: valid
status modified: 2023-05-04
accepted date: 2023-05-04
in scheme: AQD - Quality control and assurance on CDR
error type: ERROR

INF and ALT thresholds - COUNT number zone-pollutant-target combination to match those in dataset C preliminary for the same reporting Year
type: Concept
notation: C47b
definition: COUNT number zone-pollutant-target comibantion to match those in dataset B for the same reporting Year ./aqd:assessmentThreshold/aqd:AssessmentThreshold/aqd:environmentalObjective/aqd:EnvironmentalObjective/aqd:protectionTarget + ./aqd:pollutant + /aqd:zone combinations shall reconcile to corresponding information within / aqd:AQD_Zone/aqd:pollutants/aqd:Pollutant/aqd:protectionTarget , /aqd:AQD_Zone/aqd:pollutants/aqd:Pollutant/aqd:pollutantCode + /aqd:AQD_Zone/am:inspireId/base:Identifier/base:localId : Sulphur dioxide (1) + health (Cprel vs C) & Ozone (7) + health (Cprel vs C) & Nitrogen dioxide (8) + health (Cprel vs C)
status: valid
status modified: 2023-05-04
accepted date: 2023-05-04
in scheme: AQD - Quality control and assurance on CDR
error type: WARNING

If classification is (LAT-UAT o aboveUAT or aboveLTO), there must be at least 1 assessmentMethod fixed
type: Concept
notation: C48
definition: At least 1 assessmentMethod must be set to fixed when aqd:exceedanceAttainment is LAT-UAT, aboveUAT, or aboveLTO.
status: valid
status modified: 2024-02-15
accepted date: 2024-02-15
in scheme: AQD - Quality control and assurance on CDR
error type: REGERROR

Assessment regime with exceedance in previous years should be classified as above UAT / LTO
type: Concept
notation: C49
definition: If an assessment regime has reported exceedances in the previous year, the latest classification must be aboveUAT or aboveLTO.
status: valid
status modified: 2024-02-15
accepted date: 2024-02-15
in scheme: AQD - Quality control and assurance on CDR
editorial note: Downgraded to warning
error type: WARNING

Cross checks with other data-flows
type: Concept
notation: CCrossCheck
definition: Cross checks with other data-flows
status: valid
status modified: 2023-05-04
accepted date: 2023-05-04
in scheme: AQD - Quality control and assurance on CDR
error type: WARNING

Testing REGERROR
type: Concept
notation: Ctest
status: valid
status modified: 2023-05-04
accepted date: 2023-05-04
in scheme: AQD - Quality control and assurance on CDR
error type: REGERROR

Checks if this delivery is new or an update (on same reporting year)
type: Concept
notation: D0
definition: Check if delivery if this is a new delivery or updated delivery (via reporting year)
status: valid
status modified: 2023-05-04
accepted date: 2023-05-04
in scheme: AQD - Quality control and assurance on CDR
hidden label: Checks if this delivery is new or an update (on same reporting year)
editorial note: [Crucial]: Yes - Information
error type: WARNING

Total number of individual element reported within this XML Document for assessment methods. Error wil be returned if any of the expected elements are missing.
type: Concept
notation: D01
definition: Compile & feedback upon the total number of each environmental monitoring feature types included in the delivery
status: valid
status modified: 2023-05-04
accepted date: 2023-05-04
in scheme: AQD - Quality control and assurance on CDR
hidden label: Total number of individual element reported within this XML Document for assessment methods. Error wil be returned if any of the expected elements are missing.
editorial note: [Crucial]: Yes - Information
error type: BLOCKER

Total number of new records for each feature type included in the delivery. Error will be returned if all LocalIds are new.
type: Concept
notation: D02
definition: Compile and feedback upon the total number of new records for each environmental monitoring feature types included in the delivery
status: valid
status modified: 2023-05-04
accepted date: 2023-05-04
in scheme: AQD - Quality control and assurance on CDR
hidden label: Total number of new records for each feature type included in the delivery. Error will be returned if all LocalIds are new.
editorial note: [Crucial]: Yes - System requirement
error type: BLOCKER

Total number of updated records for each feature type included in the delivery. Error will be returned if all LocalIds are new.
type: Concept
notation: D03
definition: Compile and feedback upon the total number of updated environmental monitoring feature types included in the delivery
status: valid
status modified: 2023-05-04
accepted date: 2023-05-04
in scheme: AQD - Quality control and assurance on CDR
hidden label: Total number of updated records for each feature type included in the delivery. Error will be returned if all LocalIds are new.
editorial note: [Crucial]: Yes - System requirement
error type: BLOCKER

Total number of updated records for each feature type included in the delivery. Blocker will be returned if D is not complete in relation to previous Delivery.
type: Concept
notation: D03b
definition: Compile and feedback upon the total number of updated environmental monitoring feature types included in the delivery. All feature types in the previous delivered must be included in this delivery to maintain historical information. If the update is genuine, please contact AQ IPR helpdesk.
status: valid
status modified: 2023-05-04
accepted date: 2023-05-04
in scheme: AQD - Quality control and assurance on CDR
error type: BLOCKER

Total number of updated records for each feature type included in the delivery. Blocker will be returned if D is not complete in relation to latest Delivery from previous year.
type: Concept
notation: D03c
definition: Compile and feedback upon the total number of updated environmental monitoring feature types included in the delivery. All feature types in the previous delivered (latest envelope from previous year) should be included in this delivery to maintain historical information. This is for information purposes.
status: valid
status modified: 2023-05-04
accepted date: 2023-05-04
in scheme: AQD - Quality control and assurance on CDR
error type: WARNING

Full list of reported Environmental Monitoring Features within this XML Document
type: Concept
notation: D04
definition: Compile & feedback a list of the unique identifier information for each new record or modification to an environmental monitoring feature type. Feedback report shall include the gml:id attribute, ef:inspireId, aqd:inspireId, ef:name and/or ompr:name elements as available.
status: valid
status modified: 2023-05-04
accepted date: 2023-05-04
in scheme: AQD - Quality control and assurance on CDR
hidden label: Full list of reported Environmental Monitoring Features within this XML Document
editorial note: [Crucial]: Yes -
error type: INFO

Id elements must have unique content
type: Concept
notation: D05
definition: All gml:id attributes, ef:inspireId and aqd:inspireId elements shall have unique content
status: valid
status modified: 2023-05-04
accepted date: 2023-05-04
in scheme: AQD - Quality control and assurance on CDR
hidden label: Id elements must have unique content
editorial note: [Crucial]: Yes - System & INSPIRE requirement
error type: BLOCKER

LocalId must be a unique code for the AQD_network (wtihin the unique namespace).
type: Concept
notation: D06
definition: aqd:AQD_Network/ef:inspireId/base:Identifier/base:localId shall be an unique code for AQD_network and unique within the namespace.
status: valid
status modified: 2023-05-04
accepted date: 2023-05-04
in scheme: AQD - Quality control and assurance on CDR
hidden label: LocalId must be a unique code for the AQD_network.
editorial note: [Crucial]: Yes - IPR requirement (Annex II-D-ii-3)
error type: BLOCKER

List unique namespaces used and count number of Networks used. Error will be returned if namespace is not unique.
type: Concept
notation: D07
definition: Count the number of unique AQD_Network (via localId) submitted within base:namespace. Blocker will be returned if base:namespace is not unique.
status: valid
status modified: 2023-05-04
accepted date: 2023-05-04
in scheme: AQD - Quality control and assurance on CDR
hidden label: List unique namespaces used and count number of Networks used.
editorial note: [Crucial]: Yes - INSPIRE requirement
error type: BLOCKER

Check namespace is registered
type: Concept
notation: D07.1
definition: Check that namespace is registered in vocabulary (http://dd.eionet.europa.eu/vocabulary/aq/namespace/view)
status: valid
status modified: 2023-05-04
accepted date: 2023-05-04
in scheme: AQD - Quality control and assurance on CDR
hidden label: Check namespace is registered
editorial note: [Crucial]: Yes - System requirement
error type: BLOCKER

Must conform to a recognised media value. These are: Air, Biota, Landscape, Sediment, Soil/Ground, Waste and Water.
type: Concept
notation: D08
definition: The content of aqd:AQD_Network/ef:mediaMonitored shall resolve to any concept inhttp://inspire.ec.europa.eu/codelist/MediaValue/
status: valid
status modified: 2023-05-04
accepted date: 2023-05-04
in scheme: AQD - Quality control and assurance on CDR
hidden label: Must conform to a recognised media value. These are: Air, Biota, Landscape, Sediment, Soil/Ground, Waste and Water.
editorial note: [Crucial]: -
error type: ERROR

Must conform to a recognised Organisation Level. These are: International, Local, LocalAuthority, Municipality, National and Regional.
type: Concept
notation: D09
definition: The content of aqd:AQD_Network/ef:organisationLevel shall resolve to any concept in http://dd.eionet.europa.eu/vocabulary/aq/organisationallevel/
status: valid
status modified: 2023-05-04
accepted date: 2023-05-04
in scheme: AQD - Quality control and assurance on CDR
hidden label: Must conform to a recognised Organisation Level. These are: International, Local, LocalAuthority, Municipality, National and Regional.
editorial note: [Crucial]: - INSPIRE requirement
error type: WARNING

If provide, must conform to a recognised network type in the vocabulary.
type: Concept
notation: D10
definition: The content of aqd:AQD_Network/aqd:networkType shall resolve to any concept in http://dd.eionet.europa.eu/vocabulary/aq/networktype/
status: valid
status modified: 2023-05-04
accepted date: 2023-05-04
in scheme: AQD - Quality control and assurance on CDR
hidden label: If provide, must conform to a recognised network type in the vocabulary.
error type: WARNING

Check closed SPOs do not have data for closed periods
type: Concept
notation: D100
definition: When a Sampling Point is closed, monitoring data for closed periods should not be in the system.
status: valid
status modified: 2024-01-09
accepted date: 2024-01-09
in scheme: AQD - Quality control and assurance on CDR
error type: ERROR

Start time must be before End time.
type: Concept
notation: D11
definition: aqd:AQD_Network/aqd:operationActivityPeriod/gml:TimePeriod/gml:beginPosition shall be less than gml:endPosition
status: valid
status modified: 2023-05-04
accepted date: 2023-05-04
in scheme: AQD - Quality control and assurance on CDR
hidden label: Network's Start time must be before End time.
editorial note: [Crucial]: Yes - IPR requirement (Annex II-D-ii-36)
error type: BLOCKER

Network name must be provided
type: Concept
notation: D12
definition: ./ef:name shall return a string
status: valid
status modified: 2023-05-04
accepted date: 2023-05-04
in scheme: AQD - Quality control and assurance on CDR
hidden label: Network name is required. Please revise.
editorial note: [Crucial]: Yes - IPR requirement (Annex II-D-ii-35)
error type: ERROR

Information on responsible authority for the network management must be provided
type: Concept
notation: D13
definition: Information on responsible authority for the network management must be provided
status: reserved
status modified: 2023-05-04
accepted date: 2023-05-04
in scheme: AQD - Quality control and assurance on CDR
hidden label: Information on responsible authority for the network management must be provided
editorial note: Not implemented - IPR requirement (Annex II-D-ii-36)

Must conform to a recognised Time Zone as vocabulary . These are UTC (+01 to +06) and (-01 to -06)
type: Concept
notation: D14
definition: The content of /aqd:AQD_Network/aqd:aggregationTimeZone attribute shall resolve to a valid code in http://dd.eionet.europa.eu/vocabulary/aq/timezone/
status: valid
status modified: 2023-05-04
accepted date: 2023-05-04
in scheme: AQD - Quality control and assurance on CDR
hidden label: Network's aggregation time zone is not correct
editorial note: [Crucial]: Yes -
error type: BLOCKER

Station ID must be a unique code.
type: Concept
notation: D15
definition: aqd:AQD_Station/ef:inspireId/base:Identifier/base:localId shall be an unique code within namespace
status: valid
status modified: 2023-05-04
accepted date: 2023-05-04
in scheme: AQD - Quality control and assurance on CDR
hidden label: LocalId(s) for stations are not unique
editorial note: [Crucial]: Yes - IPR requirement (Annex II-D-ii-1)
error type: BLOCKER

List unique namespaces used and count number of Stations used. Blocker will be returned if namespace is not unique.
type: Concept
notation: D16
definition: Count the number of unique AQD_Station (via localId) submitted within base:namespace. Blocker will be returned if base:namespace is not unique.
status: valid
status modified: 2023-05-04
accepted date: 2023-05-04
in scheme: AQD - Quality control and assurance on CDR
hidden label: Namespace are not unique
editorial note: [Crucial]: Yes -
error type: BLOCKER

Check namespace is registered
type: Concept
notation: D16.1
definition: Check that namespace is registered in vocabulary (http://dd.eionet.europa.eu/vocabulary/aq/namespace/view)
status: valid
status modified: 2023-05-04
accepted date: 2023-05-04
in scheme: AQD - Quality control and assurance on CDR
hidden label: Unregistered country namespaace has been used
editorial note: [Crucial]: Yes - System requirement
error type: BLOCKER

Station name must be provided
type: Concept
notation: D17
definition: ./ef:name shall return a string
status: valid
status modified: 2023-05-04
accepted date: 2023-05-04
in scheme: AQD - Quality control and assurance on CDR
hidden label: Station missing name
editorial note: [Crucial]: Yes - IPR requirement (Annex II-D-ii-6) - Error, the provision of Station name is MANDATORY.
error type: BLOCKER

Station must belong to a network
type: Concept
notation: D18
definition: ./ef:belongsTo shall resolve to a traversable local of global URI to ../AQD_Network
status: valid
status modified: 2023-05-04
accepted date: 2023-05-04
in scheme: AQD - Quality control and assurance on CDR
hidden label: Station(s) are not linked to network
editorial note: [Crucial]: - System requirement
error type: BLOCKER

Must conform to a recognised media value. These are: Air, Biota, Landscape, Sediment, Soil/Ground, Waste and Water.
type: Concept
notation: D19
definition: The content of /aqd:AQD_Station/ef:mediaMonitored shall resolve to any concept in http://inspire.ec.europa.eu/codelist/MediaValue/
status: valid
status modified: 2023-05-04
accepted date: 2023-05-04
in scheme: AQD - Quality control and assurance on CDR
hidden label: Codelist for am:environmentalDomain requires revision: INSPIRE codelist is required
editorial note: [Crucial]: -
error type: ERROR

Cross checks with other data-flows
type: Concept
notation: D1bCrossCheck
definition: Cross checks with other data-flows
status: valid
status modified: 2023-05-04
accepted date: 2023-05-04
in scheme: AQD - Quality control and assurance on CDR
error type: WARNING

The coordinate reference system for the stations must be defined with a correct uniform resource name
type: Concept
notation: D20
definition: The srsName attribute within ./ef:geometry/gml:Point shall be a recognisable URN. The following 3 srsNames are expected urn:ogc:def:crs:EPSG::3035 or urn:ogc:def:crs:EPSG::4258 or urn:ogc:def:crs:EPSG::4326
status: valid
status modified: 2023-05-04
accepted date: 2023-05-04
in scheme: AQD - Quality control and assurance on CDR
hidden label: Coordinate system for Station(s) needs revision
editorial note: [Crucial]: Yes - INSPIRE requiremnt
error type: BLOCKER

The location of the station must be correctly reported and within the countries' bounding box
type: Concept
notation: D21
definition: ./ef:geometry/gml:Point/gml:pos srsDimension attribute shall resolve to “2” to allow the coordinate of the station. ORDER of 2 coordinates MUST BE Latitude & Longitud when providing the accepted srsNames and found within the bounding box of the reporting country.
status: valid
status modified: 2023-05-04
accepted date: 2023-05-04
in scheme: AQD - Quality control and assurance on CDR
hidden label: Coordinate provided for Stations needs revision as not latitude/Longitude
editorial note: [Crucial]: Yes - IPR requirement (Annex II-D-ii-26) - Exception for FR
error type: BLOCKER

reserved
type: Concept
notation: D22
definition: ./ef:geometry/gml:Point shall resolve to within the geographic boundary or bounding box of the MS.
status: reserved
status modified: 2023-05-04
accepted date: 2023-05-04
in scheme: AQD - Quality control and assurance on CDR
hidden label: reserved
editorial note: Not implemented

Check if the operational period for the station is within the network it belongs to.
type: Concept
notation: D23
definition: List the total number aqd:AQD_Station invalid operational activity periods compared to aqd:AQD_Network
status: valid
status modified: 2023-05-04
accepted date: 2023-05-04
in scheme: AQD - Quality control and assurance on CDR
hidden label: Station has incorrect operation period
editorial note: [Crucial]: Yes - IPR requirement (Annex II-D-ii-7)
error type: WARNING

Total number of operational Stations
type: Concept
notation: D24
definition: List the total number of aqd:AQD_Station which are operational ./ef:operationActivityPeriod/ef:OperationActivityPeriod/ef:activityTime/gml:TimePeriod/gml:endPosition which are unclosed (null) or have an indeterminatePosition="unknown" attribute
status: valid
status modified: 2023-05-04
accepted date: 2023-05-04
in scheme: AQD - Quality control and assurance on CDR
hidden label: Total number of operational Stations
error type: WARNING

Station altitude must be provided in meters according to vocabulary and between -10 to 5700 meters
type: Concept
notation: D25
definition: Altitude <aqd:altitude uom="http://dd.eionet.europa.eu/vocabulary/uom/length/m"> must be provided as valid number between -10 to 5.700 and unit of measurement must match http://dd.eionet.europa.eu/vocabulary/uom/length/m. Example: <aqd:altitude uom="http://dd.eionet.europa.eu/vocabulary/uom/length/m">570</aqd:altitude>
status: valid
status modified: 2023-05-04
accepted date: 2023-05-04
in scheme: AQD - Quality control and assurance on CDR
editorial note: Re-introduced
error type: ERROR

Station code must be unique, starting with ISO2-country code
type: Concept
notation: D26
definition: AQD_Station/aqd:EUStationCode shall be an unique code for the station starting with ISO2-country code
status: valid
status modified: 2023-05-04
accepted date: 2023-05-04
in scheme: AQD - Quality control and assurance on CDR
hidden label: EUStationCode(s) are not unique
editorial note: [Crucial]: Yes, key - IPR requirement (Annex II-D-ii-2)
error type: BLOCKER

Station Meterological Parameters must conform to the standard "Climate and Forecast Standard" Subset of GRIB or the Meteo parameter list eionet data dictionary
type: Concept
notation: D27
definition: The content of aqd:AQD_Station/aqd:meteoParams shall resolve to any concept in http://vocab.nerc.ac.uk/collection/P07/current/, http://vocab.nerc.ac.uk/collection/I01/current/, http://dd.eionet.europa.eu/vocabulary/aq/meteoparameter/
status: valid
status modified: 2023-05-04
accepted date: 2023-05-04
in scheme: AQD - Quality control and assurance on CDR
hidden label: Station Meterological Parameters must conform to the standard "Climate and Forecast Standard" Subset of GRIB or the Meteo parameter list eionet data dictionary
editorial note: Not required - odd element if we really need to collect met data
error type: WARNING

Must conform to a recognised Station Classification from the eionet data dictionary. These are: Rural, Rural-Nearcity, Rural-Regional, Rural-Remote, Suburban, Urban
type: Concept
notation: D28
definition: The content of aqd:AQD_Station/aqd:areaClassification shall resolve to any concept in http://dd.eionet.europa.eu/vocabulary/aq/areaclassification/
status: valid
status modified: 2023-05-04
accepted date: 2023-05-04
in scheme: AQD - Quality control and assurance on CDR
hidden label: Codelist for station classification requires revision: EEA codelist is required
editorial note: [Crucial]: Yes - IPR requirement (Annex II-D-ii-28)
error type: BLOCKER

Must use a recognised Local description from the eionet data dictionary. These are: Canyon, Detached, Elevated and Open.
type: Concept
notation: D29
definition: The content of aqd:AQD_Station/aqd:dispersionLocal shall resolve to any concept in http://dd.eionet.europa.eu/vocabulary/aq/dispersionlocal/
status: valid
status modified: 2023-05-04
accepted date: 2023-05-04
in scheme: AQD - Quality control and assurance on CDR
hidden label: Codelist for local dispersion requires revision: EEA codelist is required
error type: ERROR

Must use a recognised Regional descriptor: Alpine, Base, Basin-Hilly, Coast-Mount, Coast-Plane, Hilly, Mount, Mount-Slope, Plane, Valley-Hilly and Valley-Mount.
type: Concept
notation: D30
definition: The content of aqd:AQD_Station/aqd:dispersionRegional shall resolve to any concept in http://dd.eionet.europa.eu/vocabulary/aq/dispersionregional/
status: valid
status modified: 2023-05-04
accepted date: 2023-05-04
in scheme: AQD - Quality control and assurance on CDR
hidden label: Codelist for regional dispersion requires revision: EEA codelist is required
error type: ERROR

Sampling Point local Id must be unique
type: Concept
notation: D31
definition: AQD_SamplingPoint/ef:inspireId/base:Identifier/base:localId not unique codes:
status: valid
status modified: 2023-05-04
accepted date: 2023-05-04
in scheme: AQD - Quality control and assurance on CDR
hidden label: LocalId(s) for samplingPoint(s) are not unique
editorial note: [Crucial]: Yes - IPR requirement (Annex II-D-ii-1)
error type: BLOCKER

List unique namespaces used and count number of SamplingPoint used.
type: Concept
notation: D32
definition: Count the number of unique AQD_SamplingPoint (via localId) submitted within base:namespace.
status: valid
status modified: 2023-05-04
accepted date: 2023-05-04
in scheme: AQD - Quality control and assurance on CDR
hidden label: Namespace are not unique
editorial note: [Crucial]: Yes - INSPIRE & system requirement
error type: BLOCKER

Check namespace is registered
type: Concept
notation: D32.1
definition: Check that namespace is registered in vocabulary (http://dd.eionet.europa.eu/vocabulary/aq/namespace/view)
status: valid
status modified: 2023-05-04
accepted date: 2023-05-04
in scheme: AQD - Quality control and assurance on CDR
hidden label: Unregistered country namespaace has been used
editorial note: [Crucial]: Yes - System requirement
error type: BLOCKER

Must conform to the code 'air' in the Media codelist in the Inspire registry
type: Concept
notation: D33
definition: The content of aqd:AQD_SamplingPoint/ef:mediaMonitored shall resolve to any concept inhttp://dd.eionet.europa.eu/vocabulary/inspire/MediaValue/
status: valid
status modified: 2023-05-04
accepted date: 2023-05-04
in scheme: AQD - Quality control and assurance on CDR
hidden label: Codelist for am:environmentalDomain requires revision: INSPIRE codelist is required
error type: ERROR

The coordinate reference system for the zones must be defined with a correct uniform resource name
type: Concept
notation: D34
definition: aqd:AQD_SamplingPoint/am:geometry/gml:Point the srsName attribute shall be a recognisable URN . The following 3 srsNames are expected urn:ogc:def:crs:EPSG::3035 or urn:ogc:def:crs:EPSG::4258 or urn:ogc:def:crs:EPSG::4326
status: valid
status modified: 2023-05-04
accepted date: 2023-05-04
in scheme: AQD - Quality control and assurance on CDR
hidden label: Coordinate system for SamplingPoints needs revision
editorial note: [Crucial]: Yes - Not required under IPR. However this is rather important
error type: BLOCKER

The Dimension attribute shall resolve to "2" and the order must be Latitude & Longitude
type: Concept
notation: D35
definition: The srsDimension attribute within ./ef:geometry/gml:Point/gml:pos shall resolve to “2” to allow the x.y-coordinate of the station ORDER of 2 coordinates MUST BE Latitude & Longitude when providing the accepted srsNames (see D34)
status: valid
status modified: 2023-05-04
accepted date: 2023-05-04
in scheme: AQD - Quality control and assurance on CDR
hidden label: Coordinate provided for SamplingPoints needs revision as not latitude/Longitude
editorial note: [Crucial]: Yes - Not required under IPR. However this is rather important
error type: BLOCKER

The sampling point location shall resolve within the approximate location of the AQD_Station
type: Concept
notation: D36
definition: ./ef:geometry/gml:Point/gml:pos shall resolve to within the approximate geographic location of the AQD_Station cited by .aqd:AQD_SamplingPoint ef:broader
status: valid
status modified: 2023-05-04
accepted date: 2023-05-04
in scheme: AQD - Quality control and assurance on CDR
hidden label: SamplingPoint coordinates seem to be too distant to the Station. Please revise
editorial note: [Crucial]: Yes - Quality check
error type: ERROR

Check if the operational period for the Sampling Points is invalid or overlaps
type: Concept
notation: D37
definition: .ef:observingCapability/ef:ObservingCapability/ef:observingTime/gml:TimePeriod/gml:beginPosition shall be equal to or less than ./ef:operationalActivityPeriod/ef:OperationalActivityPeriod/ef:activityTime/gml:TimePeriod /gml:endPosition gml:TimePeriod within the multiple ef:observingCapability MUST NOT overlap which each other
status: superseded
status modified: 2023-05-04
accepted date: 2023-05-04
in scheme: AQD - Quality control and assurance on CDR
hidden label: Operational times for SamplingPoins and Station need revising due to being invalid or overlap
editorial note: [Crucial]: Yes - Quality check. Moved to d37a and d37b
error type: BLOCKER

Check if any sampling point includes more than one Operational Activity Period.
type: Concept
notation: D37a
definition: Sampling point can only include one ./ef:operationalActivityPeriod/ef:OperationalActivityPeriod. Multiple entries will be return error/blocker.
status: valid
status modified: 2023-05-04
accepted date: 2023-05-04
in scheme: AQD - Quality control and assurance on CDR
error type: ERROR

Check if the time period of the Observing Capability(ies) operate within overall OperationalActivity of the Sampling Points, are invalid and do not overlap
type: Concept
notation: D37b
definition: .ef:observingCapability/ef:ObservingCapability/ef:observingTime/gml:TimePeriod/gml:beginPosition shall be equal to or less than ./ef:operationalActivityPeriod/ef:OperationalActivityPeriod/ef:activityTime/gml:TimePeriod /gml:endPosition gml:TimePeriod within the multiple ef:observingCapability MUST NOT overlap which each other. The check will result in a warning if initial gaps are detected pre-eReporting (before 2013/01/01) The check will be skipped if d37a is a blocker.
status: valid
status modified: 2023-05-04
accepted date: 2023-05-04
in scheme: AQD - Quality control and assurance on CDR
editorial note: Amended wording after improvements on d37a and d37b.
error type: ERROR

Check that a Sampling Point with only one Observing Capability has an OperationalActivityPeriod older than 12 years
type: Concept
notation: D37c
definition: A Sampling Point with only one Observing Capability is expected not to have OperationalActivityPeriod older than 12 years. In the live spam of a sampling points (with changes in equipment), multiple observing capabilities are expected.
status: valid
status modified: 2023-11-21
accepted date: 2023-11-21
in scheme: AQD - Quality control and assurance on CDR
error type: WARNING

Check if superseded SamplingPoint exists in previous deliveries.
type: Concept
notation: D38
definition: Check if there is element <ef:supersedes/> in the delivery. This element must link to an existing SamplingPoint
status: valid
status modified: 2023-05-04
accepted date: 2023-05-04
in scheme: AQD - Quality control and assurance on CDR
hidden label: reserved

Preventive check - Check if any SamplingPoint is being superseded or supersedes this delivery.
type: Concept
notation: D39
definition: Preventive check if any SamplingPoint has element <ef:supersedes/> and/or <ef:supersededBy/> in the delivery. This is to ensure that the element is not misused and will prevent errors in the database.
status: experimental
status modified: 2023-05-04
accepted date: 2023-05-04
in scheme: AQD - Quality control and assurance on CDR
error type: BLOCKER

Pollutant must be a registered under vocabulary and each SamplingPoint must be defined for a unique pollutant under all measurement configurations
type: Concept
notation: D40
definition: The content of ../ef:observedProperty shall resolve to a valid code within http://dd.eionet.europa.eu/vocabulary/aq/pollutant/ and within a unique SamplingPoint, multiple ef:observedProperty may be found. These MUST always resolve to the same code
status: valid
status modified: 2023-05-04
accepted date: 2023-05-04
in scheme: AQD - Quality control and assurance on CDR
hidden label: Codelist for all pollutants requires revision: EEA codelist is required
editorial note: [Crucial]: Yes - INSPIRE requirement
error type: BLOCKER

Links between SamplingPoint and Sample shall be traceable and valid
type: Concept
notation: D41
definition: Cross-check with AQD_Sample (./ef:observingCapability/ef:ObservingCapability/ef:featureOfInterest/@xlink shall resolve to a traversable local of global URI to an ../AQD_Sample)
status: valid
status modified: 2023-05-04
accepted date: 2023-05-04
in scheme: AQD - Quality control and assurance on CDR
hidden label: Incorrect link between SamplingPoint and Sample
editorial note: [Crucial]: YES, key check - System requirement
error type: BLOCKER

Links between SamplingPoint and SamplingPointProcess shall be traceable and valid
type: Concept
notation: D42
definition: Cross-check with AQD_SamplingPointProcess (./ef:observingCapability/ef:ObservingCapability/ef:procedure/@xlink shall resolve to a traversable local of global URI to ../AQD_SamplingPointProcess)
status: valid
status modified: 2023-05-04
accepted date: 2023-05-04
in scheme: AQD - Quality control and assurance on CDR
hidden label: Incorrect link between SamplingPoint and SamplingPointProcess
editorial note: [Crucial]: YES, key check - System requirement
error type: BLOCKER

Links between SamplingPoint and Station shall be traceable and valid
type: Concept
notation: D43
definition: Cross-check with AQD_Station (../ef:broader/@xlink shall resolve to a traversable local of global URI to ../AQD_Station)
status: valid
status modified: 2023-05-04
accepted date: 2023-05-04
in scheme: AQD - Quality control and assurance on CDR
hidden label: Incorrect link between SamplingPoint and Station
editorial note: [Crucial]: YES, key check - System requirement Works if all in one XML
error type: BLOCKER

Links between Station and Network shall be traceable and valid
type: Concept
notation: D44
definition: Cross-check with AQD_Network (aqd:AQD_SamplingPoint/ef:belongsTo shall resolve to a traversable local of global URI to ../AQD_Network)
status: valid
status modified: 2023-05-04
accepted date: 2023-05-04
in scheme: AQD - Quality control and assurance on CDR
hidden label: Incorrect link between Station and Network
editorial note: [Crucial]: YES, key check - System requirement
error type: BLOCKER

Links between SamplingPoint and Network shall be traceable and valid
type: Concept
notation: D44b
definition: Cross-check with AQD_Network (aqd:AQD_Station/ef:belongsTo shall resolve to a traversable local of global URI to ../AQD_Network)
status: retired
status modified: 2023-05-04
accepted date: 2023-05-04
in scheme: AQD - Quality control and assurance on CDR
hidden label: Incorrect link between SamplingPoint and Network
editorial note: removed

Invalid or overlapping operational activity periods
type: Concept
notation: D45
definition: Total number aqd:AQD_SamplingPoint/ef:operationActivityPeriod/ef:OperationActivityPeriod/ef:activityTime/gml:TimePeriod/ invalid operational activity periods
status: valid
status modified: 2023-05-04
accepted date: 2023-05-04
in scheme: AQD - Quality control and assurance on CDR
hidden label: Operational times for SamplingPoins need revising due to being invalid
editorial note: [Crucial]: Yes -
error type: ERROR

Number of operational sampling points:
type: Concept
notation: D46
definition: Total number of AQD_SamplingPoints which are operational
status: valid
status modified: 2023-05-04
accepted date: 2023-05-04
in scheme: AQD - Quality control and assurance on CDR
hidden label: Number of operational sampling points:
error type: INFO

reserved
type: Concept
notation: D47
definition: ./ef:operationActivityPeriod/ef:OperationActivityPeriod/ef:activityTime/gml:TimePeriod/gml:endPosition with valid content (historical content) shall indicate that the environmental monitoring feature type is no longer operational.
status: reserved
status modified: 2023-05-04
accepted date: 2023-05-04
in scheme: AQD - Quality control and assurance on CDR
editorial note: Not implemented

Check that Assessment Type conforms to: Fixed, Indicative, Model or Objective
type: Concept
notation: D48
definition: ./aqd:assessmentType shall resolve to http://dd.eionet.europa.eu/vocabulary/aq/assessmenttype/ via xlink:href
status: valid
status modified: 2023-05-04
accepted date: 2023-05-04
in scheme: AQD - Quality control and assurance on CDR
hidden label: Check that Assessment Type conforms to: Fixed, Indicative, Model or Objective
editorial note: Implemented via Check xlink references
error type: ERROR

Check that all elements under relevantEmissions conforms to registered vocabulary
type: Concept
notation: D49
definition: Check that all elements under./aqd:relevantEmissions shall resolve to http://dd.eionet.europa.eu/vocabulary/aq/ via xlink:href and http://dd.eionet.europa.eu/vocabulary/uom/ via uom. PLEASE NOTE the system expect the usage of FULL URL like: http://dd.eionet.europa.eu/vocabulary/uom/length/m http://dd.eionet.europa.eu/vocabulary/aq/emissionsource/2
status: experimental
status modified: 2023-05-04
accepted date: 2023-05-04
in scheme: AQD - Quality control and assurance on CDR
hidden label: Check that main emission source conforms to registered vocabulary
editorial note: Implemented via Check xlink references
error type: BLOCKER

Check that Classifications conforms to: Background, Industrial or Traffic
type: Concept
notation: D50
definition: Total number/aqd:stationClassification which resolve to http://dd.eionet.europa.eu/vocabulary/aq/stationclassification/ via xlink:href
status: valid
status modified: 2023-05-04
accepted date: 2023-05-04
in scheme: AQD - Quality control and assurance on CDR
hidden label: Codelist for samplingPoint classification requires revision: EEA codelist is required
editorial note: [Crucial]: Yes - IPR requirement (Annex II-D-ii-22)
error type: BLOCKER

Number of invalid 3 elements in Sampling Point and Environmental Objective combinations:
type: Concept
notation: D51
definition: Number of invalid 3 elements aqd:AQD_SamplingPoint/aqd:environmentalObjective/aqd:EnvironmentalObjective/ combinations:
status: valid
status modified: 2023-05-04
accepted date: 2023-05-04
in scheme: AQD - Quality control and assurance on CDR
hidden label: The Environmental Objective combination declared under SamplingPoint are invalid. Please revise.
editorial note: [Crucial]: - Not required under IPR
error type: ERROR

reserved
type: Concept
notation: D52
status: reserved
status modified: 2023-05-04
accepted date: 2023-05-04
in scheme: AQD - Quality control and assurance on CDR

Check if there are any invalid link from SamplingPoint to zone(s)
type: Concept
notation: D53
definition: Number of invalid aqd:AQD_SamplingPoint/aqd:zone xlinks:
status: valid
status modified: 2023-05-04
accepted date: 2023-05-04
in scheme: AQD - Quality control and assurance on CDR
hidden label: Incorrect link between SamplingPoint(s) and zone(s)
editorial note: [Crucial]: Yes - IPR requirement (Annex II-D-ii-22)
error type: INFO

Local Id for Sampling Point Process must be unique
type: Concept
notation: D54
definition: aqd:AQD_SamplingPointProcess/ompr:inspireId/base:Identifier/base:localId not unique codes:
status: valid
status modified: 2023-05-04
accepted date: 2023-05-04
in scheme: AQD - Quality control and assurance on CDR
hidden label: LocalId(s) for samplingPointProcess(es) are not unique
editorial note: [Crucial]: Yes -
error type: BLOCKER

List unique namespaces used and count number of SamplingPointProcess(es) used.
type: Concept
notation: D55
definition: Count the number of unique AQD_SamplingPointProcess (via localId) submitted within base:namespace
status: valid
status modified: 2023-05-04
accepted date: 2023-05-04
in scheme: AQD - Quality control and assurance on CDR
hidden label: Namespace are not unique
editorial note: [Crucial]: Yes -
error type: INFO

Check namespace is registered
type: Concept
notation: D55.1
definition: Check that namespace is registered in vocabulary (http://dd.eionet.europa.eu/vocabulary/aq/namespace/view)
status: valid
status modified: 2023-05-04
accepted date: 2023-05-04
in scheme: AQD - Quality control and assurance on CDR
hidden label: Unregistered country namespaace has been used
editorial note: [Crucial]: Yes - System requirement
error type: BLOCKER

Must conform to a recognised Measurement Type from the eionet data dictionary. These are: Active, Automatic, Passive, Remote and Unknown.
type: Concept
notation: D56
definition: ./aqd:measurementType shall resolve to http://dd.eionet.europa.eu/vocabulary/aq/measurementtype/[concept]
status: valid
status modified: 2023-05-04
accepted date: 2023-05-04
in scheme: AQD - Quality control and assurance on CDR
hidden label: Codelist for measurementType requires revision: EEA codelist is required
editorial note: [Crucial]: Yes - IPR requirement (Annex II-D-ii-8)
error type: BLOCKER

If Measurement Type is Automatic or Remote, Measurement Method must be provided. However, Sampling Method and Technique shall not be provided.
type: Concept
notation: D57
definition: If ./aqd:measurementType resolves to ./measurementtype/automatic or ./measurementtype/remote, aqd:measurementMethod & aqd:measurementEquipment MUST be included AND /aqd:samplingMethod and ./aqd:analyticalTechnique SHALL NOT BE PROVIDED
status: valid
status modified: 2024-02-27
accepted date: 2023-05-04
in scheme: AQD - Quality control and assurance on CDR
hidden label: Key information is missing for automatic/remote methods
editorial note: Content check requirement
error type: ERROR

If Measurement Type is Active or Passive then Sampling Method and Analytical Technique must be provided. Measurement method shall not be provided.
type: Concept
notation: D58
definition: If ./aqd:measurementType resolves to http://dd.eionet.europa.eu/vocabulary/aq/measurementtype/active or http://dd.eionet.europa.eu/vocabulary/aq/measurementtype/passive ./aqd:samplingMethod & ./aqd:analyticalTechnique shall be included AND ./aqd:measurementMethod SHALL NOT BE PROVIDED
status: valid
status modified: 2023-05-04
accepted date: 2023-05-04
in scheme: AQD - Quality control and assurance on CDR
hidden label: Key information is missing for active/passive methods
editorial note: Content check requirement
error type: ERROR

Analytical Technique must use any of the analytical technique recognised methods in the eionet data dictionary.
type: Concept
notation: D59
definition: The content of /aqd:AQD_SamplingPointProcess/aqd:analyticalTechnique shall resolve to any concept inhttp://dd.eionet.europa.eu/vocabulary/aq/analyticaltechnique/
status: valid
status modified: 2023-05-04
accepted date: 2023-05-04
in scheme: AQD - Quality control and assurance on CDR
hidden label: Codelist for analyticalTechnique requires revision: EEA codelist is required
editorial note: [Crucial]: Yes - IPR requirement (Annex II-D-ii-8+10)
error type: BLOCKER

When measurementMethod is provided, please use any of the measurement methods in the eionet data dictionary.
type: Concept
notation: D60a
definition: The content of aqd:measurementMethod MUST resolve to any concept in http://dd.eionet.europa.eu/vocabulary/aq/measurementmethod/
status: valid
status modified: 2023-05-04
accepted date: 2023-05-04
in scheme: AQD - Quality control and assurance on CDR
hidden label: Codelist for measurementType requires revision: EEA codelist is required
editorial note: [Crucial]: Yes - IPR requirement (Annex II-D-ii-8+10)
error type: BLOCKER

When Sampling Equipment is provided, please use any of the sampling equipment in the eionet data dictionary.
type: Concept
notation: D60b
definition: The content of aqd:AQD_SamplingPointProcess/aqd:samplingEquipment/aqd:SamplingEquipment/aqd:equipment MUST resolve to any concept in http://dd.eionet.europa.eu/vocabulary/aq/samplingequipment/
status: valid
status modified: 2023-05-04
accepted date: 2023-05-04
in scheme: AQD - Quality control and assurance on CDR
hidden label: Codelist for measurementType requires revision: EEA codelist is required
editorial note: [Crucial]: Yes - IPR requirement (Annex II-D-ii-8+10)
error type: BLOCKER

When Measurement Equipment is provided, please use any of the measurement equipment in the eionet data dictionary.
type: Concept
notation: D60c
definition: The content of aqd:measurementEquipment/aqd:MeasurementEquipment/aqd:equipment MUST resolve to any concept in http://dd.eionet.europa.eu/vocabulary/aq/measurementequipment/
status: valid
status modified: 2023-05-04
accepted date: 2023-05-04
in scheme: AQD - Quality control and assurance on CDR
error type: BLOCKER

When Sampling Method is provided, please use any of the sampling methods in the eionet data dictionary.
type: Concept
notation: D60d
definition: The content of aqd:samplingMethod MUST resolve to any concept in http://dd.eionet.europa.eu/vocabulary/aq/samplingmethod/
status: valid
status modified: 2023-05-04
accepted date: 2023-05-04
in scheme: AQD - Quality control and assurance on CDR
error type: BLOCKER

Please contact IPR helpdesk in order to add new vocabulary for either MeasurementMethods/MeasurementEquipment/SamplingMethod/SamplingEquipment/AnalyticalTecnique
type: Concept
notation: D61
definition: If /aqd:AQD_SamplingPointProcess/aqd:measurementMethod/aqd:MeasurementMethod/aqd:otherMeasurementMethod, /aqd:AQD_SamplingPointProcess/aqd:measurementEquipment/aqd:MeasurementEquipment/aqd:otherEquipment, /aqd:AQD_SamplingPointProcess/aqd:samplingMethod/aqd:SamplingMethod/aqd:otherSamplingMethod, /aqd:AQD_SamplingPointProcess/aqd:SamplingEquipment/aqd:SamplingEquipment/aqd:otherEquipment or /aqd:AQD_SamplingPointProcess/aqd:analyticalTechnique/aqd:AnalyticalTechnique/aqd:otherAnalyticalTechnique populated must give a warning to contact helpdesk to add new vocabulary
status: valid
status modified: 2023-05-04
accepted date: 2023-05-04
in scheme: AQD - Quality control and assurance on CDR
hidden label: Method(s) and equipment(s) have been provided using the element Other
hidden label: Method(s) and equipment(s) have been provided using the element
editorial note: [Crucial]: -
error type: BLOCKER

SamplingPointProcess parameters shall conform with registered vocabulary
type: Concept
notation: D62
definition: ./ompr:processParameter/ompr:ProcessParameter/ompr:name must correspond to a valid code under http://dd.eionet.europa.eu/vocabulary/aq/processparameter/
status: valid
status modified: 2023-05-04
accepted date: 2023-05-04
in scheme: AQD - Quality control and assurance on CDR
hidden label: Codelist for process parameter requires revision: EEA codelist is required
editorial note: [Crucial]: -
error type: ERROR

If Detection Limit is specified, then a link to a concentration value from the eionet data dictionary must be provided.
type: Concept
notation: D63
definition: Where ./aqd:detectionLimit is resolved uom link resolving to any concept in http://dd.eionet.europa.eu/vocabulary/uom/concentration/ shall be provided
status: valid
status modified: 2023-05-04
accepted date: 2023-05-04
in scheme: AQD - Quality control and assurance on CDR
hidden label: Codelist for Detection Limit unit requires revision: EEA codelist is required
editorial note: [Crucial]: Yes - IPR requirement (Annex II-D-ii-11)
error type: BLOCKER

Check that measurementMethod, aqd:samplingMethod & aqd:analyticalTechnique is persistent of the samplingPointProcess ID
type: Concept
notation: D64
definition: f ./aqd:measurementType resolves to ./measurementtype/automatic or ./measurementtype/remote, aqd:measurementMethod MUST be the same as provided in previous delivery If ./aqd:measurementType resolves to http://dd.eionet.europa.eu/vocabulary/aq/measurementtype/active or http://dd.eionet.europa.eu/vocabulary/aq/measurementtype/passive /aqd:samplingMethod & ./aqd:analyticalTechnique MUST be the same as provided in previous delivery
status: valid
status modified: 2023-11-21
accepted date: 2023-11-21
in scheme: AQD - Quality control and assurance on CDR
error type: BLOCKER

Check persistence of sampling point process
type: Concept
notation: D64a
definition: Check persistence of sampling point process reported for same samplingpoint/observingCapability
status: valid
status modified: 2023-12-05
accepted date: 2023-12-05
in scheme: AQD - Quality control and assurance on CDR

Check that measurement equipment is for the right pollutant.
type: Concept
notation: D64b
definition: Check that the measurement equipment (https://dd.eionet.europa.eu/vocabulary/aq/measurementequipment) used is correct for the pollutant measured. Please contact the helpdesk if EEA vocabulary needs updating.
status: valid
status modified: 2023-12-05
accepted date: 2023-12-05
in scheme: AQD - Quality control and assurance on CDR
error type: ERROR

Time unit for process duration and cadence shall conform with registered vocabulary
type: Concept
notation: D65
definition: ./aqd:unit shall resolve to http://dd.eionet.europa.eu/vocabulary/uom/time/
status: valid
status modified: 2023-05-04
accepted date: 2023-05-04
in scheme: AQD - Quality control and assurance on CDR
hidden label: Codelist for Time unit requires revision: EEA codelist is required
editorial note: [Crucial]: - IPR requirement (Annex II-D-ii-14+15)
error type: BLOCKER

reserved
type: Concept
notation: D66
definition: ./aqd:numUnits shall contain an integer value
status: reserved
status modified: 2023-05-04
accepted date: 2023-05-04
in scheme: AQD - Quality control and assurance on CDR
editorial note: Not implemented - IPR requirement (Annex II-D-ii-14+15)

Sampling Process (used for compliance) was reported without or incorrect information on Equivalence demonstration.
type: Concept
notation: D67a
definition: Where ../AQD_SamplingPoint/aqd:usedAQD is “true”, ./aqd:equivalenceDemonstration/aqd:EquivalenceDemonstration/aqd:equivalenceDemonstrated must resolve to http://dd.eionet.europa.eu/vocabulary/aq/equivalencedemonstrated/
status: valid
status modified: 2023-05-04
accepted date: 2023-05-04
in scheme: AQD - Quality control and assurance on CDR
hidden label: Information on reference/equivalence demonstration is required for SamplingPoints used for Assessement
editorial note: [Crucial]: Yes - IPR requirement (Annex II-D-ii-12)
error type: ERROR

Sampling Process was reported without or incorrect information on Equivalence demonstration.
type: Concept
notation: D67b
definition: ./aqd:equivalenceDemonstration/aqd:EquivalenceDemonstration/aqd:equivalenceDemonstrated should resolve to http://dd.eionet.europa.eu/vocabulary/aq/equivalencedemonstrated/ for all SamplingPointProcess
status: valid
status modified: 2023-05-04
accepted date: 2023-05-04
in scheme: AQD - Quality control and assurance on CDR
hidden label: Sampling Process was reported without or incorrect information on Equivalence demonstration.
editorial note: [Crucial]: Yes - IPR requirement (Annex II-D-ii-12)
error type: WARNING

Sampling Process was declared as an equivalent method but the Demonstration Report was not provided.
type: Concept
notation: D68
definition: SamplingPointProcess(es) declared as an equivalent method” i.e. http://dd.eionet.europa.eu/vocabulary/aq/equivalencedemonstrated/yes but /aqd:demonstrationReport not provided.
status: valid
status modified: 2023-05-04
accepted date: 2023-05-04
in scheme: AQD - Quality control and assurance on CDR
hidden label: Equivalent demonstration report is missing
editorial note: [Crucial]: Yes - IPR requirement (Annex II-D-ii-13)
error type: ERROR

Sampling Process is missing mandatory document on Traceability and Uncertainty Estimation or QA report
type: Concept
notation: D69
definition: SamplingPointProcess(es) is missing mandatory document on Traceability and Uncertainty Estimation via aqd:AQD_SamplingPointProcess/aqd:dataQuality/aqd:DataQuality/aqd:documentation OR ./aqd:qaReport
status: valid
status modified: 2023-05-04
accepted date: 2023-05-04
in scheme: AQD - Quality control and assurance on CDR
hidden label: Document on traceability and uncertatinity estimation or QA report missing
editorial note: [Crucial]: Yes - IPR requirement (Annex II-D-ii-43+44)
error type: ERROR

Check closed SamplingPoints versus the link between Assessment Regimes and measurement methods
type: Concept
notation: D70
definition: Check closed SamplingPoints versus the link between Assessment Regimes and measurement methods
status: valid
status modified: 2023-12-05
accepted date: 2023-12-05
in scheme: AQD - Quality control and assurance on CDR
hidden label: reserved
error type: ERROR

Local Id for Sample must be unique
type: Concept
notation: D71
definition: aqd:AQD_Sample/ompr:inspireId/base:Identifier/base:localId not unique codes:
status: valid
status modified: 2023-05-04
accepted date: 2023-05-04
in scheme: AQD - Quality control and assurance on CDR
hidden label: LocalId(s) for sample(s) are not unique
editorial note: [Crucial]: Yes - INSPIRE requirement
error type: BLOCKER

List unique namespaces used and count number of Sample(s) used.
type: Concept
notation: D72
definition: Count the number of unique AQD_Sample (via localId) submitted within base:namespace
status: valid
status modified: 2023-05-04
accepted date: 2023-05-04
in scheme: AQD - Quality control and assurance on CDR
hidden label: Namespace are not unique
editorial note: [Crucial]: Yes - INSPIRE requirement
error type: BLOCKER

Check namespace is registered
type: Concept
notation: D72.1
definition: Check that namespace is registered in vocabulary (http://dd.eionet.europa.eu/vocabulary/aq/namespace/view)
status: valid
status modified: 2023-05-04
accepted date: 2023-05-04
in scheme: AQD - Quality control and assurance on CDR
hidden label: Unregistered country namespaace has been used
editorial note: [Crucial]: Yes - INSPIRE requirement
error type: BLOCKER

The coordinate reference system for the zones must be defined with a correct uniform resource name
type: Concept
notation: D73
definition: ./sams:shape/gml:Point the srsName attribute shall be a recognisable URN . The following 3 srsNames are expected urn:ogc:def:crs:EPSG::3035 or urn:ogc:def:crs:EPSG::4258 or urn:ogc:def:crs:EPSG::4326
status: valid
status modified: 2023-05-04
accepted date: 2023-05-04
in scheme: AQD - Quality control and assurance on CDR
hidden label: Coordinate system for Sample needs revision
editorial note: [Crucial]: Yes - INSPIRE/System requirement
error type: BLOCKER

The srsDimension attribute must be '2'.
type: Concept
notation: D74
definition: ./sams:shape/gml:Point, the srsDimension attribute shall resolve to “2” to allow the coordinate of the feature of interest
status: valid
status modified: 2023-05-04
accepted date: 2023-05-04
in scheme: AQD - Quality control and assurance on CDR
hidden label: Coordinate provided for SamplingPoints needs revision as not latitude/Longitude
editorial note: [Crucial]: Yes -
error type: BLOCKER

The Sample should be located near the SamplingPoint
type: Concept
notation: D75
definition: ./sams:shape/gml:Point/gml:pos shall resolve to within the approximate geographic location of the sampling point referencing the ../AQD_Sample record via ../aqd:AQD_SamplingPoint/ef:observingCapability/ef:ObservingCapability/ef:featureOfInterest
status: valid
status modified: 2023-05-04
accepted date: 2023-05-04
in scheme: AQD - Quality control and assurance on CDR
hidden label: Same coordinates seem to be too distant to the SamplingPoint. Please revise
error type: ERROR

Distance to building should be provided if SamplingPoint is classified as Traffic
type: Concept
notation: D76
definition: ./aqd:builldingDistance shall contain a numerical value, WHERE ../aqd:AQD_SamplingPoint/aqd:relevantEmissions/aqd:RelevantEmissions/aqd:stationClassification = http://dd.eionet.europa.eu/vocabulary/aq/stationclassification/traffic AND ../aqd:AQD_SamplingPoint/ef:observingCapability/ef:ObservingCapability/ef:featureOfInterest is xlinked to this./aqd:AQD_Sample via /aqd:inspireId/base:Identifier/base:localId
status: valid
status modified: 2023-05-04
accepted date: 2023-05-04
in scheme: AQD - Quality control and assurance on CDR
hidden label: Traffic samplingPoint miss distance to building. Please revise Sample (inlet)
editorial note: [Crucial]: - IPR requirement (Annex II-D-ii-20)
error type: ERROR

Distance to kerbside should be provided if SamplingPoint is classified as Traffic
type: Concept
notation: D77
definition: ./aqd:kerbDistance shall contain a numerical value, WHERE ../aqd:AQD_SamplingPoint/aqd:relevantEmissions/aqd:RelevantEmissions/aqd:stationClassification is EQUAL to http://dd.eionet.europa.eu/vocabulary/aq/stationclassification/traffic AND ../aqd:AQD_SamplingPoint/ef:observingCapability/ef:ObservingCapability/ef:featureOfInterest is xlinked to this./aqd:AQD_Sample via /aqd:inspireId/base:Identifier/base:localId
status: valid
status modified: 2023-05-04
accepted date: 2023-05-04
in scheme: AQD - Quality control and assurance on CDR
hidden label: Traffic samplingPoint miss distance to kerbside Please revise Sample (inlet)
editorial note: [Crucial]: - IPR requirement (Annex II-D-ii-21)
error type: ERROR

Inlet Height must be in meters and between 0 to 30 meters. URL to uom must be full.
type: Concept
notation: D78
definition: ./aqd:inletHeight shall contain a numerical value between 0 to 30.0 and unit of measurement (uom) shall resolve to http://dd.eionet.europa.eu/vocabulary/uom/length/m
status: valid
status modified: 2023-05-04
accepted date: 2023-05-04
in scheme: AQD - Quality control and assurance on CDR
hidden label: Inlet height is expected to use EEA uom vocabulary
editorial note: [Crucial]: Yes - IPR requirement (Annex II-D-ii-19)
error type: ERROR

reserved
type: Concept
notation: D79
definition: sam:sampledFeature shall resolve to a traversable local of global URI to an ../AQD_RepresentativeArea or a nilReason must be provided like <sam:sampledFeature nilReason="unknown"/>
status: reserved
status modified: 2023-05-04
accepted date: 2023-05-04
in scheme: AQD - Quality control and assurance on CDR
hidden label: reserved
editorial note: Not implemented

reserved
type: Concept
notation: D80
definition: ./aqd:inspireId/base:Identifier/base:localId shall be an unique code for AQD_RepresentativeArea and unique within namespace
status: reserved
status modified: 2023-05-04
accepted date: 2023-05-04
in scheme: AQD - Quality control and assurance on CDR
hidden label: reserved
editorial note: Not implemented

List unique namespaces used and count number of Sample used.
type: Concept
notation: D81
definition: ./aqd:InspireId/base:Identifier/base:namespace shall be a unique namespace identifier for the data source (within an annual e-Reporting cycle). The namespace value will be owned by the data provider of the spatial object
status: valid
status modified: 2023-05-04
accepted date: 2023-05-04
in scheme: AQD - Quality control and assurance on CDR
hidden label: Namespace are not unique
editorial note: [Crucial]: - INSPIRE requirement
error type: BLOCKER

Check namespace is registered
type: Concept
notation: D81.1
definition: Check that namespace is registered in vocabulary (http://dd.eionet.europa.eu/vocabulary/aq/namespace/view)
status: valid
status modified: 2023-05-04
accepted date: 2023-05-04
in scheme: AQD - Quality control and assurance on CDR
hidden label: Unregistered country namespaace has been used
editorial note: [Crucial]: - INSPIRE requirement
error type: BLOCKER

reserved
type: Concept
notation: D82
definition: ./sam:sampledFeature shall resolve to http://sweet.jpl.nasa.gov/2.2/realm.owl#Atmosphere
status: reserved
status modified: 2023-05-04
accepted date: 2023-05-04
in scheme: AQD - Quality control and assurance on CDR
hidden label: reserved
editorial note: Not implemented

reserved
type: Concept
notation: D83
definition: The srsName attribute within ./sams:shape/gml:Point shall be a recognisable URN. The following 3 srsNames are expected urn:ogc:def:crs:EPSG::3035 or urn:ogc:def:crs:EPSG::4258 or urn:ogc:def:crs:EPSG::4326 Alternatives, like http://www.opengis.net/gml/srs/epsg.xml#4258 or EPSG:4258 should be flagged as error
status: reserved
status modified: 2023-05-04
accepted date: 2023-05-04
in scheme: AQD - Quality control and assurance on CDR
hidden label: reserved
editorial note: Not implemented

reserved
type: Concept
notation: D84
definition: ./sams:shape/gml:Polygon/gml:exterior/gml:LinearRing/gml:posList shall resolve to within the approximate geographic location of the sampling point referencing the
status: reserved
status modified: 2023-05-04
accepted date: 2023-05-04
in scheme: AQD - Quality control and assurance on CDR
hidden label: reserved
editorial note: Not implemented

reserved
type: Concept
notation: D85
definition: ./sams:shape/gml:Polygon/gml:exterior/gml:LinearRing/gml:posList srsDimension attribute shall resolve to “2” to allow the x &y-coordinate of the feature of interest. ORDER of 2 coordinates MUST BE Latitude & Longitud when providing the accepted srsNames (see D81)
status: reserved
status modified: 2023-05-04
accepted date: 2023-05-04
in scheme: AQD - Quality control and assurance on CDR
hidden label: reserved
editorial note: Not implemented

reserved
type: Concept
notation: D86
definition: ./sams:shape/gml:Polygon/gml:exterior/gml:LinearRing/gml:posList count attribute shall resolve to the sum of x-y coordinate doublets. ORDER of 2 coordinates doublets MUST BE Latitude & Longitud when providing the accepted srsNames (see D81)
status: reserved
status modified: 2023-05-04
accepted date: 2023-05-04
in scheme: AQD - Quality control and assurance on CDR
hidden label: reserved
editorial note: Not implemented

reserved
type: Concept
notation: D87
definition: ./sams:shape/gml:Polygon/gml:exterior/gml:LinearRing/gml:posList shall resolve to the approximate geographic location of the sampling point referencing the
status: reserved
status modified: 2023-05-04
accepted date: 2023-05-04
in scheme: AQD - Quality control and assurance on CDR
hidden label: reserved
editorial note: Not implemented

reserved
type: Concept
notation: D88
definition: reserved
status: reserved
status modified: 2023-05-04
accepted date: 2023-05-04
in scheme: AQD - Quality control and assurance on CDR
hidden label: reserved
editorial note: Not implemented

reserved
type: Concept
notation: D89
definition: reserved
status: reserved
status modified: 2023-05-04
accepted date: 2023-05-04
in scheme: AQD - Quality control and assurance on CDR
hidden label: reserved
editorial note: Not implemented

reserved
type: Concept
notation: D90
definition: reserved
status: reserved
status modified: 2023-05-04
accepted date: 2023-05-04
in scheme: AQD - Quality control and assurance on CDR
hidden label: reserved
editorial note: Not implemented

All reported Sample(s) shall be used within at least one SamplingPoint
type: Concept
notation: D91
definition: Each aqd:AQD_Sample reported within the XML shall be xlinked (at least once) via aqd:AQD_SamplingPoint/ef:observingCapability/ef:ObservingCapability/ef:featureOfInterest@xlink
status: valid
status modified: 2023-05-04
accepted date: 2023-05-04
in scheme: AQD - Quality control and assurance on CDR
hidden label: Sample(s) are included which are not part of any measurement configuration
editorial note: [Crucial]: Yes -
error type: ERROR

All reported SamplingPointProcess(es) shall be used wihtin at least one SamplingPoint
type: Concept
notation: D92
definition: Each aqd:AQD_SamplingPointProcess reported within the XML shall be xlinked (at least once) via /aqd:AQD_SamplingPoint/ef:observingCapability/ef:ObservingCapability/ef:procedure@xlink
status: valid
status modified: 2023-05-04
accepted date: 2023-05-04
in scheme: AQD - Quality control and assurance on CDR
hidden label: SamplingPointProcess(es) are included which are not part of any measurement configuration
editorial note: [Crucial]: Yes -
error type: ERROR

All reported Station(s) shall be used within at least one SamplingPoint
type: Concept
notation: D93
definition: Each aqd:AQD_Station reported within the XML shall be xlinked (at least once) via aqd:AQD_SamplingPoint/ef:broader@xlink
status: valid
status modified: 2023-05-04
accepted date: 2023-05-04
in scheme: AQD - Quality control and assurance on CDR
hidden label: Station(s) are included which are not part of any measurement configuration
editorial note: [Crucial]: Yes -
error type: ERROR

All reported Networks shall be used within at least one SamplingPoint or one Station
type: Concept
notation: D94
definition: Each aqd:AQD_Netwok reported within the XML shall be xlinked (at least once) via /aqd:AQD_SamplingPoint/ef:belongsTo@xlink or /aqd:AQD_Station/ef:belongsTo@xlink
status: valid
status modified: 2023-05-04
accepted date: 2023-05-04
in scheme: AQD - Quality control and assurance on CDR
hidden label: Network(s) are included which are not part of any measurement configuration
editorial note: [Crucial]: Yes -
error type: ERROR

Sampling point should belong to the same station as previous deliveries
type: Concept
notation: D96
status: valid
status modified: 2023-05-04
accepted date: 2023-05-04
in scheme: AQD - Quality control and assurance on CDR
error type: BLOCKER

Sampling points location is not expected to change compared to previous deliveries
type: Concept
notation: D97
definition: Sampling points location is not expected to change compared to previous deliveries (latest reported).
status: valid
status modified: 2023-05-04
accepted date: 2023-05-04
in scheme: AQD - Quality control and assurance on CDR
error type: BLOCKER

Sampling point classification (Traffic, background, industrial ...) is not expected to change compared to previous year submission.
type: Concept
notation: D98
definition: Sampling point aqd:stationClassification elements (Traffic, background, industrial ...) shall not be different from what was reported in previous year for the same sampling point.
status: valid
status modified: 2023-05-04
accepted date: 2023-05-04
in scheme: AQD - Quality control and assurance on CDR
error type: WARNING

Station area classification (Rural, sub-urban, urban...) is not expected to change compared to previous year submission.
type: Concept
notation: D99
definition: Station aqd:areaClassification elements shall not be different from what was reported in previous year for the same station
status: valid
status modified: 2023-05-04
accepted date: 2023-05-04
in scheme: AQD - Quality control and assurance on CDR
error type: WARNING

Cross checks with other data-flows
type: Concept
notation: DCrossCheck
definition: Cross checks with other data-flows
status: valid
status modified: 2023-05-04
accepted date: 2023-05-04
in scheme: AQD - Quality control and assurance on CDR
error type: WARNING

Testing REGERROR in D
type: Concept
notation: Dtest
definition: Testing REGERROR in D
status: valid
status modified: 2023-05-10
accepted date: 2023-05-10
in scheme: AQD - Quality control and assurance on CDR
error type: REGERROR

Checks if this delivery is new or an update (on same reporting year)
type: Concept
notation: E0
definition: Check if delivery if this is a new delivery or updated delivery (via reporting year)
status: valid
status modified: 2023-05-04
accepted date: 2023-05-04
in scheme: AQD - Quality control and assurance on CDR
hidden label: Checks if this delivery is new or an update (on same reporting year)
editorial note: [Crucial]: Yes -
error type: WARNING

Total number Observations within this XML Document
type: Concept
notation: E01a
definition: Compile & feedback upon the total number of observations included in the delivery
status: valid
status modified: 2023-05-04
accepted date: 2023-05-04
in scheme: AQD - Quality control and assurance on CDR
hidden label: Total number Observations within this XML Document
editorial note: [Crucial]: Yes -
error type: BLOCKER

GML identifier for om:OM_Observation attribute shall be unique code
type: Concept
notation: E01b
definition: /om:OM_Observation gml:id attribute shall be unique code for the group of observations enclosed by /OM_Observation within the delivery. Please note that the om:OM_Observation do not have INSPIRE ID like all other elments with namespace & localId
status: valid
status modified: 2023-05-04
accepted date: 2023-05-04
in scheme: AQD - Quality control and assurance on CDR
hidden label: GML identifier for om:OM_Observation attribute shall be unique code
editorial note: [Crucial]: -
error type: BLOCKER

Start time must be less than end time (phenomenonTime)
type: Concept
notation: E02
definition: ./om:phenomenonTime/gml:TimePeriod/gml:beginPosition shall be LESS THAN ./om:phenomenonTime/gml:TimePeriod/gml:endPosition.
status: valid
status modified: 2023-05-04
accepted date: 2023-05-04
in scheme: AQD - Quality control and assurance on CDR
hidden label: Start time must be less than end time (phenomenonTime)
editorial note: [Crucial]: -
error type: BLOCKER

The resultTime must be after the phenomenonTime
type: Concept
notation: E03
definition: ./om:resultTime/gml:TimeInstant/gml:timePosition shall be GREATER THAN ./om:phenomenonTime/gml:TimePeriod/gml:endPosition
status: valid
status modified: 2023-05-04
accepted date: 2023-05-04
in scheme: AQD - Quality control and assurance on CDR
hidden label: The resultTime must be after the phenomenonTime
editorial note: [Crucial]: -
error type: BLOCKER

Observation must link to a valid AQD_SamplingPointProcess in dataflow D (via om:procedure)
type: Concept
notation: E04
definition: All om:OM_Observation/ must provide a valid /om:procedure xlink (can not be empty) & ./om:procedure xlink:href attribute shall resolve to a traversable link process configuration in Data flow D: /aqd:AQD_SamplingPointProcess/ompr:inspireld/base:Identifier/base:localId
status: valid
status modified: 2023-05-04
accepted date: 2023-05-04
in scheme: AQD - Quality control and assurance on CDR
hidden label: Observation must link to a valid AQD_SamplingPointProcess in dataflow D (via om:procedure)
editorial note: [Crucial]: - IPR requirement (Annex II-E-7)
error type: BLOCKER

Observation must provide a link to SamplingPoint
type: Concept
notation: E05
definition: A valid delivery MUST provide an om:parameter with om:name xlink:href to http://dd.eionet.europa.eu/vocabulary/aq/processparameter/SamplingPoint
status: valid
status modified: 2023-05-04
accepted date: 2023-05-04
in scheme: AQD - Quality control and assurance on CDR
hidden label: Observation must provide a link to SamplingPoint
editorial note: [Crucial]: Yes - IPR requirement (Annex II-E-)
error type: BLOCKER

Observation must link to a valid AQD_SamplingPoint in dataflow D (via om:parameter/...)
type: Concept
notation: E06
definition: If ./om:parameter/om:NamedValue/om:name xlink:href resolves to http://dd.eionet.europa.eu/vocabulary/aq/processparameter/SamplingPoint /om:parameter/om:NamedValue/om:value xlink:href attribute shall resolve to a traversable link to a unique AQD_SamplingPoint (“namespace/localId” of the object)
status: valid
status modified: 2023-05-04
accepted date: 2023-05-04
in scheme: AQD - Quality control and assurance on CDR
hidden label: Observation must link to a valid AQD_SamplingPoint in dataflow D (via om:parameter/...)
editorial note: [Crucial]: Yes - IPR requirement (Annex II-E-7)
error type: BLOCKER

Observation should provide link to Assessment Type
type: Concept
notation: E07
definition: A valid delivery should provide an om:parameter with om:name xlink:href to http://dd.eionet.europa.eu/vocabulary/aq/processparameter/AssessmentType
status: valid
status modified: 2023-05-04
accepted date: 2023-05-04
in scheme: AQD - Quality control and assurance on CDR
hidden label: Observation should provide link to Assessment Type
editorial note: [Crucial]: Yes - IPR requirement (Annex II-E-6)
error type: ERROR

Observation must provide a correct link to AssessmentType vocabulary
type: Concept
notation: E08
definition: If ./om:parameter/om:NamedValue/om:name links to http://dd.eionet.europa.eu/vocabulary/aq/processparameter/AssessmentType /om:parameter/om:NamedValue/om:value xlink:href attribute shall resolve to valid code for http://dd.eionet.europa.eu/vocabulary/aq/assessmenttype/
status: valid
status modified: 2023-05-04
accepted date: 2023-05-04
in scheme: AQD - Quality control and assurance on CDR
hidden label: Observation must provide a correct link to AssessmentType vocabulary
editorial note: [Crucial]: -
error type: ERROR

All observation paramater should link to be registered under vocabulary
type: Concept
notation: E09
definition: OM observations shall contain several om:parameters to further define the observations. ./om:parameter/om:NamedValue/om:name xlink:href attribute shall resolve to a traversable link to http://dd.eionet.europa.eu/vocabulary/aq/processparameter/
status: valid
status modified: 2023-05-04
accepted date: 2023-05-04
in scheme: AQD - Quality control and assurance on CDR
hidden label: All observation paramater should link to be registered under vocabulary
editorial note: [Crucial]: -
error type: ERROR

Pollutant must be a registered under vocabulary
type: Concept
notation: E10
definition: ./om:parameter/om:NamedValue/om:name xlink:href attribute shall resolve to a traversable link to http://dd.eionet.europa.eu/vocabulary/aq/processparameter/
status: valid
status modified: 2023-05-04
accepted date: 2023-05-04
in scheme: AQD - Quality control and assurance on CDR
hidden label: Codelist for all pollutants requires revision: EEA codelist is required
editorial note: [Crucial]: Yes -
error type: BLOCKER

The pollutant for the observation must match the pollutant of the SamplingPoint
type: Concept
notation: E11
definition: The pollutant xlinked via /om:observedProperty must match the pollutant code declared via /aqd:AQD_SamplingPoint/ef:observingCapability/ef:ObservingCapability/ef:observedProperty (See E6 on linkages between the Observations & the SamplingPoint)
status: valid
status modified: 2023-05-04
accepted date: 2023-05-04
in scheme: AQD - Quality control and assurance on CDR
hidden label: Mismatch between pollutant reported under Obseration and pollutant declared at SamplingPoint level
editorial note: [Crucial]: Yes - IPR requirement (Annex II-E-7)
error type: BLOCKER

Observation must link to a valid AQD_Sample in dataflow D (via om:featureOfInterest)
type: Concept
notation: E12
definition: All om:OM_Observation/ must provide a valid /om:featureOfInterest xlink (can not be empty)& /om:featureOfInterest xlink:href attribute shall resolve to a traversable link to /aqd:AQD_Sample/ompr:inspireld/base:Identifier/base:localId
status: valid
status modified: 2023-05-04
accepted date: 2023-05-04
in scheme: AQD - Quality control and assurance on CDR
hidden label: Incorrect link between observation(s) and Sample(s)
editorial note: [Crucial]: - IPR requirement (Annex II-E-7)
error type: BLOCKER

reserved
type: Concept
notation: E13
definition: The temporal envelopes of ./om:phenomenonTime/gml:TimePeriod/gml:beginPosition shall reconcile with /aqd:AQD_SamplingPoint/ef:operationalActivityPeriod/ef:OperationalActivityPeriod associated with the citations via /om:parameter/om:value xlink:href attribute AND /aqd:AQD_SamplingPoint/ef:observingCapability/ef:ObservingCapability/ef:observingTime/gml:TimePeriod/ associated with /aqd:AQD_SamplingPoint/ef:observingCapability/ef:ObservingCapability/ef:procedure the citations via /om:procedure xlink:href attribute
status: reserved
status modified: 2023-05-04
accepted date: 2023-05-04
in scheme: AQD - Quality control and assurance on CDR
hidden label: reserved
editorial note: Not implemented

reserved
type: Concept
notation: E14
definition: ./om:result/swe:DataArray/swe:elementCount/swe:Count/swe:value shall resolve to the count of observations in /om:result/swe:DataArray/swe:values
status: reserved
status modified: 2023-05-04
accepted date: 2023-05-04
in scheme: AQD - Quality control and assurance on CDR
hidden label: reserved
editorial note: Not implemented

Check valid definition for startTime
type: Concept
notation: E15
definition: IF ./om:result/swe:DataArray/swe:elementType/swe:DataRecord/swe:field name="startTime" attribute THEN swe:Time definition=http://www.opengis.net/def/property/OGC/0/SamplingTime swe:uom xlink:href=http://www.opengis.net/def/uom/ISO-8601/0/Gregorian
status: valid
status modified: 2023-05-04
accepted date: 2023-05-04
in scheme: AQD - Quality control and assurance on CDR
hidden label: Codelist for startTime definition requires revision: EEA codelist is required
editorial note: [Crucial]: Yes - IPR requirement (Annex II-E-8)
error type: BLOCKER

Check valid definition for endTime
type: Concept
notation: E16
definition: IF ./om:result/swe:DataArray/swe:elementType/swe:DataRecord/swe:field name="endTime" attribute THEN swe:Time definition=http://www.opengis.net/def/property/OGC/0/SamplingTime swe:uom xlink:href=http://www.opengis.net/def/uom/ISO-8601/0/Gregorian
status: valid
status modified: 2023-05-04
accepted date: 2023-05-04
in scheme: AQD - Quality control and assurance on CDR
hidden label: Codelist for endTime definition requires revision: EEA codelist is required
editorial note: [Crucial]: Yes - IPR requirement (Annex II-E-8)
error type: BLOCKER

Check valid definition for observation validity
type: Concept
notation: E17
definition: IF ./om:result/swe:DataArray/swe:elementType/swe:DataRecord/swe:field name="validity" attribute THEN swe:Category definition is defined by http://dd.eionet.europa.eu/vocabulary/aq/observationvalidity
status: valid
status modified: 2023-05-04
accepted date: 2023-05-04
in scheme: AQD - Quality control and assurance on CDR
hidden label: Codelist for observation Validity requires revision: EEA codelist is required
editorial note: [Crucial]: Yes - IPR requirement (Annex II-E-12)
error type: BLOCKER

Check valid definition for observation verification
type: Concept
notation: E18
definition: IF ./om:result/swe:DataArray/swe:elementType/swe:DataRecord/swe:field name="verification" attribute THEN swe:Category definition is defined by http://dd.eionet.europa.eu/vocabulary/aq/observationverification
status: valid
status modified: 2023-05-04
accepted date: 2023-05-04
in scheme: AQD - Quality control and assurance on CDR
hidden label: Codelist for observation Verification requires revision: EEA codelist is required
editorial note: [Crucial]: Yes - IPR requirement (Annex II-E-13)
error type: BLOCKER

Check valid definition for the observation values (primaryObservation code & concentration)
type: Concept
notation: E19
definition: IF ./om:result/swe:DataArray/swe:elementType/swe:DataRecord/swe:field name="Value" attribute THEN swe:Quantity definition is defined by http://dd.eionet.europa.eu/vocabulary/aq/primaryObservation/[code] & the swe:uom resolves to an xlink to http://dd.eionet.europa.eu/vocabulary/uom/concentration/[code]
status: valid
status modified: 2023-05-04
accepted date: 2023-05-04
in scheme: AQD - Quality control and assurance on CDR
hidden label: Codelist for primaryObservations and/or concentration requires revision: EEA codelist is required
editorial note: [Crucial]: Yes - IPR requirement (Annex II-E-5)
error type: BLOCKER

Check primaryObservation definition for the observation values are defined as /hour /day or /var
type: Concept
notation: E19a
definition: IF ./om:result/swe:DataArray/swe:elementType/swe:DataRecord/swe:field name="Value" attribute THEN swe:Quantity definition is defined by http://dd.eionet.europa.eu/vocabulary/aq/primaryObservation/[code] & code should only be hour, day or var. Other definitions will be automatically converted to /var for aggregation purposes.
status: valid
status modified: 2023-05-04
accepted date: 2023-05-04
in scheme: AQD - Quality control and assurance on CDR
error type: WARNING

Check if data is provided using the recommended unit according to vocabulary. Important note: aggregates will not be calculated.
type: Concept
notation: E19b
definition: Check if the unit of measure reporting via (swe:uom) corresponds to the recommended unit of measure in vocabulary http://dd.eionet.europa.eu/vocabulary/uom/concentration/[code] depending on pollutant reported via /om:observedProperty . Important note: aggregates will not be calculated for those timeseries not using the recommended unit.
status: valid
status modified: 2023-05-04
accepted date: 2023-05-04
in scheme: AQD - Quality control and assurance on CDR
hidden label: Check if data is provided using the recommended unit according to vocabulary
editorial note: [Crucial]: -
error type: ERROR

Check if data is provided using the mandatory unit according to vocabulary
type: Concept
notation: E19c
definition: Check if the unit of measure reporting via (swe:uom) corresponds to the mandatory unit of measure in vocabulary http://dd.eionet.europa.eu/vocabulary/uom/concentration/[code] depending on pollutant reported via /om:observedProperty
status: valid
status modified: 2024-11-27
accepted date: 2023-05-04
in scheme: AQD - Quality control and assurance on CDR
editorial note: Turned to blocker
error type: BLOCKER

Check consistency of primaryObservatin (hour/day/var) with data already reported for same SamplingPoint
type: Concept
notation: E19d
definition: Check consistency of primaryObservatin (hour/day/var) with data already reported for same SamplingPoint
status: valid
status modified: 2024-01-30
accepted date: 2024-01-30
in scheme: AQD - Quality control and assurance on CDR
error type: BLOCKER

Check primaryObservation definition for the observation values (hour /day or /var) against Cadence/Duration reported in meta-data (D)
type: Concept
notation: E19e
definition: Check primaryObservation definition for the observation values (hour /day or /var) against Cadence/Duration reported in meta-data (D)
status: valid
status modified: 2024-01-30
accepted date: 2024-01-30
in scheme: AQD - Quality control and assurance on CDR
error type: WARNING

Cross checks with other data-flows
type: Concept
notation: E1aCrossCheck
definition: Cross checks with other data-flows
status: valid
status modified: 2023-05-04
accepted date: 2023-05-04
in scheme: AQD - Quality control and assurance on CDR
error type: WARNING

Cross checks with other data-flows
type: Concept
notation: E1bCrossCheck
definition: Cross checks with other data-flows
status: valid
status modified: 2023-05-04
accepted date: 2023-05-04
in scheme: AQD - Quality control and assurance on CDR
error type: WARNING

Check valid definition for the data coverage element (if provided)
type: Concept
notation: E20
definition: A fifth element might be included. IF ./om:result/swe:DataArray/swe:elementType/swe:DataRecord/swe:field name="DataCapture" attribute THEN swe:Category definition is defined by http://dd.eionet.europa.eu/vocabulary/aq/primaryObservation/dc & the swe:uom resolves to an xlink to http://dd.eionet.europa.eu/vocabulary/uom/statistics/percentage
status: valid
status modified: 2023-05-04
accepted date: 2023-05-04
in scheme: AQD - Quality control and assurance on CDR
hidden label: Codelist for data coverage definition requires revision: EEA codelist is required
editorial note: [Crucial]: Yes -
error type: BLOCKER

Check valid TextEncoding (decimalSeparator="." tokenSeparator=“”SEMICOLON”” blockSeparator="@@")
type: Concept
notation: E21
definition: /om:result/swe:DataArray/swe:encoding/swe:TextEncoding shall resolve to decimalSeparator="." tokenSeparator=“”SEMICOLON”” blockSeparator="@@"
status: valid
status modified: 2023-05-04
accepted date: 2023-05-04
in scheme: AQD - Quality control and assurance on CDR
hidden label: The primary data text encoding differs. Please revise if this causes a problem when processing data
editorial note: [Crucial]: - System requirement
error type: ERROR

The order of the fields within individual data blocks must correspond to the order described.
type: Concept
notation: E22
definition: The order of the fields within individual data blocks (swe:values) must correspond to the order described within the swe:DataRecord/swe:field(multiple).
status: valid
status modified: 2023-05-04
accepted date: 2023-05-04
in scheme: AQD - Quality control and assurance on CDR
hidden label: The order of the fields within individual data blocks must correspond to the order described.
editorial note: [Crucial]: Yes - System requirement (processing)
error type: BLOCKER

The count of values provided for observation should match the count declared and should not be 0.
type: Concept
notation: E23
definition: The count of elements under <swe:elementCount><swe:Count><swe:value> should match the count of data blocks under <swe:values> and must be greater than 0.
status: valid
status modified: 2023-05-04
accepted date: 2023-05-04
in scheme: AQD - Quality control and assurance on CDR
hidden label: The count of values provided for observation should match the count declared.
editorial note: [Crucial]: Yes - System requirement (processing)
error type: BLOCKER

The primaryObsevation value can not be empty (NULL)
type: Concept
notation: E23b
definition: The primaryObsevation value provided in the swe:array can not be empty (NULL). This is incorrect: 2019-01-01T00:00:00+01:00,2019-01-01T01:00:00+01:00,1,-1,@@
status: valid
status modified: 2023-05-04
accepted date: 2023-05-04
in scheme: AQD - Quality control and assurance on CDR
error type: BLOCKER

Difference between endTime & startTime must correspond to the definition under <swe:field name="Value"><swe:Quantity definition=>.
type: Concept
notation: E24
definition: Difference between endTime & startTime must correspond to the definition under <swe:field name="Value"><swe:Quantity definition=> .Difference between endTime & startTime must correspond to the definition: http://dd.eionet.europa.eu/vocabulary/aq/primaryObservation/hour must be 1 h or http://dd.eionet.europa.eu/vocabulary/aq/primaryObservation/day must be 24 hoursor http://dd.eionet.europa.eu/vocabulary/aq/primaryObservation/year must be 8760 hours or 8784 http://dd.eionet.europa.eu/vocabulary/aq/primaryObservation/var can be anything
status: valid
status modified: 2023-05-04
accepted date: 2023-05-04
in scheme: AQD - Quality control and assurance on CDR
hidden label: Difference between endTime & startTime must correspond to the definition under <swe:field name="Value"><swe:Quantity definition=>.
editorial note: [Crucial]: Yes - System requirement (processing)
error type: BLOCKER

All reported dates within the data array must be fully ISO
type: Concept
notation: E24b
definition: All reported dates within the data array must be fully ISO
status: valid
status modified: 2023-05-04
accepted date: 2023-05-04
in scheme: AQD - Quality control and assurance on CDR
error type: BLOCKER

The temporal envelopes of the swe:values (reported via starTime and EndTime) shall reconcile with ./om:phenomenonTime/gml:TimePeriod/gml:beginPosition
type: Concept
notation: E25
definition: The temporal envelopes of the swe:values (reported via starTime and EndTime) shall reconcile with ./om:phenomenonTime/gml:TimePeriod/gml:beginPosition
status: valid
status modified: 2023-05-04
accepted date: 2023-05-04
in scheme: AQD - Quality control and assurance on CDR
hidden label: The temporal envelopes of the swe:values (reported via starTime and EndTime) shall reconcile with ./om:phenomenonTime/gml:TimePeriod/gml:beginPosition
editorial note: [Crucial]: Yes -
error type: BLOCKER

The date-time of the primary data must be within the Reporting Year.
type: Concept
notation: E25b
definition: The /om:phenomenonTime/gml:TimePeriod/gml:beginPosition & gml:endPosition must correspond to the Reporting Year (For hourly and daily data, data must be within +/- 1 day. For var data, date-time must be within +/- 1 month)
status: valid
status modified: 2023-05-04
accepted date: 2023-05-04
in scheme: AQD - Quality control and assurance on CDR
hidden label: The date-time of the primary data must be within the Reporting Year
error type: BLOCKER

The combination of SamplingPoint, SamplingPointProcess, Sample and Pollutant must be valid compared to latest Assessment Methods (D) reported
type: Concept
notation: E26
definition: Check valid “constellation”: The combination of SamplingPoint, SamplingPointProcess, Sample and Pollutant must be valid compared to latest Assessment Methods (D) reported /om:parameter/om:NamedValue/om:value xlink:href attribute when /om:parameter/om:NamedValue/om:name xlink:href resolves to http://dd.eionet.europa.eu/vocabulary/aq/processparameter/SamplingPoint + /om:procedure xlink:href attribute + /om:featureOfInterest xlink:href attribute + om:observedProperty xlink:href attribute must be found in latest metadata (D) as /aqd:AQD_SamplingPoint/ef:inspireId/base:localId (note xlink above include “namespace”) + /aqd:AQD_SamplingPoint/ef:observingCapability/ef:ObservingCapability/ef:procedure + /aqd:AQD_SamplingPoint/ef:observingCapability/ef:ObservingCapability/ef:featureOfInterest + /aqd:AQD_SamplingPoint/ef:observingCapability/ef:ObservingCapability/ef:observedProperty
status: valid
status modified: 2023-05-04
accepted date: 2023-05-04
in scheme: AQD - Quality control and assurance on CDR
hidden label: Incorrect link between observation(s) and SamplingPoint/SamplingPointProcess/Sample/Pollutant
editorial note: [Crucial]: Yes - System requirement
error type: BLOCKER

The Assessment Methods must be operational for the reported primary data
type: Concept
notation: E26b
definition: The primary data reported within the XML file must correspond to a period when the assessment method is fully operational.
status: valid
status modified: 2023-05-04
accepted date: 2023-05-04
in scheme: AQD - Quality control and assurance on CDR
error type: WARNING

Check that all values (between @@) include as many fields as declared under swe:DataRecord
type: Concept
notation: E27
definition: Check that all values (between @@) include as many fields as declared under swe:DataRecord
status: valid
status modified: 2023-05-04
accepted date: 2023-05-04
in scheme: AQD - Quality control and assurance on CDR
hidden label: Incorrect number of values within data blocks (or incorrect format/codelist)
editorial note: [Crucial]: Yes - System requirement (processing)
error type: BLOCKER

The data array should not end with "@@". Please note that @@ is a block separator.
type: Concept
notation: E28
definition: The data array should not end with "@@". Please note that @@ is a block separator.
status: valid
status modified: 2023-05-04
accepted date: 2023-05-04
in scheme: AQD - Quality control and assurance on CDR
hidden label: Data array are not expected to end with @@""
hidden label: Data array are not expected to end with "@@"
editorial note: [Crucial]: Yes - System requirement (processing)
error type: WARNING

Check for unexpected spaces around all values (between comma separator) under swe:values
type: Concept
notation: E29
definition: Check for unexpected spaces around all values (between comma separator) under swe:values
status: valid
status modified: 2023-05-04
accepted date: 2023-05-04
in scheme: AQD - Quality control and assurance on CDR
hidden label: Unexpected spaces around data values are found. Please revise
editorial note: [Crucial]: Yes - System requirement (processing)
error type: BLOCKER

Check for possible outliers reported. List of valid values found outside the range according to http://dd.eionet.europa.eu/vocabulary/aq/primaryObservationRange/
type: Concept
notation: E30
definition: Check for possible outliers reported. List of valid values found outside the range according to http://dd.eionet.europa.eu/vocabulary/aq/primaryObservationRange/
status: valid
status modified: 2023-05-04
accepted date: 2023-05-04
in scheme: AQD - Quality control and assurance on CDR
hidden label: Please revise possible outliers on your primary validated data.
editorial note: [Crucial]: Yes - System requirement (processing) - ErrorType downgraded to Warning on 25.07.2017
error type: WARNING

Check for possible outliers reported taking into account both country specific and general ranges.
type: Concept
notation: E30a
definition: Check for possible outliers reported. List of valid values found outside the range according to http://dd.eionet.europa.eu/vocabulary/aq/primaryObservationRange/ and http://dd.eionet.europa.eu/vocabulary/aq/primaryObservationRangeCountry/
status: valid
status modified: 2023-05-04
accepted date: 2023-05-04
in scheme: AQD - Quality control and assurance on CDR
error type: WARNING

Check for possible outliers reported taking into account country specific ranges.
type: Concept
notation: E30b
definition: Check for possible outliers reported taking into account country specific ranges. List of valid values found outside the range according to http://dd.eionet.europa.eu/vocabulary/aq/primaryObservationRangeCountry/
status: valid
status modified: 2023-05-04
accepted date: 2023-05-04
in scheme: AQD - Quality control and assurance on CDR
error type: WARNING

Check for date overlaps between consecutive data blocks within swe:values
type: Concept
notation: E31
definition: Check for date overlaps between consecutive data blocks within swe:values
status: valid
status modified: 2023-05-04
accepted date: 2023-05-04
in scheme: AQD - Quality control and assurance on CDR
hidden label: Unexpected DATE overlaps are found in primary data. Please revise as this prevents correct harvesting.
editorial note: [Crucial]: - Information to data provider - Label corrected on 26.07.2017
error type: BLOCKER

Check that all data submitted via CDR has been fully verified (flag 1)
type: Concept
notation: E32
definition: Check that all data submitted via CDR has been fully verified. The verification flag must be 1 for all data.
status: valid
status modified: 2023-05-04
accepted date: 2023-05-04
in scheme: AQD - Quality control and assurance on CDR
hidden label: Please revise verification status of data submitted as data is not completely fully verified.
editorial note: [Crucial]: - Information to data provider
error type: ERROR

The average of valid data should not be 0 or negative
type: Concept
notation: E33
definition: The average of valid data within individual swe:array MUST be above 0 (Negative or 0 averages are not expected).
status: valid
status modified: 2023-05-04
accepted date: 2023-05-04
in scheme: AQD - Quality control and assurance on CDR
error type: ERROR

The average of valid data is expected to be within 70 - 130% when comparing with the previous year
type: Concept
notation: E34
definition: The average of valid data within each data:array is compared with the annual mean from previous year. In order to catch possible outliers, the data is expected to be within 70 - 130% when comparing with the previous year.
status: valid
status modified: 2023-05-04
accepted date: 2023-05-04
in scheme: AQD - Quality control and assurance on CDR
error type: WARNING

The average of valid data per timeseries reported.
type: Concept
notation: E34b
definition: The average of valid data per timeseries reported.
status: valid
status modified: 2023-05-04
accepted date: 2023-05-04
in scheme: AQD - Quality control and assurance on CDR
error type: INFO

Check if data's resultTime is newer than previously reported data for same SamplingPoint/Year
type: Concept
notation: E35
definition: Check if the om:resultTime within the XML is newer than previously reported data for same SamplingPoint and reporting period (om:phenomenonPeriod)
status: valid
status modified: 2023-05-04
accepted date: 2023-05-04
in scheme: AQD - Quality control and assurance on CDR
error type: BLOCKER

Check that reported data is evenly distributed over the year in order to avoid skewing of results.Evaluate the spread of data.
type: Concept
notation: E36
definition: Check that reported data is evenly distributed over the year in order to avoid skewing of results.
status: valid
status modified: 2024-02-15
accepted date: 2024-02-15
in scheme: AQD - Quality control and assurance on CDR
error type: ERROR

Checks if this delivery is new or an update (on same reporting year)
type: Concept
notation: Eb0
definition: Check if delivery if this is a new delivery or updated delivery (via reporting year)
status: valid
status modified: 2023-05-04
accepted date: 2023-05-04
in scheme: AQD - Quality control and assurance on CDR
hidden label: Checks if this delivery is new or an update (on same reporting year)
editorial note: [Crucial]: Yes -
error type: WARNING

Total number Observations within this XML Document
type: Concept
notation: Eb01
definition: Compile & feedback upon the total number of observations included in the delivery
status: valid
status modified: 2023-05-04
accepted date: 2023-05-04
in scheme: AQD - Quality control and assurance on CDR
hidden label: Total number Observations within this XML Document
editorial note: [Crucial]: Yes -
error type: BLOCKER

Start time must be less than end time (phenomenonTime)
type: Concept
notation: Eb02
definition: ./om:phenomenonTime/gml:TimePeriod/gml:beginPosition shall be LESS THAN ./om:phenomenonTime/gml:TimePeriod/gml:endPosition.
status: valid
status modified: 2023-05-04
accepted date: 2023-05-04
in scheme: AQD - Quality control and assurance on CDR
hidden label: Start time must be less than end time (phenomenonTime)
editorial note: [Crucial]: Yes - System requirement (processing)
error type: BLOCKER

The resultTime must be after the phenomenonTime
type: Concept
notation: Eb03
definition: ./om:resultTime/gml:TimeInstant/gml:timePosition shall be GREATER THAN ./om:phenomenonTime/gml:TimePeriod/gml:endPosition
status: valid
status modified: 2023-05-04
accepted date: 2023-05-04
in scheme: AQD - Quality control and assurance on CDR
hidden label: The resultTime must be after the phenomenonTime
editorial note: [Crucial]: Yes - System requirement (processing)
error type: BLOCKER

Observation must link to a valid AQD_ModelProcess in dataflow D (via om:procedure)
type: Concept
notation: Eb04
definition: All om:OM_Observation/ must provide a valid /om:procedure xlink (can not be empty) & ./om:procedure xlink:href attribute shall resolve to a traversable link process configuration in Data flow D1b: /aqd:AQD_ModelProcess/ompr:inspireld/base:Identifier/base:localId
status: valid
status modified: 2023-05-04
accepted date: 2023-05-04
in scheme: AQD - Quality control and assurance on CDR
hidden label: Observation must link to a valid AQD_ModelProcess in dataflow D (via om:procedure)
editorial note: [Crucial]: Yes - IPR requirement (Annex II-E-7)
error type: BLOCKER

Observation must provide a link to Model or Objective
type: Concept
notation: Eb05
definition: A valid delivery MUST provide an om:parameter/om:NamedValue/om:name xlink:href to either http://dd.eionet.europa.eu/vocabulary/aq/processparameter/model or http://dd.eionet.europa.eu/vocabulary/aq/processparameter/objective
status: valid
status modified: 2023-05-04
accepted date: 2023-05-04
in scheme: AQD - Quality control and assurance on CDR
hidden label: Observation must provide a link to Model or Objective
editorial note: [Crucial]: Yes - IPR requirement (Annex II-E-)
error type: BLOCKER

Observation must link to a valid AQD_Model in dataflow D (via om:parameter/...)
type: Concept
notation: Eb06
definition: If ./om:parameter/om:NamedValue/om:name xlink:href resolves to http://dd.eionet.europa.eu/vocabulary/aq/processparameter/model or .../objective /om:parameter/om:NamedValue/om:value xlink:href attribute shall resolve to a traversable link to a unique AQD_Model (“namespace/localId” of the object)
status: valid
status modified: 2023-05-04
accepted date: 2023-05-04
in scheme: AQD - Quality control and assurance on CDR
hidden label: Observation must link to a valid AQD_Model in dataflow D (via om:parameter/...)
editorial note: [Crucial]: Yes - IPR requirement (Annex II-E-7)
error type: BLOCKER

Observation should provide link to Assessment Type
type: Concept
notation: Eb07
definition: A valid delivery should provide an om:parameter with om:name xlink:href to http://dd.eionet.europa.eu/vocabulary/aq/processparameter/AssessmentType
status: valid
status modified: 2023-05-04
accepted date: 2023-05-04
in scheme: AQD - Quality control and assurance on CDR
hidden label: Observation should provide link to Assessment Type
editorial note: [Crucial]: Yes - IPR requirement (Annex II-E-6)
error type: ERROR

Assessment type declared in Observation for a given Model/Objective Estimation should correspond to assessment type declared for that Model/Objective Estimation in Assessment Regimes (data set C).
type: Concept
notation: Eb07a
definition: Value of AssessmentType parameter in Observation should correspond with declaration given in aqd:assessmentType as xlink:href to http://dd.eionet.europa.eu/vocabulary/aq/assessmenttype/ in Assessment Regimes.
status: valid
status modified: 2023-05-04
accepted date: 2023-05-04
in scheme: AQD - Quality control and assurance on CDR
error type: WARNING

Observation must provide a correct link to AssessmentType vocabulary
type: Concept
notation: Eb08
definition: If ./om:parameter/om:NamedValue/om:name links to http://dd.eionet.europa.eu/vocabulary/aq/processparameter/AssessmentType /om:parameter/om:NamedValue/om:value xlink:href attribute shall resolve to valid code for http://dd.eionet.europa.eu/vocabulary/aq/assessmenttype/
status: valid
status modified: 2023-05-04
accepted date: 2023-05-04
in scheme: AQD - Quality control and assurance on CDR
hidden label: Observation must provide a correct link to AssessmentType vocabulary
editorial note: [Crucial]: -
error type: ERROR

All the results paramater should link to be registered under vocabulary
type: Concept
notation: Eb09
definition: OM observations shall contain several om:parameters to further define the model/objective estimation results ./om:parameter/om:NamedValue/om:name xlink:href attribute shall resolve to a traversable link to http://dd.eionet.europa.eu/vocabulary/aq/processparameter/
status: valid
status modified: 2023-05-04
accepted date: 2023-05-04
in scheme: AQD - Quality control and assurance on CDR
hidden label: All the results paramater should link to be registered under vocabulary
editorial note: [Crucial]: -
error type: ERROR

Pollutant must be a registered under vocabulary
type: Concept
notation: Eb10
definition: . /om:observedProperty xlink:href attribute shall resolve to a traversable link to http://dd.eionet.europa.eu/vocabulary/aq/pollutant/
status: valid
status modified: 2023-05-04
accepted date: 2023-05-04
in scheme: AQD - Quality control and assurance on CDR
hidden label: Pollutant must be a registered under vocabulary
editorial note: [Crucial]: Yes -
error type: BLOCKER

The pollutant for the observation must match the pollutant of the Model
type: Concept
notation: Eb11
definition: The pollutant xlinked via /om:observedProperty must match the pollutant code declared via /aqd:AQD_Model/ef:observingCapability/ef:ObservingCapability/ef:observedProperty (See Eb6 on linkages between the Observations & the SamplingPoint)
status: valid
status modified: 2023-05-04
accepted date: 2023-05-04
in scheme: AQD - Quality control and assurance on CDR
hidden label: The pollutant for the observation must match the pollutant of the Model
editorial note: [Crucial]: Yes - IPR requirement (Annex II-E-7)
error type: BLOCKER

Observation must link to a valid AQD_modelArea in dataflow D1b (via om:featureOfInterest)
type: Concept
notation: Eb12
definition: All om:OM_Observation/ must provide a valid /om:featureOfInterest xlink (can not be empty)& /om:featureOfInterest xlink:href attribute shall resolve to a traversable link to /aqd:AQD_modelArea/ompr:inspireld/base:Identifier/base:localId
status: valid
status modified: 2023-05-04
accepted date: 2023-05-04
in scheme: AQD - Quality control and assurance on CDR
hidden label: Observation must link to a valid AQD_modelArea in dataflow D1b (via om:featureOfInterest)
editorial note: [Crucial]: Yes - IPR requirement (Annex II-E-7)
error type: BLOCKER

Results must provide result encoding (Inline or using external file)
type: Concept
notation: Eb13
definition: A valid delivery MUST provide an om:parameter/om:NamedValue/om:name xlink:href to http://dd.eionet.europa.eu/vocabulary/aq/processparameter/resultencoding & om:parameter/om:NamedValue/om:value xlink:href attribute shall resolve to valid code for http://dd.eionet.europa.eu/vocabulary/aq/ resultencoding/
status: valid
status modified: 2023-05-04
accepted date: 2023-05-04
in scheme: AQD - Quality control and assurance on CDR
hidden label: Results must provide result encoding (Inline or using external file)
editorial note: [Crucial]: Yes - System requirement (processing)
error type: BLOCKER

Results must provide result format (swe array, shape file, geo tiff or Ascii grid)
type: Concept
notation: Eb14
definition: A valid delivery MUST provide an om:parameter/om:NamedValue/om:name xlink:href to http://dd.eionet.europa.eu/vocabulary/aq/processparameter/resultformat & om:parameter/om:NamedValue/om:value xlink:href attribute attribute shall resolve to valid code for http://dd.eionet.europa.eu/vocabulary/aq/resultformat/
status: valid
status modified: 2023-05-04
accepted date: 2023-05-04
in scheme: AQD - Quality control and assurance on CDR
hidden label: Results must provide result format (swe array, shape file, geo tiff or Ascii grid)
editorial note: [Crucial]: YES - System requirement (processing)
error type: BLOCKER

Results must be provided using right combination between encoding & format and using the correct elements with XML
type: Concept
notation: Eb14b
definition: IF resultencoding = inline, resultformat can only be http://dd.eionet.europa.eu/vocabulary/aq/resultformat/swe-array & results reported under swe:array IF resultencoding = external resultformat can only be http://dd.eionet.europa.eu/vocabulary/aq/resultformat/ascii-grid , http://dd.eionet.europa.eu/vocabulary/aq/resultformat/esri-shp or http://dd.eionet.europa.eu/vocabulary/aq/resultformat/geotiff and results reported gml:File
status: valid
status modified: 2023-05-04
accepted date: 2023-05-04
in scheme: AQD - Quality control and assurance on CDR
hidden label: reserved
editorial note: [Crucial]: YES - System requirement (processing)
error type: BLOCKER

Check valid definition for startTime
type: Concept
notation: Eb15
definition: IF resultformat is http://dd.eionet.europa.eu/vocabulary/aq/resultformat/swe-array (Eb14) then ./om:result/swe:DataArray/swe:elementType/swe:DataRecord/swe:field name="startTime" attribute THEN swe:Time definition=http://www.opengis.net/def/property/OGC/0/SamplingTime swe:uom xlink:href=http://www.opengis.net/def/uom/ISO-8601/0/Gregorian
status: valid
status modified: 2023-05-04
accepted date: 2023-05-04
in scheme: AQD - Quality control and assurance on CDR
hidden label: Check valid definition for startTime
editorial note: [Crucial]: Yes - IPR requirement (Annex II-E-8)
error type: BLOCKER

Check valid definition for endTime
type: Concept
notation: Eb16
definition: IF resultformat is http://dd.eionet.europa.eu/vocabulary/aq/resultformat/swe-array (Eb14) then ./om:result/swe:DataArray/swe:elementType/swe:DataRecord/swe:field name="endTime" attribute THEN swe:Time definition=http://www.opengis.net/def/property/OGC/0/SamplingTime swe:uom xlink:href=http://www.opengis.net/def/uom/ISO-8601/0/Gregorian
status: valid
status modified: 2023-05-04
accepted date: 2023-05-04
in scheme: AQD - Quality control and assurance on CDR
hidden label: Check valid definition for endTime
editorial note: [Crucial]: Yes - IPR requirement (Annex II-E-8)
error type: BLOCKER

Check valid definition for observation validity
type: Concept
notation: Eb17
definition: IF resultformat is http://dd.eionet.europa.eu/vocabulary/aq/resultformat/swe-array (Eb14) then ./om:result/swe:DataArray/swe:elementType/swe:DataRecord/swe:field name="validity" attribute THEN swe:Category definition is defined by http://dd.eionet.europa.eu/vocabulary/aq/observationvalidity
status: valid
status modified: 2023-05-04
accepted date: 2023-05-04
in scheme: AQD - Quality control and assurance on CDR
hidden label: Check valid definition for observation validity
editorial note: [Crucial]: Yes - IPR requirement (Annex II-E-12)
error type: BLOCKER

Check valid definition for observation verification
type: Concept
notation: Eb18
definition: IF resultformat is http://dd.eionet.europa.eu/vocabulary/aq/resultformat/swe-array (Eb14) then ./om:result/swe:DataArray/swe:elementType/swe:DataRecord/swe:field name="verification" attribute THEN swe:Category definition is defined by http://dd.eionet.europa.eu/vocabulary/aq/observationverification
status: valid
status modified: 2023-05-04
accepted date: 2023-05-04
in scheme: AQD - Quality control and assurance on CDR
hidden label: Check valid definition for observation verification
editorial note: [Crucial]: Yes - IPR requirement (Annex II-E-13)
error type: BLOCKER

Check valid definition for the observation values (primaryObservation/aggregationProcess code & concentration)
type: Concept
notation: Eb19
definition: IF resultformat is http://dd.eionet.europa.eu/vocabulary/aq/resultformat/swe-array (Eb14) then ./om:result/swe:DataArray/swe:elementType/swe:DataRecord/swe:field name="Value" attribute THEN swe:Quantity definition is defined by http://dd.eionet.europa.eu/vocabulary/aq/primaryObservation/[code] or http://dd.eionet.europa.eu/vocabulary/aq/aggregationprocess/[code] & the swe:uom resolves to an xlink to http://dd.eionet.europa.eu/vocabulary/uom/concentration/[code]
status: valid
status modified: 2023-05-04
accepted date: 2023-05-04
in scheme: AQD - Quality control and assurance on CDR
hidden label: Check valid definition for the observation values (primaryObservation code & concentration)
editorial note: [Crucial]: Yes - IPR requirement (Annex II-E-5)
error type: BLOCKER

Check if data is provided using the recommended unit according to vocabulary
type: Concept
notation: Eb19b
definition: Check if the unit of measure reporting via (swe:uom) corresponds to the recommended unit of measure in vocabulary http://dd.eionet.europa.eu/vocabulary/uom/concentration/[code] depending on pollutant reported via /om:observedProperty
status: valid
status modified: 2023-05-04
accepted date: 2023-05-04
in scheme: AQD - Quality control and assurance on CDR
hidden label: Check if data is provided using the recommended unit according to vocabulary
editorial note: [Crucial]: Yes -
error type: WARNING

Check valid definition for the data coverage element (if provided)
type: Concept
notation: Eb20
definition: IF resultformat is http://dd.eionet.europa.eu/vocabulary/aq/resultformat/swe-array (Eb14) then a fifth element might be included. IF ./om:result/swe:DataArray/swe:elementType/swe:DataRecord/swe:field name="DataCapture" attribute THEN swe:Category definition is defined by http://dd.eionet.europa.eu/vocabulary/aq/primaryObservation/dc & the swe:uom resolves to an xlink to http://dd.eionet.europa.eu/vocabulary/uom/statistics/percentage
status: valid
status modified: 2023-05-04
accepted date: 2023-05-04
in scheme: AQD - Quality control and assurance on CDR
hidden label: Check valid definition for the data coverage element (if provided)
editorial note: [Crucial]: Yes -
error type: BLOCKER

Check valid TextEncoding (decimalSeparator="." tokenSeparator=“”SEMICOLON”” blockSeparator="@@")
type: Concept
notation: Eb21
definition: IF resultformat is http://dd.eionet.europa.eu/vocabulary/aq/resultformat/swe-array (Eb14) then /om:result/swe:DataArray/swe:encoding/swe:TextEncoding shall resolve to decimalSeparator="." tokenSeparator=“”SEMICOLON”” blockSeparator="@@"
status: valid
status modified: 2023-05-04
accepted date: 2023-05-04
in scheme: AQD - Quality control and assurance on CDR
hidden label: Check valid TextEncoding of data array
editorial note: [Crucial]: - System requirement
error type: ERROR

The order of the fields within individual data blocks must correspond to the order described.
type: Concept
notation: Eb22
definition: IF resultformat is http://dd.eionet.europa.eu/vocabulary/aq/resultformat/swe-array (Eb14) then the order of the fields within individual data blocks (swe:values) must correspond to the order described within the swe:DataRecord/swe:field(multiple).
status: valid
status modified: 2023-05-04
accepted date: 2023-05-04
in scheme: AQD - Quality control and assurance on CDR
hidden label: The order of the fields within individual data blocks must correspond to the order described.
editorial note: [Crucial]: Yes - System requirement (processing)
error type: BLOCKER

The count of values provided for observation should match the count declared.
type: Concept
notation: Eb23
definition: IF resultformat is http://dd.eionet.europa.eu/vocabulary/aq/resultformat/swe-array (Eb14) then the count of elements under <swe:elementCount><swe:Count><swe:value> should match the count of data blocks under <swe:values>.
status: valid
status modified: 2023-05-04
accepted date: 2023-05-04
in scheme: AQD - Quality control and assurance on CDR
hidden label: The count of values provided for observation should match the count declared.
editorial note: [Crucial]: Yes - System requirement (processing)
error type: BLOCKER

Difference between endTime & startTime must correspond to the definition under <swe:field name="Value"><swe:Quantity definition=>
type: Concept
notation: Eb24
definition: IF resultformat is http://dd.eionet.europa.eu/vocabulary/aq/resultformat/swe-array (Eb14) then difference between endTime & startTime must correspond to the definition under <swe:field name="Value"><swe:Quantity definition=> .Difference between endTime & startTime must correspond to the definition: http://dd.eionet.europa.eu/vocabulary/aq/primaryObservation/hour must be 1 h http://dd.eionet.europa.eu/vocabulary/aq/primaryObservation/day must be 24 hours http://dd.eionet.europa.eu/vocabulary/aq/primaryObservation/year must be 8760 hours or 8784 http://dd.eionet.europa.eu/vocabulary/aq/primaryObservation/var can be anything
status: valid
status modified: 2023-05-04
accepted date: 2023-05-04
in scheme: AQD - Quality control and assurance on CDR
hidden label: Difference between endTime & startTime must correspond to the definition under <swe:field name="Value"><swe:Quantity definition=>
editorial note: [Crucial]: Yes - System requirement (processing)
error type: BLOCKER

The temporal envelopes of the swe:values (reported via starTime and EndTime) shall reconcile with ./om:phenomenonTime/gml:TimePeriod/gml:beginPosition
type: Concept
notation: Eb25
definition: IF resultformat is http://dd.eionet.europa.eu/vocabulary/aq/resultformat/swe-array (Eb14) then the temporal envelopes of the swe:values (reported via starTime and EndTime) shall reconcile with ./om:phenomenonTime/gml:TimePeriod/gml:beginPosition
status: valid
status modified: 2023-05-04
accepted date: 2023-05-04
in scheme: AQD - Quality control and assurance on CDR
hidden label: The temporal envelopes of the swe:values (reported via starTime and EndTime) shall reconcile with ./om:phenomenonTime/gml:TimePeriod/gml:beginPosition
editorial note: [Crucial]: Yes -
error type: BLOCKER

The combination of Model, ModelProcess, ModelArea (optional) and Pollutant must be valid compared to Assessment Methods (D1b), yearly specific, reported
type: Concept
notation: Eb26
definition: Check valid “constellation”: The combination of Model – ModelProcess - (ModelArea) and Pollutant must be valid compared to latest Assessment Methods (D1b) reported /om:parameter/om:NamedValue/om:value xlink:href attribute when /om:parameter/om:NamedValue/om:name xlink:href resolves to http://dd.eionet.europa.eu/vocabulary/aq/processparameter/model or /objective + /om:procedure xlink:href attribute + /om:featureOfInterest xlink:href attribute (optional) + om:observedProperty xlink:href attribute must be found in metadata (D1b) year specific as /aqd:AQD_Model/ef:inspireId/base:localId (note xlink above include “namespace”) + /aqd:AQD_Model/ef:observingCapability/ef:ObservingCapability/ef:procedure + /aqd:AQD_Model/ef:observingCapability/ef:ObservingCapability/ef:featureOfInterest (optional) + /aqd:AQD_Model/ef:observingCapability/ef:ObservingCapability/ef:observedProperty
status: valid
status modified: 2023-05-04
accepted date: 2023-05-04
in scheme: AQD - Quality control and assurance on CDR
hidden label: The combination of Model, ModelProcess, ModelArea (optional) and Pollutant must be valid compared to Assessment Methods (D1b), yearly specific, reported
editorial note: [Crucial]: Yes - System requirement
error type: BLOCKER

Check that all values (between @@) include as many fields as declared under swe:DataRecord
type: Concept
notation: Eb27
definition: IF resultformat is http://dd.eionet.europa.eu/vocabulary/aq/resultformat/swe-array (Eb14) then check that all values (between @@) include as many fields as declared under swe:DataRecord
status: valid
status modified: 2023-05-04
accepted date: 2023-05-04
in scheme: AQD - Quality control and assurance on CDR
hidden label: Check that all values (between @@) include as many fields as declared under swe:DataRecord
editorial note: [Crucial]: Yes - System requirement (processing)
error type: BLOCKER

The data array should not end with "@@". Please note that @@ is a block separator.
type: Concept
notation: Eb28
definition: IF resultformat is http://dd.eionet.europa.eu/vocabulary/aq/resultformat/swe-array (Eb14) then the data array should not end with "@@". Please note that @@ is a block separator.
status: valid
status modified: 2023-05-04
accepted date: 2023-05-04
in scheme: AQD - Quality control and assurance on CDR
hidden label: The data array should not end with "@@". Please note that @@ is a block separator.
editorial note: [Crucial]: Yes - System requirement (processing)
error type: BLOCKER

Check for unexpected spaces around all values (between comma separator) under swe:values
type: Concept
notation: Eb29
definition: IF resultformat is http://dd.eionet.europa.eu/vocabulary/aq/resultformat/swe-array (Eb14) then check for unexpected spaces around all values (between comma separator) under swe:values
status: valid
status modified: 2023-05-04
accepted date: 2023-05-04
in scheme: AQD - Quality control and assurance on CDR
hidden label: Check for unexpected spaces around all values (between comma separator) under swe:values
editorial note: [Crucial]: Yes - System requirement (processing)
error type: BLOCKER

Empty
type: Concept
notation: Eb30
definition: Empty
status: reserved
status modified: 2023-05-04
accepted date: 2023-05-04
in scheme: AQD - Quality control and assurance on CDR
hidden label: Empty

Check for date overlaps between consecutive data blocks within swe:values
type: Concept
notation: Eb31
definition: IF resultformat is http://dd.eionet.europa.eu/vocabulary/aq/resultformat/swe-array (Eb14) then check for date overlaps between consecutive data blocks within swe:values
status: valid
status modified: 2023-05-04
accepted date: 2023-05-04
in scheme: AQD - Quality control and assurance on CDR
hidden label: Check for date overlaps between consecutive data blocks within swe:values
editorial note: [Crucial]: Yes - Information to data provider
error type: BLOCKER

Check that all data submitted via CDR has been fully verified (flag 1)
type: Concept
notation: Eb32
definition: IF resultformat is http://dd.eionet.europa.eu/vocabulary/aq/resultformat/swe-array (Eb14) then check that all data submitted via CDR has been fully verified. The verification flag must be 1 for all data.
status: valid
status modified: 2023-05-04
accepted date: 2023-05-04
in scheme: AQD - Quality control and assurance on CDR
hidden label: Check that all data submitted via CDR has been fully verified (flag 1)
editorial note: [Crucial]: Yes - Information to data provider
error type: ERROR

Empty
type: Concept
notation: Eb33
definition: Empty
status: reserved
status modified: 2023-05-04
accepted date: 2023-05-04
in scheme: AQD - Quality control and assurance on CDR
hidden label: Empty

Empty
type: Concept
notation: Eb34
definition: Empty
status: reserved
status modified: 2023-05-04
accepted date: 2023-05-04
in scheme: AQD - Quality control and assurance on CDR
hidden label: Empty

rangeParameters must be provided when reporting ascii grids - shape files or GeoTiff
type: Concept
notation: Eb35
definition: IF resultformat is ascii-grid esri-shp or geotiff (Eb14) then ./om:result/gml:File/gml:rangeParameters MUST be populated
status: valid
status modified: 2023-05-04
accepted date: 2023-05-04
in scheme: AQD - Quality control and assurance on CDR
hidden label: rangeParameters must be provided when reporting ascii grids - shape files or GeoTiff
editorial note: [Crucial]: Yes -
error type: BLOCKER

Aggregation process of the results must be provided and must match EEA vocabulary
type: Concept
notation: Eb36
definition: IF resultformat is ascii-grid esri-shp or geotiff (Eb14) then ./om:result/gml:File/gml:rangeParameters/swe:Quantity@Definition MUST match a code under http://dd.eionet.europa.eu/vocabulary/aq/aggregationprocess/
status: valid
status modified: 2023-05-04
accepted date: 2023-05-04
in scheme: AQD - Quality control and assurance on CDR
hidden label: Aggregation process of the results must be provided and must match EEA vocabulary
editorial note: [Crucial]: Yes -
error type: BLOCKER

A user-friendly label should be provided
type: Concept
notation: Eb37
definition: IF resultformat is ascii-grid esri-shp or geotiff (Eb14) then ./om:result/gml:File/gml:rangeParameters/swe:label should be populated
status: valid
status modified: 2023-05-04
accepted date: 2023-05-04
in scheme: AQD - Quality control and assurance on CDR
hidden label: A user-friendly label should be provided
editorial note: [Crucial]: Yes -
error type: WARNING

A clear description of the results provided MUST be provided
type: Concept
notation: Eb38
definition: IF resultformat is ascii-grid esri-shp or geotiff (Eb14) then ./om:result/gml:File/gml:rangeParameters/swe:description MUST be provided
status: valid
status modified: 2023-05-04
accepted date: 2023-05-04
in scheme: AQD - Quality control and assurance on CDR
hidden label: A clear description of the results provided MUST be provided
editorial note: [Crucial]: Yes -
error type: BLOCKER

Unit of the results must be provided and must match EEA vocabulary
type: Concept
notation: Eb39
definition: IF resultformat is ascii-grid esri-shp or geotiff (Eb14) then ./om:result/gml:File/gml:rangeParameters/swe:Quantity/swe:uom xlink MUST match a code under http://dd.eionet.europa.eu/vocabulary/uom/concentration/ or http://dd.eionet.europa.eu/vocabulary/uom/statistics/
status: valid
status modified: 2023-05-04
accepted date: 2023-05-04
in scheme: AQD - Quality control and assurance on CDR
hidden label: Unit of the results must be provided and must match EEA vocabulary
editorial note: [Crucial]: Yes -
error type: BLOCKER

Check if data is provided using the recommended unit according to vocabulary
type: Concept
notation: Eb40
definition: Check if the unit of measure reporting via (/om:result/gml:File/gml:rangeParameters/swe:uom) corresponds to the recommended unit of measure in vocabulary http://dd.eionet.europa.eu/vocabulary/uom/concentration/[code] depending on pollutant reported via /om:observedProperty
status: valid
status modified: 2023-05-04
accepted date: 2023-05-04
in scheme: AQD - Quality control and assurance on CDR
hidden label: Check if data is provided using the recommended unit according to vocabulary
editorial note: [Crucial]: Yes -
error type: WARNING

When reporting results using ASCII grid shape file or GeoTiff a reference must be provided to the result file
type: Concept
notation: Eb41
definition: IF resultformat is ascii-grid esri-shp or geotiff (Eb14) then ./om:result/gml:File/gml:fileReference MUST be provided
status: valid
status modified: 2023-05-04
accepted date: 2023-05-04
in scheme: AQD - Quality control and assurance on CDR
hidden label: When reporting results using ASCII grid, shape file or GeoTiff a reference must be provided to the result file
hidden label: When reporting results using ASCII grid shape file or GeoTiff a reference must be provided to the result file
editorial note: [Crucial]: Yes -
error type: BLOCKER

The result file (*.zip, *.shp ; *.tiff, *.asc) must follow this format: A valid cdr URL matching location of XML + File including extension + Variable using a # (e.g. #no2)
type: Concept
notation: Eb42
definition: ./om:result/gml:File/gml:fileReference MUST provide appropiate reference following this format: A valid cdr URL matching the cdr location where the XML files is located (e.g. http://cdr.eionet.europa.eu/es/eu/aqd/e1b/.../) + File including extension (e.g. model.zip) + Variable using a # (e.g. #no2). ONLY the following extensions are allowed: *.zip, *.shp ; *.tiff, *.asc
status: valid
status modified: 2023-05-04
accepted date: 2023-05-04
in scheme: AQD - Quality control and assurance on CDR
hidden label: The result file must follow this format: A valid cdr URL matching location of XML + File including extension + Variable using a # (e.g. #no2)
editorial note: [Crucial]: Yes -
error type: BLOCKER

When results are provided via an external file and the external file is ESRI shapefile, it must include the *.prj file
type: Concept
notation: Eb43
definition: IF resultencoding = external resultformat, AND resultformat = esri-shp, THEN the external results provided must include the correct projection file. [Example: if results provided via gml:fileReference (http://cdr.eionet.europa.eu/es/eu/aqd/e1b/envxta1qq/ES_CIEMAT_O3_V_TV_AOT40c-5yr_2018.shp), the same envelope must include file ES_CIEMAT_O3_V_TV_AOT40c-5yr_2018.prj]
status: valid
status modified: 2023-05-04
accepted date: 2023-05-04
in scheme: AQD - Quality control and assurance on CDR
error type: BLOCKER

Eb44
type: Concept
notation: Eb44
preferred label: When results are provided via an external file, the XML must include an om:parameter with the modelprojection via EEA vocabulary, using SRID number directly or one of the following references: http://dd.eionet.europa.eu/vocabulary/common/epsg/, https://spatialreference.org/ref/epsg/ or https://epsg.io/
definition: IF resultencoding = external resultformat, the XML must include an om:parameter with modelprojection <om:parameter> <om:NamedValue> <om:name xlink:href="https://dd.eionet.europa.eu/vocabulary/aq/modelparameter/projection"/> <om:value xlink:href="http://dd.eionet.europa.eu/vocabulary/common/epsg/4326"/> </om:NamedValue> </om:parameter> or <om:parameter> <om:NamedValue> <om:name xlink:href="http://dd.eionet.europa.eu/vocabulary/aq/modelparameter/projection"/> <om:value xlink:href="https://spatialreference.org/ref/epsg/4326/"/> </om:NamedValue> </om:parameter> or <om:parameter> <om:NamedValue> <om:name xlink:href="http://dd.eionet.europa.eu/vocabulary/aq/modelparameter/projection"/> <om:value xlink:href="https://epsg.io/4326"/> </om:NamedValue> </om:parameter> or <om:parameter> <om:NamedValue> <om:name xlink:href="http://dd.eionet.europa.eu/vocabulary/aq/modelparameter/projection"/> <om:value xlink:href="4326"/> </om:NamedValue> </om:parameter>
status: valid
status modified: 2023-05-04
accepted date: 2023-05-04
in scheme: AQD - Quality control and assurance on CDR
error type: BLOCKER

When results are provided via an external file, the XML must include an om:parameter including the modelresolution via EEA vocabulary
type: Concept
notation: Eb45
definition: IF resultencoding = external resultformat, the XML must include an om:parameter with modelresolution <om:parameter> <om:NamedValue> <om:name xlink:href="http://dd.eionet.europa.eu/vocabulary/aq/modelparameter/resolution"/> <om:value xlink:href="http://dd.eionet.europa.eu/vocabulary/aq/modelresolution/5kmx5km"/> </om:NamedValue> </om:parameter>
status: valid
status modified: 2023-05-04
accepted date: 2023-05-04
in scheme: AQD - Quality control and assurance on CDR

When results are provided via an external file (compressed in a zip file), the compressed file can only contain one external result (i.e only one shape file for each zip file)
type: Concept
notation: Eb46
definition: 1. scan envelope to find all files with *.zip extension, 2. within each zip file count number of files with extensions such as: *.shp or *.tiff or *.tif or *.asc, 3. return BLOCKER if the count > 1 (ie each zip file should not contain more than 1 *.shp files, neither e.g. *.shp and *.asc).
status: valid
status modified: 2023-05-04
accepted date: 2023-05-04
in scheme: AQD - Quality control and assurance on CDR
error type: BLOCKER

When results are provided via an external file, all reported files (*.zip, *.shp ; *.tiff, *.tif, *.asc) must be referenced via gml:fileReference
type: Concept
notation: Eb47
definition: All external files containing model results with allowed extensions (*.zip, *.shp ; *.tiff, *.tif, *.asc) must be referenced via gml:fileReference. Blocker will return if files are submitted which are not referenced in the XML.
status: valid
status modified: 2023-05-04
accepted date: 2023-05-04
in scheme: AQD - Quality control and assurance on CDR
error type: BLOCKER

When results are provided via an external file, definition of quantity must be provided and must match EEA vocabulary of aggregation processes.
type: Concept
notation: Eb48
definition: ./om:result/gml:File/gml:rangeParameters/swe:Quantity must refer to the correct vocabulary which is https://dd.eionet.europa.eu/vocabulary/aq/aggregationprocess, e.g.: <swe:Quantity definition ="http://dd.eionet.europa.eu/vocabulary/aq/aggregationprocess/P1Y">
status: valid
status modified: 2023-05-04
accepted date: 2023-05-04
in scheme: AQD - Quality control and assurance on CDR
error type: BLOCKER

Eb49
type: Concept
notation: Eb49
preferred label: When results are provided via an external file, the combinations of file#variable declared in XML must be unique, and the variables declared in XML after a # should be unique. QC should return WARNING if the variables are not unique. QC should return BLOCKER if the combinations of file#variable are not unique.
definition: /om:result/gml:File/gml:fileReference#variable MUST provide unique combinations; #variable should be unique: - if the variables declared in ./om:result/gml:File/gml:fileReference after a # are unique (WARNING), - if the combinations of file#variable declared in ./om:result/gml:File/gml:fileReference are unique (BLOCKER)
status: valid
status modified: 2023-05-04
accepted date: 2023-05-04
in scheme: AQD - Quality control and assurance on CDR
error type: BLOCKER

Each E1b observation must point to unique combination of formed by model + procedure + observedProperty + featureOfInterest + definition.
type: Concept
notation: Eb50a
definition: Each <gml:featureMember><om:OM_Observation>...</om:OM_Observation></gml:featureMember> must contain unique set of identifiers/items for <om:name xlink:href="http://dd.eionet.europa.eu/vocabulary/aq/processparameter/model"/><om:value/>,<om:procedure/>,<om:observedProperty/>, <om:featureOfInterest /> and <swe:Quantity definition="http://dd.eionet.europa.eu/vocabulary/aq/aggregationprocess/...">
status: valid
status modified: 2023-05-04
accepted date: 2023-05-04
in scheme: AQD - Quality control and assurance on CDR
error type: BLOCKER

Declaration of aggregation process in E1b must match with reporting metric in C.
type: Concept
notation: Eb52
definition: Declaration of aggregation process in E1b must match with aggregation process corresponding to reporting metric, objective, protection target and pollutant declared in C, for assessment regime where the model/objective estimation is used as assessment method.
status: valid
status modified: 2023-05-04
accepted date: 2023-05-04
in scheme: AQD - Quality control and assurance on CDR
error type: BLOCKER

Values provided within the data array must be interpretable and logically possible.
type: Concept
notation: Eb53
definition: Values provided within data array must be below 100000. They should be provided as number or as indication of a value below certain threshold, e.g.: < 10 or <= 10
status: valid
status modified: 2023-05-04
accepted date: 2023-05-04
in scheme: AQD - Quality control and assurance on CDR
error type: SKIPPED

Combination of pollutant and aggregation process must match the one allowed in https://dd.eionet.europa.eu/vocabulary/aq/aggregationprocess
type: Concept
notation: Eb54
definition: Combination of pollutant declared in <om:observedProperty.../> and aggregation process declared in <swe:Quantity definition=...> must match the one allowed in https://dd.eionet.europa.eu/vocabulary/aq/aggregationprocess (P1Y, P1M and P1D are exceptions matching all pollutants).
status: valid
status modified: 2023-05-04
accepted date: 2023-05-04
in scheme: AQD - Quality control and assurance on CDR
error type: BLOCKER

Attribute names specified in XML with url of external file must correspond univocally with the attribute names which can be found in dbf file of ESRI shapefile.
type: Concept
notation: Eb51
definition: If there is one, unique attribute name in dbf, which is exactly the same as the one in XML, the test is passed. If there is no attribute name in dbf which is exactly the same or at least starts with string of attribute name specified in XML, the test will return BLOCKER. If there is more than one attribute name in dbf, which is exactly the same as the one in XML, the test will fail with BLOCKER. If there is one, unique attribute name in dbf which starts with string of attribute name specified in XML, but has more characters, the test will return ERROR. If there is more than one attribute name in dbf which starts with string of attribute name specified in XML, but has more characters, the test will fail with BLOCKER.
status: valid
status modified: 2023-05-04
accepted date: 2023-05-04
in scheme: AQD - Quality control and assurance on CDR

Checks if this delivery is new or an update (on same reporting year)
type: Concept
notation: G0
definition: Check if delivery if this is a new delivery or updated delivery (via reporting year)
status: valid
status modified: 2023-05-04
accepted date: 2023-05-04
in scheme: AQD - Quality control and assurance on CDR
hidden label: Checks if this delivery is new or an update (on same reporting year)
editorial note: [Crucial]: -
error type: WARNING

Number of Attainments reported
type: Concept
notation: G01
definition: Compile & feedback upon the total number of attainment records included in the delivery
status: valid
status modified: 2023-05-04
accepted date: 2023-05-04
in scheme: AQD - Quality control and assurance on CDR
hidden label: Number of Attainments reported
editorial note: [Crucial]: Yes -
error type: BLOCKER

Number of new Attainments compared to previous report. ERROR will be returned if XML is a new delivery and localId are not new compared to previous deliveries
type: Concept
notation: G02
definition: Compile & feedback upon the total number of new attainment records included in the delivery. ERROR will be returned if XML is a new delivery and localId are not new compared to previous deliveries.
status: valid
status modified: 2023-05-04
accepted date: 2023-05-04
in scheme: AQD - Quality control and assurance on CDR
hidden label: Number of new Attainments compared to previous report. ERROR will be returned if XML is a new delivery and localId are not new compared to previous deliveries
editorial note: [Crucial]: Yes -
error type: BLOCKER

Number of existing Attainment compared to previous report. ERROR will be returned if XML is an update and ALL localId (100%) are different to previous delivery (for the same YEAR).
type: Concept
notation: G03
definition: Compile & feedback upon the total number of updated attainment records included in the delivery. ERROR will be returned if XML is an update and ALL localId (100%) are different to previous delivery (for the same YEAR).
status: valid
status modified: 2023-05-04
accepted date: 2023-05-04
in scheme: AQD - Quality control and assurance on CDR
hidden label: Number of existing Attainment compared to previous report. ERROR will be returned if XML is an update and ALL localId (100%) are different to previous delivery (for the same YEAR).
editorial note: [Crucial]: Yes -
error type: BLOCKER

List of unique identifier information for all attainment records. Blocker if no attainments
type: Concept
notation: G04
definition: Compile & feedback a list of the unique identifier information for all attainment records included in the delivery. Feedback report shall include the gml:id attribute ./aqd:inspireId ./aqd:pollutant ./aqd:environmentalObjective/aqd:EnvironmentalObjective/aqd:objectiveType ./aqd:environmentalObjective/aqd:EnvironmentalObjective/aqd:reportingMetric ./aqd:environmentalObjective/aqd:EnvironmentalObjective/aqd:protectionTarget ./aqd:zone /aqd:assessment elements as available.
status: valid
status modified: 2023-05-04
accepted date: 2023-05-04
in scheme: AQD - Quality control and assurance on CDR
hidden label: List of unique identifier information for all attainment records. Blocker if no attainments
editorial note: [Crucial]: Yes -
error type: BLOCKER

List number of final exceedances (TRUE)
type: Concept
notation: G05
definition: Compile & feedback a list of the exceedances situations when aqd:exceedanceDescriptionFinal/aqd:ExceedanceDescription/aqd:exceedance is TRUE
status: valid
status modified: 2023-05-04
accepted date: 2023-05-04
in scheme: AQD - Quality control and assurance on CDR
hidden label: List number of final exceedances (TRUE)
editorial note: [Crucial]: Yes -
error type: WARNING

Check and provide a list of those attainment records with a time extension
type: Concept
notation: G06
definition: Compile & feedback a list of attainment records that have been assessed against the objectiveType for zones with time extensions ./aqd:environmentalObjective/aqd:EnvironmentalObjective/aqd:objectiveType/@xlink:href – “LVmaxMOT” link via ./aqd:zone to /aqd:AQD_Zone record & present the /aqd:AQD_Zone/aqd:timeExtensionExemption info. Feedback report shall include ./aqd:inspireId, ./aqd:pollutant, ./aqd:environmentalObjective/aqd:EnvironmentalObjective/aqd:objectiveType, ./aqd:environmentalObjective/aqd:EnvironmentalObjective/aqd:reportingMetric, ./aqd:environmentalObjective/aqd:EnvironmentalObjective/aqd:protectionTarget, ./aqd:zone, ./aqd:pollutant, /aqd:AQD_Zone/aqd:timeExtensionExemption
status: valid
status modified: 2023-05-04
accepted date: 2023-05-04
in scheme: AQD - Quality control and assurance on CDR
hidden label: Check and provide a list of those attainment records with a time extension
editorial note: [Crucial]: Yes -
error type: BLOCKER

All gml ID attributes shall have unique code
type: Concept
notation: G07
definition: All gml:id attributes, ef:inspireId and aqd:inspireId elements shall have unique content
status: valid
status modified: 2023-05-04
accepted date: 2023-05-04
in scheme: AQD - Quality control and assurance on CDR
hidden label: All gml ID attributes shall have unique code
editorial note: [Crucial]: Yes -
error type: BLOCKER

Local Id must be unique for the attainment records
type: Concept
notation: G08
definition: ./aqd:inspireId/base:Identifier/base:localId must be unique code for the attainment records
status: valid
status modified: 2023-05-04
accepted date: 2023-05-04
in scheme: AQD - Quality control and assurance on CDR
hidden label: Local Id must be unique for the attainment records
editorial note: [Crucial]: Yes -
error type: BLOCKER

List unique namespaces used and count number of elements
type: Concept
notation: G09
definition: ./aqd:inspireId/base:Identifier/base:namespace List base:namespace and count the number of base:localId assigned to each base:namespace.
status: valid
status modified: 2023-05-04
accepted date: 2023-05-04
in scheme: AQD - Quality control and assurance on CDR
hidden label: List unique namespaces used and count number of elements
editorial note: [Crucial]: Yes -
error type: BLOCKER

Check namespace is registered
type: Concept
notation: G09.1
definition: Check that namespace is registered in vocabulary (http://dd.eionet.europa.eu/vocabulary/aq/namespace/view)
status: valid
status modified: 2023-05-04
accepted date: 2023-05-04
in scheme: AQD - Quality control and assurance on CDR
hidden label: Check namespace is registered
editorial note: [Crucial]: Yes - System requirement
error type: BLOCKER

The Attainment Pollutant must be one of the following: SO2, O3, NO2, NOX, PM10, PM2.5, CO, Pb in PM10, Cd in PM10, Ni in PM10, As in PM10, BaP in PM10
type: Concept
notation: G10
definition: The content of ./aqd:pollutant xlink:href attribute shall resolve to one of http://dd.eionet.europa.eu/vocabulary/aq/pollutant/1 http://dd.eionet.europa.eu/vocabulary/aq/pollutant/7 http://dd.eionet.europa.eu/vocabulary/aq/pollutant/8 http://dd.eionet.europa.eu/vocabulary/aq/pollutant/9 http://dd.eionet.europa.eu/vocabulary/aq/pollutant/5 http://dd.eionet.europa.eu/vocabulary/aq/pollutant/6001 http://dd.eionet.europa.eu/vocabulary/aq/pollutant/10 http://dd.eionet.europa.eu/vocabulary/aq/pollutant/20 http://dd.eionet.europa.eu/vocabulary/aq/pollutant/5012 http://dd.eionet.europa.eu/vocabulary/aq/pollutant/5014 http://dd.eionet.europa.eu/vocabulary/aq/pollutant/5015 http://dd.eionet.europa.eu/vocabulary/aq/pollutant/5018 http://dd.eionet.europa.eu/vocabulary/aq/pollutant/5029
status: valid
status modified: 2023-05-04
accepted date: 2023-05-04
in scheme: AQD - Quality control and assurance on CDR
hidden label: Attainment has been provided for an unexpected pollutant.
editorial note: [Crucial]: Yes - IPR requirement (Annex II-G-6)
error type: BLOCKER

INF and ALT thresholds - COUNT number zone-pollutant-target combination to match those in dataset B and dataset C for the same reporting Year
type: Concept
notation: G100
definition: COUNT number zone-pollutant-target combination to match those in dataset B and dataset C for the same reporting Year & compare it with Attainment. Sulphur dioxide (1) + health (B vs C) & Ozone (7) + health (B vs C) & Nitrogen dioxide (8) + health (B vs C)
status: valid
status modified: 2023-05-19
accepted date: 2023-05-19
in scheme: AQD - Quality control and assurance on CDR
error type: ERROR

Exceedance Description Base is only expected for the following pollutants: SO2, PM10, PM2.5, CO
type: Concept
notation: G11
definition: Element ./aqd:exceedanceDescriptionBase may only be used WHERE ./aqd:pollutant xlink:href attribute EQUALs http://dd.eionet.europa.eu/vocabulary/aq/pollutant/1 http://dd.eionet.europa.eu/vocabulary/aq/pollutant/5 http://dd.eionet.europa.eu/vocabulary/aq/pollutant/6001 http://dd.eionet.europa.eu/vocabulary/aq/pollutant/10
status: valid
status modified: 2023-05-04
accepted date: 2023-05-04
in scheme: AQD - Quality control and assurance on CDR
hidden label: Attainment has been provided with a base scenario for an unexpected pollutant
editorial note: [Crucial]: Yes - IPR requirement (Annex II-G-6)
error type: BLOCKER

Exceedance Description Adjustment is only expected for the following pollutants: SO2, PM10, PM2.5, CO
type: Concept
notation: G12
definition: Element ./aqd:exceedanceDescriptionAdjustment can only be used WHERE ./aqd:pollutant xlink:href attribute EQUALs http://dd.eionet.europa.eu/vocabulary/aq/pollutant/1 http://dd.eionet.europa.eu/vocabulary/aq/pollutant/5 http://dd.eionet.europa.eu/vocabulary/aq/pollutant/6001 http://dd.eionet.europa.eu/vocabulary/aq/pollutant/10
status: valid
status modified: 2023-05-04
accepted date: 2023-05-04
in scheme: AQD - Quality control and assurance on CDR
hidden label: Attainment has been provided with an adjustment for an unexpected pollutant
editorial note: [Crucial]: Yes - IPR requirement (Annex II-G-6)
error type: BLOCKER

Attainment should link to a valid assessment regime with matching Pollutant and Objetive Type
type: Concept
notation: G13
definition: ./aqd:assessment xlink:href attribute shall resolve to a valid assessment regime within / qd:AQD_AssessmentRegime AND /aqd:AQD_AssessmentRegime/aqd:pollutant, aqd:AQD_AssessmentRegime/aqd:assessmentThreshold/aqd:AssessmentThreshold/aqd:environmentalObjective/aqd:EnvironmentalObjective/aqd:objectiveType EQUAL to aqd:AQD_Attainment/aqd:pollutant aqd:AQD_Attainment/aqd:environmentalObjective/aqd:EnvironmentalObjective/aqd:objectiveType
status: valid
status modified: 2023-05-04
accepted date: 2023-05-04
in scheme: AQD - Quality control and assurance on CDR
hidden label: Incorrect link between Attainment and Assessment Regime (including match Pollutant & ObjectiveType)
editorial note: [Crucial]: Yes - IPR requirement (Annex II-G-7)
error type: BLOCKER

Attainment must link to a valid assessment regime with matching Pollutant and Protection Target
type: Concept
notation: G13b
definition: ./aqd:assessment xlink:href attribute shall resolve to a valid assessment regime within / qd:AQD_AssessmentRegime AND /aqd:AQD_AssessmentRegime/aqd:pollutant, aqd:AQD_AssessmentRegime/aqd:assessmentThreshold/aqd:AssessmentThreshold/aqd:environmentalObjective/aqd:EnvironmentalObjective/aqd:protectionTarget EQUAL to aqd:AQD_Attainment/aqd:pollutant aqd:AQD_Attainment/aqd:environmentalObjective/aqd:EnvironmentalObjective/aqd:protectionTarget
status: valid
status modified: 2023-05-04
accepted date: 2023-05-04
in scheme: AQD - Quality control and assurance on CDR
hidden label: Pollutant/ProtectionTarget mismatch between AssessmentRegime and Attainment. Please revise as this will cause problems when processing deliveries
editorial note: [Crucial]: Yes -
error type: BLOCKER

Attainment should link to a valid assessment regime with matching Pollutant/Objective Type/ReportingMetric/ProtectionTarget/
type: Concept
notation: G13c
definition: aqd:AQD_Attainment/aqd:pollutant aqd:AQD_Attainment/aqd:environmentalObjective/aqd:EnvironmentalObjective/aqd:objectiveType aqd:AQD_Attainment/aqd:environmentalObjective/aqd:EnvironmentalObjective/aqd:reportingMetric aqd:AQD_Attainment/aqd:environmentalObjective/aqd:EnvironmentalObjective/aqd:protectionTarget should correspond with aqd:AQD_AssessmentRegime/aqd:pollutant aqd:AQD_AssessmentRegime/aqd:assessmentThreshold/aqd:AssessmentThreshold/aqd:environmentalObjective/aqd:EnvironmentalObjective/aqd:objectiveType aqd:AQD_AssessmentRegime/aqd:assessmentThreshold/aqd:AssessmentThreshold/aqd:environmentalObjective/aqd:EnvironmentalObjective/aqd:reportingMetric aqd:AQD_AssessmentRegime/aqd:assessmentThreshold/aqd:AssessmentThreshold/aqd:environmentalObjective/aqd:EnvironmentalObjective/aqd:protectionTarget
status: valid
status modified: 2023-05-04
accepted date: 2023-05-04
in scheme: AQD - Quality control and assurance on CDR
hidden label: Environmental Objective mismatch between AssessmentRegime and Attainment. Please revise as this will cause problems when processing deliveries
editorial note: [Crucial]: Yes -
error type: BLOCKER

COUNT number zone-pollutant-target combination to match those in dataset B and dataset C for the same reporting Year
type: Concept
notation: G14
definition: COUNT number zone-pollutant-target combination to match those in dataset B and dataset C for the same reporting Year & compare it with Attainment. aqd:AQD_Attainment/aqd:pollutant xlink + aqd:AQD_Attainment/aqd:environmentalObjective/aqd:EnvironmentalObjective/aqd:protectionTarget + aqd:AQD_Attainment/aqd:zone .aqd:assessmentThreshold/aqd:AssessmentThreshold/aqd:environmentalObjective/aqd:EnvironmentalObjective/aqd:protectionTarget + ./aqd:pollutant + /aqd:zone combinations shall reconcile to corresponding information within /aqd:AQD_Zone/aqd:pollutants/aqd:Pollutant/aqd:protectionTarget , /aqd:AQD_Zone/aqd:pollutants/aqd:Pollutant/aqd:pollutantCode + /aqd:AQD_Zone/am:inspireId/base:Identifier/base:localId
status: valid
status modified: 2023-05-04
accepted date: 2023-05-04
in scheme: AQD - Quality control and assurance on CDR
hidden label: Mismatch in the count of unique zone-pollutant-protectionTarget combinations between Attainment, AssessmentRegime and Zones
editorial note: Changed to REGERROR following coordination meeting 12/02/2024
editorial note: [Crucial]: Yes (crosscheck) - Important content check
error type: REGERROR

All the /aqd:AQD_AssessmentRegime reported under latest dataflow C must be xlinked once at one Attainment (with exception of /MO)
type: Concept
notation: G14b
definition: For the same reporting year, all the /aqd:AQD_AssessmentRegime reported under dataflow C, must be xlinked once at /aqd:AQD_Attainment /aqd:assessment xlink:href attribute
status: valid
status modified: 2023-05-04
accepted date: 2023-05-04
in scheme: AQD - Quality control and assurance on CDR
hidden label: Assessment Regimes are missing in Attainment. Please revise
editorial note: [Crucial]: Yes -
error type: ERROR

Must be a valid AQ Zone.
type: Concept
notation: G15
definition: The subject of ./aqd:zone xlink:href attribute shall resolve to a valid AQ zone with /aqd:AQD_Zone
status: valid
status modified: 2023-05-04
accepted date: 2023-05-04
in scheme: AQD - Quality control and assurance on CDR
hidden label: Incorrect link between Attainment and Zone(s)
editorial note: [Crucial]: Yes - IPR requirement (Annex II-G-4)
error type: BLOCKER

The attainment(s) for PM2.5 AEI (both ECO & ERT) MUST not link to any specific zone.
type: Concept
notation: G16
definition: The attaniment(s) for PM2.5 AEI (both ECO & ERT) MUST not link to any specific zone. Specific syntax in XML is: <aqd:zone nilReason="inapplicable"/>
status: experimental
status modified: 2023-05-04
accepted date: 2023-05-04
in scheme: AQD - Quality control and assurance on CDR
editorial note: Not implemented
error type: ERROR

Linked zones must contain same pollutant as the Attainment
type: Concept
notation: G17
definition: The subject of the ./aqd: zone xlink:href attribute shall contain a /aqd:AQD_Zone/aqd:pollutant EQUAL to ./aqd:pollutan
status: valid
status modified: 2023-05-04
accepted date: 2023-05-04
in scheme: AQD - Quality control and assurance on CDR
hidden label: Mismtach between Attainment's pollutant and Zone's pollutant
editorial note: [Crucial]: Yes - Content check vs Zones
error type: BLOCKER

Any attainment for LVmaxMOT should link to a zone with a time extension
type: Concept
notation: G18
definition: The subject of the ./aqd: zone xlink:href attribute shall contain a /aqd:AQD_Zone/aqd:timeExtensionExemption shall NOT EQUAL http://dd.eionet.europa.eu/vocabulary/aq/timeextensiontypes/none WHERE ./aqd:exceedanceDescription_Final/aqd:ExceedanceDescription/aqd:environmentalObj ective/aqd:EnvironmentalObjective/aqd:objectiveType xlink:href attribute EQUALs http://dd.eionet.europa.eu/vocabulary/aq/objectivetype/LVmaxMOT
status: valid
status modified: 2023-05-04
accepted date: 2023-05-04
in scheme: AQD - Quality control and assurance on CDR
hidden label: Any attainment for LVmaxMOT should link to a zone with a time extension
editorial note: [Crucial]: Yes - Content check
error type: BLOCKER

Objective Type must use one of the following: TV LV CL LVMOT LVmaxMOT INT ALT LTO ECO
type: Concept
notation: G19
definition: ./aqd:environmentalObjective/aqd:EnvironmentalObjective/aqd:objectiveType xlink:href attribute shall resolve to one of http://dd.eionet.europa.eu/vocabulary/aq/objectivetype/LV http://dd.eionet.europa.eu/vocabulary/aq/objectivetype/TV http://dd.eionet.europa.eu/vocabulary/aq/objectivetype/LVMOT http://dd.eionet.europa.eu/vocabulary/aq/objectivetype/LVmaxMOT http://dd.eionet.europa.eu/vocabulary/aq/objectivetype/CL http://dd.eionet.europa.eu/vocabulary/aq/objectivetype/LTO http://dd.eionet.europa.eu/vocabulary/aq/objectivetype/ECO http://dd.eionet.europa.eu/vocabulary/aq/objectivetype/INT http://dd.eionet.europa.eu/vocabulary/aq/objectivetype/ALT
status: valid
status modified: 2023-05-04
accepted date: 2023-05-04
in scheme: AQD - Quality control and assurance on CDR
hidden label: Codelist for objective type requires revision (EEA codelist is required) or unexpected option
editorial note: [Crucial]: Yes - Content check
error type: BLOCKER

G20
type: Concept
notation: G20
preferred label: The Exceedence description must use an approved reporting metric, These are: Three consecutive hours in exceedance Annual mean / average , Winter Mean, Hours in exceedance in a calendar year, Days in exceedance in a calendar year, Days in exceedance averaged over 3 calendar years, Accumulated Ozone Exposure , Accumulated Ozone Exposure averaged over 5 years, Average Exposure Indicator
definition: The content of ./aqd:EnvironmentalObjective/aqd:reportingMetric shall resolve to a valid concept in http://dd.eionet.europa.eu/vocabulary/aq/reportingmetric/ that must be one of http://dd.eionet.europa.eu/vocabulary/aq/reportingmetric/3hAbove http://dd.eionet.europa.eu/vocabulary/aq/reportingmetric/aMean http://dd.eionet.europa.eu/vocabulary/aq/reportingmetric/wMean http://dd.eionet.europa.eu/vocabulary/aq/reportingmetric/hrsAbove http://dd.eionet.europa.eu/vocabulary/aq/reportingmetric/daysAbove http://dd.eionet.europa.eu/vocabulary/aq/reportingmetric/daysAbove-3yr http://dd.eionet.europa.eu/vocabulary/aq/reportingmetric/maxd8hrMean http://dd.eionet.europa.eu/vocabulary/aq/reportingmetric/AOT40c http://dd.eionet.europa.eu/vocabulary/aq/reportingmetric/AOT40c-5yr http://dd.eionet.europa.eu/vocabulary/aq/reportingmetric/AEI
status: valid
status modified: 2023-05-04
accepted date: 2023-05-04
in scheme: AQD - Quality control and assurance on CDR
hidden label: Codelist for reporting metric requires revision (EEA codelist is required) or unexpected option
editorial note: [Crucial]: Yes - Content check
error type: BLOCKER

The protection target must use the approved vocabulary
type: Concept
notation: G21
definition: If ./aqd:protectionTarget shall resolve to a register vocabulary under http://dd.eionet.europa.eu/vocabulary/aq/protectiontarget/[Code]
status: valid
status modified: 2023-05-04
accepted date: 2023-05-04
in scheme: AQD - Quality control and assurance on CDR
hidden label: Codelist for protection target requires revision (EEA codelist is required) or unexpected option
editorial note: [Crucial]: Yes - Content check
error type: BLOCKER

Check and list any invalid combination of pollutant & environmental objective
type: Concept
notation: G22
definition: Check that EnvironmentalObjetive (ObjectiveType+ReportingMetric+ProtectionTarget) correspond to a valid combination in http://dd.eionet.europa.eu/vocabulary/aq/environmentalobjective/view
status: valid
status modified: 2023-05-04
accepted date: 2023-05-04
in scheme: AQD - Quality control and assurance on CDR
hidden label: Invalid Environmental Objective combination found
editorial note: [Crucial]: Yes - Content check
error type: BLOCKER

reserved
type: Concept
notation: G23
definition: reserved
status: deprecated
status modified: 2023-05-04
accepted date: 2023-05-04
in scheme: AQD - Quality control and assurance on CDR
hidden label: reserved
editorial note: Included in G22

reserved
type: Concept
notation: G24
definition: reserved
status: deprecated
status modified: 2023-05-04
accepted date: 2023-05-04
in scheme: AQD - Quality control and assurance on CDR
hidden label: reserved
editorial note: Included in G22

reserved
type: Concept
notation: G25
definition: reserved
status: deprecated
status modified: 2023-05-04
accepted date: 2023-05-04
in scheme: AQD - Quality control and assurance on CDR
hidden label: reserved
editorial note: Included in G22

reserved
type: Concept
notation: G26
definition: reserved
status: deprecated
status modified: 2023-05-04
accepted date: 2023-05-04
in scheme: AQD - Quality control and assurance on CDR
hidden label: reserved
editorial note: Included in G22

reserved
type: Concept
notation: G27
definition: reserved
status: deprecated
status modified: 2023-05-04
accepted date: 2023-05-04
in scheme: AQD - Quality control and assurance on CDR
hidden label: reserved
editorial note: Included in G22

reserved
type: Concept
notation: G28
definition: reserved
status: deprecated
status modified: 2023-05-04
accepted date: 2023-05-04
in scheme: AQD - Quality control and assurance on CDR
hidden label: reserved
editorial note: Included in G22

reserved
type: Concept
notation: G29
definition: reserved
status: deprecated
status modified: 2023-05-04
accepted date: 2023-05-04
in scheme: AQD - Quality control and assurance on CDR
hidden label: reserved
editorial note: Included in G22

reserved
type: Concept
notation: G30
definition: reserved
status: deprecated
status modified: 2023-05-04
accepted date: 2023-05-04
in scheme: AQD - Quality control and assurance on CDR
hidden label: reserved
editorial note: Included in G22

reserved
type: Concept
notation: G31
definition: reserved
status: deprecated
status modified: 2023-05-04
accepted date: 2023-05-04
in scheme: AQD - Quality control and assurance on CDR
hidden label: reserved
editorial note: Included in G22

reserved
type: Concept
notation: G32
definition: reserved
status: deprecated
status modified: 2023-05-04
accepted date: 2023-05-04
in scheme: AQD - Quality control and assurance on CDR
hidden label: reserved
editorial note: Included in G22

reserved
type: Concept
notation: G33
definition: reserved
status: deprecated
status modified: 2023-05-04
accepted date: 2023-05-04
in scheme: AQD - Quality control and assurance on CDR
hidden label: reserved
editorial note: Included in G22

reserved
type: Concept
notation: G34
definition: All occurrences of the srsDimension attribute in ./aqd:exceedanceDescriptionBase/aqd:ExceedanceDescription/aqd:exceedanceArea/aqd:ExceedanceArea/aqd:spatialExtent shall EQUAL “2”
status: reserved
status modified: 2023-05-04
accepted date: 2023-05-04
in scheme: AQD - Quality control and assurance on CDR
editorial note: Not implemented

reserved
type: Concept
notation: G35
definition: All occurrences of the srsName attribute in ./aqd:exceedanceDescriptionBase/aqd:ExceedanceDescription/aqd:exceedanceArea/aqd:ExceedanceArea/aqd:spatialExtent shall resolve to a valid spatial reference system URN or URI
status: reserved
status modified: 2023-05-04
accepted date: 2023-05-04
in scheme: AQD - Quality control and assurance on CDR
editorial note: Not implemented

reserved
type: Concept
notation: G36
definition: /aqd:exceedanceDescriptionBase/aqd:ExceedanceDescription/aqd:exceedanceArea/aqd:ExceedanceArea/aqd:surfaceArea uom attribute shall resolve to http://dd.eionet.europa.eu/vocabulary/uom/area/km2
status: reserved
status modified: 2023-05-04
accepted date: 2023-05-04
in scheme: AQD - Quality control and assurance on CDR
editorial note: Not implemented

reserved
type: Concept
notation: G37
definition: /aqd:exceedanceDescriptionBase/aqd:ExceedanceDescription/aqd:exceedanceArea/aqd:ExceedanceArea/aqd:roadLength uom attribute shall be http://dd.eionet.europa.eu/vocabulary/uom/length/km
status: reserved
status modified: 2023-05-04
accepted date: 2023-05-04
in scheme: AQD - Quality control and assurance on CDR
editorial note: Not implemented

Classification type must be one of the following: rural rural-nearcity rural-regional rural-remote urban suburban
type: Concept
notation: G38
definition: The content of /aqd:exceedanceDescriptionBase/aqd:ExceedanceDescription/aqd:exceedanceArea/aqd:ExceedanceArea/aqd:areaClassification xlink:xref shall resolve to a areaClassification in http://dd.eionet.europa.eu/vocabulary/aq/areaclassification/ that must be one of Hide items http://dd.eionet.europa.eu/vocabulary/aq/areaclassification/rural http://dd.eionet.europa.eu/vocabulary/aq/areaclassification/rural-nearcity http://dd.eionet.europa.eu/vocabulary/aq/areaclassification/rural-regional http://dd.eionet.europa.eu/vocabulary/aq/areaclassification/rural-remote http://dd.eionet.europa.eu/vocabulary/aq/areaclassification/urban http://dd.eionet.europa.eu/vocabulary/aq/areaclassification/suburban
status: valid
status modified: 2023-05-04
accepted date: 2023-05-04
in scheme: AQD - Quality control and assurance on CDR
hidden label: Codelist for classificationType requires revision: EEA codelist is required
editorial note: [Crucial]: Yes - Content check
error type: BLOCKER

The exceeding AQ_Model shall resolve to a traversable local of global URL.
type: Concept
notation: G39
definition: ./aqd:exceedanceDescriptionBase/aqd:ExceedanceDescription/aqd:exceedanceArea/aqd:ExceedanceArea/aqd:modelUsed xlink:href attribute shall resolve to a model description in /aqd:AQD_Model
status: valid
status modified: 2023-05-04
accepted date: 2023-05-04
in scheme: AQD - Quality control and assurance on CDR
hidden label: Incorrect link between attainment(s) and model(s)
editorial note: [Crucial]: Yes - Content check
error type: BLOCKER

The exceeding AQ_Model must be included in the corresponding AssessmentRegime
type: Concept
notation: G40
definition: The subject of ./aqd:exceedanceDescriptionBase/aqd:ExceedanceDescription/aqd:exceedanceArea/ aqd:ExceedanceArea/aqd:modelUsed xlink:href attribute shall be found in /aqd:AQD_AssessmentRegime/aqd:assessmentMethods/aqd:AssessmentMethods/aqd:modelAssessmentMetadata xlink:href attribute for the AQD_AssessmentRegime record cited by ./aqd:assessment
status: valid
status modified: 2023-05-04
accepted date: 2023-05-04
in scheme: AQD - Quality control and assurance on CDR
hidden label: Model used under attainment not included in corresponding Assessment Regime
editorial note: [Crucial]: Yes - Content check
error type: BLOCKER

The exceeding SamplingPoint shall resolve to a traversable local of global URL.
type: Concept
notation: G41
definition: ./aqd:exceedanceDescriptionBase/aqd:ExceedanceDescription/aqd:exceedanceArea/aqd:ExceedanceArea/aqd:stationUsed xlink:href attribute shall resolve to a sampling point description in /aqd:AQD_SamplingPoint
status: valid
status modified: 2023-05-04
accepted date: 2023-05-04
in scheme: AQD - Quality control and assurance on CDR
hidden label: Incorrect link between attainment(s) and samplingpoint(s)
editorial note: [Crucial]: Yes - Content check
error type: BLOCKER

The exceeding SamplingPoint must be included in the corresponding AssessmentRegime
type: Concept
notation: G42
definition: The subject of ./aqd:exceedanceDescriptionBase/aqd:ExceedanceDescription/aqd:exceedanceArea/aqd:ExceedanceArea/aqd:stationlUsed xlink:href attribute shall be found in /aqd:AQD_AssessmentRegime/aqd:assessmentMethods/aqd:AssessmentMethods/aqd:samplingPointAssessmentMetadata xlink:href attribute for the AQD_AssessmentRegime record cited by ./aqd:assessment
status: valid
status modified: 2023-05-04
accepted date: 2023-05-04
in scheme: AQD - Quality control and assurance on CDR
hidden label: SamplingPoint used under attainment not included in corresponding Assessment Regime
editorial note: [Crucial]: Yes - Content check
error type: BLOCKER

reserved
type: Concept
notation: G43
definition: ./aqd:exceedanceDescriptionBase/aqd:ExceedanceDescription/aqd:exceedanceExposure/aqd:ExceedanceExposure/aqd:referenceYear/gml:TimeInstant/gml:timePosition shall specify a year in yyyy format.
status: reserved
status modified: 2023-05-04
accepted date: 2023-05-04
in scheme: AQD - Quality control and assurance on CDR
editorial note: Not implemented

Baseline exceedance must be TRUE or FALSE (if provided)
type: Concept
notation: G44
definition: ./aqd:exceedanceDescriptionBase/aqd:ExceedanceDescription/aqd:exceedance shall EQUAL “true” or “false”
status: valid
status modified: 2023-05-04
accepted date: 2023-05-04
in scheme: AQD - Quality control and assurance on CDR
hidden label: Baseline Exceedance invalid
editorial note: Improved in v5.0
error type: BLOCKER

If baseline exceedance is TRUE numericalExceedance or numberExceedances must be provided
type: Concept
notation: G45
definition: If ./aqd:exceedanceDescriptionBase/aqd:ExceedanceDescription/aqd:exceedance is TRUE EITHER ./aqd:exceedanceDescriptionBase/aqd:ExceedanceDescription/aqd:numericalExceedance OR ./aqd:exceedanceDescriptionBase/aqd:ExceedanceDescription/aqd:numberExceedances must be provided AS an integer number
status: valid
status modified: 2023-05-04
accepted date: 2023-05-04
in scheme: AQD - Quality control and assurance on CDR
hidden label: BaselineExceedance (TRUE) do not include numericalExceedance or numberExceedances.
editorial note: [Crucial]: Yes - IPR requirement (Annex II-G-8+9)
error type: BLOCKER

If baseline exceedance is FALSE the provision of numericalExceedance or numberExceedances is useful
type: Concept
notation: G46
definition: If ./aqd:exceedanceDescriptionBase/aqd:ExceedanceDescription/aqd:exceedance is FALSE EITHER ./aqd:exceedanceDescriptionBase/aqd:ExceedanceDescription/aqd:numericalExceedance OR ./aqd:exceedanceDescriptionBase/aqd:ExceedanceDescription/aqd:numberExceedances must be provided AS an integer number
status: valid
status modified: 2023-05-04
accepted date: 2023-05-04
in scheme: AQD - Quality control and assurance on CDR
hidden label: If baseline exceedance is FALSE the provision of numericalExceedance or numberExceedances is useful
editorial note: [Crucial]: Yes - IPR requirement (Annex II-G-8+9)
error type: BLOCKER

Deduction is not allowed when providing Baseline Exceedance
type: Concept
notation: G47
definition: ./aqd:exceedanceDescriptionBase/aqd:ExceedanceDescription/aqd:deductionAssessmentMethod/aqd:AdjustmentMethod/aqd:adjustmentType xlink:href attribute shall resolve to http://dd.eionet.europa.eu/vocabulary/aq/adjustmenttype/noneApplied
status: valid
status modified: 2023-05-04
accepted date: 2023-05-04
in scheme: AQD - Quality control and assurance on CDR
hidden label: Deduction is not allowed when providing Baseline Exceedance
editorial note: [Crucial]: Yes - Content check
error type: BLOCKER

When reporting aqd:exceedanceDescriptionBase, a correspoding aqd:exceedanceDescriptionAdjustment is expected
type: Concept
notation: G48
definition: When reporting aqd:exceedanceDescriptionBase, a correspoding aqd:exceedanceDescriptionAdjustment is expected
status: valid
status modified: 2024-08-29
accepted date: 2024-08-29
in scheme: AQD - Quality control and assurance on CDR
editorial note: Implemented
error type: BLOCKER

reserved
type: Concept
notation: G49
definition: All occurrences of the srsName attribute in ./aqd:exceedanceDescriptionAdjustment/aqd:ExceedanceDescription/aqd:exceedanceArea/aqd:ExceedanceArea/aqd:spatialExtent shall resolve to a valid spatial reference system URN or URI
status: reserved
status modified: 2023-05-04
accepted date: 2023-05-04
in scheme: AQD - Quality control and assurance on CDR
editorial note: Not implemented

reserved
type: Concept
notation: G50
definition: /aqd:exceedanceDescriptionAdjustment/aqd:ExceedanceDescription/aqd:exceedanceArea/aqd:ExceedanceArea/aqd:surfaceArea uom attribute shall resolve to http://dd.eionet.europa.eu/vocabulary/uom/area/km2
status: reserved
status modified: 2023-05-04
accepted date: 2023-05-04
in scheme: AQD - Quality control and assurance on CDR
editorial note: Not implemented

reserved
type: Concept
notation: G51
definition: /aqd:exceedanceDescriptionAdjustment/aqd:ExceedanceDescription/aqd:exceedanceArea/aqd:ExceedanceArea/aqd:roadLength uom attribute shall be http://dd.eionet.europa.eu/vocabulary/uom/length/km
status: reserved
status modified: 2023-05-04
accepted date: 2023-05-04
in scheme: AQD - Quality control and assurance on CDR
editorial note: Not implemented

The exceeding AQ_Model shall resolve to a traversable local of global URL.
type: Concept
notation: G53
definition: ./aqd:exceedanceDescriptionAdjustment/aqd:ExceedanceDescription/aqd:exceedanceArea/aqd:ExceedanceArea/aqd:modelUsed xlink:href attribute shall resolve to a model description in aqd:AQD_Model
status: valid
status modified: 2023-05-04
accepted date: 2023-05-04
in scheme: AQD - Quality control and assurance on CDR
hidden label: Incorrect link between attainment(s) and model(s)
editorial note: [Crucial]: Yes - Content check
error type: BLOCKER

The exceeding AQ_Model must be included in the corresponding AssessmentRegime
type: Concept
notation: G54
definition: The subject of ./aqd:exceedanceDescriptionAdjustment/aqd:ExceedanceDescription/aqd:exceedanceArea/aqd:ExceedanceArea/aqd:modelUsed xlink:href attribute shall be found in /aqd:AQD_AssessmentRegime/aqd:assessmentMethods/aqd:AssessmentMethods/aqd:modelAssessmentMetadata xlink:href attribute for the AQD_AssessmentRegime record cited by ./aqd:assessment
status: valid
status modified: 2023-05-04
accepted date: 2023-05-04
in scheme: AQD - Quality control and assurance on CDR
hidden label: Model used under attainment not included in corresponding Assessment Regime
editorial note: [Crucial]: Yes - Content check
error type: BLOCKER

The exceeding SamplingPoint shall resolve to a traversable local of global URL.
type: Concept
notation: G55
definition: ./aqd:exceedanceDescriptionAdjustment/aqd:ExceedanceDescription/aqd:exceedanceArea/aqd:ExceedanceArea/aqd:stationUsed xlink:href attribute shall resolve to a sampling point description in /aqd:AQD_SamplingPoint
status: valid
status modified: 2023-05-04
accepted date: 2023-05-04
in scheme: AQD - Quality control and assurance on CDR
hidden label: Incorrect link between attainment(s) and samplingpoint(s)
editorial note: [Crucial]: Yes - Content check
error type: BLOCKER

The exceeding SamplingPoint must be included in the corresponding AssessmentRegime
type: Concept
notation: G56
definition: The subject of ./aqd:exceedanceDescriptionAdjustment/aqd:ExceedanceDescription/aqd:exceedanceArea/aqd:ExceedanceArea/aqd:stationlUsed xlink:href attribute shall be found in /aqd:AQD_AssessmentRegime/aqd:assessmentMethods/aqd:AssessmentMethods/aqd:samplingPointAssessmentMetadata xlink:href attribute for the AQD_AssessmentRegime record cited by ./aqd:assessment
status: valid
status modified: 2023-05-04
accepted date: 2023-05-04
in scheme: AQD - Quality control and assurance on CDR
hidden label: SamplingPoint used under attainment not included in corresponding Assessment Regime
editorial note: [Crucial]: Yes - Content check
error type: BLOCKER

If provided unde Adjustment Exceedance, area classification must be one of the following: rural rural-nearcity rural-regional rural-remote urban suburban
type: Concept
notation: G52
definition: The content of /aqd:exceedanceDescriptionAdjustment/aqd:ExceedanceDescription/aqd:environmentalObjective/aqd:EnvironmentalObjective/aqd:areaClassification xlink:xref shall resolve to a areaClassification in http://dd.eionet.europa.eu/vocabulary/aq/areaclassification/ that must be one of Hide items http://dd.eionet.europa.eu/vocabulary/aq/areaclassification/rural http://dd.eionet.europa.eu/vocabulary/aq/areaclassification/rural-nearcity http://dd.eionet.europa.eu/vocabulary/aq/areaclassification/rural-regional http://dd.eionet.europa.eu/vocabulary/aq/areaclassification/rural-remote http://dd.eionet.europa.eu/vocabulary/aq/areaclassification/urban http://dd.eionet.europa.eu/vocabulary/aq/areaclassification/suburban
status: valid
status modified: 2023-05-04
accepted date: 2023-05-04
in scheme: AQD - Quality control and assurance on CDR
hidden label: Codelist for area classification requires revision: EEA codelist is required
editorial note: [Crucial]: Yes -
error type: ERROR

reserved
type: Concept
notation: G57
definition: ./aqd:exceedanceDescriptionAdjustment/aqd:ExceedanceDescription/aqd:exceedanceExposure/aqd:ExceedanceExposure/aqd:referenceYear/gml:TimeInstant/gml:timePosition shall specify a year in yyyy format.
status: reserved
status modified: 2023-05-04
accepted date: 2023-05-04
in scheme: AQD - Quality control and assurance on CDR
editorial note: Not implemented

Adjusment exceedance must be TRUE or FALSE
type: Concept
notation: G58
definition: ./aqd:exceedanceDescriptionAdjustment/aqd:ExceedanceDescription/aqd:exceedance shall EQUAL “true” or “false”
status: valid
status modified: 2023-05-04
accepted date: 2023-05-04
in scheme: AQD - Quality control and assurance on CDR
hidden label: Adjustment Exceedance invalid
editorial note: [Crucial]: Yes - IPR requirement (Annex II-G-10+11)
error type: BLOCKER

If adjustment exceedance is TRUE numericalExceedance or numberExceedances must be provided
type: Concept
notation: G59
definition: ./aqd:exceedanceDescriptionAdjustment/aqd:ExceedanceDescription/aqd:numericalExceedance shall be an integer number
status: valid
status modified: 2023-05-04
accepted date: 2023-05-04
in scheme: AQD - Quality control and assurance on CDR
hidden label: AdjustmentExceedance (TRUE) do not include numericalExceedance or numberExceedances.
editorial note: [Crucial]: Yes - IPR requirement (Annex II-G-10+11)
error type: BLOCKER

If adjustment exceedance is FALSE the provision of numericalExceedance or numberExceedances is useful
type: Concept
notation: G60
definition: ./aqd:exceedanceDescriptionAdjustment/aqd:ExceedanceDescription/aqd:numberExceedances shall be an integer number
status: valid
status modified: 2023-05-04
accepted date: 2023-05-04
in scheme: AQD - Quality control and assurance on CDR
hidden label: If adjustment exceedance is FALSE the provision of numericalExceedance or numberExceedances is useful
editorial note: [Crucial]: Yes - IPR requirement (Annex II-G-10+11)
error type: WARNING

The Adjustment Method type shall be 'Natural source correction' or 'Winter-sanding or -salting correction'
type: Concept
notation: G61
definition: The content of /aqd:exceedanceDescriptionAdjustment/aqd:ExceedanceDescription/aqd:deductionAssessmentMethod/aqd:AdjustmentMethod/aqd:adjustmentType xlink:xref shall resolve to a adjustmentType in http://dd.eionet.europa.eu/vocabulary/aq/adjustmenttype/ that must be one of Hide items http://dd.eionet.europa.eu/vocabulary/aq/adjustmenttype/nsCorrection http://dd.eionet.europa.eu/vocabulary/aq/adjustmenttype/wssCorrection
status: valid
status modified: 2023-05-04
accepted date: 2023-05-04
in scheme: AQD - Quality control and assurance on CDR
hidden label: Deduction is not allowed when providing Baseline Exceedance
editorial note: [Crucial]: Yes - Content check
error type: BLOCKER

The Adjustment Source Type must be one of the registered vocabulary.
type: Concept
notation: G62
definition: The content of /aqd:exceedanceDescriptionAdjustment/aqd:ExceedanceDescription/aqd:deductionAssessmentMethod/aqd:AdjustmentMethod/aqd:adjustmenSource xlink:xref shall resolve to a adjustmenSource in http://dd.eionet.europa.eu/vocabulary/aq/adjustmentsourcetype/ that must be one of Hide items http://dd.eionet.europa.eu/vocabulary/aq/adjustmentsourcetype/A1 http://dd.eionet.europa.eu/vocabulary/aq/adjustmentsourcetype/A2 http://dd.eionet.europa.eu/vocabulary/aq/adjustmentsourcetype/B http://dd.eionet.europa.eu/vocabulary/aq/adjustmentsourcetype/B1 http://dd.eionet.europa.eu/vocabulary/aq/adjustmentsourcetype/B2 http://dd.eionet.europa.eu/vocabulary/aq/adjustmentsourcetype/C1 http://dd.eionet.europa.eu/vocabulary/aq/adjustmentsourcetype/C2 http://dd.eionet.europa.eu/vocabulary/aq/adjustmentsourcetype/D1 http://dd.eionet.europa.eu/vocabulary/aq/adjustmentsourcetype/D2 http://dd.eionet.europa.eu/vocabulary/aq/adjustmentsourcetype/E1 http://dd.eionet.europa.eu/vocabulary/aq/adjustmentsourcetype/E2 http://dd.eionet.europa.eu/vocabulary/aq/adjustmentsourcetype/F1 http://dd.eionet.europa.eu/vocabulary/aq/adjustmentsourcetype/F2 http://dd.eionet.europa.eu/vocabulary/aq/adjustmentsourcetype/G1 http://dd.eionet.europa.eu/vocabulary/aq/adjustmentsourcetype/G2 http://dd.eionet.europa.eu/vocabulary/aq/adjustmentsourcetype/H
status: valid
status modified: 2023-05-04
accepted date: 2023-05-04
in scheme: AQD - Quality control and assurance on CDR
hidden label: Codelist for adjustement source type requires revision: EEA codelist is required
editorial note: [Crucial]: Yes - Content check
error type: BLOCKER

Assessment Type must be one of the following: fixed, model, indicative or objective estimation
type: Concept
notation: G63
definition: The content of ./aqd:exceedanceDescriptionAdjustment/aqd:ExceedanceDescription/ aqd:deductionAssessmentMethod/aqd:AdjustmentMethod/aqd:assessmentMethod/aqd:AssessmentMethods/aqd:assessmentType shall resolve to http://dd.eionet.europa.eu/vocabulary/aq/assessmenttype/ that must be one of Hide items http://dd.eionet.europa.eu/vocabulary/aq/assessmenttype/fixed http://dd.eionet.europa.eu/vocabulary/aq/assessmenttype/model http://dd.eionet.europa.eu/vocabulary/aq/assessmenttype/indicative http://dd.eionet.europa.eu/vocabulary/aq/assessmenttype/objective
status: valid
status modified: 2023-05-04
accepted date: 2023-05-04
in scheme: AQD - Quality control and assurance on CDR
hidden label: Codelist for assessment type requires revision: EEA codelist is required
editorial note: [Crucial]: Yes - Content check
error type: BLOCKER

If adjusting for NS/WSS correction, a correct link must be provided to the adjusment method (either Model or SamplingPoint)
type: Concept
notation: G64
definition: When adusting for NS/WSS correction, aqd:exceedanceDescriptionAdjustment must contain, at least, a link to the adjustment method used (via /aqd:exceedanceDescriptionAdjustment/aqd:ExceedanceDescription/aqd:deductionAssessmentMethod/aqd:AdjustmentMethod/aqd:assessmentMethod/aqd:AssessmentMethods/[aqd:modelAssessmentMetadata or samplingPointAssessmentMetadata] xlink:href
status: valid
status modified: 2023-05-04
accepted date: 2023-05-04
in scheme: AQD - Quality control and assurance on CDR
hidden label: Incorrect link between adjustment method and samplingpoint(s) and/or model(s)
editorial note: [Crucial]: Yes - Content check
error type: BLOCKER

If model(s) or samplingPoint(s) are used for adjusting for NS/WSS correction, a correct link must be provided
type: Concept
notation: G65
definition: The subject of ./aqd:exceedanceDescriptionAdjustment/aqd:ExceedanceDescription/aqd:deductionAssessmentMethod/aqd:AdjustmentMethod/aqd:assessmentMethod/aqd:AssessmentMethods/[aqd:modelAssessmentMetadata or aqd:samplingPointAssessmentMetadata] xlink:href attribute shall be reported in dataflow D
status: valid
status modified: 2023-05-04
accepted date: 2023-05-04
in scheme: AQD - Quality control and assurance on CDR
hidden label: If model(s) or samplingPoint(s) are used for adjusting for NS/WSS correction, a correct link must be provided
error type: Removed

If the adjustment method(s) are Model(s), these must be found with the corresponding Assessment Regime (link to the Attainment)
type: Concept
notation: G66
definition: The subject of ./aqd:exceedanceDescriptionAdjustment/aqd:ExceedanceDescription/aqd:deductionAssessmentMethod/aqd:AdjustmentMethod/aqd:assessmentMethod/aqd:AssessmentMethods/aqd:modelAssessmentMetadata xlink:href attribute shall be found in /aqd:AQD_AssessmentRegime/aqd:assessmentMethods/aqd:AssessmentMethods/aqd:modelAssessmentMetadata xlink:href attribute for the AQD_AssessmentRegime record cited by ./aqd:assessment
status: valid
status modified: 2023-05-04
accepted date: 2023-05-04
in scheme: AQD - Quality control and assurance on CDR
hidden label: Model(s) used for adjustment not included in corresponding Assessment Regime
editorial note: [Crucial]: Yes - Content check
error type: BLOCKER

If the adjustment method(s) are SamplingPoint(s), these must be found with the corresponding Assessment Regime (link to the Attainment)
type: Concept
notation: G67
definition: The subject of ./aqd:exceedanceDescriptionAdjustment/aqd:ExceedanceDescription/aqd:deductionAssessmentMethod/aqd:AdjustmentMethod/aqd:assessmentMethod/aqd:AssessmentMethods/aqd: samplingPointAssessmentMetadata xlink:href attribute shall be found in /aqd:AQD_AssessmentRegime/aqd:assessmentMethods/aqd:AssessmentMethods/aqd:samplingPointAssessmentMetadata xlink:href attribute for the AQD_AssessmentRegime record cited by ./aqd:assessment
status: valid
status modified: 2023-05-04
accepted date: 2023-05-04
in scheme: AQD - Quality control and assurance on CDR
hidden label: SamplingPoint(s) used for adjustment not included in corresponding Assessment Regime
editorial note: [Crucial]: Yes - Content check
error type: BLOCKER

When reporting aqd:exceedanceDescriptionAdjustment, a correspoding aqd:exceedanceDescriptionBase is expected
type: Concept
notation: G68
definition: When reporting aqd:exceedanceDescriptionAdjustment, a correspoding aqd:exceedanceDescriptionBase is expected
status: valid
status modified: 2024-08-29
accepted date: 2024-08-29
in scheme: AQD - Quality control and assurance on CDR
editorial note: Implemented
error type: BLOCKER

G69
type: Concept
notation: G69
preferred label: Ensure that documentation is provided for Adjustments of Natural Source and/or Winter Sanding. Under /aqd:AQD_Attainment/aqd:exceedanceDescriptionAdjustment/aqd:ExceedanceDescription/aqd:comment the full name of a pdf document attached to the G envelope must be provided
definition: Ensure that documentation is provided for Adjustments of Natural Source and/or Winter Sanding. Under /aqd:AQD_Attainment/aqd:exceedanceDescriptionAdjustment/aqd:ExceedanceDescription/aqd:comment the full name of a pdf document attached to the G envelope must be provided (example: <aqd:comment>Spanish_adjustment_natural_contribution_2022.pdf</aqd:comment>
status: valid
status modified: 2024-07-11
accepted date: 2024-07-11
in scheme: AQD - Quality control and assurance on CDR
editorial note: Not implemented
error type: BLOCKER

Exceedence area uom attribute must be in Square kilometers.
type: Concept
notation: G70
definition: /aqd:exceedanceDescriptionFinal/aqd:ExceedanceDescription/aqd:exceedanceArea/aqd:ExceedanceArea/aqd:surfaceArea uom attribute shall resolve to http://dd.eionet.europa.eu/vocabulary/uom/area/km2
status: valid
status modified: 2023-05-04
accepted date: 2023-05-04
in scheme: AQD - Quality control and assurance on CDR
hidden label: Codelist for exceedance area requires revision: EEA codelist is required
editorial note: [Crucial]: Yes - System check
error type: BLOCKER

Road Length attribute must be in kilometers.
type: Concept
notation: G71
definition: /aqd:exceedanceDescriptionFinal/aqd:ExceedanceDescription/aqd:exceedanceArea/aqd:ExceedanceArea/aqd:roadLength uom attribute shall be http://dd.eionet.europa.eu/vocabulary/uom/length/km
status: valid
status modified: 2023-05-04
accepted date: 2023-05-04
in scheme: AQD - Quality control and assurance on CDR
hidden label: Codelist for road length requires revision: EEA codelist is required
editorial note: [Crucial]: Yes - System check
error type: BLOCKER

Area Classification must be one of the following: rural rural-nearcity rural-regional rural-remote urban suburban
type: Concept
notation: G72
definition: The content of /aqd:exceedanceDescriptionFinal/aqd:ExceedanceDescription/aqd:exceedanceArea/aqd:ExceedanceArea/aqd:areaClassification xlink:xref shall resolve to a areaClassification in http://dd.eionet.europa.eu/vocabulary/aq/areaclassification/ that must be one of Hide items http://dd.eionet.europa.eu/vocabulary/aq/areaclassification/rural http://dd.eionet.europa.eu/vocabulary/aq/areaclassification/rural-nearcity http://dd.eionet.europa.eu/vocabulary/aq/areaclassification/rural-regional http://dd.eionet.europa.eu/vocabulary/aq/areaclassification/rural-remote http://dd.eionet.europa.eu/vocabulary/aq/areaclassification/urban http://dd.eionet.europa.eu/vocabulary/aq/areaclassification/suburban
status: valid
status modified: 2023-05-04
accepted date: 2023-05-04
in scheme: AQD - Quality control and assurance on CDR
hidden label: Codelist for area classification requires revision: EEA codelist is required
editorial note: [Crucial]: Yes - Content check
error type: BLOCKER

The exceeding AQ_Model shall resolve to a traversable local of global URL.
type: Concept
notation: G73
definition: ./aqd:exceedanceDescriptionFinal/aqd:ExceedanceDescription/aqd:exceedanceArea/aqd:ExceedanceArea/aqd:modelUsed xlink:href attribute shall resolve to a model description in /aqd:AQD_Model
status: valid
status modified: 2023-05-04
accepted date: 2023-05-04
in scheme: AQD - Quality control and assurance on CDR
hidden label: Incorrect link between attainment(s) and model(s)
editorial note: [Crucial]: Yes - Content check
error type: BLOCKER

The exceeding AQ_Model must be included in the corresponding AssessmentRegime
type: Concept
notation: G74
definition: The subject of ./aqd:exceedanceDescriptionFinal/aqd:ExceedanceDescription/aqd:exceedanceArea/aqd:ExceedanceArea/aqd:modelUsed xlink:href attribute shall be found in /aqd:AQD_AssessmentRegime/aqd:assessmentMethods/aqd:AssessmentMethods/aqd:modelAssessmentMetadata xlink:href attribute for the AQD_AssessmentRegime record cited by ./aqd:assessment
status: valid
status modified: 2023-05-04
accepted date: 2023-05-04
in scheme: AQD - Quality control and assurance on CDR
hidden label: Model used under attainment not included in corresponding Assessment Regime
editorial note: [Crucial]: Yes - Content check
error type: BLOCKER

The exceeding SamplingPoint shall resolve to a traversable local of global URL.
type: Concept
notation: G75
definition: ./aqd:exceedanceDescriptionFinal/aqd:ExceedanceDescription/aqd:exceedanceArea/aqd:ExceedanceArea/aqd:stationUsed xlink:href attribute shall resolve to a sampling point description in /aqd:AQD_SamplingPoint
status: valid
status modified: 2023-05-04
accepted date: 2023-05-04
in scheme: AQD - Quality control and assurance on CDR
hidden label: Incorrect link between attainment(s) and samplingpoint(s)
editorial note: [Crucial]: Yes - Content check
error type: BLOCKER

The exceeding SamplingPoint must be included in the corresponding AssessmentRegime
type: Concept
notation: G76
definition: The subject of ./aqd:exceedanceDescriptionFinal/aqd:ExceedanceDescription/aqd:exceedanceArea/aqd:ExceedanceArea/aqd:stationlUsed xlink:href attribute shall be found in /aqd:AQD_AssessmentRegime/aqd:assessmentMethods/aqd:AssessmentMethods/aqd:samplingPointAssessmentMetadata xlink:href attribute for the AQD_AssessmentRegime record cited by ./aqd:assessment
status: valid
status modified: 2023-05-04
accepted date: 2023-05-04
in scheme: AQD - Quality control and assurance on CDR
hidden label: SamplingPoint used under attainment not included in corresponding Assessment Regime
editorial note: [Crucial]: Yes - Content check
error type: BLOCKER

reserved
type: Concept
notation: G77
definition: ./aqd:exceedanceDescriptionFinal/aqd:ExceedanceDescription/aqd:exceedanceExposure/aqd:ExceedanceExposure/aqd:referenceYear/gml:TimeInstant/gml:timePosition shall specify a year in yyyy format.
status: reserved
status modified: 2023-05-04
accepted date: 2023-05-04
in scheme: AQD - Quality control and assurance on CDR
editorial note: Not implemented

Final Exceedance must be TRUE or FALSE
type: Concept
notation: G78
definition: ./aqd:exceedanceDescriptionFinal/aqd:ExceedanceDescription/aqd:exceedance shall EQUAL “true” or “false”
status: valid
status modified: 2023-05-04
accepted date: 2023-05-04
in scheme: AQD - Quality control and assurance on CDR
hidden label: Final Exceedance invalid
editorial note: [Crucial]: Yes - IPR requirement (Annex II-G-13)
error type: BLOCKER

If Final exceedance is TRUE numericalExceedance or numberExceedances must be provided
type: Concept
notation: G79
definition: ./aqd:exceedanceDescriptionFinal/aqd:ExceedanceDescription/aqd:numericalExceedance shall be an integer number
status: valid
status modified: 2023-05-04
accepted date: 2023-05-04
in scheme: AQD - Quality control and assurance on CDR
hidden label: Final exceedance (TRUE) do not include numericalExceedance or numberExceedances.
editorial note: [Crucial]: Yes - IPR requirement (Annex II-G-13
error type: BLOCKER

If Final exceedance is FALSE the provision of numericalExceedance or numberExceedances is useful
type: Concept
notation: G80
definition: ./aqd:exceedanceDescriptionFinal/aqd:ExceedanceDescription/aqd:numberExceedances shall be an integer number
status: valid
status modified: 2023-05-04
accepted date: 2023-05-04
in scheme: AQD - Quality control and assurance on CDR
hidden label: Attainment(s) with NO exceedance do not include numericalExceedance or numberExceedances. This information is very useful, please provide.
editorial note: [Crucial]: Yes - IPR requirement (Annex II-G-13
error type: ERROR

aqd:exceedanceDescriptionFinal/aqd:ExceedanceDescription/aqd:deductionAssessmentMethod/aqd:AdjustmentMethod must be 'Fully corrected" when base/adjustment are provided.'
type: Concept
notation: G81
definition: ./aqd:exceedanceDescriptionFinal/aqd:ExceedanceDescription/aqd:deductionAssessmentMethod/aqd:AdjustmentMethod/aqd:adjustmentType xlink:href attribute shall resolve to http://dd.eionet.europa.eu/vocabulary/aq/adjustmenttype/fullyCorrected when the attainment includes aqd:exceedanceDescriptionBase & aqd:exceedanceDescriptionAdjustment
status: valid
status modified: 2023-05-04
accepted date: 2023-05-04
in scheme: AQD - Quality control and assurance on CDR
hidden label: Adjustment method (at Final exceedance) must be fully corrected
editorial note: [Crucial]: Yes - Content check
error type: BLOCKER

For each individual attainment, only 1 of the following elements is expected: numericalExceedance or numberExceedances (not BOTH)
type: Concept
notation: G82
definition: For each individual attainment, only 1 of the following elements is expected: numericalExceedance or numberExceedances (not BOTH)
status: experimental
status modified: 2023-05-04
accepted date: 2023-05-04
in scheme: AQD - Quality control and assurance on CDR
editorial note: Crucial for G
error type: ERROR

Evaluate that the exceedance is correctly reported according to the particular Environmental Objective (aqd:numericalExceedance vs aqd:numberExceedance)
type: Concept
notation: G83
definition: According to IPR decision, each Environmental Objective is defined by a particular reporting metric. Depending on the reporting metric, within Attainment declaration, a user will use either aqd:numericalExceedance for means, percentiles or AOT and aqd:numberExceedances for hoursAbove or daysAbove.
status: stable
status modified: 2023-05-04
accepted date: 2023-05-04
in scheme: AQD - Quality control and assurance on CDR
editorial note: Implemented
error type: BLOCKER

ExceedanceDescriptionBase, exceedanceDescriptionAdjustment and exceedanceDescriptionFinal should be consistent in terms of numericalExceedance or numberExceedance
type: Concept
notation: G83b
definition: Evaluate that the exceedanceDescriptionBase, exceedanceDescriptionAdjustment and exceedanceDescriptionFinal are consistently reported. aqd:numericalExceedance or aqd:numberExceedance consistent in the 3 elements.
status: valid
status modified: 2024-07-11
accepted date: 2024-07-11
in scheme: AQD - Quality control and assurance on CDR
error type: BLOCKER

Check if exceedance (TRUE/FALSE) correspond to the reported value aqd:numericalExceedance/aqd:numberExceedances/...
type: Concept
notation: G84
definition: Check if exceedance (TRUE/FALSE) correspond to the reported value aqd:numericalExceedance/aqd:numberExceedances/...
status: experimental
status modified: 2023-05-04
accepted date: 2023-05-04
in scheme: AQD - Quality control and assurance on CDR
editorial note: Not implemented
error type: ERROR

If exceedance is TRUE, a link to the exceeding SamplingPoint(s) and/or Model(s) must be provided [at least one]
type: Concept
notation: G85
definition: WHERE ./aqd:exceedanceDescriptionFinal/aqd:ExceedanceDescription/aqd:exceedance shall EQUAL “true” ./aqd:exceedanceDescriptionFinal/aqd:ExceedanceDescription/aqd:exceedanceArea/aqd:ExceedanceArea/aqd:stationUsed OR ./aqd:exceedanceDescriptionFinal/aqd:ExceedanceDescription/aqd:exceedanceArea/aqd:ExceedanceArea/aqd:modelUsed shall be populated
status: valid
status modified: 2023-05-04
accepted date: 2023-05-04
in scheme: AQD - Quality control and assurance on CDR
hidden label: Final exceedance (TRUE) do not include link to exceeding SamplingPoint(s) and/or Model(s)
error type: BLOCKER

If SamplingPoint(s) and/or Model(s) are provided, these must be valid
type: Concept
notation: G86
definition: If, aqd:stationUsed and/or aqd:modelUsed are populated, these must be valid elements stationUsed must link To SamplingPoint via namespace/localid modelUsed must link to AQD_Model via namespace/ localid
status: valid
status modified: 2023-05-04
accepted date: 2023-05-04
in scheme: AQD - Quality control and assurance on CDR
hidden label: Incorrect link between Attainment and exceeding SamplingPoin(s) and/or Model(s)
error type: BLOCKER

If exceedance is TRUE, information on population exposed must be provided
type: Concept
notation: G87
definition: WHERE ./aqd:exceedanceDescriptionFinal/aqd:ExceedanceDescription/aqd:exceedance shall EQUAL “true” /aqd:exceedanceDescriptionFinal/aqd:ExceedanceDescription/aqd:exceedanceExposure/aqd:ExceedanceExposure/aqd:populationExposed shall be populated
status: reserved
status modified: 2023-05-04
accepted date: 2023-05-04
in scheme: AQD - Quality control and assurance on CDR
hidden label: If exceedance is TRUE, information on population exposed must be provided
editorial note: Not implemented

If exceedance is TRUE, information on area exposed must be provided
type: Concept
notation: G88
definition: WHERE ./aqd:exceedanceDescriptionFinal/aqd:ExceedanceDescription/aqd:exceedance shall EQUAL “true”/aqd:exceedanceDescriptionFinal/aqd:ExceedanceDescription/aqd:exceedanceExposure/aqd:ExceedanceExposure/aqd:ecosystemAreaExposed shall be populated
status: reserved
status modified: 2023-05-04
accepted date: 2023-05-04
in scheme: AQD - Quality control and assurance on CDR
hidden label: If exceedance is TRUE, information on area exposed must be provided
editorial note: Not implemented

Primary validated data (both E1a and/or E1b) must be submitted for all declared methods under Assessment Regime before releasing the Attainment.
type: Concept
notation: G89
definition: Primary validated data (both E1a and/or E1b) must be submitted for all declared methods under Assessment Regime before releasing the Attainment.
status: valid
status modified: 2024-02-15
accepted date: 2023-05-04
in scheme: AQD - Quality control and assurance on CDR
error type: ERROR

Primary validated data (both E1a and/or E1b) must be submitted for all declared methods under Assessment Regime before releasing the Attainment
type: Concept
notation: G89a
definition: Primary validated data (both E1a and/or E1b) must be submitted for all declared methods under Assessment Regime before releasing the Attainment
status: valid
status modified: 2025-06-10
accepted date: 2025-06-10
in scheme: AQD - Quality control and assurance on CDR
error type: BLOCKER

Count the number of Sampling Points and Models in different dataflows such as E1a, E1b, C and G
type: Concept
notation: G89b
definition: Count the number of Sampling Points and Models in different dataflows such as E1a, E1b, C and G
status: valid
status modified: 2025-06-10
accepted date: 2025-06-10
in scheme: AQD - Quality control and assurance on CDR
error type: ERROR

Compare attainment results to previous year submission
type: Concept
notation: G91
definition: When G report is submitted, compare the compliance status of each Attainment compared to previous reported information (for previous year).
status: valid
status modified: 2023-05-04
accepted date: 2023-05-04
in scheme: AQD - Quality control and assurance on CDR
error type: WARNING

Compare attainment results compared to current year (if an update)
type: Concept
notation: G92
definition: When G report is updated, compare the compliance status of each Attainment compared to previous reported information (for same year).
status: valid
status modified: 2023-05-04
accepted date: 2023-05-04
in scheme: AQD - Quality control and assurance on CDR
error type: WARNING

For all attainments, numericalExceedance < -1 or numberExceedances < 0
type: Concept
notation: G93
definition: aqd:numericalExceedance must be greater or equal to -1 & aqd:numberExceedance must be greater or equal to 0
status: valid
status modified: 2023-10-09
accepted date: 2023-10-09
in scheme: AQD - Quality control and assurance on CDR
error type: BLOCKER

G95
type: Concept
notation: G95
preferred label: An attainment for PM2.5 Exposure concentration obligationMUST be provided, it is has to be unique and the exceedance value reported via a unique element numericalExceedance. The reported AEI CANNOT be 0.
definition: In order to ensure correct reporting of the AEI compliance, the unique attainment for PM2.5 Average Exposure Indicator must provide a unique element numericalExceedance. This will be the calculated AEI and CANNOT be 0.
status: valid
status modified: 2023-05-04
accepted date: 2023-05-04
in scheme: AQD - Quality control and assurance on CDR
error type: BLOCKER

An attainment for PM2.5 Exposure Reduction Target SHOULD be provided, it is has to be unique and the exceedance value reported via a unique element numericalExceedance. The reported AEI CANNOT be 0.
type: Concept
notation: G96
definition: In order to ensure correct reporting of the ERT compliance, the unique attainment for PM2.5 Average Exposure Indicator must provide a unique element numericalExceedance. This will be the calculated AEI and CANNOT be 0.
status: valid
status modified: 2023-05-04
accepted date: 2023-05-04
in scheme: AQD - Quality control and assurance on CDR
error type: ERROR

Check PM2.5 Compliance against National Exposure Reduction Target
type: Concept
notation: G97
definition: Check PM2.5 Compliance against National Exposure Reduction Target
status: valid
status modified: 2023-05-04
accepted date: 2023-05-04
in scheme: AQD - Quality control and assurance on CDR
error type: ERROR

Check if at least one of the following combinations is reported (O3-INT, O3-ALT, NO2-ALT & SO2-ALT)
type: Concept
notation: G99
definition: Check if at least there is on Attainment for the following combinations in the XML (O3-INT, O3-ALT, NO2-ALT & SO2-ALT)
status: valid
status modified: 2023-05-19
accepted date: 2023-05-19
in scheme: AQD - Quality control and assurance on CDR
error type: BLOCKER

Cross checks with other data-flows
type: Concept
notation: GCrossCheck
definition: Cross checks with other data-flows
status: valid
status modified: 2023-05-04
accepted date: 2023-05-04
in scheme: AQD - Quality control and assurance on CDR
error type: WARNING

Check if delivery if this is a new delivery or updated delivery (via reporting year)
type: Concept
notation: H0
definition: Checks if this delivery is new or an update (on same reporting year)
status: valid
status modified: 2023-05-04
accepted date: 2023-05-04
in scheme: AQD - Quality control and assurance on CDR
hidden label: Check if delivery if this is a new delivery or updated delivery (via reporting year)
error type: WARNING

Compile & feedback upon the total number of plans records included in the delivery
type: Concept
notation: H01
definition: Number of AQ Plans reported
status: valid
status modified: 2023-05-04
accepted date: 2023-05-04
in scheme: AQD - Quality control and assurance on CDR
hidden label: Compile & feedback upon the total number of plans records included in the delivery
error type: BLOCKER

Compile & feedback upon the total number of new plans records included in the delivery (compared to any delivery for the same reporting year)
type: Concept
notation: H02
definition: Number of new Plans compared to previous report(s).
status: valid
status modified: 2023-05-04
accepted date: 2023-05-04
in scheme: AQD - Quality control and assurance on CDR
hidden label: Compile & feedback upon the total number of new plans records included in the delivery (compared to any delivery for the same reporting year)
error type: WARNING

H03
type: Concept
notation: H03
preferred label: Compile & feedback upon the total number of updated plans records included in the delivery. BLOCKER will be returned if XML is an update and ALL localId (100%) are different to previous delivery (for the same YEAR).
definition: Number of existing Plans compared to previous report (same reporting year). BLOCKER will be returned if XML is an update and ALL localId (100%) are different to previous delivery (for the same YEAR).
status: valid
status modified: 2023-05-04
accepted date: 2023-05-04
in scheme: AQD - Quality control and assurance on CDR
hidden label: Compile & feedback upon the total number of updated plans records included in the delivery. BLOCKER will be returned if XML is an update and ALL localId (100%) are different to previous delivery (for the same YEAR).
error type: ERROR

List of unique identifier information for all Plan records. Error will be returned if no Plans are reported.
type: Concept
notation: H04
definition: Compile & feedback a list of the unique identifier information for all Plans records included in the delivery. Feedback report shall include the gml:id attribute- ./aqd:inspireId- ./aqd:pollutant - ./aqd:protectionTarget - /gml:FeatureCollection/gml:featureMember/aqd:AQD_Plan/aqd:firstExceedanceYear -
status: valid
status modified: 2023-05-04
accepted date: 2023-05-04
in scheme: AQD - Quality control and assurance on CDR
hidden label: List of unique identifier information for all Plan records. Error will be returned if no Plans are reported.
error type: INFO

Your plan should be for an expected pollutant and correctly use one of pollutants listed at http://dd.eionet.europa.eu/vocabulary/aq/pollutant/
type: Concept
notation: H05
definition: aqd:AQD_Plan/aqd:pollutants/aqd:Pollutant/aqd:pollutantCode xlink:href attribute shall resolve to one of http://dd.eionet.europa.eu/vocabulary/aq/pollutant/
status: valid
status modified: 2023-05-04
accepted date: 2023-05-04
in scheme: AQD - Quality control and assurance on CDR
hidden label: Your plan should use one of pollutants listed at http://dd.eionet.europa.eu/vocabulary/aq/pollutant/
error type: WARNING

Reserved
type: Concept
notation: H06
definition: Reserved
status: valid
status modified: 2023-05-04
accepted date: 2023-05-04
in scheme: AQD - Quality control and assurance on CDR
hidden label: Reserved
error type: reserved

All gml ID attributes shall have unique code.
type: Concept
notation: H07
definition: All gml:id attributes - ef:inspireId and aqd:inspireId elements shall have unique content
status: valid
status modified: 2023-05-04
accepted date: 2023-05-04
in scheme: AQD - Quality control and assurance on CDR
hidden label: All gml ID attributes shall have unique code.
error type: WARNING

Local Id of the Plans must be unique.
type: Concept
notation: H08
definition: ./aqd:inspireId/base:Identifier/base:localId must be unique code for the Plans records
status: valid
status modified: 2023-05-04
accepted date: 2023-05-04
in scheme: AQD - Quality control and assurance on CDR
hidden label: Local Id of the Plans must be unique.
error type: BLOCKER

List unique namespaces used and count number of elements.
type: Concept
notation: H09
definition: ./aqd:inspireId/base:Identifier/base:namespace List base:namespace and count the number of base:localId assigned to each base:namespace.
status: valid
status modified: 2023-05-04
accepted date: 2023-05-04
in scheme: AQD - Quality control and assurance on CDR
hidden label: List unique namespaces used and count number of elements.
error type: INFO

Check if namespace is registered in vocabulary (http://dd.eionet.europa.eu/vocabulary/aq/namespace/view)
type: Concept
notation: H10
definition: Check if namespace is registered in vocabulary (http://dd.eionet.europa.eu/vocabulary/aq/namespace/view)
status: valid
status modified: 2023-05-04
accepted date: 2023-05-04
in scheme: AQD - Quality control and assurance on CDR
hidden label: Check if namespace is registered in vocabulary (http://dd.eionet.europa.eu/vocabulary/aq/namespace/view)
error type: BLOCKER

AQ Plan must link to a valid exceedance situation (G)
type: Concept
notation: H11
definition: If aqd:AQD_ReportingHeader/aqd:reportingPeriod => 2013 aqd:AQD_Plan/aqd:exceedanceSituation@xlink:href attribute shall resolve to at least one exceedance situation in dataset G via namespace/localId.
status: valid
status modified: 2023-05-04
accepted date: 2023-05-04
in scheme: AQD - Quality control and assurance on CDR
hidden label: AQ must link to a valid exceedande situation (G) if reporting period equal or greater than 2013.
error type: BLOCKER

aqd:comment should be provided if reporting period before than 2013 and a valid exceedande situation is not provided.
type: Concept
notation: H12
definition: If aqd:reportingPeriod < 2013 and aqd:AQD_Plan/aqd:exceedanceSituation is empty aqd:comment must be populated
status: valid
status modified: 2023-05-04
accepted date: 2023-05-04
in scheme: AQD - Quality control and assurance on CDR
hidden label: aqd:comment should be provided if reporting period before than 2013 and a valid exceedande situation is not provided.
error type: WARNING

Reserved
type: Concept
notation: H13
definition: Reserved
status: valid
status modified: 2023-05-04
accepted date: 2023-05-04
in scheme: AQD - Quality control and assurance on CDR
hidden label: Reserved
error type: reserved

We recommend you start you codes with the 2-digit country code according to ISO 3166-1.
type: Concept
notation: H14
definition: aqd:AQD_Plan/aqd:code should begin with with the 2-digit country code according to ISO 3166-1.
status: invalid
status modified: 2023-05-04
accepted date: 2023-05-04
in scheme: AQD - Quality control and assurance on CDR
hidden label: We recommend you start you codes with the 2-digit country code according to ISO 3166-1.
error type: WARNING

aqd:code must be populated & unique within the XML
type: Concept
notation: H15
definition: aqd:code can not be EMPTY & the code provided must be unique within the XML delivered
status: valid
status modified: 2023-05-04
accepted date: 2023-05-04
in scheme: AQD - Quality control and assurance on CDR
hidden label: Reserved
error type: ERROR

You must provide the name of the organisation responsible for the Plan.
type: Concept
notation: H16
definition: aqd:AQD_Plan/aqd:competentAuthority/base2:RelatedParty/base2:organisationName/gco:CharacterString shall not be NULL or voided
status: valid
status modified: 2023-05-04
accepted date: 2023-05-04
in scheme: AQD - Quality control and assurance on CDR
hidden label: You must provide the name of the organisation responsible for the Plan.
error type: BLOCKER

You should provide a contact point within the organisation responsible for the plan. This should be a generic contact point.
type: Concept
notation: H17
definition: aqd:AQD_Plan/aqd:competentAuthority/base2:RelatedParty/base2:individualName/gco:CharacterString shall not be NULL or voided
status: valid
status modified: 2023-05-04
accepted date: 2023-05-04
in scheme: AQD - Quality control and assurance on CDR
hidden label: You should provide a contact point within the organisation responsible for the plan. This should be a generic contact point.
error type: WARNING

You should provide an email address for the contact point within the organisation responsible for the plan (This should be a generic email address).
type: Concept
notation: H18
definition: aqd:AQD_Plan/aqd:competentAuthority/base2:RelatedParty/base2:contact/base2:Contact/base2:electronicMailAddress shall not be NULL or voided
status: valid
status modified: 2023-05-04
accepted date: 2023-05-04
in scheme: AQD - Quality control and assurance on CDR
hidden label: You should provide an email address for the contact point within the organisation responsible for the plan (This should be a generic email address).
error type: WARNING

Your reference year must be in yyyy format.
type: Concept
notation: H19
definition: aqd:AQD_Plan/aqd:firstExceedanceYear/gml:TimeInstant/gml:timePosition shall not be voided - NULL or an empty tag & shall contain content in yyyy format
status: valid
status modified: 2023-05-04
accepted date: 2023-05-04
in scheme: AQD - Quality control and assurance on CDR
hidden label: Your reference year must be in yyyy format.
error type: BLOCKER

Your plan status should use one of those listed at http://dd.eionet.europa.eu/vocabulary/aq/statusaqplan/
type: Concept
notation: H20
definition: aqd:AQD_Plan/aqd:status xlink:href attribute shall resolve to one of http://dd.eionet.europa.eu/vocabulary/aq/statusaqplan/
status: valid
status modified: 2023-05-04
accepted date: 2023-05-04
in scheme: AQD - Quality control and assurance on CDR
hidden label: Your plan status should use one of those listed at http://dd.eionet.europa.eu/vocabulary/aq/statusaqplan/
error type: BLOCKER

Your plan should use one of pollutants listed at http://dd.eionet.europa.eu/vocabulary/aq/pollutant/
type: Concept
notation: H21
definition: aqd:AQD_Plan/aqd:pollutants/aqd:Pollutant/aqd:pollutantCode xlink:href attribute shall resolve to one of http://dd.eionet.europa.eu/vocabulary/aq/pollutant/
status: valid
status modified: 2023-05-04
accepted date: 2023-05-04
in scheme: AQD - Quality control and assurance on CDR
hidden label: Your plan should use one of pollutants listed at http://dd.eionet.europa.eu/vocabulary/aq/pollutant/
error type: SKIPPED

Your plan should use one of protection targets listed at http://dd.eionet.europa.eu/vocabulary/aq/protectiontarget/
type: Concept
notation: H22
definition: aqd:AQD_Plan/aqd:pollutants/aqd:Pollutant/aqd:protectionTarget xlink:href attribute shall resolve to one of http://dd.eionet.europa.eu/vocabulary/aq/protectiontarget/
status: valid
status modified: 2023-05-04
accepted date: 2023-05-04
in scheme: AQD - Quality control and assurance on CDR
hidden label: Your plan should use one of protection targets listed at http://dd.eionet.europa.eu/vocabulary/aq/protectiontarget/
error type: BLOCKER

Check and count expected combinations of Pollutant and ProtectionTarget.
type: Concept
notation: H23
definition: Check and count expected combinations of Pollutant and ProtectionTarget at /gml:FeatureCollection/gml:featureMember/aqd:AQD_Plan/aqd:pollutants/aqd:Pollutant Sulphur dioxide (1) + health Sulphur dioxide (1) + vegetation Ozone (7) + health Ozone (7) + vegetation Nitrogen dioxide (8) + health Nitrogen oxides (9) + vegetation Particulate matter < 10 µm (5) + health Particulate matter < 2.5 µm (6001) + health Carbon monoxide (10) + health Benzene (20) + health Lead in PM10 (5012) + health Arsenic in PM10 (5018) + health Cadmium in PM10 (5014) + health Nickel in PM10 (5015) + health Benzo(a)pyrene in PM10 (5029) + health
status: valid
status modified: 2023-05-04
accepted date: 2023-05-04
in scheme: AQD - Quality control and assurance on CDR
hidden label: Check and count expected combinations of Pollutant and ProtectionTarget.
error type: BLOCKER

AQ plan pollutant's should match those in the exceedance situation (G).
type: Concept
notation: H24
definition: aqd:AQD_Plan/aqd:pollutants/aqd:Pollutant/aqd:pollutantCode xlink:href attribute (may be multiple) shall be the same as those in the referenced data flow G xlinked via aqd:AQD_Plan/aqd:exceedanceSituation@xlink:href attribute (maybe multiple)
status: valid
status modified: 2023-05-04
accepted date: 2023-05-04
in scheme: AQD - Quality control and assurance on CDR
hidden label: AQ plan pollutant's should match those in the exceedance situation (G).
error type: WARNING

Your reference year must be in yyyy-mm-dd format.
type: Concept
notation: H25
definition: aqd:AQD_Plan/aqd:adoptionDate/gml:TimeInstant/gml:timePosition MUST be populated and its content in yyyy-mm-dd format if /gml:FeatureCollection/gml:featureMember/aqd:AQD_Plan/aqd:status xlink:href attribute not equal http://dd.eionet.europa.eu/vocabulary/aq/statusaqplan/preparation - http://dd.eionet.europa.eu/vocabulary/aq/statusaqplan/adoption-process or http://dd.eionet.europa.eu/vocabulary/aq/statusaqplan/under-revision
status: valid
status modified: 2023-05-04
accepted date: 2023-05-04
in scheme: AQD - Quality control and assurance on CDR
hidden label: Your reference year must be in yyyy-mm-dd format.
error type: BLOCKER

Plan adoption date should not be populated if plan is in preparation, under revision or in adoption process.
type: Concept
notation: H26
definition: if /gml:FeatureCollection/gml:featureMember/aqd:AQD_Plan/aqd:status xlink:href attribute equal http://dd.eionet.europa.eu/vocabulary/aq/statusaqplan/preparation - http://dd.eionet.europa.eu/vocabulary/aq/statusaqplan/adoption-process or http://dd.eionet.europa.eu/vocabulary/aq/statusaqplan/under-revision aqd:AQD_Plan/aqd:adoptionDate/gml:TimeInstant/gml:timePosition should not be populated
status: valid
status modified: 2023-05-04
accepted date: 2023-05-04
in scheme: AQD - Quality control and assurance on CDR
hidden label: Plan adoption date should not be populated if plan is in preparation, under revision or in adoption process.
error type: ERROR

You should report a short textual description of timetable for the implementation of the air quality plan.
type: Concept
notation: H27
definition: aqd:AQD_Plan/aqd:timeTable shal contain a text string
status: valid
status modified: 2023-05-04
accepted date: 2023-05-04
in scheme: AQD - Quality control and assurance on CDR
hidden label: You should report a short textual description of timetable for the implementation of the air quality plan.
error type: ERROR

You should report a URL to document or web resource describing the last version of full air quality plan.
type: Concept
notation: H28
definition: aqd:AQD_Plan/aqd:referenceImplementation shall contain a URL to document or web resource describing the latest version of full air quality plan. This MUST be valid.
status: valid
status modified: 2023-05-04
accepted date: 2023-05-04
in scheme: AQD - Quality control and assurance on CDR
hidden label: You should report a URL to document or web resource describing the last version of full air quality plan.
error type: ERROR

You should report a URL to a document or web resource where information about the implementation of the air quality plan can be found.
type: Concept
notation: H29
definition: aqd:AQD_Plan/aqd:referenceImplementation must contain a URL to a document or web resource where information about the implementation of the air quality plan can be found.
status: valid
status modified: 2023-05-04
accepted date: 2023-05-04
in scheme: AQD - Quality control and assurance on CDR
hidden label: You should report a URL to a document or web resource where information about the implementation of the air quality plan can be found.
error type: ERROR

Brief textual description of the published AQ Plan should be provided. Include the ISBN number (If available)
type: Concept
notation: H30
definition: aqd:AQD_Plan/aqd:publication/aqd:Publication/aqd:description must contain a text string describing the publication
status: valid
status modified: 2023-05-04
accepted date: 2023-05-04
in scheme: AQD - Quality control and assurance on CDR
hidden label: Brief textual description of the published AQ Plan should be provided. Include the ISBN number (If available)
error type: WARNING

You should provide title as written in the published AQ Plan.
type: Concept
notation: H31
definition: aqd:AQD_Plan/aqd:publication/aqd:Publication/aqd:title must contain the title of the publication
status: valid
status modified: 2023-05-04
accepted date: 2023-05-04
in scheme: AQD - Quality control and assurance on CDR
hidden label: You should provide title as written in the published AQ Plan.
error type: ERROR

Author information for the AQ Plan report - multiple entries can be provided as a comma separate list.
type: Concept
notation: H32
definition: aqd:AQD_Plan/aqd:publication/aqd:Publication/aqd:author must contain the author(s) of the publication
status: valid
status modified: 2023-05-04
accepted date: 2023-05-04
in scheme: AQD - Quality control and assurance on CDR
hidden label: Author(s) should be provided as text (Please provide in one field separated by commas if there are multiple authors).
error type: WARNING

The publication date of the AQ Plan should be provided in yyyy or yyyy-mm-dd format
type: Concept
notation: H33
definition: aqd:AQD_Plan/aqd:publication/aqd:Publication/aqd:publicationDate/gml:TimeInstant/gml:timePosition must contaong the date of publication in yyyy-mm-dd format
status: valid
status modified: 2023-05-04
accepted date: 2023-05-04
in scheme: AQD - Quality control and assurance on CDR
hidden label: The publication date of the AQ Plan should be provided in yyyy or yyyy-mm-dd format
error type: BLOCKER

Publisher should be provided as a text (Publishing institution - academic jourmal – etc.)
type: Concept
notation: H34
definition: aqd:AQD_Plan/aqd:publication/aqd:Publication/aqd:publisher must container a text string describing the publisher
status: valid
status modified: 2023-05-04
accepted date: 2023-05-04
in scheme: AQD - Quality control and assurance on CDR
hidden label: Publisher should be provided as a text (Publishing institution - academic jourmal – etc.)
error type: WARNING

Provided url to the published AQ Plan should be valid.
type: Concept
notation: H35
definition: aqd:AQD_Plan/aqd:publication/aqd:Publication/aqd:webLink must contain a URL to document or web resource describing the last version of full air quality plan
status: valid
status modified: 2023-05-04
accepted date: 2023-05-04
in scheme: AQD - Quality control and assurance on CDR
hidden label: Provided url to the published AQ Plan should be valid.
error type: ERROR

Check if the delivery is a new or an update delivery (based on reporting year)
type: Concept
notation: I0
definition: Check if the delivery is a new or an update delivery. If the system already includes a submission for the same data flow I for the same year, this will be considered as an update.
status: valid
status modified: 2023-05-04
accepted date: 2023-05-04
in scheme: AQD - Quality control and assurance on CDR
hidden label: Check if delivery if this is a new delivery or updated delivery (via reporting year)
error type: WARNING

Number of source apportionment records in this delivery
type: Concept
notation: I1
definition: Compile & feedback upon the total number of Source Apportionments included in the delivery
status: valid
status modified: 2023-05-04
accepted date: 2023-05-04
in scheme: AQD - Quality control and assurance on CDR
hidden label: Compile & feedback upon the total number of Source Apportionments included in the delivery
error type: BLOCKER

Check if namespace is registered in vocabulary (http://dd.eionet.europa.eu/vocabulary/aq/namespace/view)
type: Concept
notation: I10
definition: Check if namespace is registered in vocabulary (http://dd.eionet.europa.eu/vocabulary/aq/namespace/view)
status: valid
status modified: 2023-05-04
accepted date: 2023-05-04
in scheme: AQD - Quality control and assurance on CDR
hidden label: Check if namespace is registered in vocabulary (http://dd.eionet.europa.eu/vocabulary/aq/namespace/view)
error type: BLOCKER

You must provide a reference to a plan document from data flow H via its namespace & localId. The plan document must have the same reporting year as the source apportionment document.
type: Concept
notation: I11
definition: aqd:AQD_SourceApportionment/aqd:usedInPlan shall reference an existing H document for the same reporting year same year via namespace/localId
status: valid
status modified: 2023-05-04
accepted date: 2023-05-04
in scheme: AQD - Quality control and assurance on CDR
hidden label: You must provide a reference to a plan document from data flow H via its namespace & localId. The plan document must have the same reporting year as the source apportionment document.
error type: BLOCKER

You must provide a reference to an exceedance situation from data flow G. The exceedance situation must have the same reporting year as the source apportionment and refer to the same pollutant.
type: Concept
notation: I12
definition: aqd:AQD_SourceApportionment/aqd:parentExceedanceSituation shall reference an existing exceedance situation delivered within a data flow G and the reporting year of G & I shall be the same year via namespace/localId.
status: valid
status modified: 2023-05-04
accepted date: 2023-05-04
in scheme: AQD - Quality control and assurance on CDR
hidden label: You must provide a reference to an exceedance situation from data flow G. The exceedance situation must have the same reporting year as the source apportionment and refer to the same pollutant.
error type: BLOCKER

The exceedanceSituation linked (G) in this Source Apportionment (I) must be listed in the linked AQ Plan (H) for the same Source Apportionment (I)
type: Concept
notation: I12a
definition: HINT: Please ensure that the exceedanceSituation listed in the Source Apportionment listed (if there is an error), is also listed in the released AQ Plan (H) which the Source Apportionment also links too.
status: valid
status modified: 2023-05-04
accepted date: 2023-05-04
in scheme: AQD - Quality control and assurance on CDR
error type: BLOCKER

Reference year must be a calendar year in yyyy format.
type: Concept
notation: I13
definition: aqd:AQD_SourceApportionment/aqd:referenceYear/gml:TimeInstant/gml:timePosition shall be a calendar year in yyyy format
status: valid
status modified: 2023-05-04
accepted date: 2023-05-04
in scheme: AQD - Quality control and assurance on CDR
hidden label: Reference year must be a calendar year in yyyy format.
error type: BLOCKER

Source apportionments values should be provided as a number.
type: Concept
notation: I15
definition: Across all the delivery: check that the element aqd:QuantityCommented/aqd:quantity is number greater or equal to zero (>= 0) if attribute xsi:nil="false" (example: <aqd:quantity uom="http://dd.eionet.europa.eu/vocabulary/uom/concentration/ug.m-3" xsi:nil="false">4.03038</aqd:quantity>)
status: valid
status modified: 2023-05-04
accepted date: 2023-05-04
in scheme: AQD - Quality control and assurance on CDR
hidden label: Source apportionments should be provided as an integer.
error type: WARNING

If quantification is either "unpopulated" or "unknown" or "withheld" the element should be empty.
type: Concept
notation: I16
definition: Across all the delivery: check that the element aqd:QuantityCommented/aqd:quantity is empty if attribute xsi:nil="unpopulated" or "unknown" or "withheld" (example: <aqd:quantity uom="Unknown" nilReason="Unpopulated" xsi:nil="true"/>)
status: valid
status modified: 2023-05-04
accepted date: 2023-05-04
in scheme: AQD - Quality control and assurance on CDR
hidden label: If quantification is either "unpopulated" or "unknown" or "withheld" the element should be empty.
error type: BLOCKER

If the quantification is voided an explanation is required in aqd:comment.
type: Concept
notation: I17
definition: Across all the delivery: If aqd:QuantityCommented/aqd:quantity attribute xsi:nil="true" aqd:QuantityCommented/aqd:comment must be populated
status: valid
status modified: 2023-05-04
accepted date: 2023-05-04
in scheme: AQD - Quality control and assurance on CDR
hidden label: If the quantification is voided an explanation is required in aqd:comment.
error type: WARNING

The unit of measurement of the Source Apportioment must match recommended unit for the pollutant.
type: Concept
notation: I18
definition: Across all the delivery: check that the unit attribute (.../aqd:QuantityCommented/aqd:quantity@uom) corresponds to the recommended unit (via vocabulary) of the pollutant found at aqd:AQD_Attainment/aqd:pollutant xlink:href attribute for the AQD_Attainment record cited by ./aqd:parentExceedanceSituation
status: valid
status modified: 2023-05-04
accepted date: 2023-05-04
in scheme: AQD - Quality control and assurance on CDR
hidden label: The unit of measurement of the Source Apportioment must match recommended unit for the pollutant.
error type: WARNING

The total regional background source contribution must be equal to the sum of its components.
type: Concept
notation: I19
definition: aqd:AQD_SourceApportionment/aqd:regionalBackground/aqd:RegionalBackground/aqd:total/aqd:QuantityCommented/aqd:quantity must equal to the sum of aqd:regionalBackground/aqd:RegionalBackground/aqd:fromWithinMS/aqd:QuantityCommented/aqd:quantity + aqd:regionalBackground/aqd:RegionalBackground/aqd:transboundary/aqd:QuantityCommented/aqd:quantity + aqd:regionalBackground/aqd:RegionalBackground/aqd:natural /aqd:QuantityCommented/aqd:quantity + aqd:regionalBackground/aqd:RegionalBackground/aqd:other/aqd:QuantityCommented/aqd:quantity
status: valid
status modified: 2023-05-04
accepted date: 2023-05-04
in scheme: AQD - Quality control and assurance on CDR
hidden label: The total regional background source contribution must be equal to the sum of its components.
error type: WARNING

Number of NEW source apportionment records in this delivery.
type: Concept
notation: I2
definition: Compile & feedback upon the total number of new Source Apportionments records included in the delivery. ERROR will be returned if XML is a new delivery and localId are not new compared to previous deliveries.
status: valid
status modified: 2023-05-04
accepted date: 2023-05-04
in scheme: AQD - Quality control and assurance on CDR
hidden label: Number of new Source Apportionments compared to previous report. ERROR will be returned if XML is a new delivery and localId are not new compared to previous deliveries.
error type: WARNING

The total urban background source contribution must be equal to the sum of its components.
type: Concept
notation: I20
definition: aqd:AQD_SourceApportionment/aqd:urbanBackground/aqd:UrbanBackground/aqd:total/aqd:QuantityCommented/aqd:quantity must equal the sum of aqd:urbanBackground/aqd:UrbanBackground/aqd:traffic/aqd:QuantityCommented/aqd:quantity + aqd:urbanBackground/aqd:UrbanBackground/aqd:heatAndPowerProduction/aqd:QuantityCommented/aqd:quantity + aqd:urbanBackground/aqd:UrbanBackground/aqd:agriculture/aqd:QuantityCommented/aqd:quantity + aqd:urbanBackground/aqd:UrbanBackground/aqd:commercialAndResidential/aqd:QuantityCommented/aqd:quantity + aqd:urbanBackground/aqd:UrbanBackground/aqd:shipping/aqd:QuantityCommented/aqd:quantity + aqd:urbanBackground/aqd:UrbanBackground/aqd:offRoadMobileMachinery/aqd:QuantityCommented/aqd:quantity + aqd:urbanBackground/aqd:UrbanBackground/aqd:natural/aqd:QuantityCommented/aqd:quantity + aqd:urbanBackground/aqd:UrbanBackground/aqd:transboundary/aqd:QuantityCommented/aqd:quantity + aqd:urbanBackground/aqd:UrbanBackground/aqd:other/aqd:QuantityCommented/aqd:quantity
status: valid
status modified: 2023-05-04
accepted date: 2023-05-04
in scheme: AQD - Quality control and assurance on CDR
hidden label: The total urban background source contribution must be equal to the sum of its components.
error type: WARNING

The total local increment source contribution must be equal to the sum of its components.
type: Concept
notation: I21
definition: aqd:AQD_SourceApportionment/aqd:localIncrement/aqd:LocalIncrement/aqd:total/aqd:QuantityCommented/aqd:quantity must equal to the sum of aqd:localIncrement/aqd:LocalIncrement/aqd:traffic/aqd:QuantityCommented/aqd:quantity + aqd:localIncrement/aqd:LocalIncrement/aqd:heatAndPowerProduction/aqd:QuantityCommented/aqd:quantity + aqd:localIncrement/aqd:LocalIncrement/aqd:agriculture/aqd:QuantityCommented/aqd:quantity + aqd:localIncrement/aqd:LocalIncrement/aqd:commercialAndResidential/aqd:QuantityCommented/aqd:quantity + aqd:localIncrement/aqd:LocalIncrement/aqd:shipping/aqd:QuantityCommented/aqd:quantity + aqd:localIncrement/aqd:LocalIncrement/aqd:offRoadMobileMachinery/aqd:QuantityCommented/aqd:quantity + aqd:localIncrement/aqd:LocalIncrement/aqd:natural/aqd:QuantityCommented/aqd:quantity + aqd:localIncrement/aqd:LocalIncrement/aqd:transboundary/aqd:QuantityCommented/aqd:quantity + aqd:localIncrement/aqd:LocalIncrement/aqd:other/aqd:QuantityCommented/aqd:quantity
status: valid
status modified: 2023-05-04
accepted date: 2023-05-04
in scheme: AQD - Quality control and assurance on CDR
hidden label: The total local increment source contribution must be equal to the sum of its components.
error type: WARNING

The macro exceedance situation relevant to the source apportionment must be populated.
type: Concept
notation: I22
definition: aqd:AQD_SourceApportionment/aqd:macroExceedanceSituation must be presented and must not be an empty tag
status: valid
status modified: 2023-05-04
accepted date: 2023-05-04
in scheme: AQD - Quality control and assurance on CDR
hidden label: The macro exceedance situation relevant to the source apportionment must be populated.
error type: BLOCKER

numericalExceedance or numberExceedances must be provided
type: Concept
notation: I23
definition: Either aqd:AQD_SourceApportionment/aqd:macroExceedanceSituation/aqd:numericalExceedance OR aqd:AQD_SourceApportionment/aqd:macroExceedanceSituation/aqd:numberExceedances must be provided (just one or the other) AS an integer or floating point numeric > 0 (no more that 2 decimal places expected)
status: valid
status modified: 2023-05-04
accepted date: 2023-05-04
in scheme: AQD - Quality control and assurance on CDR
hidden label: numericalExceedance or numberExceedances must be provided
error type: ERROR

Area Classification is mandatory and must conform to vocabulary.
type: Concept
notation: I24
definition: The content of /aqd:macroExceedanceSituation/aqd:ExceedanceDescription/aqd:exceedanceArea/aqd:ExceedanceArea/aqd:areaClassification xlink:xref must be provided and must resolve to a areaClassification in http://dd.eionet.europa.eu/vocabulary/aq/areaclassification/
status: valid
status modified: 2023-05-04
accepted date: 2023-05-04
in scheme: AQD - Quality control and assurance on CDR
hidden label: Area Classification is mandatory and must conform to vocabulary.
error type: BLOCKER

Area classification should match classification declared in the corresponding Attainment.
type: Concept
notation: I25
definition: aqd:AQD_SourceApportionment/aqd:macroExceedanceSituation/aqd:ExceedanceDescription/aqd:exceedanceArea/aqd:ExceedanceArea/aqd:areaClassification xlink:href attribute shall match those /aqd:AQD_Attainment/aqd:exceedanceDescriptionFinal/aqd:ExceedanceDescription/aqd:exceedanceArea/aqd:ExceedanceArea/aqd:areaClassification xlink:href attribute for the AQD_Attainment record cited by ./aqd:parentExceedanceSituation
status: valid
status modified: 2023-05-04
accepted date: 2023-05-04
in scheme: AQD - Quality control and assurance on CDR
hidden label: Area classification should match classification declared in the corresponding Attainment.
error type: WARNING

Exceedence area uom attribute must be in Square kilometers (use http://dd.eionet.europa.eu/vocabulary/uom/area/km2).
type: Concept
notation: I26
definition: /aqd:macroExceedanceSituation/aqd:ExceedanceDescription/aqd:exceedanceArea/aqd:ExceedanceArea/aqd:surfaceArea uom attribute shall resolve to http://dd.eionet.europa.eu/vocabulary/uom/area/km2
status: valid
status modified: 2023-05-04
accepted date: 2023-05-04
in scheme: AQD - Quality control and assurance on CDR
hidden label: Exceedence area uom attribute must be in Square kilometers (use http://dd.eionet.europa.eu/vocabulary/uom/area/km2).
error type: ERROR

Road Length attribute must be in kilometers (use http://dd.eionet.europa.eu/vocabulary/uom/length/km).
type: Concept
notation: I27
definition: /aqd:macroExceedanceSituation/aqd:ExceedanceDescription/aqd:exceedanceArea/aqd:ExceedanceArea/aqd:roadLength uom attribute shall be http://dd.eionet.europa.eu/vocabulary/uom/length/km
status: valid
status modified: 2023-05-04
accepted date: 2023-05-04
in scheme: AQD - Quality control and assurance on CDR
hidden label: Road Length attribute must be in kilometers (use http://dd.eionet.europa.eu/vocabulary/uom/length/km).
error type: ERROR

A link to the exceeding SamplingPoint(s) and/or Model(s) must be provided [at least one].
type: Concept
notation: I29
definition: ./aqd:macroExceedanceSituation/aqd:ExceedanceDescription/aqd:exceedanceArea/aqd:ExceedanceArea/aqd:stationUsed OR ./aqd:macroExceedanceSituation/aqd:ExceedanceDescription/aqd:exceedanceArea/aqd:ExceedanceArea/aqd:modelUsed must be populated If using PAPERS, please ensure that A.2.5.6(a) or A.2.5.6(b) are filled in. For "Station used" ensure that you link to the SAMPLINGPOINT localId
status: valid
status modified: 2023-05-04
accepted date: 2023-05-04
in scheme: AQD - Quality control and assurance on CDR
hidden label: A link to the exceeding SamplingPoint(s) and/or Model(s) must be provided [at least one].
error type: ERROR

Number of existing Plans compared to previous report. ERROR will be returned if XML is an update and ALL localId (100%) are different to previous delivery (for the same YEAR).
type: Concept
notation: I3
definition: Compile & feedback upon the total number of updated Source Apportionments included in the delivery. ERROR will be returned if XML is an update and ALL localId (100%) are different to previous delivery (for the same YEAR).
status: valid
status modified: 2023-05-04
accepted date: 2023-05-04
in scheme: AQD - Quality control and assurance on CDR
hidden label: Number of existing Plans compared to previous report. ERROR will be returned if XML is an update and ALL localId (100%) are different to previous delivery (for the same YEAR).
error type: WARNING

If SamplingPoint(s) and/or Model(s) are provided these must be valid.
type: Concept
notation: I30
definition: If aqd:stationUsed and/or aqd:modelUsed are populated these must be valid elementsstationUsed must link To SamplingPoint via namespace/localidmodelUsed must link to AQD_Model via namespace/ localidIf aqd:station
status: valid
status modified: 2023-05-04
accepted date: 2023-05-04
in scheme: AQD - Quality control and assurance on CDR
hidden label: If SamplingPoint(s) and/or Model(s) are provided these must be valid.
error type: ERROR

The models referenced here must be found in the Attainment document (dataflow G). The following models do not appear in the Attainment documents deliver for this reporting year.
type: Concept
notation: I31
definition: The subject of ./aqd:macroExceedanceSituation/aqd:ExceedanceDescription/aqd:exceedanceArea/aqd:ExceedanceArea/aqd:modelUsed xlink:href attribute shall be found in /aqd:AQD_Attainment/aqd:exceedanceDescriptionFinal/aqd:ExceedanceDescription/aqd:exceedanceArea/aqd:ExceedanceArea/aqd:modelUsed xlink:href attribute for the AQD_Attainment record cited by ./aqd:parentExceedanceSituation
status: valid
status modified: 2023-05-04
accepted date: 2023-05-04
in scheme: AQD - Quality control and assurance on CDR
hidden label: The exceeding AQ_Model must be included in the corresponding Attainment.
error type: ERROR

I32
type: Concept
notation: I32
preferred label: The link to sampling points referenced here must be found in the Attainment document (dataflow G). The following sampling points do not appear in the linked Attainment. Hint: do not xlink to station eiocode/localId
definition: THIS CHECK IS NOT WORKING 100% HINT: Ensure the link is to a Sampling Point localId, NOT a station nor station EOICODE. The subject of ./aqd:macroExceedanceSituation/aqd:ExceedanceDescription/aqd:exceedanceArea/aqd:ExceedanceArea/aqd:stationlUsed xlink:href attribute shall be found in /aqd:AQD_Attainment/aqd:exceedanceDescriptionFinal/aqd:ExceedanceDescription/aqd:exceedanceArea/aqd:ExceedanceArea/aqd:modelUsed xlink:href attribute for the AQD_Attainment record cited by ./aqd:parentExceedanceSituation
status: valid
status modified: 2023-05-04
accepted date: 2023-05-04
in scheme: AQD - Quality control and assurance on CDR
hidden label: The exceeding SamplingPoint must be included in the corresponding Attainment.
error type: ERROR

Spatial extent or administrative unit may be provided.
type: Concept
notation: I33
definition: ./aqd:macroExceedanceSituation/aqd:ExceedanceDescription/aqd:exceedanceArea/aqd:ExceedanceArea/aqd:spatalExtent OR./aqd:macroExceedanceSituation/aqd:ExceedanceDescription/aqd:exceedanceArea/aqd:ExceedanceArea/aqd:administrativeUnit shall be populated
status: valid
status modified: 2023-05-04
accepted date: 2023-05-04
in scheme: AQD - Quality control and assurance on CDR
hidden label: Spatial extent or administrative unit may be provided.
error type: SKIPPED

Information on surface area or road length shall be provided.
type: Concept
notation: I34
definition: ./aqd:macroExceedanceSituation/aqd:ExceedanceDescription/aqd:exceedanceArea/aqd:ExceedanceArea/aqd:surfaceArea OR./aqd:macroExceedanceSituation/aqd:ExceedanceDescription/aqd:exceedanceArea/aqd:ExceedanceArea/aqd:roadLength shall be populated
status: valid
status modified: 2023-05-04
accepted date: 2023-05-04
in scheme: AQD - Quality control and assurance on CDR
hidden label: Information on surface area or road length shall be provided.
error type: ERROR

If exceedance is TRUE: information on population exposed must be provided.
type: Concept
notation: I35
definition: WHERE./aqd:macroExceedanceSituation/aqd:ExceedanceDescription/aqd:exceedance shall EQUAL “true” /aqd:macroExceedanceSituation/aqd:ExceedanceDescription/aqd:exceedanceExposure/aqd:ExceedanceExposure/aqd:populationExposed shall be populated
status: valid
status modified: 2023-05-04
accepted date: 2023-05-04
in scheme: AQD - Quality control and assurance on CDR
hidden label: If exceedance is TRUE: information on population exposed must be provided.

If exceedance is TRUE: information on area exposed must be provided.
type: Concept
notation: I36
definition: /aqd:macroExceedanceSituation/aqd:ExceedanceDescription/aqd:exceedanceExposure/aqd:ExceedanceExposure/aqd:ecosystemAreaExposed shall be populated
status: invalid
status modified: 2023-05-04
accepted date: 2023-05-04
in scheme: AQD - Quality control and assurance on CDR
hidden label: If exceedance is TRUE: information on area exposed must be provided.

Reference year for the population/exposure data in yyyy format.
type: Concept
notation: I37
definition: aqd:AQD_SourceApportionment/aqd:macroExceedanceSituation/aqd:ExceedanceDescription/aqd:exceedanceExposure/aqd:ExceedanceExposure/aqd:referenceYear/gml:TimeInstant/gml:timePosition shall be a calendar year in yyyy format
status: valid
status modified: 2023-05-04
accepted date: 2023-05-04
in scheme: AQD - Quality control and assurance on CDR
hidden label: Reference year for the population/exposure data in yyyy format.
error type: ERROR

Exceedance reason must match vocabulary.
type: Concept
notation: I38
definition: aqd:AQD_SourceApportionment/aqd:macroExceedanceSituation/aqd:ExceedanceDescription/aqd:exceedanceExposure/aqd:reason shall conform to vocabulary http://dd.eionet.europa.eu/vocabulary/aq/exceedancereason/
status: valid
status modified: 2023-05-04
accepted date: 2023-05-04
in scheme: AQD - Quality control and assurance on CDR
hidden label: Exceedance reason must match vocabulary.
error type: WARNING

If the pollutant is SO2 / PM10 / PM2.5 or CO, deduction assessment methods may be populated.
type: Concept
notation: I39
definition: /aqd:AQD_SourceApportionment/aqd:macroExceedanceSituation/aqd:ExceedanceDescription/aqd:deductionAssessmentMethod/aqd:AdjustmentMethod may be populated if ./aqd:pollutant xlink:href attribute EQUALs http://dd.eionet.europa.eu/vocabulary/aq/pollutant/[1/5/10/6001] (via …/aqd:parentExceedanceSituation)
status: valid
status modified: 2023-05-04
accepted date: 2023-05-04
in scheme: AQD - Quality control and assurance on CDR
hidden label: If the pollutant is SO2 / PM10 / PM2.5 or CO, deduction assessment methods may be populated.

List of unique identifier information for all Source Apportionments records. ERROR will be returned if no SA(s) are provided.
type: Concept
notation: I4
definition: Compile & feedback a list of the unique identifier information for all Source Apportionments records included in the delivery. Feedback report shall include the gml:id attribute - ./aqd:inspireId - aqd:AQD_Plan (via ./usedInPlan) - aqd:AQD_Attainment (via aqd:parentExceedanceSituation) - aqd:pollutant (via Attainment link under aqd:parentExceedanceSituation)
status: valid
status modified: 2023-05-04
accepted date: 2023-05-04
in scheme: AQD - Quality control and assurance on CDR
hidden label: List of unique identifier information for all Source Apportionments records. ERROR will be returned if no SA(s) are provided.
error type: BLOCKER

If the pollutant is SO2 / PM10 / PM2.5 or CO, the aqd:adjustmentType MUST be either (fullyCorrected noneApplicable noneApplied) under aqd:deductionAssessmentMethod
type: Concept
notation: I40
definition: WHERE ./aqd:pollutant xlink:href attribute EQUALs http://dd.eionet.europa.eu/vocabulary/aq/pollutant/[1/5/10/6001] (via …/aqd:parentExceedanceSituation then /aqd:AQD_SourceApportionment/aqd:macroExceedanceSituation/aqd:ExceedanceDescription/aqd:deductionAssessmentMethod/aqd:AdjustmentMethod/aqd:assessmentMethod/aqd:adjustmentType must conform to http://dd.eionet.europa.eu/vocabulary/aq/adjustmenttype (fullyCorrected noneApplicable noneApplied)
status: valid
status modified: 2023-05-04
accepted date: 2023-05-04
in scheme: AQD - Quality control and assurance on CDR
hidden label: If the pollutant is SO2 / PM10 / PM2.5 or CO, the aqd:adjustmentType MUST be either (fullyCorrected noneApplicable noneApplied) under aqd:deductionAssessmentMethod
error type: ERROR

If the pollutant is SO2 / PM10 / PM2.5 or CO, a description of the assessment type is expected.
type: Concept
notation: I41
definition: WHERE ./aqd:pollutant xlink:href attribute EQUALs http://dd.eionet.europa.eu/vocabulary/aq/pollutant/[1/5/10/6001] (via …/aqd:parentExceedanceSituation then /aqd:AQD_SourceApportionment/aqd:macroExceedanceSituation/aqd:ExceedanceDescription/aqd:deductionAssessmentMethod/aqd:AdjustmentMethod/aqd:assessmentMethod/aqd:AssessmentMethods/aqd:assessmentTypeDescription must be populated.
status: valid
status modified: 2023-05-04
accepted date: 2023-05-04
in scheme: AQD - Quality control and assurance on CDR
hidden label: If the pollutant is SO2 / PM10 / PM2.5 or CO, a description of the assessment type is expected.
error type: ERROR

If the pollutant is SO2 / PM10 / PM2.5 or CO and deductionAssessmentMethod is populated, adjustmentType must be "fullyCorrected" (else "noneApplicable").
type: Concept
notation: I44
definition: If aqd:AQD_SourceApportionment/aqd:macroExceedanceSituation/aqd:ExceedanceDescription/aqd:deductionAssessmentMethod/aqd:AdjustmentMethod/aqd:adjustmentType is populated WHERE ./aqd:pollutant xlink:href attribute EQUALs http://dd.eionet.europa.eu/vocabulary/aq/pollutant/[1/5/10/6001] (via …/aqd:parentExceedanceSituation) the xlink:href must be "fullyCorrected" if another pollutant it must be "noneApplicable"
status: valid
status modified: 2023-05-04
accepted date: 2023-05-04
in scheme: AQD - Quality control and assurance on CDR
hidden label: If the pollutant is SO2 / PM10 / PM2.5 or CO and deductionAssessmentMethod is populated, adjustmentType must be "fullyCorrected" (else "noneApplicable").
error type: ERROR

If the pollutant is SO2 / PM10 / PM2.5 or CO and deductionAssessmentMethod is populated, adjustmentSource must conform with vocabulary (else "noneApplicable").
type: Concept
notation: I45
definition: WHERE ./aqd:pollutant xlink:href attribute EQUALs http://dd.eionet.europa.eu/vocabulary/aq/pollutant/[1/5/10/6001] (via …/aqd:parentExceedanceSituation) then /aqd:AQD_SourceApportionment/aqd:macroExceedanceSituation/aqd:ExceedanceDescription/aqd:deductionAssessmentMethod/aqd:AdjustmentMethod/aqd:adjustmentSource must be populated & the content of the xlink:href shall conform to http://dd.eionet.europa.eu/vocabulary/aq/adjustmentsourcetype (else this element must not be populated
status: valid
status modified: 2023-05-04
accepted date: 2023-05-04
in scheme: AQD - Quality control and assurance on CDR
hidden label: If the pollutant is SO2 / PM10 / PM2.5 or CO and deductionAssessmentMethod is populated, adjustmentSource must conform with vocabulary (else
error type: ERROR

If the pollutant is SO2 / PM10 / PM2.5 or CO, a link to the assessment method in D or D1b is required via xlink:href attribute.
type: Concept
notation: I42
definition: WHERE ./aqd:pollutant xlink:href attribute EQUALs http://dd.eionet.europa.eu/vocabulary/aq/pollutant/[1/5/10/6001] (via …/aqd:parentExceedanceSituation) at least one of /aqd:AQD_SourceApportionment/aqd:macroExceedanceSituation/aqd:ExceedanceDescription/aqd:deductionAssessmentMethod/aqd:AdjustmentMethod/aqd:assessmentMethod/aqd:AssessmentMethods/aqd:samplingPointAssessmentMetadata/@xlink:hrefor/aqd:AQD_SourceApportionment/aqd:macroExceedanceSituation/aqd:ExceedanceDescription/aqd:deductionAssessmentMethod/aqd:AdjustmentMethod/aqd:assessmentMethod/aqd:AssessmentMethods/aqd:modelAssessmentMetadata/@xlink:href must be populated and correctly link to D/D1b. Cross check the links provided against D – all assessment methods must exist in D
status: valid
status modified: 2023-05-04
accepted date: 2023-05-04
in scheme: AQD - Quality control and assurance on CDR
hidden label: If the pollutant is SO2 / PM10 / PM2.5 or CO, a link to the assessment method in D or D1b is required via xlink:href attribute.
error type: ERROR

If the pollutant is NOT SO2 / PM10 / PM2.5 or CO, the following elements are not expected: assessmentType link to adjusting sampling point/model, assessmentTypeDescription, assessmentType.
type: Concept
notation: I43
definition: WHERE ./aqd:pollutant xlink:href attribute does NOT EQUAL http://dd.eionet.europa.eu/vocabulary/aq/pollutant/[1/5/10/6001] (via …/aqd:parentExceedanceSituatio) the following elments must be empty or not provided: /aqd:AQD_SourceApportionment/aqd:macroExceedanceSituation/aqd:ExceedanceDescription/aqd:deductionAssessmentMethod/aqd:AdjustmentMethod/aqd:assessmentMethod/aqd:AssessmentMethods/aqd:assessmentType ; /aqd:AQD_SourceApportionment/aqd:macroExceedanceSituation/aqd:ExceedanceDescription/aqd:deductionAssessmentMethod/aqd:AdjustmentMethod/aqd:assessmentMethod/aqd:AssessmentMethods/aqd:samplingPointAssessmentMetadata/@xlink:href ; /aqd:AQD_SourceApportionment/aqd:macroExceedanceSituation/aqd:ExceedanceDescription/aqd:deductionAssessmentMethod/aqd:AdjustmentMethod/aqd:assessmentMethod/aqd:AssessmentMethods/aqd:modelAssessmentMetadata/@xlink:href ; /aqd:AQD_SourceApportionment/aqd:macroExceedanceSituation/aqd:ExceedanceDescription/aqd:deductionAssessmentMethod/aqd:AdjustmentMethod/aqd:assessmentMethod/aqd:AssessmentMethods/aqd:assessmentTypeDescription ; /aqd:AQD_SourceApportionment/aqd:macroExceedanceSituation/aqd:ExceedanceDescription/aqd:deductionAssessmentMethod/aqd:AdjustmentMethod/aqd:assessmentMethod/aqd:AssessmentMethods/aqd:assessmentType
status: valid
status modified: 2023-05-04
accepted date: 2023-05-04
in scheme: AQD - Quality control and assurance on CDR
hidden label: If the pollutant is NOT SO2 / PM10 / PM2.5 or CO, the following elements are not expected: assessmentType link to adjusting sampling point/model, assessmentTypeDescription, assessmentType.
error type: WARNING

All gml ID attributes shall have unique code.
type: Concept
notation: I7
definition: All gml:id attributes - ef:inspireId and aqd:inspireId elements shall have unique content
status: valid
status modified: 2023-05-04
accepted date: 2023-05-04
in scheme: AQD - Quality control and assurance on CDR
hidden label: All gml ID attributes shall have unique code.
error type: BLOCKER

Local Id of the Source Apportionments must be unique.
type: Concept
notation: I8
definition: ./aqd:inspireId/base:Identifier/base:localId must be unique code for the Plans records
status: valid
status modified: 2023-05-04
accepted date: 2023-05-04
in scheme: AQD - Quality control and assurance on CDR
hidden label: Local Id of the Source Apportionments must be unique.
error type: BLOCKER

List unique namespaces and count number of elements.
type: Concept
notation: I9
definition: ./aqd:inspireId/base:Identifier/base:namespace List base:namespace and count the number of base:localId assigned to each base:namespace.
status: valid
status modified: 2023-05-04
accepted date: 2023-05-04
in scheme: AQD - Quality control and assurance on CDR
hidden label: List unique namespaces and count number of elements.
error type: INFO

Check if delivery if this is a new delivery or updated delivery (via reporting year)
type: Concept
notation: J0
definition: Checks if this delivery is new or an update (on same reporting year)
status: valid
status modified: 2023-05-04
accepted date: 2023-05-04
in scheme: AQD - Quality control and assurance on CDR
hidden label: Check if delivery if this is a new delivery or updated delivery (via reporting year)
error type: WARNING

Number of AQ Scenarios reported
type: Concept
notation: J1
definition: Compile & feedback upon the total number of scenario records included in the delivery
status: valid
status modified: 2023-05-04
accepted date: 2023-05-04
in scheme: AQD - Quality control and assurance on CDR
hidden label: Compile & feedback upon the total number of scenario records included in the delivery
error type: BLOCKER

Check if namespace is registered in vocabulary (http://dd.eionet.europa.eu/vocabulary/aq/namespace/view)
type: Concept
notation: J10
definition: Check if namespace is registered in vocabulary (http://dd.eionet.europa.eu/vocabulary/aq/namespace/view)
status: valid
status modified: 2023-05-04
accepted date: 2023-05-04
in scheme: AQD - Quality control and assurance on CDR
hidden label: Check if namespace is registered in vocabulary (http://dd.eionet.europa.eu/vocabulary/aq/namespace/view)
error type: BLOCKER

You must provide a reference to a plan document from data flow H via its namespace & localId. The plan document must have the same reporting year as the scenario document.
type: Concept
notation: J11
definition: aqd:AQD_EvaluationScenario/aqd:usedInPlan shall reference an existing AQD_Plan (H) document for the same reporting year same year via namespace/localId
status: valid
status modified: 2023-05-04
accepted date: 2023-05-04
in scheme: AQD - Quality control and assurance on CDR
hidden label: You must provide a reference to a plan document from data flow H via its namespace & localId. The plan document must have the same reporting year as the scenario document.
error type: BLOCKER

You must provide a link to a Source Apportionment (I) document from data flow I via its namespace & localId (for the same reporting year).
type: Concept
notation: J12
definition: aqd:AQD_EvaluationScenario/aqd:sourceApportionment MUST reference an existing AQD_SourceApportionment (I) document via namespace/localId record for the same reporting year .
status: valid
status modified: 2023-05-04
accepted date: 2023-05-04
in scheme: AQD - Quality control and assurance on CDR
hidden label: You must provide a link to a Source Apportionment (I) document from data flow I via its namespace & localId (for the same reporting year).
error type: ERROR

A code of the scenario should be provided as an alpha-numeric code starting with the country ISO code.
type: Concept
notation: J13
definition: aqd:AQD_EvaluationScenario/aqd:codeOfScenario should begin with with the 2-digit country code according to ISO 3166-1.
status: valid
status modified: 2023-05-04
accepted date: 2023-05-04
in scheme: AQD - Quality control and assurance on CDR
hidden label: A code of the scenario should be provided as an alpha-numeric code starting with the country ISO code.
error type: SKIPPED

Short textul description of the publication should be provided. Include the ISBN number if available.
type: Concept
notation: J14
definition: aqd:AQD_EvaluationScenario/aqd:publication/aqd:Publication/aqd:description shall be a text string
status: valid
status modified: 2023-05-04
accepted date: 2023-05-04
in scheme: AQD - Quality control and assurance on CDR
hidden label: Short textul description of the publication should be provided. Include the ISBN number if available.
error type: ERROR

You should provide title as written in the publication.
type: Concept
notation: J15
definition: aqd:AQD_EvaluationScenario/aqd:publication/aqd:Publication/aqd:title shall be a text string
status: valid
status modified: 2023-05-04
accepted date: 2023-05-04
in scheme: AQD - Quality control and assurance on CDR
hidden label: You should provide title as written in the publication.
error type: ERROR

Author(s) should be provided as text (Please provide in one field separated by commas if there are multiple authors).
type: Concept
notation: J16
definition: aqd:AQD_EvaluationScenario/aqd:publication/aqd:Publication/aqd:author shall be a text string (if provided)
status: valid
status modified: 2023-05-04
accepted date: 2023-05-04
in scheme: AQD - Quality control and assurance on CDR
hidden label: Author(s) should be provided as text (Please provide in one field separated by commas if there are multiple authors).
error type: WARNING

The publication date should be provided in yyyy or yyyy-mm-dd format.
type: Concept
notation: J17
definition: aqd:AQD_EvaluationScenario/aqd:publication/aqd:Publication/aqd:publicationDate/gml:TimeInstant/gml:timePosition may be a data in yyyy or yyyy-mm-dd format
status: valid
status modified: 2023-05-04
accepted date: 2023-05-04
in scheme: AQD - Quality control and assurance on CDR
hidden label: The publication date should be provided in yyyy or yyyy-mm-dd format.
error type: BLOCKER

Publisher should be provided as a text (Publishing institution / academic journal / etc.)
type: Concept
notation: J18
definition: aqd:AQD_EvaluationScenario/aqd:publication/aqd:Publication/aqd:publisher shall be a text string
status: valid
status modified: 2023-05-04
accepted date: 2023-05-04
in scheme: AQD - Quality control and assurance on CDR
hidden label: Publisher should be provided as a text (Publishing institution / academic journal / etc.)
error type: BLOCKER

Url to the published AQ Scenario should be valid (if provided).
type: Concept
notation: J19
definition: aqd:AQD_EvaluationScenario/aqd:publication/aqd:Publication/aqd:webLink as a valid url (if provided)
status: valid
status modified: 2023-05-04
accepted date: 2023-05-04
in scheme: AQD - Quality control and assurance on CDR
hidden label: Url to the published AQ Scenario should be valid (if provided).
error type: ERROR

Number of new EvaluationScenarios compared to previous report.
type: Concept
notation: J2
definition: Compile & feedback upon the total number of new EvaluationScenarios records included in the delivery. ERROR will be returned if XML is a new delivery and localId are not new compared to previous deliveries.
status: valid
status modified: 2023-05-04
accepted date: 2023-05-04
in scheme: AQD - Quality control and assurance on CDR
hidden label: Number of new EvaluationScenarios compared to previous report.
error type: INFO

The year for which the projections are developed must be provided and the yyyy format must be used.
type: Concept
notation: J20
definition: aqd:AQD_EvaluationScenario/aqd:attainmentYear/gml:TimeInstant/gml:timePosition must be provided and must conform to yyyy format
status: valid
status modified: 2023-05-04
accepted date: 2023-05-04
in scheme: AQD - Quality control and assurance on CDR
hidden label: The year for which the projections are developed must be provided and the yyyy format must be used.
error type: BLOCKER

Reference year from which the projections started and for which the scenario is available must be provided and must conform to yyyy format.
type: Concept
notation: J21
definition: aqd:AQD_EvaluationScenario/aqd:startYear/gml:TimeInstant/gml:timePosition must be provided and must conform to yyyy format
status: valid
status modified: 2023-05-04
accepted date: 2023-05-04
in scheme: AQD - Quality control and assurance on CDR
hidden label: Reference year from which the projections started and for which the scenario is available must be provided and must conform to yyyy format.
error type: BLOCKER

Check if start year of the evaluation scenario is the same as the source apportionment reference year.
type: Concept
notation: J22
definition: Check aqd:AQD_EvaluationScenario/aqd:startYear/gml:TimeInstant/gml:timePosition must be equal to aqd:AQD_SourceApportionment/aqd:referenceYear/gml:TimeInstant/gml:timePosition referenced via the xlink of (aqd:AQD_EvaluationScenario/aqd:sourceApportionment)
status: invalid
status modified: 2023-05-04
accepted date: 2023-05-04
in scheme: AQD - Quality control and assurance on CDR
hidden label: Check if start year of the evaluation scenario is the same as the source apportionment reference year.
error type: WARNING

A description of the emission scenario used for the baseline analysis should be provided as text.
type: Concept
notation: J23
definition: aqd:AQD_EvaluationScenario/aqd:baselineScenario/aqd:Scenario/aqd:description shall be a text string
status: valid
status modified: 2023-05-04
accepted date: 2023-05-04
in scheme: AQD - Quality control and assurance on CDR
hidden label: A description of the emission scenario used for the baseline analysis should be provided as text.
error type: ERROR

The baseline total emissions should be provided as integer with correct unit.
type: Concept
notation: J24
definition: Check that the element aqd:AQD_EvaluationScenario/aqd:baselineScenario/aqd:Scenario/aqd:totalEmissions is an integer or floating point numeric >= 0 and the unit (@uom) shall resolve to the codelist http://dd.eionet.europa.eu/vocabulary/uom/emission/kt.year-1
status: valid
status modified: 2023-05-04
accepted date: 2023-05-04
in scheme: AQD - Quality control and assurance on CDR
hidden label: The baseline total emissions should be provided as integer with correct unit.
error type: BLOCKER

The expected concentration (under baseline scenario) should be provided as an integer and its unit should conform to vocabulary (use http://dd.eionet.europa.eu/vocabulary/uom/concentration/).
type: Concept
notation: J25
definition: Check that the element aqd:AQD_EvaluationScenario/aqd:baselineScenario/aqd:AQD_Scenario/aqd:expectedConcentration is an integer or floating point numeric >= 0 and the unit (@uom) shall resolve to the codelist http://dd.eionet.europa.eu/vocabulary/uom/concentration/
status: valid
status modified: 2023-05-04
accepted date: 2023-05-04
in scheme: AQD - Quality control and assurance on CDR
hidden label: The expected concentration (under baseline scenario) should be provided as an integer and its unit should conform to vocabulary (use http://dd.eionet.europa.eu/vocabulary/uom/concentration/).
error type: BLOCKER

The number of exceecedance expected (under baseline scenario) should be provided as an integer
type: Concept
notation: J26
definition: Check that the element aqd:AQD_EvaluationScenario/aqd:baselineScenario/aqd:AQD_Scenario/aqd:expectedExceedances is an integer or floating point numeric >= 0
status: valid
status modified: 2023-05-04
accepted date: 2023-05-04
in scheme: AQD - Quality control and assurance on CDR
hidden label: The number of exceecedance expected (under baseline scenario) should be provided as an integer and its unit should conform to vocabulary (use http://dd.eionet.europa.eu/vocabulary/uom/statistics).
error type: ERROR

Measures identified in the AQ Plan that are included in this baseline scenario should be provided (link to dataflow K).
type: Concept
notation: J27
definition: aqd:AQD_EvaluationScenario/aqd:baselineScenario/aqd:Scenario/aqd:measuresApplied shall reference an existing AQD_Measures delivered within a data flow K and the reporting year of K & J shall be the same year via namespace/localId.
status: valid
status modified: 2023-05-04
accepted date: 2023-05-04
in scheme: AQD - Quality control and assurance on CDR
hidden label: Measures identified in the AQ Plan that are included in this baseline scenario should be provided (link to dataflow K).
error type: WARNING

A description of the emission scenario used for the projection analysis should be provided as text.
type: Concept
notation: J28
definition: aqd:AQD_EvaluationScenario/aqd:projectionScenario/aqd:Scenario/aqd:description shall be a text string
status: valid
status modified: 2023-05-04
accepted date: 2023-05-04
in scheme: AQD - Quality control and assurance on CDR
hidden label: A description of the emission scenario used for the projection analysis should be provided as text.
error type: ERROR

The projection total emissions should be provided as integer with correct unit.
type: Concept
notation: J29
definition: Check that the element aqd:AQD_EvaluationScenario/aqd:projectionScenario/aqd:Scenario/aqd:totalEmissions is an integer or floating point numeric >= 0 and the unit (@uom) shall resolve to the codelist http://dd.eionet.europa.eu/vocabulary/uom/emission/kt.year-1
status: valid
status modified: 2023-05-04
accepted date: 2023-05-04
in scheme: AQD - Quality control and assurance on CDR
hidden label: The projection total emissions should be provided as integer with correct unit.
error type: BLOCKER

Number of existing EvaluationScenarios compared to previous report. ERROR will be returned if XML is an update and ALL localId (100%) are different to previous delivery (for the same YEAR).
type: Concept
notation: J3
definition: Compile & feedback upon the total number of updated EvaluationScenarios records included in the delivery. ERROR will be returned if XML is an update and ALL localId (100%) are different to previous delivery (for the same YEAR).
status: valid
status modified: 2023-05-04
accepted date: 2023-05-04
in scheme: AQD - Quality control and assurance on CDR
hidden label: Number of existing EvaluationScenarios compared to previous report. ERROR will be returned if XML is an update and ALL localId (100%) are different to previous delivery (for the same YEAR).
error type: WARNING

The expected concentration (under projection scenario) should be provided as an integer and its unit should conform to vocabulary (use http://dd.eionet.europa.eu/vocabulary/uom/concentration/).
type: Concept
notation: J30
definition: Check that the element aqd:AQD_EvaluationScenario/aqd:projectionScenario/aqd:AQD_Scenario/aqd:expectedConcentration is an integer or floating point numeric >= 0 and the unit (@uom) shall resolve to the codelist http://dd.eionet.europa.eu/vocabulary/uom/concentration/
status: valid
status modified: 2023-05-04
accepted date: 2023-05-04
in scheme: AQD - Quality control and assurance on CDR
hidden label: The expected concentration (under projection scenario) should be provided as an integer and its unit should conform to vocabulary (use http://dd.eionet.europa.eu/vocabulary/uom/concentration/).
error type: ERROR

The number of exceecedance expected (under projection scenario) should be provided as an integer a
type: Concept
notation: J31
definition: Check that the element aqd:AQD_EvaluationScenario/aqd:projectionScenario/aqd:AQD_Scenario/aqd:expectedExceedances is an integer or floating point numeric >= 0
status: valid
status modified: 2023-05-04
accepted date: 2023-05-04
in scheme: AQD - Quality control and assurance on CDR
hidden label: The number of exceecedance expected (under projection scenario) should be provided as an integer and its unit should conform to vocabulary (use http://dd.eionet.europa.eu/vocabulary/uom/statistics).
error type: BLOCKER

Measures identified in the AQ Plan that are included in this projection should be provided (link to dataflow K).
type: Concept
notation: J32
definition: aqd:AQD_EvaluationScenario/aqd:projectionScenario/aqd:Scenario/aqd:measuresApplied shall reference an existing AQD_Measures delivered within a data flow K and the reporting year of K & J shall be the same year via namespace/localId.
status: valid
status modified: 2023-05-04
accepted date: 2023-05-04
in scheme: AQD - Quality control and assurance on CDR
hidden label: Measures identified in the AQ Plan that are included in this projection should be provided (link to dataflow K).
error type: WARNING

List of unique identifier information for all EvaluationScenarios records. It returns BLOCKER if no EvaluationScenarios are provided
type: Concept
notation: J4
definition: List of evaluation scenario records in deliver & mandatory cross references. All evaluation scenarios must link to an AQ Plan document (H), a Source Apportionment record (I). A BLOCKER will return if either of these links are missing.
status: valid
status modified: 2023-05-04
accepted date: 2023-05-04
in scheme: AQD - Quality control and assurance on CDR
hidden label: List of unique identifier information for all EvaluationScenarios records. It returns BLOCKER if no EvaluationScenarios are provided.
error type: BLOCKER

All gml ID attributes shall have unique code.
type: Concept
notation: J7
definition: All gml:id attributes ef:inspireId and aqd:inspireId elements shall have unique content
status: valid
status modified: 2023-05-04
accepted date: 2023-05-04
in scheme: AQD - Quality control and assurance on CDR
hidden label: All gml ID attributes shall have unique code.
error type: BLOCKER

Local Ids of the EvaluationScenarios must be unique & not empty
type: Concept
notation: J8
definition: ./aqd:inspireId/base:Identifier/base:localId must be unique code for the Scenario records & not empty
status: valid
status modified: 2023-05-04
accepted date: 2023-05-04
in scheme: AQD - Quality control and assurance on CDR
hidden label: Local Ids of the EvaluationScenarios must be unique.
error type: BLOCKER

Lists unique namespaces and counts number of elements.
type: Concept
notation: J9
definition: ./aqd:inspireId/base:Identifier/base:namespace List base:namespace and count the number of base:localId assigned to each base:namespace.
status: valid
status modified: 2023-05-04
accepted date: 2023-05-04
in scheme: AQD - Quality control and assurance on CDR
hidden label: Lists unique namespaces and counts number of elements.
error type: WARNING

Check if delivery if this is a new delivery or updated delivery (via reporting year)
type: Concept
notation: K0
definition: Checks if this delivery is new or an update (on same reporting year)
status: valid
status modified: 2023-05-04
accepted date: 2023-05-04
in scheme: AQD - Quality control and assurance on CDR
hidden label: Check if delivery if this is a new delivery or updated delivery (via reporting year)
error type: WARNING

Compile & feedback upon the total number of Measures included in the delivery
type: Concept
notation: K01
definition: Number of Measures reported
status: valid
status modified: 2023-05-04
accepted date: 2023-05-04
in scheme: AQD - Quality control and assurance on CDR
hidden label: Compile & feedback upon the total number of Measures included in the delivery
error type: BLOCKER

Number of new Measures compared to previous report. ERROR will be returned if XML is a new delivery and localId are not new compared to previous deliveries.
type: Concept
notation: K02
definition: Compile & feedback upon the total number of new Measures records included in the delivery. ERROR will be returned if XML is a new delivery and localId are not new compared to previous deliveries.
status: valid
status modified: 2023-05-04
accepted date: 2023-05-04
in scheme: AQD - Quality control and assurance on CDR
hidden label: Number of new Measures compared to previous report. ERROR will be returned if XML is a new delivery and localId are not new compared to previous deliveries.
error type: WARNING

Number of existing Measures compared to previous report. ERROR will be returned if XML is an update and ALL localId (100%) are different to previous delivery (for the same YEAR).
type: Concept
notation: K03
definition: Compile & feedback upon the total number of updated Measures included in the delivery. ERROR will be returned if XML is an update and ALL localId (100%) are different to previous delivery (for the same YEAR).
status: valid
status modified: 2023-05-04
accepted date: 2023-05-04
in scheme: AQD - Quality control and assurance on CDR
hidden label: Number of existing Measures compared to previous report. ERROR will be returned if XML is an update and ALL localId (100%) are different to previous delivery (for the same YEAR).
error type: BLOCKER

List of unique identifier information for all Measures records. It returns ERROR if no Measures are reported.
type: Concept
notation: K04
definition: Compile & feedback a list of the unique identifier information for all Measures records included in the delivery. Feedback report shall include the gml:id attribute ./aqd:inspireId aqd:AQD_SourceApportionment (via ./exceedanceAffected) aqd:AQD_Scenario (via aqd:usedForScenario)
status: valid
status modified: 2023-05-04
accepted date: 2023-05-04
in scheme: AQD - Quality control and assurance on CDR
hidden label: List of unique identifier information for all Measures records. It returns ERROR if no Measures are reported.
error type: BLOCKER

reserved
type: Concept
notation: K05
definition: reserved
status: valid
status modified: 2023-05-04
accepted date: 2023-05-04
in scheme: AQD - Quality control and assurance on CDR
hidden label: reserved
error type: reserved

reserved
type: Concept
notation: K06
definition: reserved
status: valid
status modified: 2023-05-04
accepted date: 2023-05-04
in scheme: AQD - Quality control and assurance on CDR
hidden label: reserved
error type: reserved

All gml ID attributes shall have unique code.
type: Concept
notation: K07
definition: All gml:id attributes ef:inspireId and aqd:inspireId elements shall have unique content
status: valid
status modified: 2023-05-04
accepted date: 2023-05-04
in scheme: AQD - Quality control and assurance on CDR
hidden label: All gml ID attributes shall have unique code.
error type: BLOCKER

Local Ids of the Measures must be unique & not empty
type: Concept
notation: K08
definition: ./aqd:inspireId/base:Identifier/base:localId must be unique code for the Measure records & not empty
status: valid
status modified: 2023-05-04
accepted date: 2023-05-04
in scheme: AQD - Quality control and assurance on CDR
hidden label: Local Ids of the Measures must be unique & not empty
error type: BLOCKER

Lists unique namespaces used and counts number of elements.
type: Concept
notation: K09
definition: ./aqd:inspireId/base:Identifier/base:namespace List base:namespace and count the number of base:localId assigned to each base:namespace.
status: valid
status modified: 2023-05-04
accepted date: 2023-05-04
in scheme: AQD - Quality control and assurance on CDR
hidden label: Lists unique namespaces used and counts number of elements.
error type: WARNING

Check if namespace is registered in vocabulary (http://dd.eionet.europa.eu/vocabulary/aq/namespace/view)
type: Concept
notation: K10
definition: Check if namespace is registered in vocabulary (http://dd.eionet.europa.eu/vocabulary/aq/namespace/view)
status: valid
status modified: 2023-05-04
accepted date: 2023-05-04
in scheme: AQD - Quality control and assurance on CDR
hidden label: Check if namespace is registered in vocabulary (http://dd.eionet.europa.eu/vocabulary/aq/namespace/view)
error type: BLOCKER

You must provide a link to a source apportionment document from data flow I via its namespace & localId.
type: Concept
notation: K11
definition: aqd:AQD_Measures/aqd:exceedanceAffected MUST reference an existing Source Apportionment (I) document via namespace/localId
status: valid
status modified: 2023-05-04
accepted date: 2023-05-04
in scheme: AQD - Quality control and assurance on CDR
hidden label: You must provide a link to a source apportionment document from data flow I via its namespace & localId.
error type: BLOCKER

A link may be provided to Evaluation Scenario (J). This must be valid via namespace & localId.
type: Concept
notation: K12
definition: aqd:AQD_Measures/aqd:usedForScenario shall reference an existing Scenario delivered within a data flow J via namespace/localId.
status: valid
status modified: 2023-05-04
accepted date: 2023-05-04
in scheme: AQD - Quality control and assurance on CDR
hidden label: A link may be provided to Evaluation Scenario (J). This must be valid via namespace & localId.
error type: INFO

Measure code should be a unique local identifier for each measure record. For convenience the same code as localId may be used.
type: Concept
notation: K13
definition: aqd:AQD_Measures/aqd:code should be a unique local identifier for each measure record. For convenience the same code as localId may be used
status: valid
status modified: 2023-05-04
accepted date: 2023-05-04
in scheme: AQD - Quality control and assurance on CDR
hidden label: Measure code should be a unique local identifier for each measure record. For convenience the same code as localId may be used.
error type: SKIPPED

You should provide a short name for the measure.
type: Concept
notation: K14
definition: aqd:AQD_Measures/aqd:name must be populated with a text string
status: valid
status modified: 2023-05-04
accepted date: 2023-05-04
in scheme: AQD - Quality control and assurance on CDR
hidden label: You should provide a short name for the measure.
error type: WARNING

You should provide a short description of the measure.
type: Concept
notation: K15
definition: aqd:AQD_Measures/aqd:description must be provided as a text string
status: valid
status modified: 2023-05-04
accepted date: 2023-05-04
in scheme: AQD - Quality control and assurance on CDR
hidden label: You should provide a short description of the measure.
error type: ERROR

Measure classification should conform to vocabulary (use http://dd.eionet.europa.eu/vocabulary/aq/measureclassification/).
type: Concept
notation: K16
definition: aqd:AQD_Measures/aqd:classification shall resolve to the codelist http://dd.eionet.europa.eu/vocabulary/aq/measureclassification/
status: valid
status modified: 2023-05-04
accepted date: 2023-05-04
in scheme: AQD - Quality control and assurance on CDR
hidden label: Measure classification should conform to vocabulary (use http://dd.eionet.europa.eu/vocabulary/aq/measureclassification/).
error type: BLOCKER

Measure type should conform to vocabulary (use http://dd.eionet.europa.eu/vocabulary/aq/measuretype/).
type: Concept
notation: K17
definition: aqd:AQD_Measures/aqd:measureType shall resolve to the codelist http://dd.eionet.europa.eu/vocabulary/aq/measuretype/
status: valid
status modified: 2023-05-04
accepted date: 2023-05-04
in scheme: AQD - Quality control and assurance on CDR
hidden label: Measure type should conform to vocabulary (use http://dd.eionet.europa.eu/vocabulary/aq/measuretype/).
error type: BLOCKER

Administrative level should conform to vocabulary (use http://dd.eionet.europa.eu/vocabulary/aq/administrativelevel/).
type: Concept
notation: K18
definition: aqd:AQD_Measures/aqd:administrativeLevel shall resolve to the codelist http://dd.eionet.europa.eu/vocabulary/aq/administrativelevel/
status: valid
status modified: 2023-05-04
accepted date: 2023-05-04
in scheme: AQD - Quality control and assurance on CDR
hidden label: Administrative level should conform to vocabulary (use http://dd.eionet.europa.eu/vocabulary/aq/administrativelevel/).
error type: BLOCKER

The measure's timescale should conform to vocabulary (use http://dd.eionet.europa.eu/vocabulary/aq/timescale/).
type: Concept
notation: K19
definition: aqd:AQD_Measures/aqd:timeScale shall resolve to the codelist http://dd.eionet.europa.eu/vocabulary/aq/timescale/
status: valid
status modified: 2023-05-04
accepted date: 2023-05-04
in scheme: AQD - Quality control and assurance on CDR
hidden label: The measure's timescale should conform to vocabulary (use http://dd.eionet.europa.eu/vocabulary/aq/timescale/).
error type: BLOCKER

Information on the cost of the measure should be provided.
type: Concept
notation: K20
definition: aqd:AQD_Measures/aqd:costs/ should be provided
status: valid
status modified: 2023-05-04
accepted date: 2023-05-04
in scheme: AQD - Quality control and assurance on CDR
hidden label: Information on the cost of the measure should be provided.
error type: ERROR

The estimated total costs should be provided. If NOT an explanation on the reasons for not providing it should be included.
type: Concept
notation: K21
definition: If aqd:costs provided aqd:AQD_Measures/aqd:costs/aqd:Costs/aqd:estimatedImplementationCosts should be an integer number. If voided /aqd:AQD_Measures/aqd:costs/aqd:Costs/aqd:comment must be populated with an explanation of why no costs are available.
status: valid
status modified: 2023-05-04
accepted date: 2023-05-04
in scheme: AQD - Quality control and assurance on CDR
hidden label: The estimated total costs should be provided. If NOT an explanation on the reasons for not providing it should be included.
error type: ERROR

If the final total costs of the measure is provided, it needs to be a number.
type: Concept
notation: K22
definition: /aqd:AQD_Measures/aqd:costs/aqd:Costs/aqd:finalImplementationCosts should be an integer number if populated
status: valid
status modified: 2023-05-04
accepted date: 2023-05-04
in scheme: AQD - Quality control and assurance on CDR
hidden label: If the final total costs of the measure is provided, it needs to be a number.
error type: BLOCKER

The currency must be provided conforming to vocabulary (http://dd.eionet.europa.eu/vocabulary/common/currencies/), if estimated costs are provided.
type: Concept
notation: K23
definition: If aqd:AQD_Measures/aqd:costs/aqd:Costs/aqd:estimatedImplementationCosts is populated aqd:AQD_Measures/aqd:costs/aqd:Costs/aqd:currency must be populated and shall resolve to the codelist http://dd.eionet.europa.eu/vocabulary/common/currencies/
status: valid
status modified: 2023-05-04
accepted date: 2023-05-04
in scheme: AQD - Quality control and assurance on CDR
hidden label: The currency must be provided conforming to vocabulary (http://dd.eionet.europa.eu/vocabulary/common/currencies/), if estimated costs are provided.
error type: BLOCKER

Source sector should conform to vocabulary (use http://dd.eionet.europa.eu/vocabulary/aq/sourcesectors/).
type: Concept
notation: K24
definition: aqd:AQD_Measures/aqd:sourceSectors shall resolve to the codelist http://dd.eionet.europa.eu/vocabulary/aq/sourcesectors/
status: valid
status modified: 2023-05-04
accepted date: 2023-05-04
in scheme: AQD - Quality control and assurance on CDR
hidden label: Source sector should conform to vocabulary (use http://dd.eionet.europa.eu/vocabulary/aq/sourcesectors/).
error type: BLOCKER

Spatial scale should conform to vocabulary (use http://dd.eionet.europa.eu/vocabulary/aq/spatialscale/).
type: Concept
notation: K25
definition: aqd:AQD_Measures/aqd:spatialScale shall resolve to the codelist http://dd.eionet.europa.eu/vocabulary/aq/spatialscale/
status: valid
status modified: 2023-05-04
accepted date: 2023-05-04
in scheme: AQD - Quality control and assurance on CDR
hidden label: Spatial scale should conform to vocabulary (use http://dd.eionet.europa.eu/vocabulary/aq/spatialscale/).
error type: BLOCKER

Measure Implementation Status should conform to vocabulary (use http://dd.eionet.europa.eu/vocabulary/aq/measureimplementationstatus/).
type: Concept
notation: K26
definition: aqd:AQD_Measures/aqd:plannedImplementation/aqd:PlannedImplementation/aqd:status shall resolve to the codelist http://dd.eionet.europa.eu/vocabulary/aq/measureimplementationstatus/
status: valid
status modified: 2023-05-04
accepted date: 2023-05-04
in scheme: AQD - Quality control and assurance on CDR
hidden label: Measure Implementation Status should conform to vocabulary (use http://dd.eionet.europa.eu/vocabulary/aq/measureimplementationstatus/).
error type: BLOCKER

The planned start date for the measure should be provided in the right format.
type: Concept
notation: K27
definition: aqd:AQD_Measures/aqd:plannedImplementation/aqd:PlannedImplementation/aqd:implementationPlannedTimePeriod/gml:TimePeriod/gml:beginPosition must be a date in full ISO date format
status: valid
status modified: 2023-05-04
accepted date: 2023-05-04
in scheme: AQD - Quality control and assurance on CDR
hidden label: The planned start date for the measure should be provided in the right format.
error type: BLOCKER

The planned end date for the measure should be provided in the right format. If unknown, it should be voided using indeterminatePosition="unknown".
type: Concept
notation: K28
definition: If not voided aqd:AQD_Measures/aqd:plannedImplementation/aqd:PlannedImplementation/aqd:implementationPlannedTimePeriod/gml:TimePeriod/gml:endPosition must be a date in full ISO format and must be after aqd:AQD_Measures/aqd:plannedImplementation/aqd:PlannedImplementation/aqd:implementationPlannedTimePeriod/gml:TimePeriod/gml:beginPosition. If voided it should be indeterminatePosition="unknown"
status: valid
status modified: 2023-05-04
accepted date: 2023-05-04
in scheme: AQD - Quality control and assurance on CDR
hidden label: The planned end date for the measure should be provided in the right format. If unknown, it should be voided using indeterminatePosition="unknown".
error type: BLOCKER

The actual start date of the measure should be provided in the right format.
type: Concept
notation: K29
definition: aqd:AQD_Measures/aqd:plannedImplementation/aqd:PlannedImplementation/aqd:implementationActualTimePeriod/gml:TimePeriod/gml:beginPosition must be a date in full ISO date format
status: valid
status modified: 2023-05-04
accepted date: 2023-05-04
in scheme: AQD - Quality control and assurance on CDR
hidden label: The actual start date of the measure should be provided in the right format.
error type: ERROR

The actual end date of the measure should be provided in the right format. If unknown, it should be voided using indeterminatePosition="unknown".
type: Concept
notation: K30
definition: If not voided aqd:AQD_Measures/aqd:plannedImplementation/aqd:PlannedImplementation/aqd:implementationActualTimePeriod/gml:TimePeriod/gml:endPosition must be a date in full ISO format and must be after aqd:AQD_Measures/aqd:plannedImplementation/aqd:PlannedImplementation/aqd:implementationActualTimePeriod/gml:TimePeriod/gml:beginPosition. If voided it should be indeterminatePosition="unknown"
status: valid
status modified: 2023-05-04
accepted date: 2023-05-04
in scheme: AQD - Quality control and assurance on CDR
hidden label: The actual end date of the measure should be provided in the right format. If unknown, it should be voided using indeterminatePosition="unknown".
error type: ERROR

The full effect date of the measure must be provided and the format to be yyyy or yyyy-mm-dd.
type: Concept
notation: K31
definition: aqd:AQD_Measures/aqd:plannedImplementation/aqd:PlannedImplementation/aqd:plannedFullEffectDate/gml:TimeInstant/gml:timePosition to be provided in the following format yyyy or yyyy-mm-dd
status: valid
status modified: 2023-05-04
accepted date: 2023-05-04
in scheme: AQD - Quality control and assurance on CDR
hidden label: The full effect date of the measure must be provided and the format to be yyyy or yyyy-mm-dd.
error type: ERROR

reserved
type: Concept
notation: K32
definition: /aqd:AQD_Measures/aqd:plannedImplementation/aqd:PlannedImplementation/aqd:otherDates
status: valid
status modified: 2023-05-04
accepted date: 2023-05-04
in scheme: AQD - Quality control and assurance on CDR
hidden label: reserved

An explanation is expected under aqd:comment if monitoring progress indicators are not provided as text.
type: Concept
notation: K33
definition: A text string may be provided under aqd:AQD_Measures/aqd:plannedImplementation/aqd:PlannedImplementation/aqd:monitoringProgressIndicators ; If voided an explanation of why this information unavailable shall be provided in /aqd:AQD_Measures/aqd:plannedImplementation/aqd:PlannedImplementation/aqd:comment
status: valid
status modified: 2023-05-04
accepted date: 2023-05-04
in scheme: AQD - Quality control and assurance on CDR
hidden label: An explanation is expected under aqd:comment if monitoring progress indicators are not provided as text.
error type: ERROR

Reduction of emissions shall be provided as a number and unit should conform to vocabulary.
type: Concept
notation: K34
definition: Check that the element aqd:AQD_Measures/aqd:reductionOfEmissions/aqd:QuantityCommented/aqd:quantity is an number or floating point numeric >= 0 if attribute xsi:nil="false" (example: <aqd:quantity uom="http://dd.eionet.europa.eu/vocabulary/uom/emission/t.year-1" xsi:nil="false">273</aqd:quantity>)
status: valid
status modified: 2023-05-04
accepted date: 2023-05-04
in scheme: AQD - Quality control and assurance on CDR
hidden label: Reduction of emissions shall be provided as an integer and unit should conform to vocabulary.
error type: BLOCKER

If quantification is either "unpopulated" or "unknown" or "withheld" then the element should be empty.
type: Concept
notation: K35
definition: Check that the element aqd:QuantityCommented/aqd:quantity is empty if attribute xsi:nil="unpopulated" or "unknown" or "withheld" (example: <aqd:quantity uom="Unknown" nilReason="Unpopulated" xsi:nil="true"/>)
status: valid
status modified: 2023-05-04
accepted date: 2023-05-04
in scheme: AQD - Quality control and assurance on CDR
hidden label: If quantification is either "unpopulated" or "unknown" or "withheld" then the element should be empty.
error type: BLOCKER

If the quantification is voided an explanation is required in aqd:comment.
type: Concept
notation: K36
definition: If aqd:QuantityCommented/aqd:quantity attribute xsi:nil="true" aqd:QuantityCommented/aqd:comment must be populated
status: valid
status modified: 2023-05-04
accepted date: 2023-05-04
in scheme: AQD - Quality control and assurance on CDR
hidden label: If the quantification is voided an explanation is required in aqd:comment.
error type: ERROR

The quantification of reductionOfEmissions should conform to vocabulary (use http://dd.eionet.europa.eu/vocabulary/uom/emission).
type: Concept
notation: K37
definition: The unit attribute (aqd:AQD_Measures/aqd:reductionOfEmissions/aqd:QuantityCommented/aqd:quantity/@UoM) shall correspond to http://dd.eionet.europa.eu/vocabulary/uom/emission
status: valid
status modified: 2023-05-04
accepted date: 2023-05-04
in scheme: AQD - Quality control and assurance on CDR
hidden label: The quantification of reductionOfEmissions should conform to vocabulary (use http://dd.eionet.europa.eu/vocabulary/uom/emission).
error type: ERROR

The level of concentration expected should be provided as an integer and its unit should conform to vocabulary (use http://dd.eionet.europa.eu/vocabulary/uom/concentration/).
type: Concept
notation: K38
definition: Check that the element aqd:AQD_Measures/aqd:expectedImpact/aqd:ExpectedImpact/aqd:levelOfConcentration is an integer or floating point numeric >= 0 and the unit (@uom) shall resolve to the codelist http://dd.eionet.europa.eu/vocabulary/uom/concentration/
status: valid
status modified: 2023-05-04
accepted date: 2023-05-04
in scheme: AQD - Quality control and assurance on CDR
hidden label: The level of concentration expected should be provided as an integer and its unit should conform to vocabulary (use http://dd.eionet.europa.eu/vocabulary/uom/concentration/).
error type: ERROR

The number of exceecedance expected should be provided as an integer
type: Concept
notation: K39
definition: Check that the element aqd:AQD_Measures/aqd:expectedImpact/aqd:ExpectedImpact/aqd:numberOfExceedances is an integer or floating point numeric >= 0
status: valid
status modified: 2023-05-04
accepted date: 2023-05-04
in scheme: AQD - Quality control and assurance on CDR
hidden label: The number of exceecedance expected should be provided as an integer and its unit should conform to vocabulary (use http://dd.eionet.europa.eu/vocabulary/uom/statistics).
error type: WARNING

The specification of length should conform to vocabulary (use http://dd.eionet.europa.eu/vocabulary/uom/time/) and must be either /hour or /day.
type: Concept
notation: K40
definition: Check that the element aqd:AQD_Measures/aqd:expectedImpact/aqd:ExpectedImpact/aqd:specificationOfHours xlinks to codelist http://dd.eionet.europa.eu/vocabulary/uom/time/ and the code is either /hour or /day
status: valid
status modified: 2023-05-04
accepted date: 2023-05-04
in scheme: AQD - Quality control and assurance on CDR
hidden label: The specification of length should conform to vocabulary (use http://dd.eionet.europa.eu/vocabulary/uom/time/) and must be either /hour or /day.
error type: ERROR

Checks if this delivery is new or an update (on same reporting year)
type: Concept
notation: M0
definition: Check if delivery if this is a new delivery or updated delivery (via reporting year)
status: valid
status modified: 2023-05-04
accepted date: 2023-05-04
in scheme: AQD - Quality control and assurance on CDR
hidden label: Checks if this delivery is new or an update (on same reporting year)
editorial note: [Crucial]: Yes - Information
error type: WARNING

Total number of individual element reported within this XML Document for assessment methods (models/objective estimation)
type: Concept
notation: M01
definition: Compile & feedback upon the total number of each environmental monitoring feature types included in the delivery
status: valid
status modified: 2023-05-04
accepted date: 2023-05-04
in scheme: AQD - Quality control and assurance on CDR
hidden label: Total number of individual element reported within this XML Document for assessment methods (models/objective estimation)
editorial note: [Crucial]: Yes -
error type: BLOCKER

Total number of new records for each feature type included in the delivery. Warning will be returned if all LocalIds are new.
type: Concept
notation: M02
definition: Compile & feedback upon the total number of new records for each environmental monitoring feature types included in the delivery
status: valid
status modified: 2023-05-04
accepted date: 2023-05-04
in scheme: AQD - Quality control and assurance on CDR
hidden label: Total number of new records for each feature type included in the delivery. Warning will be returned if all LocalIds are new.
editorial note: [Crucial]: Yes -
error type: ERROR

Total number of updated records for each feature type included in the delivery. Warning will be returned if all LocalIds are new.
type: Concept
notation: M03
definition: Compile & feedback upon the total number of modification to existing for each environmental monitoring feature types included in the delivery
status: valid
status modified: 2023-05-04
accepted date: 2023-05-04
in scheme: AQD - Quality control and assurance on CDR
hidden label: Total number of updated records for each feature type included in the delivery. Warning will be returned if all LocalIds are new.
editorial note: [Crucial]: Yes -
error type: ERROR

Full list of reported Environmental Monitoring Features within this XML Document
type: Concept
notation: M04
definition: Compile & feedback a list of the unique identifier information for each new record or modification to an environmental monitoring feature type. Feedback report shall include the gml:id attribute, ef:inspireId, aqd:inspireId, ef:name and/or ompr:name elements as available.
status: valid
status modified: 2023-05-04
accepted date: 2023-05-04
in scheme: AQD - Quality control and assurance on CDR
hidden label: Full list of reported Environmental Monitoring Features within this XML Document
editorial note: [Crucial]: Yes -
error type: INFO

Id elements must have unique content
type: Concept
notation: M05
definition: All gml:id attributes, ef:inspireId and aqd:inspireId elements shall have unique content
status: valid
status modified: 2023-05-04
accepted date: 2023-05-04
in scheme: AQD - Quality control and assurance on CDR
hidden label: Id elements must have unique content
editorial note: [Crucial]: Yes -
error type: BLOCKER

M06
type: Concept
notation: M06
preferred label: ./ef:inspireId/base:Identifier/base:localId shall be an unique code for AQD_Model and unique within the namespace. It is recommended to start with “MOD” and may include ISO2-country code (e.g.: MOD-ES0001)
definition: ./ef:inspireId/base:Identifier/base:localId shall be an unique code for AQD_Model and unique within the namespace. It is recommended to start with “MOD” and may include ISO2-country code (e.g.: MOD-ES0001)
status: valid
status modified: 2023-05-04
accepted date: 2023-05-04
in scheme: AQD - Quality control and assurance on CDR
hidden label: ./ef:inspireId/base:Identifier/base:localId shall be an unique code for AQD_Model and unique within the namespace. It is recommended to start with “MOD” and may include ISO2-country code (e.g.: MOD-ES0001)
editorial note: [Crucial]: Yes -
error type: BLOCKER

List unique namespaces used and count number of Models used.
type: Concept
notation: M07
definition: Count the number of unique AQD_Model (via localId) submitted within base:namespace.
status: valid
status modified: 2023-05-04
accepted date: 2023-05-04
in scheme: AQD - Quality control and assurance on CDR
hidden label: List unique namespaces used and count number of Models used.
editorial note: [Crucial]: Yes -
error type: BLOCKER

Check namespace is registered
type: Concept
notation: M07.1
definition: Check that namespace is registered in vocabulary (http://dd.eionet.europa.eu/vocabulary/aq/namespace/view)
status: valid
status modified: 2023-05-04
accepted date: 2023-05-04
in scheme: AQD - Quality control and assurance on CDR
hidden label: Check namespace is registered
editorial note: reserved
error type: BLOCKER

Model name must be provided
type: Concept
notation: M08
definition: ./ef:name shall return a string
status: valid
status modified: 2023-05-04
accepted date: 2023-05-04
in scheme: AQD - Quality control and assurance on CDR
hidden label: Model name must be provided
editorial note: [Crucial]: Yes -
error type: BLOCKER

The content of /ef:additionalDescription shall provide brief description for the model / objective estimation method
type: Concept
notation: M09
definition: The content of /ef:additionalDescription shall provide brief description for the model / objective estimation method
status: reserved
status modified: 2023-05-04
accepted date: 2023-05-04
in scheme: AQD - Quality control and assurance on CDR
hidden label: The content of /ef:additionalDescription shall provide brief description for the model / objective estimation method
editorial note: Not implemented

Must conform to the code 'air' in the Media codelist in the Inspire registry
type: Concept
notation: M10
definition: The content of aqd:AQD_SamplingPoint/ef:mediaMonitored shall resolve to any concept inhttp://dd.eionet.europa.eu/vocabulary/inspire/MediaValue/
status: valid
status modified: 2023-05-04
accepted date: 2023-05-04
in scheme: AQD - Quality control and assurance on CDR
hidden label: Codelist for am:environmentalDomain requires revision: INSPIRE codelist is required
editorial note: [Crucial]: -
error type: ERROR

./ef:geometry shall contain a valid geometric property type, typically gml:Point, gml:MultiPoint, gml:Grid, gml:RectifiedGrid, gml:Polygon
type: Concept
notation: M11
definition: ./ef:geometry shall contain a valid geometric property type, typically gml:Point, gml:MultiPoint, gml:Grid, gml:RectifiedGrid, gml:Polygon
status: reserved
status modified: 2023-05-04
accepted date: 2023-05-04
in scheme: AQD - Quality control and assurance on CDR
hidden label: ./ef:geometry shall contain a valid geometric property type, typically gml:Point, gml:MultiPoint, gml:Grid, gml:RectifiedGrid, gml:Polygon
editorial note: Not implemented

reserved
type: Concept
notation: M12
definition: reserved
status: reserved
status modified: 2023-05-04
accepted date: 2023-05-04
in scheme: AQD - Quality control and assurance on CDR
hidden label: reserved
editorial note: Removed

reserved
type: Concept
notation: M13
definition: reserved
status: reserved
status modified: 2023-05-04
accepted date: 2023-05-04
in scheme: AQD - Quality control and assurance on CDR
hidden label: reserved
editorial note: Removed

reserved
type: Concept
notation: M14
definition: reserved
status: reserved
status modified: 2023-05-04
accepted date: 2023-05-04
in scheme: AQD - Quality control and assurance on CDR
hidden label: reserved
editorial note: Removed

Check if the operational period for the model is invalid or overlaps
type: Concept
notation: M15
definition: .ef:observingCapability/ef:ObservingCapability/ef:observingTime/gml:TimePeriod/gml:beginPosition shall be equal to or less than ./ef:operationalActivityPeriod/ef:OperationalActivityPeriod/ef:activityTime/gml:TimePeriod /gml:endPosition - gml:TimePeriod within the multiple ef:observingCapability MUST NOT overlap which each other
status: valid
status modified: 2023-05-04
accepted date: 2023-05-04
in scheme: AQD - Quality control and assurance on CDR
hidden label: Model has incorrect operation period
editorial note: [Crucial]: Yes -
error type: BLOCKER

ef:processType must conform to codelist in the Inspire registry
type: Concept
notation: M16
definition: ./ef:observingCapability/ef:ObservingCapability/ef:processType shall resolve to “INSPIRE_OM_Process” via an XLINK: http://inspire.ec.europa.eu/codelist/ProcessTypeValue/process (currently resolves to 404 error)
status: reserved
status modified: 2023-05-04
accepted date: 2023-05-04
in scheme: AQD - Quality control and assurance on CDR
hidden label: ef:processType must conform to codelist in the Inspire registry
editorial note: Not implemented

ef:resultNature must conform to codelist in the Inspire registry
type: Concept
notation: M17
definition: ./ef:observingCapability/ef:ObservingCapability/ef:resultNature element shall resolve to http://inspire.ec.europa.eu/codelist/ResultNatureValue/simulated (currently resolves to 404 error)
status: reserved
status modified: 2023-05-04
accepted date: 2023-05-04
in scheme: AQD - Quality control and assurance on CDR
hidden label: ef:resultNature must conform to codelist in the Inspire registry
editorial note: Not implemented

M18
type: Concept
notation: M18
preferred label: ./ef:observingCapability/ef:ObservingCapability/ef:observedProperty shall resolve to a valid code within http://dd.eionet.europa.eu/vocabulary/aq/pollutant/ Within a unique AQD_Model, multiple ef:observedProperty may be found. These MUST always resolve to the same code
definition: ./ef:observingCapability/ef:ObservingCapability/ef:observedProperty shall resolve to a valid code within http://dd.eionet.europa.eu/vocabulary/aq/pollutant/ Within a unique AQD_Model, multiple ef:observedProperty may be found. These MUST always resolve to the same code
status: valid
status modified: 2023-05-04
accepted date: 2023-05-04
in scheme: AQD - Quality control and assurance on CDR
hidden label: Codelist for all pollutants requires revision: EEA codelist is required
editorial note: [Crucial]: Yes -
error type: BLOCKER

Links between Model and ModelArea shall be traceable and valid
type: Concept
notation: M19
definition: ./ef:observingCapability/ef:ObservingCapability/ef:featureOfInterest shall resolve to a traversable link to a unique AQD_ModelArea (“namespace/localId” of the object)
status: valid
status modified: 2023-05-04
accepted date: 2023-05-04
in scheme: AQD - Quality control and assurance on CDR
hidden label: Incorrect link between Model and ModelArea
editorial note: [Crucial]: Yes -
error type: BLOCKER

Links between Model and ModelProcess shall be traceable and valid
type: Concept
notation: M20
definition: ./ef:observingCapability/ef:ObservingCapability/ef:procedure shall resolve to a traversable local of global URI to ../aqd:AQD_ModelProcess
status: valid
status modified: 2023-05-04
accepted date: 2023-05-04
in scheme: AQD - Quality control and assurance on CDR
hidden label: Incorrect link between Model and ModelProcess
editorial note: [Crucial]: Yes -
error type: BLOCKER

ef:organisationLevel
type: Concept
notation: M21
definition: ./ef:organisationLevel attribute shall resolve to a valid code in http://dd.eionet.europa.eu/vocabulary/aq/reportinglevel/ (e.g. http://dd.eionet.europa.eu/vocabulary/aq/reportinglevel/national
status: reserved
status modified: 2023-05-04
accepted date: 2023-05-04
in scheme: AQD - Quality control and assurance on CDR
hidden label: ef:organisationLevel
editorial note: [Crucial]: YES. Key information. -

reserved
type: Concept
notation: M22
status: reserved
status modified: 2023-05-04
accepted date: 2023-05-04
in scheme: AQD - Quality control and assurance on CDR
error type: reserved

Number of invalid 3 elements in Model and Environmental Objective combinations:
type: Concept
notation: M23
definition: Number of invalid 3 elements aqd:AQD_Model/aqd:environmentalObjective/aqd:EnvironmentalObjective/ combinations
status: valid
status modified: 2023-05-04
accepted date: 2023-05-04
in scheme: AQD - Quality control and assurance on CDR
hidden label: The Environmental Objective combination declared under Model are invalid. Please revise.
error type: ERROR

Check that Assessment Type conforms to either Model or Objective
type: Concept
notation: M24
definition: /aqd:assessmentType shall resolve to http://dd.eionet.europa.eu/vocabulary/aq/assessmenttype/ via xlink:href to either http://dd.eionet.europa.eu/vocabulary/aq/assessmenttype/model or http://dd.eionet.europa.eu/vocabulary/aq/assessmenttype/objective
status: valid
status modified: 2023-05-04
accepted date: 2023-05-04
in scheme: AQD - Quality control and assurance on CDR
hidden label: Codelist for all pollutants requires revision: EEA codelist is required
editorial note: [Crucial]: Yes -
error type: BLOCKER

reserved
type: Concept
notation: M25
definition: If ./aqd:usedAQD equals “true”, the AQD_Model must be xlinked in at least at one /aqd:AQD_AssessmentRegime /aqd:assessmentMethods/aqd:AssessmentMethods/aqd:modelAssessmentMetadata (dataset C)
status: reserved
status modified: 2023-05-04
accepted date: 2023-05-04
in scheme: AQD - Quality control and assurance on CDR
editorial note: Removed

Check if there are any invalid link from Model to zone(s)
type: Concept
notation: M26
definition: ./aqd:zone shall resolve to a traversable local of global URI to AQD_Zones via xlink:href
status: valid
status modified: 2023-05-04
accepted date: 2023-05-04
in scheme: AQD - Quality control and assurance on CDR
hidden label: Incorrect link between Model(s) and Zone(s)
editorial note: [Crucial]: Yes -
error type: WARNING

ModelProcess localId must be unique within the namespace
type: Concept
notation: M27
definition: ./ompr:inspireId/base:Identifier/base:localId shall be an unique code for SamplingPointProcess and within the namespace
status: valid
status modified: 2023-05-04
accepted date: 2023-05-04
in scheme: AQD - Quality control and assurance on CDR
hidden label: LocalId(s) for ModelProcess(es) are not unique
editorial note: [Crucial]: Yes -
error type: BLOCKER

List unique namespaces used and count number of ModelProcess used.
type: Concept
notation: M28
definition: ./ompr:inspireld/base:Identifier/base:namespace shall be a unique namespace identifier for the data source (within an annual e-Reporting cycle). The namespace value will be owned by the data provider of the spatial object
status: valid
status modified: 2023-05-04
accepted date: 2023-05-04
in scheme: AQD - Quality control and assurance on CDR
hidden label: Namespace are not unique
editorial note: [Crucial]: Yes -
error type: BLOCKER

Check namespace is registered
type: Concept
notation: M28.1
definition: Check that namespace is registered in vocabulary (http://dd.eionet.europa.eu/vocabulary/aq/namespace/view)
status: valid
status modified: 2023-05-04
accepted date: 2023-05-04
in scheme: AQD - Quality control and assurance on CDR
hidden label: Unregistered country namespaace has been used
error type: BLOCKER

./ompr:documentation/base2:DocumentationCitation/base2:link shall resolve to a traceable URL
type: Concept
notation: M29
definition: ./ompr:documentation/base2:DocumentationCitation/base2:link shall resolve to a traceable URL
status: valid
status modified: 2023-05-04
accepted date: 2023-05-04
in scheme: AQD - Quality control and assurance on CDR
hidden label: ./ompr:documentation/base2:DocumentationCitation/base2:link shall resolve to a traceable URL
editorial note: [Crucial]: Yes -
error type: BLOCKER

ModelProcess name should be provided
type: Concept
notation: M30
definition: ./ompr:name shall resolve to provide a name for the model process configuration
status: valid
status modified: 2023-05-04
accepted date: 2023-05-04
in scheme: AQD - Quality control and assurance on CDR
hidden label: ModelProcess requires a name. Please revise
editorial note: [Crucial]: -
error type: ERROR

Process parameter for both result-encoding and result-format must be provided
type: Concept
notation: M31
definition: At least one ompr:processParameter/ompr:ProcessParameter/ompr:name MUST to be http://dd.eionet.europa.eu/vocabulary/aq/processparameter/resultencoding AND ompr:processParameter/ompr:ProcessParameter/ompr:description resolve to a text description and one ompr:processParameter/ompr:ProcessParameter/ompr:name MUST http://dd.eionet.europa.eu/vocabulary/aq/processparameter/resultformat AND ompr:processParameter/ompr:ProcessParameter/ompr:description resolve to a text description
status: valid
status modified: 2023-05-04
accepted date: 2023-05-04
in scheme: AQD - Quality control and assurance on CDR
hidden label: Process parameter for both result-encoding and result-format must be provided
editorial note: [Crucial]: YES, key check - NEW - system requirement
error type: BLOCKER

Other model parameters may be reported
type: Concept
notation: M32
definition: ompr:processParameter/ompr:ProcessParameter/ompr:name shall resolve to a valid code within http://dd.eionet.europa.eu/vocabulary/aq/modelparameter/ AND ompr:processParameter/ompr:ProcessParameter/ompr:description resolve to a text description of the model process -- e.g. <ompr:name xlink:href="http://dd.eionet.europa.eu/vocabulary/aq/modelparameter/emissions"/> <ompr:description>NAEI2011 data, scaled forward to 2012 by linear interpolation between 2011 and projected (UEP45) 2012 data.</ompr:description>
status: valid
status modified: 2023-05-04
accepted date: 2023-05-04
in scheme: AQD - Quality control and assurance on CDR
hidden label: Other model parameters may be reported
editorial note: [Crucial]: YES, key check - NEW - system requirement
error type: ERROR

reserved
type: Concept
notation: M33
definition: If the aqd:AQD_Model/aqd:assessmentType resolves to http://dd.eionet.europa.eu/vocabulary/aq/assessmenttype/model (please note that the link between AQD_Model and AQD_ModelProcess is made via an xlink with aqd:AQD_Model/ef:observingCapability/ef:ObservingCapability/ef:procedure - AQD_ModelProcess shall include a description of the following modelparameters: http://dd.eionet.europa.eu/vocabulary/aq/modelparameter/chemistry http://dd.eionet.europa.eu/vocabulary/aq/modelparameter/emissions http://dd.eionet.europa.eu/vocabulary/aq/modelparameter/meterology http://dd.eionet.europa.eu/vocabulary/aq/modelparameter/topography
status: reserved
status modified: 2023-05-04
accepted date: 2023-05-04
in scheme: AQD - Quality control and assurance on CDR
hidden label: reserved
editorial note: Not implemented

A textual description of model process
type: Concept
notation: M34
definition: aqd:AQD_ModelProcess/aqd:description shall provide a free text description of the model - e.g. GIS-based dispersion kernel approach for 1x1km background concentrations from area source emissions, calibrated with monitoring. The contribution from point sources is estimated using a separate dispersion model and then included in the total. A bi-linear interpolation of corrected rural measurement data has been used to map regional background NOx concentrations throughout the UK.
status: valid
status modified: 2023-05-04
accepted date: 2023-05-04
in scheme: AQD - Quality control and assurance on CDR
hidden label: ModelProcess requires a textual description. Please revise
editorial note: [Crucial]: -
error type: ERROR

The unit of the temporal resolution should be provided and conform with vocabulary
type: Concept
notation: M35
definition: /aqd:AQD_ModelProcess/aqd:temporalResolution/aqd:TimeReferences/aqd:unit shall resolve to http://dd.eionet.europa.eu/vocabulary/uom/time/
status: valid
status modified: 2023-05-04
accepted date: 2023-05-04
in scheme: AQD - Quality control and assurance on CDR
hidden label: Codelist for process time reference requires revision: EEA codelist is required
editorial note: [Crucial]: -
error type: ERROR

./aqd:numUnits shall contain an integer value
type: Concept
notation: M36
definition: ./aqd:numUnits shall contain an integer value
status: reserved
status modified: 2023-05-04
accepted date: 2023-05-04
in scheme: AQD - Quality control and assurance on CDR
hidden label: ./aqd:numUnits shall contain an integer value
editorial note: Not implemented

./aqd:spatialResolution shall provide a free text description of the spatial resolution of the model - e.g. 1x1km background concentrations
type: Concept
notation: M37
definition: ./aqd:spatialResolution shall provide a free text description of the spatial resolution of the model - e.g. 1x1km background concentrations
status: reserved
status modified: 2023-05-04
accepted date: 2023-05-04
in scheme: AQD - Quality control and assurance on CDR
hidden label: ./aqd:spatialResolution shall provide a free text description of the spatial resolution of the model - e.g. 1x1km background concentrations
editorial note: Not implemented

./dataQualityDescription shall provide a description of the quality of the model data / objective estimation in relation to the DQOs
type: Concept
notation: M38
definition: ./dataQualityDescription shall provide a description of the quality of the model data / objective estimation in relation to the DQOs
status: reserved
status modified: 2023-05-04
accepted date: 2023-05-04
in scheme: AQD - Quality control and assurance on CDR
hidden label: ./dataQualityDescription shall provide a description of the quality of the model data / objective estimation in relation to the DQOs
editorial note: Not implemented

Check Data Quality Report is provided via a traceable URL
type: Concept
notation: M39
definition: ./dataQualityReport shall provide a traceable URL (Note to data provider, the url should lead to a report describing the data quality equaluation process)
status: valid
status modified: 2023-05-04
accepted date: 2023-05-04
in scheme: AQD - Quality control and assurance on CDR
hidden label: Check Data Quality Report is provided via a traceable URL
editorial note: [Crucial]: Yes -
error type: BLOCKER

ModelArea localId must be unique within the namespace
type: Concept
notation: M40
definition: ./aqd:inspireId/base:Identifier/base:localId shall be an unique code for AQD_Sample and unique within the namespace
status: valid
status modified: 2023-05-04
accepted date: 2023-05-04
in scheme: AQD - Quality control and assurance on CDR
hidden label: LocalId(s) for ModelArea(s) are not unique
editorial note: [Crucial]: Yes -
error type: BLOCKER

List unique namespaces used and count number of ModelArea used.
type: Concept
notation: M41
definition: ./aqd:inspireId/base:Identifier/base:namespace shall be a unique namespace identifier for the data source (within an annual e-Reporting cycle). The namespace value will be owned by the data provider of the spatial object and will be registered in the INSPIRE External Object Identifier Namespaces Register
status: valid
status modified: 2023-05-04
accepted date: 2023-05-04
in scheme: AQD - Quality control and assurance on CDR
hidden label: Namespace are not unique
editorial note: [Crucial]: Yes -
error type: BLOCKER

Check namespace is registered
type: Concept
notation: M41.1
definition: Check that namespace is registered in vocabulary (http://dd.eionet.europa.eu/vocabulary/aq/namespace/view)
status: valid
status modified: 2023-05-04
accepted date: 2023-05-04
in scheme: AQD - Quality control and assurance on CDR
hidden label: Unregistered country namespaace has been used
editorial note: [Crucial]: Yes -
error type: BLOCKER

reserved
type: Concept
notation: M42
definition: Check on ./sam:sampledFeature to be skipped. This element is not relevant and might contain xlink to http://sweet.jpl.nasa.gov/2.2/realm.owl or <sam:sampledFeature nilReason="inapplicable" xsi:nil="true"/>
status: reserved
status modified: 2023-05-04
accepted date: 2023-05-04
in scheme: AQD - Quality control and assurance on CDR
editorial note: Not implemented

The coordinate reference system for the ModelArea must be defined with a correct uniform resource name
type: Concept
notation: M43
definition: /sams:shape/gml:Polygon, ./sams:shape/gml:Point, ./sams:shape/gml:MultiPoint, ./sams:shape/gml:MultiSurface, ./sams:shape/gml:Grid, ./sams:shape/gml:RectifiedGrid the srsName attribute shall be a recognisable URN. The following 3 srsNames are expected urn:ogc:def:crs:EPSG::3035 or urn:ogc:def:crs:EPSG::4258 or urn:ogc:def:crs:EPSG::4326
status: valid
status modified: 2023-05-04
accepted date: 2023-05-04
in scheme: AQD - Quality control and assurance on CDR
hidden label: Coordinate system for ModelArea needs revision
editorial note: [Crucial]: Yes -
error type: BLOCKER

./sams:shape shall contain a valid geometric property type typically gml:Point gml:MultiPoint gml:MultiSurface gml:Grid gml:RectifiedGrid OR gml:Polygon
type: Concept
notation: M44
definition: ./sams:shape shall contain a valid geometric property type typically gml:Point gml:MultiPoint gml:MultiSurface gml:Grid gml:RectifiedGrid OR gml:Polygon
status: reserved
status modified: 2023-05-04
accepted date: 2023-05-04
in scheme: AQD - Quality control and assurance on CDR
hidden label: ./sams:shape shall contain a valid geometric property type, typically gml:Point, gml:MultiPoint, gml:MultiSurface, gml:Grid, gml:RectifiedGrid, gml:Polygon
editorial note: Not implemented

The count attribute must be equal to the Y and X coordinate doublets
type: Concept
notation: M45
definition: .../gml:posList the count attribute shall resolve to the sum of y & x-coordinate doublets.
status: valid
status modified: 2023-05-04
accepted date: 2023-05-04
in scheme: AQD - Quality control and assurance on CDR
hidden label: Coordinate provided for ModelArea needs revision as not all doublets
error type: BLOCKER

The coordinates must be ordered as latitude (y-axis) , longtitude (x-axis)
type: Concept
notation: M46
definition: Check that the coordinates lists in .../gml:posList ar presented in lat / long (y-axis / x-axis) notation.
status: valid
status modified: 2023-05-04
accepted date: 2023-05-04
in scheme: AQD - Quality control and assurance on CDR
hidden label: Coordinate provided for ModelArea needs revision as not latitude/Longitude
error type: WARNING

Cross checks with other data-flows
type: Concept
notation: MCrossCheck
definition: Cross checks with other data-flows
status: valid
status modified: 2023-05-04
accepted date: 2023-05-04
in scheme: AQD - Quality control and assurance on CDR
error type: WARNING

Check that the XML correctly provides XML's prefix/namespaces
type: Concept
notation: NS
definition: Check prefix and namespaces of the gml:featureCollection according to expected root elements (More information at http://www.eionet.europa.eu/aqportal/datamodel)
status: valid
status modified: 2023-05-04
accepted date: 2023-05-04
in scheme: AQD - Quality control and assurance on CDR
hidden label: gml:featureCollection requires revision
editorial note: [Crucial]: Yes - System requirement - Integrated into one qa check
error type: BLOCKER

All EEA vocabulary links must be correctly constructed
type: Concept
notation: VOCAB
definition: Check through out the XML if any URL looks like "http://dd.eionet.europa.eu/vocabularyconcept/aq/". This should be BLOCKED as the EEA vocabulary should be: "http://dd.eionet.europa.eu/vocabulary/aq/"
status: valid
status modified: 2023-05-04
accepted date: 2023-05-04
in scheme: AQD - Quality control and assurance on CDR
editorial note: Crucial
error type: BLOCKER

All EEA vocabulary links must resolve to a correct link
type: Concept
notation: VOCABALL
definition: All EEA vocabulary (starting like "http://dd.eionet.europa.eu/..." or ""https://dd.eionet.europa.eu/...") links must resolve to a correct link
status: valid
status modified: 2023-05-04
accepted date: 2023-05-04
in scheme: AQD - Quality control and assurance on CDR
error type: BLOCKER

XML validation
type: Concept
notation: XML
definition: XML validation to confirm that it is both well-formed and also "valid" in that it follows a defined structure. A well-formed document follows the basic syntactic rules of XML, which are the same for all XML documents.A valid document also respects the rules dictated by XML schema (http://dd.eionet.europa.eu/schemaset/id2011850eu-1.0/view)
status: valid
status modified: 2023-05-04
accepted date: 2023-05-04
in scheme: AQD - Quality control and assurance on CDR
hidden label: XML failed to validate
editorial note: [Crucial]: Yes - System requirement - Integrated into one qa check
error type: BLOCKER